##TITLE=1H_CA-9412-2
 200.13MHz,DMSO-d6.
 8 sc
 
 29.1.2026
##JCAMPDX= 6.0         $$ Bruker NMR JCAMP-DX V2.0
##DATA TYPE= NMR SPECTRUM
##DATA CLASS= NTUPLES
##ORIGIN= UXNMR, Bruker Analytische Messtechnik GmbH
##OWNER= pz
$$ XWIN-NMR		Version 3.5
$$ Thu Jan 29 13:42:29 2026 Russian Standard Time (UT+4h)  she@DPX200
##.OBSERVE FREQUENCY= 200.1313
##.OBSERVE NUCLEUS= ^1H
##.ACQUISITION MODE= SIMULTANEOUS
##.ACQUISITION SCHEME= undefined
##.AVERAGES= 8
##.DIGITISER RES= 18
##SPECTROMETER/DATA SYSTEM= spect
##.PULSE SEQUENCE= zg30
##.SOLVENT NAME= DMSO
##.SHIFT REFERENCE= (INTERNAL, DMSO, 0, 15.4097)
##AUDIT TRAIL= $$ (NUMBER, WHEN, WHO, WHERE, WHAT)
$$ ##TITLE= Audit trail, XWIN-NMR		Version 3.5
$$ ##JCAMPDX= 5.01
$$ ##ORIGIN= Bruker BioSpin GmbH
$$ ##OWNER= she
$$ F:/spectra/data/she/nmr/H-C/1/pdata/1/auditp.txt
$$ ##AUDIT TRAIL=  $$ (NUMBER, WHEN, WHO, WHERE, WHAT)
(   1,<2026-01-29 13:40:27.37 +0400>,<she>,<DPX200>,
      <created by zg, POWCHK disabled, PULCHK disabled
       configuration hash MD5:
       00 E9 B6 7A A2 85 ED C7 34 08 36 98 17 FE 4E 26
       data hash MD5: 16K
       D4 24 46 50 85 E9 05 31 33 49 41 A0 BE ED 1F 0B>)
(   2,<2026-01-29 13:40:29.78 +0400>,<she>,<DPX200>,
      <Start of raw data processing
       efp BC_mod = 2 LB = 0.25 FT_mod = 6 PKNL = 1 PHC0 = -3703.033 PHC1 = 10.79231 SI = 16K 
       data hash MD5: 16K
       76 89 C1 8F 0D 38 32 7C D7 07 BE BB 2A 30 B6 A2>)
(   3,<2026-01-29 13:40:51.01 +0400>,<she>,<DPX200>,
      <pk PHC0 = 0.8743914 PHC1 = -1.2 
       data hash MD5: 16K
       44 21 78 3E AE B5 64 CB D5 59 D1 38 5F 88 3A D5>)
(   4,<2026-01-29 13:40:55.25 +0400>,<she>,<DPX200>,
      <abs ABSG = 5 
       data hash MD5: 16K
       9F 54 2E AC 12 6F 38 B4 31 B5 9F 5B FD 65 7B 40>)
$$ ##END=
$$ 
$$ hash MD5
$$ E8 62 05 34 23 2F 5C 7F 5C AB 8D C5 CD AE 35 46
##$RELAX= 
##$RELAX= 
##$RELAX= 
##$RELAX= 
##$RELAX= 
##$RELAX= 
$$ Bruker specific parameters
$$ --------------------------
##$DU= <F:/spectra>
##$EXPNO= 1
##$NAME= <H-C>
##$PROCNO= 1
##$TYPE= <nmr>
##$USER= <she>
##$AMP= (0..31)
100 100 100 100 100 100 100 100 100 100 100 100 100 100 100 100 100 100 
100 100 100 100 100 100 100 100 100 100 100 100 100 100 
##$AQSEQ= 0
##$AQ_mod= 1
##$AUNM= <au_zg>
##$AUTOPOS= <>
##$BF1= 200.13
##$BF2= 200.13
##$BF3= 200.13
##$BF4= 200.13
##$BF5= 200.13
##$BF6= 200.13
##$BF7= 200.13
##$BF8= 200.13
##$BYTORDA= 1
##$CFDGTYP= 0
##$CFRGTYP= 5
##$CHEMSTR= <none>
##$CNST= (0..31)
1 1 145 1 1 1 1 1 1 1 1 1 1 1 1 1 1 1 1 1 1 1 1 1 1 1 1 1 1 1 1 1 
##$CPDPRG= <>
##$CPDPRG1= <>
##$CPDPRG2= <>
##$CPDPRG3= <>
##$CPDPRG4= <mlev>
##$CPDPRG5= <mlev>
##$CPDPRG6= <mlev>
##$CPDPRG7= <mlev>
##$CPDPRG8= <mlev>
##$CPDPRGB= <>
##$CPDPRGT= <>
##$D= (0..31)
0 0.7 0 0 0 0 0 0 0 0 0 0.03 0 0 0 0 0 0 0 0 0 0 0 0 0 0 0 0 0 0 0 0 
##$DATE= 1769679626
##$DBL= (0..7)
120 120 120 120 120 120 120 120 
##$DBP= (0..7)
150 150 150 150 150 150 150 150 
##$DBP07= 0
##$DBPNAM0= <>
##$DBPNAM1= <>
##$DBPNAM2= <>
##$DBPNAM3= <>
##$DBPNAM4= <>
$$ [...]
##$SUBNAM3= <"">
##$SUBNAM4= <"">
##$SUBNAM5= <"">
##$SUBNAM6= <"">
##$SUBNAM7= <"">
##$SUBNAM8= <"">
##$SUBNAM9= <"">
##$SW= 18.0517328524113
##$SWIBOX= (0..15)
0 0 2 0 0 0 0 0 0 0 0 0 0 0 0 0 
##$SW_h= 3612.71676300578
##$TD= 16384
##$TD0= 1
##$TE= 0
##$TE2= 300
##$TE3= 300
##$TEG= 300
##$TL= (0..7)
0 120 120 120 120 120 120 120 
##$TP= (0..7)
150 150 150 150 150 150 150 150 
##$TP07= 0
##$TPNAME0= <>
##$TPNAME1= <>
##$TPNAME2= <>
##$TPNAME3= <>
##$TPNAME4= <>
##$TPNAME5= <>
##$TPNAME6= <>
##$TPNAME7= <>
##$TPOAL= (0..7)
0.5 0.5 0.5 0.5 0.5 0.5 0.5 0.5 
##$TPOFFS= (0..7)
0 0 0 0 0 0 0 0 
##$TUNHIN= 0
##$TUNHOUT= 0
##$TUNXOUT= 0
##$USERA1= <user>
##$USERA2= <user>
##$USERA3= <user>
##$USERA4= <user>
##$USERA5= <user>
##$V9= 5
##$VALIST= <valist>
##$VCLIST= <CCCCCCCCCCCCCCC>
##$VD= 0
##$VDLIST= <DDDDDDDDDDDDDDD>
##$VPLIST= <PPPPPPPPPPPPPPP>
##$VTLIST= <TTTTTTTTTTTTTTT>
##$WBST= 1024
##$WBSW= 4
##$XGAIN= (0..3)
0 0 0 0 
##$XL= 0
##$YL= 0
##$YMAX_a= 267911
##$YMIN_a= -362567
##$ZGOPTNS= <>
##$ZL1= 120
##$ZL2= 120
##$ZL3= 120
##$ZL4= 120
##$ABSF1= 15.46924
##$ABSF2= -2.582609
##$ABSG= 5
##$ABSL= 3
##$ALPHA= 0
##$AQORDER= 0
##$ASSFAC= 0
##$ASSFACI= 0
##$ASSFACX= 0
##$ASSWID= 0
##$AUNMP= <proc_1d>
##$AZFE= 0.1
##$AZFW= 0.1
##$BCFW= 0
##$BC_mod= 2
##$BYTORDP= 0
##$COROFFS= 0
##$CY= -3
##$DATMOD= 1
##$DC= 0
##$DFILT= <>
##$DTYPP= 0
##$F1P= 0
##$F2P= 0
##$FCOR= 1
##$FTSIZE= 16384
##$FT_mod= 6
##$GAMMA= 0
##$GB= 0
##$INTBC= 1
##$INTSCL= 3.241238e-09
##$ISEN= 128
##$LB= 0.25
##$LEV0= 0
##$LPBIN= 0
##$MAXI= 10000
##$MC2= 0
##$MEAN= 0
##$ME_mod= 0
##$MI= 1.114404
##$NCOEF= 0
##$NC_proc= -7
##$NLEV= 6
##$NOISF1= 3.799351
##$NOISF2= 2.8
##$NSP= 0
##$NTH_PI= 0
##$NZP= 0
##$OFFSET= 15.40974
##$PC= 1
##$PHC0= -3702.158
##$PHC1= 9.59231
##$PH_mod= 1
##$PKNL= yes
##$PPARMOD= 0
##$PSCAL= 0
##$PSIGN= 0
##$REVERSE= no
##$SF= 200.130022407499
##$SI= 16384
##$SIGF1= 3
##$SIGF2= 2
##$SINO= 0.751879
##$SIOLD= 32768
##$SREGLST= <19F.Aceton>
##$SSB= 0
##$STSI= 16384
##$STSR= 0
##$SW_p= 3612.71676300578
##$SYMM= 0
##$S_DEV= 0
##$TDeff= 16384
##$TDoff= 0
##$TI= <>
##$TILT= no
##$TM1= 0
##$TM2= 0
##$TOPLEV= 0
##$USERP1= <user>
##$USERP2= <user>
##$USERP3= <user>
##$USERP4= <user>
##$USERP5= <user>
##$WDW= 1
##$XDIM= 16384
##$YMAX_p= 504979592
##$YMIN_p= -1277376
$$ End of Bruker specific parameters
$$ ---------------------------------
##NTUPLES= NMR SPECTRUM
##VAR_NAME=  FREQUENCY,     SPECTRUM/REAL,   SPECTRUM/IMAG
##SYMBOL=    X,             R,               I
##VAR_TYPE=  INDEPENDENT,   DEPENDENT,       DEPENDENT
##VAR_FORM=  AFFN,          ASDF,            ASDF
##VAR_DIM=   16384,         16384,           16384
##UNITS=     HZ,            ARBITRARY UNITS, ARBITRARY UNITS
##FACTOR=    0.220516191357247, 1,           1
##FIRST=     3083.95170115159, 0,            0
##LAST=      -528.765061854187, 0,           0
##MIN=       -528.765061854187, -1277376,    0
##MAX=       3083.95170115159, 504979592,    0
$$ Real data points
##PAGE= N=1
##DATA TABLE= (X++(R..R)), XYDATA
$$ [...]
11973b74045p4911L36967O6615Q2434j4424j44662m8729P6706K45845J33880m1443
11962C44233l17974n26737n5910p154J97545k9653J92157J95257k3061k36620
11952b67917J75764R428J82898o1813K25367k7065j10355k63535j81362M67785
11942A49195j65990j54248J91888j1923o2365R3166J80281j85422j21422k64485
11932c51325O85281L53733k85282m56543O6185j7402k2819k7418k14602j37150
11922d07342k58588J29812K96499N06002l3244m14891m50983R9432K12765K09022
11912a11516Q5001K4253k93518r8770Q6334J38306M1493L0181n283M0138o0107
11901a23488q3923O1764L03247j35850m17714k71390K80533M55005j33357J6389
$$ plain form
11973 -274045 -348956 -11989 54626 137060 122636 -22026 -70755 5951 251796 385676 344233
11962 344233 26259 -500478 -556388 -563542 -365997 -395650 -203493 -8236 -31297 -267917
11952 -267917 -92153 -82725 100173 38360 263727 236662 126307 -137228 -318590 149195
11942 149195 -16795 -171043 20845 8922 -53443 39723 220004 34582 -86840 -351325
11932 -351325 333956 687689 402407 -54136 12049 -5353 -28172 -55590 -270192 -407342
11922 -407342 -665930 -536118 -239619 266383 233139 -181752 -632735 -533303 -320538 -111516
11912 -111516 -26515 -2262 -295780 -394550 -308216 -169910 -128417 -98236 -103519 -63381 -123488
11901 -123488 -207411 -145647 157600 21750 -395964 -667354 -386821 68184 -65173 -48784
11891d8784L30988k39381j83250o6178J85558k0133j36989M738J77698L51278
11881C55545j5016l06160R0707J62905j75471k49223q3098o4104M73488o4820
11871A24753l98915O4083j5637j6444P5304J2401J52484j50608J73857M17859
11861D39137R3077j15652l96130R7567J09435M4002K81217n6499l70496j06667
11851A8991j39850O6942j96264K5950K05270L18232L69050l16189k93311j30489
11841g1668k1883L55049J40623k28144r8501j63003j8544K00936R7746j53481
11831C9130n80600j01371N24505L10023k23149R3306j30909J02761K87955M0885
11821C62536k51550m18022j37535j18890K55832K40708l09744j5200M34376k96288
$$ plain form
11891 -48784 282204 42823 -140427 -206605 -21047 -41180 -178169 -173431 4267 355545
11881 355545 340529 34369 125076 287981 112510 -136713 -219811 -283915 189573 124753
11871 124753 -274162 -210079 -225716 -242160 -166856 -154455 -1971 -152579 21278 439137
11861 439137 532214 416562 20432 117999 227434 271436 552653 496154 125658 18991
11851 18991 -120859 -53917 -250181 -224231 -18961 299271 668321 352132 58821 -71668
11841 -71668 -93551 261498 402121 173977 75476 -87527 -106071 94865 192611 39130
11831 39130 -541470 -642841 -118336 191687 -31462 61844 -69065 33696 321651 362536
11821 362536 110986 -307036 -444571 -563461 -307629 -66921 -376665 -391865 42511 -253777
11811b53777l66398J41794N12545N92297q506j69470n8419j56174l67175m26179
11801e59462J36613M48608m1486j08612j16707l30878j16952o2023o579K88332
11791d69146N9426M3667L96299L86054J05111P4957k34010k80184k20043k84976
11781d22845J60642M28871k32083m68354J91136L00346R9485j77522J64447K59030
11771C03153j49263J45718J32305J78133M7050l92128l27993K56300l86755j3959
11761b07439L28140j0826M0173j07951J37783J44180O7164n42766J00651M01415
11751C50524k6930l81858L4940K28008Q5068k02430n33974M57098O09218Q076
11741F27740j97121K4129p6486k18086k81561J35467J69790l72657l84498J0916
$$ plain form
11811 -253777 -620175 -478381 34164 626461 617955 448485 390066 233892 -133283 -559462
11801 -559462 -422849 25759 -15727 -124339 -241046 -571924 -688876 -750899 -757478 -469146
11791 -469146 -409720 -366053 30246 416300 521411 596368 362358 82174 -137869 -422845
11781 -422845 -262203 166668 -65415 -533769 -342633 -42287 57198 -120324 44123 303153
11771 303153 153890 299608 431913 610046 657096 264968 -63025 193275 -193480 -207439
11761 -207439 120701 109875 150048 42097 179880 324060 391224 -151542 -50891 350524
11751 350524 323594 -58264 -23324 204684 289752 87322 -446652 10446 619664 627740
11741 627740 430619 454748 378262 160176 -121385 14082 183872 -188785 -573283 -562367
11731e62367J99318N2363J30468J99017j8422k16541L07420J58849j67055j22268
11721c9218K003L28008L63208l85694j59045L06625k25084j39524l49486j13646
11711d11853J6941L49225M75240l43899l19599Q8335J07426o9536J17888O0946
11701G1114m28791m86695K05512K64966J2343j87953L35312J3520j8983M87744
11691B68089J15802k52630k18203K27675N02620R4995o71227k52705M2829Q735
11681a34020k07101j48201k69105L12110L69851O5000K69450N3138N6146j74877
11671A92391q4765L25377J57389n02702l31974J99353J03050l89947l30163J81066
11661d80925K34222J02939j7597J37889J48880k92685j66179L62682N2913k82638
$$ plain form
11731 -562367 -363049 -310686 -180218 18799 377 -216164 91256 250105 83050 -39218
11721 -39218 -37215 290793 654001 268307 109262 415887 190803 51279 -298207 -411853
11711 -411853 -394912 -45687 429553 85654 -233945 -145610 -38184 -107720 10168 71114
11701 71114 -357677 -844372 -638860 -373894 -361551 -549504 -214192 -200672 -219655 268089
11691 268089 383891 131261 -86942 140733 643353 738348 67121 -185584 -142755 -134020
11681 -134020 -341121 -489322 -758427 -446317 -76466 -11466 257984 311122 367268 192391
11671 192391 107626 433003 590392 87690 -244284 -44931 58119 -331828 -661991 -480925
11661 -480925 -246703 -143764 -161361 -23472 125408 -167277 -333456 29226 82139 -200499
11651b00499j62469k7101p4347M1376O9183L0045J18909k19033o1729l504K37485
11640b51684J31844L21747L1560K82297q1686l54039j51438j27917K10197l1446
11630b0565n06048j86599K81314k39402K29636J62938o980L12654K10348J24393
11620C61689P084k89134J51641J13076n0546j92539P6326L52483l45820k47612
11610f3352Q4027K90565L465m84916j12330j466P3659L03327K01089j02080l16193
11599a24205j34800M055r1419J14211K99477k38980k7895N23749K15352j63406
11589C76139j55772K21496R8499j73257k03852L4242M490l76733j95457k37022
11579f07227J55736J07708P1054j44442k23940K98733J71731K80404l2078j59439
$$ plain form
11651 -200499 -362968 -390069 -464416 -423040 -353857 -323812 -204903 -423936 -485665 -489169 -251684
11640 -251684 -119840 201907 233467 515764 434078 80039 -71399 -199316 10881 -20565
11630 -20565 -526613 -713212 -431898 -671300 -441664 -278726 -285706 26948 237296 361689
11620 361689 368773 79639 231280 344356 293810 101271 177597 530080 184260 -63352
11610 -63352 20675 311240 314705 -170211 -282541 -284007 -210348 92979 294068 191988 -124205
11599 -124205 -259005 -254950 -346369 -232158 67319 -171661 -199556 324193 539545 376139
11589 376139 220367 441863 540362 367105 163253 197495 201985 -174748 -370205 -607227
11579 -607227 -451491 -343783 -272729 -417171 -641111 -342378 -170647 109757 77679 -81760
11569h1760j0710K9574L3477L06180M38040l58309l40062K24990k9137n65768
11559c53485N6164R7929L02303K64219l52116k44950j73873j75762J33151N86236
11549A39816j42806j31435R1266q067l2631K10343J77593p8692j7927L34623m19418
11538A22665n61191O8353M16752r9623j83246j83986p101J44564K80523J77878
11528A75588N6951J62868l25967o6224K80668L68362q9250j38217q6034L9959
11518C78704K30820l12044n82004k78803J67756K03199k6542J13568l1951J53025
11508A5728J64501o1283R5718n8817j98550J37408J32305j80458j19243r1612
11498a64303J1783j35059j19245J74326J91869l73148L01634N18420k61457j87159
$$ plain form
11569 -81760 -92470 -62896 -29419 276761 714801 356492 16430 241420 212283 -353485
11559 -353485 -297321 -199392 102911 367130 15014 -229936 -403809 -579571 -446420 139816
11549 139816 -2990 -134425 -43159 -51226 -83857 126486 304079 225387 207460 542083 122665
11538 122665 -438526 -370173 46579 -53044 -236290 -420276 -427377 -282813 -2290 175588
11528 175588 232539 395407 69440 3216 283884 652246 562996 424779 338745 378704
11518 378704 609524 297480 -284524 -563327 -395571 -192372 -218914 -105346 -137297 15728
11508 15728 180229 118946 214664 155847 -42703 94705 227010 46552 -72691 -164303
11498 -164303 -152520 -287579 -406824 -232498 -40629 -413777 -112143 406277 144820 -42339
11488d2339j42648j4907j9994K11161J47283k24585r2653l9310Q7405L25848k66647
11477g1386k05364J94095K2951q2794J20077n7481J20514j88232r4002l97350
11467f38972l5298J08319j75162J70064J80176K87366J7836k48965J13629N1340
11457a69667r2343P312L17508J33181k95154k1549K02236P0813k13697R1802r7755
11446f7313r0427l4777q752J12596M8735p1691J27322Q555k36360j42679J43264
11435b11527K54894J14475O1739l20371l12572j13366L35349K79070n5725O7931
11425I9897J16413J8505p7916r9242j06714K11201J7373J07847l16876l89992
11415d19504j21914J63889K41327J25342j27695N1243K80791m98864P6045P7910
$$ plain form
11488 -42339 -184987 -199894 -219888 -8727 138556 -86029 -178682 -217992 -130587 195261 -71386
11477 -71386 -276750 -82655 -59704 -142498 -22421 -79902 40612 -147620 -241622 -638972
11467 -638972 -674270 -565951 -741113 -571049 -390873 -103507 -85671 -334636 -221007 -169667
11457 -169667 -262010 -254698 62810 195991 -99163 -120712 81524 152337 -61360 30442 -67313
11446 -67313 -157740 -192517 -201269 -88673 -39938 -111629 15693 24248 -212112 -354791 -211527
11435 -211527 43367 157842 219581 -100790 -413362 -526728 -191379 87691 31966 99897
11425 99897 216310 234815 156899 57657 -49057 162144 179517 287364 -29512 -419504
11415 -419504 -541418 -377529 -136202 -10860 -138555 -87312 193479 -305385 -229340 -151430
11405a51430J00246K52875Q3940j01952k72956Q8857J15217l69P5503L57354j30453
11394D16832l53943p7978L01664K1079l97619k27027o682M01616R1404K21445
11384C90791j20600o30823l39724N58102Q09708j61517j32473j31018k67738n6134
11374h1426K82513J52793k48442l74811j42365K06682k9452O5510j19655p2736
11364c61389K64805J63899p3448l38840l32614J97080L45723K52493K03212O9561
11354C90482m98286k25664K69007L89148P8075l98761j20481j38994l52253L69519
11344b38208P01355n35458l83960L45676M83160k17802k76288j5637j86918j37917
11334d61997J03263R9479O8391l50002m0229L46094R6403J10258j09555q2300
$$ plain form
11405 -151430 -51184 201691 285631 183679 -89277 -420 114797 114428 189931 547285 416832
11394 416832 62889 -15089 286575 307654 -89965 -316992 -323674 77942 169346 390791
11384 390791 270191 -360632 -700356 -142254 667454 505937 373464 242446 -25292 -81426
11374 -81426 201087 353880 105438 -269373 -411738 -205056 -234508 -168998 -288653 -361389
11364 -361389 -96584 67315 -6133 -344973 -677587 -480507 -134784 117709 320921 390482
11354 390482 -107804 -333468 -64461 324687 402762 4001 -116480 -255474 -607727 -238208
11344 -238208 463147 -72311 -456271 -110595 372565 154763 -121525 -137162 -324080 -461997
11334 -461997 -358734 -259255 -190864 -540866 -581095 -235001 -138598 -28340 -137895 -220195
11324b20195J47838Q856j11867K89949J74524n295k65673j33626K04375J26452
11314B15338k0898j19035j36619J33170j25035l92115N9624M61195J98626l95646
11304a21395J07828K30430N5194J96497j53087j43480o1603m4028L61688M2441
11294D70485l15629M4153M170l5609l1579J65252J84946k49179l33354L97150
11284C00806n8632j75290o7509j56387j65618J23602N91374k50752L4081k14046
11274c8371k51130J11758K14480J58240Q2773j95178r6457j91653L81231J19616
11264B95309m6225m04512j26466M56078J95201k67681l63752K95202K45493N7231
11254C35878m79806l71537j88050K30991J21403M0147m6951n3474L8584l66095
$$ plain form
11324 -220195 -72357 -63501 -175368 114581 289105 283810 18137 -115489 88886 215338
11314 215338 194440 75405 -61214 71956 -53079 -445194 -385570 75625 274251 -121395
11304 -121395 -13567 216863 272057 468554 315467 171987 110384 66356 428044 470485
11294 470485 154856 199009 203179 167570 135991 301243 486189 237010 -96344 300806
11284 300806 242174 66884 -625 -157012 -322630 -199028 392346 141594 175675 -38371
11274 -38371 -289501 -177743 36737 194977 277750 82572 -13885 -205538 175693 295309
11264 295309 249084 -155428 -281894 174184 369385 101704 -262048 33154 278647 335878
11254 335878 -143928 -515465 -703515 -472524 -351121 -310974 -357925 -411399 -372815 -738910
11244g38910M5080L32418K28088k16481j9257N35623j64729K2371M7738k67418
11234a95477L73717K76840k88849l89790n50391j25636K41568M47865j66411k59808
11224f36372l71529K23817P87680M37909r0245P662j40500k73334L21434J29827
11214C96349O3954n88654k99294L57808M55027L266m48318k82454j48537R6492
11204c94361N93946L07966l79035j8706q8264J09622l55355j91682j28084L47473
11194a96480M01994j45361l40649J1643L18538M51142L0001K09088J2850o92398
11184F0368m68031N23226N08947j11806k53131n28836K08724L2308l24930K7043
11174c26118M19667K08853l72645l39599J87978M54737l96771l82584M86127K05738
$$ plain form
11244 -738910 -693830 -361412 -133324 -349805 -369062 166561 1832 24203 71941 -195477
11234 -195477 178240 455080 166231 -223559 -773950 -899586 -658018 -210153 -376564 -636372
11224 -636372 -1007901 -784084 3596 441505 351260 358922 218422 -54912 266522 396349
11214 396349 460303 -128351 -427645 -69837 385190 388456 -59862 -342316 -490853 -394361
11204 -394361 199585 507551 128516 109810 21546 131168 -224187 -415869 -543953 -196480
11194 -196480 205514 60153 -280496 -268853 49685 500827 530828 739916 752766 60368
11184 60368 -407663 115563 624510 512704 259573 -269263 -60539 -28231 -353161 -326118
11174 -326118 93549 302402 -70243 -409842 -221864 232873 -163898 -546482 -60355 145383
11164A45383O8743k78668N28060k79483l75327Q9701J06924M3128N8641j96809
11154h9707q4154J68198j24630l4375j3080k466J8699Q9436M13477m53340n30093
11143f42035K19910K33001L78406o4876k88725j04344M43827p9415o6856J92221
11133B21114l246o4060n02121J33332J67265j80227m8858N37609J79894m59745
11123a9043m21228K2300K36100j11779L75426M63976J12877n09521n70352j54761
11113e76005K53986L15517j24630P6742M1665k8358k78092j82775M59284K37713
11103A95047m28109j97813l973J89336l0724J66420L59126J02246k25573n56466
11093d30483k9871M49540l4268M6641J16550m31126j96623j42072O90313L24744
$$ plain form
11164 145383 214126 -64542 463518 184035 -191292 -101591 5333 48461 107102 -89707
11154 -89707 -173861 -5663 -130293 -164668 -177748 -180214 -161515 -72079 341398 -111942 -642035
11143 -642035 -422125 -189124 189282 124406 -164319 -268663 175164 95749 28893 221114
11133 221114 217868 153808 -348313 -214981 -47716 -227943 -276801 260808 440702 -19043
11123 -19043 -440271 -417971 -181871 -293650 81776 545752 658629 149108 -421244 -576005
11113 -576005 -322019 -6502 -131132 -54390 -12725 -41083 -319175 -501950 -42666 195047
11103 195047 -233062 -430875 -434848 -245512 -276236 -109816 249310 351556 125983 -430483
11093 -430483 -460354 -10814 -45082 1559 118109 -313017 -509640 -651712 38601 363345
11083C63345m4113j41910J05948k01418r6518N8635K3910k4345j04113k52099
11073c12678j00242L16237J24410J11946R8729j87722J36324K26227j98972q6870
11063A27389N3357M9116K26172r6184j31515Q9770J7494K7839k72384l43234k11686
11052d63866J84176K70429L3074j22711Q6457J37782r8801q0914L00952L15768
11042E62346j38058l36816J43195k5465P3364l79147k00443J09611j12843j4358
11032c18614K4495P9402k47404j36306M50325L10514L45303K15979m90010k40875
11022g191M56197p7617j69551k0407r2524L3514P7457K78131k90181l79132O306
11011a84998J95897n7705j86699m4680J09953K65766J45509k4301p6469K00609
$$ plain form
11083 363345 319232 177322 283270 81852 -14666 43969 67879 43534 -60579 -312678
11073 -312678 -412920 -96683 27727 139673 238402 50680 187004 413231 214259 127389
11063 127389 180746 229862 456034 359850 228335 318105 335599 363438 91054 -252180 -463866
11052 -463866 -279690 -9261 23813 -98898 -12441 125341 26540 -54374 246578 562346
11042 562346 424288 87472 230667 205202 278566 -100581 -301024 -191413 -304256 -318614
11032 -318614 -294119 -214717 -462121 -598427 -148102 162412 507715 723694 233684 -7191
11022 -7191 449006 371389 201838 181431 88907 122421 199878 478009 187828 -191304 -184998
11011 -184998 10899 -46806 -233505 -278185 -168232 97534 243043 218742 142273 342882
11001C42882K04080j82242N8498m81670k16971j4739L14907J53128l72542l87555
10991e82224r3995L67667M29590J38984q4031l25290m70530J14428K81179K69427
10981D5205k21092l48203L60970N71090j20468j19042m01144L06066J51240k00645
10971B3977K9099k39141j97314J07148L39433L1030J12724K09436o0708j6662
10961C39022l95043n3289J56203K33768K45813j96031O605k80006K41324k41238
10951E7128j36126J16959r8992O7220k839m8918R8681K70766m4618l24529N3950
10940H682J61635K53422j01581j47152k1869n0979j30798o9395m8768O0580j91114
10929b77337J00765j13733j26468K79828L0141j70309k46611L16756K90943J54459
$$ plain form
11001 342882 546962 364720 423218 -58452 -275423 -290162 24745 177873 -194669 -582224
10991 -582224 -676219 -308552 121038 260022 175991 -149299 -619829 -505401 -224222 45205
10981 45205 -175887 -524090 -163120 407970 287502 168460 -232684 73382 224622 23977
10971 23977 53076 -186065 -383379 -276231 63202 94232 206956 416392 355684 339022
10961 339022 -56021 -109310 46893 280661 526474 330443 337048 57042 298366 57128
10951 57128 -78998 37961 -61031 6189 3350 -45568 53113 323879 279261 -45268 8682
10940 8682 170317 423739 322158 175006 153137 102158 -28640 -98035 -146803 -86223 -277337
10929 -277337 -176572 -290305 -416773 -136945 -106804 -277113 -523724 -206968 83975 238434
10919B38434j06685l50275k30602K45578K83302p3798l24872J17595J87708j15021
10909a28636k16786M13725L05397l31345k62015K12171O8721j19605J32796r1716
10899a7293l11861J88712J75188Q6480j06350M8931l2631k73034M0470J64635
10889c6753j36645Q2461j1343j58097M237K36314J09569K36156k99668l33172
10879c06941L11360r7639k46318K47182K00912m04178l23753M1159L79557j14921
10869c13580J5151j78379K6445K1973M2264P3792j1100k27393M5877N58190K47323
10858C00563Q6818l16205j00014q383L17202L09579j37679r0626q7248k24109
10848D9898K54268j10521r7789k74386l28594m045J03818J17778K05280L1024
$$ plain form
10919 238434 131749 -218526 -449128 -203550 79752 5954 -318918 -201323 -13615 -128636
10909 -128636 -345422 68303 373700 42355 -219660 -7489 61232 -58373 74423 -17293
10899 -17293 -329154 -140442 34746 121226 14876 63807 31176 -241858 -201388 -36753
10889 -36753 -173398 -90937 -102280 -260377 -256140 -19826 89743 325899 26231 -306941
10879 -306941 4419 -93220 -339538 -92356 108556 -295622 -619375 -578216 -198659 -313580
10869 -313580 -298429 -476808 -450363 -428390 -386126 -312334 -323434 -550827 -504950 53240 300563
10858 300563 387381 71176 -28838 -37221 279981 589560 451881 361255 274007 49898
10848 49898 304166 193645 95856 -178530 -507124 -511169 -407351 -289573 -84293 -53269
10838e3269k28049K86092L64411k68570k13722M22224L6884J21211j53364J73597
10828D87445m3643J6471p1242j09292j82283j98756j42509J91480J22717J20315
10818A90703m6120m30142q9718J55185K04384K55217R9671K44599l49604q0256
10808A53919O7645k05435J05954k1821J19679k62161j48981Q3916J33306j8576
10798G445j77725j46255N3594J13073J39431j96252L89543J07749l87164l9999
10788a36560r5163L4814J22414j5767J38111o1121k02108R1341m775N7146j932
10777g3600r7874K427K77880m5347m21053L54531O6590k46378P5415M5560k13748
10766b75597p2845J61230o8714L62378K94191m56386o8565K38773J39957J54410
$$ plain form
10838 -53269 -281318 4774 369185 100615 -113107 309117 346001 467212 313848 487445
10828 487445 443802 460273 389031 279739 97456 -101300 -243809 -52329 70388 190703
10818 190703 144583 -285559 -375277 -220092 -15708 239509 339180 583779 234175 153919
10808 153919 221564 16129 122083 100262 219941 -42220 -191201 -107285 26021 7445
10798 7445 -170280 -316535 -262941 -149868 -10437 -206689 182854 290603 -96561 -136560
10788 -136560 -231723 -196909 -74495 -90262 47849 -13272 -215380 -124039 -128814 -71668 -73600
10777 -73600 -171474 -169047 108833 63486 -357567 -3036 63554 -182824 -107409 -61849 -275597
10766 -275597 -348442 -187212 -255926 106452 400643 -55743 -124308 114465 254422 408832
10756D08832j29832J29909P889l77792j28221J17428j21410l05645j0072L38221
10746g0693K68927K3545k87514l13576M68522K36754k07936j35367K10837j73337
10736B0162j8640M95874N00766k05331l79145l09371m6008K40710k31168k35099
10726a67250j84289k79674k0857L58123K59077J98969l6009k63321k5450L56556
10716A95875J55609j1833K62600j8187m46999j01106r6288M1183j31083p8852
10706b29081J21582j45555m48380J1657L87234L0739J02135K34646J19669R5584
10696B80230O2076k76877j64877J05328K38296j48056j1901p7198j54452R5823
10686e1608R1753R1533l03796k9472M0821N2289j35131j08473K1397Q9813J44196
$$ plain form
10756 408832 279000 408909 416798 39006 -89215 28213 -93197 -398842 -408914 -70693
10746 -70693 198234 221779 -65735 -379311 89211 325965 118029 -17338 193499 20162
10736 20162 1522 497396 998162 792831 413686 104315 58307 299017 67849 -167250
10726 -167250 -351539 -631213 -652070 -293947 -34870 164099 128090 -135231 -160681 195875
10716 195875 351484 339651 602251 584064 137065 35959 -60329 -19146 -150229 -229081
10706 -229081 -107499 -253054 -701434 -689777 -302543 -271804 -169669 64977 184646 280230
10696 280230 342306 65429 -99448 5880 244176 96120 84219 7021 -147431 -51608
10686 -51608 40145 131678 -172118 -201590 -160769 -108480 -243611 -352084 -330687 -240874 -96678
10675i6678L84700N8157l56422j01461K22139j92884O3245j351k13321j45652
10665c79528J13761L04511j6164j54926J8136L65389k07304k12445j77187L6799
10655c08958K4160K51682j44796j27307L40065L73341k08705l83995J91370J81591
10645A88448k48455m89211M25137M01800q0296N2139k72655l7753R8303j33120
10635i5663l3724J76087L17236K4680l77170J19868j27067j83875j28822m0980
10625c49430N84975l43445l1161Q5338J35078j77477O3206J71517j19789L2074
10615E0886r1202l1369k06519K6474K47044J92654L75330j80777n24453k0560
10605a62492K34984O9400m8784L7535K10862k24572k11551j29373J93622O9003
$$ plain form
10675 -96678 288022 346179 -10243 -111704 110435 -82449 -19204 -20555 -233876 -379528
10665 -379528 -265767 38744 22580 -132346 -114210 251179 43875 -168570 -345757 -308958
10655 -308958 -284798 -33116 -177912 -305219 34846 408187 199482 -184513 6857 188448
10645 188448 -60007 -549218 -124081 277719 197423 249562 -23093 -60846 37457 -95663
10635 -95663 -129387 46700 363936 388616 11446 131314 4247 -179628 -308450 -349430
10625 -349430 235545 -107900 -139061 -53723 81355 -96122 -32916 138601 18812 50886
10615 50886 -40316 -71685 -278204 -251730 -4686 187968 563298 382521 -141932 -162492
10605 -162492 72492 141892 93108 130643 341505 116933 -94618 -223991 -30369 38634
10595C8634j33521N8483J70216J66072K5945K10366N1081k03066l25874K63322
10585C21658j71996j78121L72828j19830k47622m8036K20967r4446J62999K93722
10575E12123k99399k53016K46629M32231l38013m19988P5165R4205k19743o1740
10565b31546r948K50697k36722N1872M2815J76138L1589j31810J73687K72895
10555C89667l93196Q7167m0947j26658o3409J77975l89802k00184L64137j99145
10545c94395j80717K01813K57634O9948q1648k3123K94173j62510J00462M72264
10535E53901o1913l08102L9033J22035k1894j80994l34767l34302K04068K63816
10525e9119M08292K14659n6303p33302l3489L53378L85875j79552j33133m54639
$$ plain form
10595 38634 -94887 -36404 133812 299884 325829 536195 587276 384210 58336 321658
10585 321658 149662 -28459 344369 224539 -23083 -71119 149848 55402 218401 512123
10575 512123 212724 -40292 206337 638568 300555 -119433 -44268 49937 -169806 -231546
10565 -231546 -241494 9203 -227519 -175647 -132832 43306 74895 -56915 116772 389667
10555 389667 -3529 83638 42691 -83967 -147376 30599 -359203 -559387 -195250 -394395
10545 -394395 -575112 -373299 -115665 -45717 -127365 -150488 143685 -18825 81637 553901
10535 553901 491988 183886 222919 344954 323060 142066 -192701 -527003 -322935 -59119
10525 -59119 349173 563832 507529 -225773 -259262 94116 479991 300439 167306 -287333
10515b87333K48862N73890K6543P3693Q7448n15984k63780J25886K76050p5967
10505B69308q9137K08818j51764j98354l33793J29955N0226J19517J08276K25907
10495C38959J48016K04709k78817l86870L88322K40543m46080k50434M20505L3482
10485D12335k15757J56403m49772k05690M171j5390K64775J02096K8467K22026
10475C03664O2804J37121k47671p0122k52381K05870L89120n0626p3588n077l03375
10464I5739l76994P3385L29775l8613m52361j98311N54020M13580k79673L9113
10454A59660k58902J16662L07519J2450l76907L2756J93707k12137r4J78759k96090
10443a42617l52710J54334J86707Q8809M28572m4370j74424l91228K43358K93351
$$ plain form
10515 -287333 -38471 535419 561962 635655 723103 207119 -56661 69225 345275 269308
10505 269308 180171 388989 237225 38871 -294922 -164967 -114741 4776 113052 338959
10495 338959 486975 691684 412867 25997 414319 654862 208782 -41652 378853 412335
10485 412335 196578 352981 -96791 -302481 -298310 -313700 -48925 53171 81638 303664
10475 303664 366468 503589 255918 185796 -66585 139285 528405 477779 404191 399114 95739
10464 95739 -281255 -207870 121905 83292 -369069 -567380 -13360 400220 120547 159660
10454 159660 -99242 17420 324939 337389 -39518 -6762 186945 -25192 -25286 153473 -142617
10443 -142617 -495327 -340993 -154286 -65477 363095 318725 144301 -246927 -3569 289782
10433B89782L3596j85247K15233K18296j61527j92372k78232j72092J04683J12102
10423a5778J091k57892J69923L59252k88083m79905J24266K60398m48239l41967
10413i16934N22019M00283m38963J6297M03582O0102k80668M88979l6950l83499
10403a65752J67582K20377M7471l85198k73941j54402n0708L77815n5379J27289
10393a44846J97954j52134j6360k44268J24781O13885j6811n49293J22361M61307
10383C96576j43337r2701M03947K19260j40215l71400l92184M5829K98307K71650
10373D95732j07848p2006m54878j09501P40451N86589j77570o12954l89656O6125
10363c5516K28391j87165l0645M19496l99396l27612M96283M39987m57554k35133
$$ plain form
10433 289782 323378 138131 353364 571660 410133 217761 -60471 -232563 -127880 -15778
10423 -15778 -14687 -272579 -102656 256596 -31487 -511392 -387126 -126728 -574967 -916934
10413 -916934 -394915 5368 -433595 -417298 -13716 46386 -234282 254697 217747 -165752
10403 -165752 1830 222207 269678 -115520 -389461 -543863 -594571 -216756 -272135 -144846
10393 -144846 53108 -99026 -115386 -359654 -234873 379012 362201 -187092 -64731 396576
10383 396576 253239 160538 564485 783745 643530 272130 -120054 -74225 224082 495732
10373 495732 387884 315878 -139000 -248501 491950 1078539 900969 288015 -101641 -35516
10363 -35516 192875 5710 -24935 394561 -4835 -332447 163836 603823 146269 -88864
10353h8864K04894L38793J30877j87214p15451r1460L77483j206j88665n0922
10343b71735J70526K11382K0861l17626K85851M5320o76573L45564N45494m67653
10333a08589p1972J62138J79272K3257J392K98332P7868j63693m43783J93147
10323A47369J67833n5791n3744L4433m29417l58725J68051n2693L58601N96142
10313E22059r6958n63695K23886N31453J79870l14914l36615l5694k0936L5108
10303A23564L09806J15282m49314o16475J92975Q8088J11334J82747j74827o82777
10293g99597r292L76952K43552N6570j81244j54118J09490J51483L2007J308L46892
10282A74003K38325r482m28722J1182L51370J12471q2164k30975O0575J63706
$$ plain form
10353 -88864 116030 454823 585700 398486 -316965 -408425 -30942 -32148 -220813 -271735
10343 -271735 -101209 110173 131034 -186592 99259 144579 -531994 -186430 359064 -108589
10333 -108589 -180561 -18423 160849 184106 185498 483830 561698 398005 -45778 147369
10323 147369 315202 259411 205667 240100 -189317 -548042 -379991 -432684 -74083 522059
10313 522059 425101 -138594 85292 616745 796615 481701 145086 109392 88456 123564
10303 123564 433370 548652 99338 -517137 -324162 -236074 -124740 58007 -116820 -799597
10293 -799597 -808889 -431937 -188385 -131815 -313059 -467177 -357687 -206204 -174197 -172889 174003
10282 174003 412328 402846 -25876 -14694 336676 449147 366983 136008 196583 360289
10272C60289Q9069m9326k57145l16063j48228M4066M84205L30088K71091r8715
10262G09331l87306l28320O7102O54132M3404l34232k0319Q7277K42370M61890
10252A195329m60886l50818k02319M8140R4389R8019K39011j69869l90610n8558
10242D1828M28908k37160m17116j13407K89142L55314O2524k26220q0912j9719
10232H3182J95218J54544k94353j60328M09163K57184j03367m24019k23770j42418
10222b48964j27524j37867J3943O9151K3330J05378o0934K9883N67189J54359
10212C87944m75374j59743M09558L92089j93718k51826L48015J35528j14717k05831
10202B71925m45306L6073k25360Q5647M16019M1302j90007j86257J29111p0909
$$ plain form
10272 360289 449358 400032 142887 -173176 -321404 -277338 206867 536955 808046 709331
10262 709331 322025 -6295 60807 714939 758343 424111 403792 491069 733439 1195329
10252 1195329 734443 383625 181306 229446 323835 421854 660865 490996 100386 41828
10242 41828 470736 233576 -183540 -296947 -7805 347509 410033 183813 102901 83182
10232 83182 278400 432944 138591 -21737 387426 644610 541243 117224 -106546 -248964
10222 -248964 -376488 -514355 -500412 -431261 -407931 -302553 -363487 -333604 233585 387944
10212 387944 -87430 -247173 162385 554474 360756 108930 456945 592473 477756 271925
10202 271925 -173381 -137308 -362668 -277021 138998 180300 -9707 -195964 -66853 -137762
10192a37762K14213j57914M28348K01586M6570K7885R0562j67822o31192J32311
10182D6785K18681K94851j98148N8746n119L18577k35021m88582J11887R5739
10172B18396l6352k00082Q9168J83308L21511m7067r2463N520o2631L76607J70342
10161I26257J11350j9520m06681K16377j51500m76140k1940J50390L27086n3309
10151F02370p9392P5045M30470j68603l01194j83879L31811J05739l35550j31690
10141C45127K97417K02308l56186n49294k15449Q23562J21954m11417J81026O2538
10131E01586k36336J14743M4378p1552J25074J42056j54456O2294M831j82050
10121C50568j97437m5241j95583k53355P8657M34214k02215j77419M69648N49565
$$ plain form
10192 -137762 76451 -81463 346885 548471 595041 622926 713488 545666 -85526 46785
10182 46785 265466 560317 362169 420915 415796 734373 499352 10770 122657 218396
10172 218396 182044 -18038 71130 254438 575949 528882 436419 441939 379308 755915 926257
10161 926257 1037607 1018087 611406 827783 676283 200143 178203 328593 655679 602370
10151 602370 522978 598023 1028493 859890 558696 374817 706628 812367 476817 345127
10141 345127 642544 844852 488666 -60628 -276077 547485 669439 258022 439048 501586
10131 501586 265250 379993 424371 352819 477893 619949 465493 527787 532618 350568
10121 350568 153131 107890 -87693 -341048 -262391 171823 -30392 -207811 261837 811402
10111H11402P4830m22576J92230R501k48676j77071j44040J52033K68702L35710
10101H52045l08871m39038J24923l7608k19781j1357L14856J13468j51943R9741
10091C36435K12153J91618j23327P5007k38416j63779J12235L19946j86444k94403
10081B41025R4957J10159J54882l33404j13856O44064J9014l61384j81182J34123
10071D08398j05158j05109n307n5983N65003J70245k10204j49383J80109J5303
10061G07914k33074M35656K85191K18329k66863k41111L14998j33082j83531l7897
10051H66530L2555m52393j68608j7074O05994n3530k1659K69951p5046J09389
10041A096109j03552J76204O40525R7597m40119l06082J26367K93044O7764k21234
$$ plain form
10111 811402 886232 463656 655886 665387 416711 239640 95600 247633 516335 852045
10101 852045 543174 104136 229059 191451 -28330 -39687 275169 388637 236694 336435
10091 336435 548588 740206 616879 691886 453470 289691 401926 721872 535428 241025
10081 241025 335982 446141 601023 267619 153763 797827 816841 455457 274275 408398
10071 408398 303240 198131 192824 136841 701844 872089 661885 512502 692611 707914
10061 707914 474840 910496 1195687 1414016 1147153 906042 1221040 1087958 904427 866530
10051 866530 899085 446692 278084 261010 867004 813474 791815 1061766 986720 1096109
10041 1096109 992557 1168761 1809286 1906883 1466764 1160682 1287049 1580093 1647857 1426623
10031A426623k8356J31812K6597j28441K50084R4874j13355o6544L0681k40468
10021A383507k69430k904K99378L18447J40085m47507l27974k06456K16790M15522
10011A519458L28282k10759l07467J63118k50610O31349J45519j68721j31483
10002A718686L72957K5038n7318J81502j94012j52021l4417L33329j60194k01088
9992A832462j28831O9565J20481J12758J21694q2943j82337j41508J2383j51760
9982A581964j40594m82774j06079L50638k32302j42924m7032Q0312K73347J80398
9972A314954l44298j15415j19427j10823J74111n939L49560j12415k12166K42315
9962A060457K50693K02266j61328j82578J04317P9949K1744J3406k99800l76740
$$ plain form
10031 1426623 1398267 1530079 1556676 1428235 1678319 1773193 1659838 1593294 1623975 1383507
10021 1383507 1114077 1111173 1410551 1728998 1869083 1421576 1093602 887146 1103936 1519458
10011 1519458 1847740 1636981 1329514 1492632 1242022 1873371 2018890 1850169 1718686
10002 1718686 2091643 2116681 2059363 2240865 2046853 1894832 1860415 2193744 2033550 1832462
9992 1832462 1703631 1773196 1893677 2006435 2128129 2045186 1862849 1721341 1733724 1581964
9982 1581964 1441370 958596 852517 1203155 970853 827929 780897 861209 1134556 1314954
9972 1314954 970656 855241 735814 624991 799102 793163 1142723 1030308 818142 1060457
9962 1060457 1311150 1513416 1352088 1169510 1273827 1353776 1375520 1388926 1089126 712386
9952G12386P963J57340K90455Q301j744O9681J85678l0739m19571R843J40363
9941A129956K43904J20841J27478j69150r395K25905J05170R6360j1973k26068
9931A633028l39950k6974L9436J83212J84339K09949p05643j65747L9552K42389
9921A293591L47674J83958Q6274k84800n08399r7186p8635L92811k5483j82922
9911A126883k79716R4670L35740J92465k93795k88884J50254L5682M86928Q2920
9901A643147j27767j68706l83177K5299O15052K00368l79705k59049p8J59578
9891A324962M93580N6911k96048k96720K2287R8547l9053q2049O9755J89576M17580
9880A959328j18256j98979k49512m53970K56202L11972o5648K56967J3676J5301
$$ plain form
9952 712386 720349 877689 1168144 1176445 1174701 1244382 1430060 1399321 979750 989593 1129956
9941 1129956 1373860 1494701 1622179 1453029 1443634 1669539 1774709 1871069 1859096 1633028
9931 1633028 1293078 1266104 1305540 1488752 1673091 1883040 1177397 1011650 1051202 1293591
9921 1293591 1641265 1825223 1911497 1626697 1118298 1021112 942477 1335288 1309805 1126883
9911 1126883 847167 941837 1277577 1470042 1176247 887363 1037617 1073299 1560227 1643147
9901 1643147 1515380 1346674 963497 988796 1603848 1804216 1424511 1165462 1165384 1324962
9891 1324962 1818542 1875453 1579405 1282685 1304972 1403519 1364466 1282417 1352172 1541748 1959328
9880 1959328 1841072 1642093 1392581 938611 1194813 1506785 1441137 1698104 1711780 1727081
9870A727081N0477L40539K49947k78753J39370K42447j98764n77336K255K23113
9860A920376j31948k5086k5473j38747J35918J6605J85649L58570J66518k262
9850B460120o08648L12148M20319j0835k25724k4251J18733J26375j42046j75614
9840B250577k8022j53884Q0168J32070L41665j33840K24391Q2005k23721J68184
9830B739593j61043k46899o9615K43731J94037o6702k60012J14436K04363J17103
9820B808992J79105j05927p5500J35626K95332J26189k00798K50595k7596N2785
9810C438803P3590N9511R1239k46395k30387J11359L64348P9925J59917j74614
9800C727296l99634J5717N82879M41853j96028K32515k85300j12654q4661K85502
$$ plain form
9870 1727081 1777558 2118097 2368044 2089291 2228661 2471108 2272344 1695008 1697263 1920376
9860 1920376 1788428 1763342 1737869 1599122 1735040 1751645 1937294 2295864 2462382 2460120
9850 2460120 1851472 2163620 2583939 2573104 2347380 2323129 2441862 2568237 2426191 2250577
9840 2250577 2222555 2068671 2148839 2280909 2622574 2488734 2713125 2795130 2571409 2739593
9830 2739593 2578550 2331651 2262036 2505767 2699804 2633102 2373090 2487526 2691889 2808992
9820 2808992 2988097 2882170 2806670 2942296 3237628 3363817 3163019 3413614 3386018 3438803
9810 3438803 3512393 3571904 3663143 3416748 3186361 3297720 3662068 3741993 3901910 3727296
9800 3727296 3327662 3343379 3926258 4368111 4172083 4404598 4119298 4006644 3921983 4207485
9790D207485L62654j84371J64733K58105K37056l84286O9415M3347J44315K94819
9780E213272J71278O7389L4518j02035j33837K66797K37636j9030N0649l5226
9770E751411o01K7516K00379K88786K07311n8704J35191R2036J22811L08088N7743
9759G131967r6748J19260N27528O6372k08508o1808J93537L68352L60347M19199
9749H819498j49789j95261J29586j759M95421O18557R7703N8276K64646O08407
9739A0745285R34830J6670j06112J46812r9014L36912P21066P19462J65304K01188
9729A3782403J45618N49155M84848L27361R01814M10980M23108P76074Q39744
9720A8641105Q35811N86101K46272O93307N47501O74553O05920Q06753J078555
$$ plain form
9790 4207485 4570139 4385768 4550501 4808606 5045662 4661376 4730791 4774138 4918453 5213272
9780 5213272 5384550 5451939 5486457 5384422 5250585 5517382 5755018 5735988 5786637 5751411
9770 5751411 5750810 5778326 5978705 6267491 6474802 6416098 6551289 6643325 6766136 7074224 7131967
9759 7131967 7035219 7154479 7682007 7748379 7539871 7478063 7671600 8039952 8400299 8819498
9749 8819498 8669709 8474448 8604034 8602275 9097696 9716253 9813956 9872232 10136878 10745285
9739 10745285 11680115 11696785 11590673 11737485 11638471 11975383 12696449 13415911 13581215 13782403
9729 13782403 13928021 14477176 14962024 15289385 16191199 16602179 17025287 17801361 18641105
9720 18641105 19476916 20063017 20309289 21002596 21550097 22224650 22830570 23637323 24715878
9711B4715878O44431R00685J060382J133913J145539J206231Q14432J443932J858500
9702C4923923J797064J380483J321765K359562K956517K704679K992959K889432
9694E3326384L198048L861413M139227N164001N408055N297066O170675O834746
9686I3399615P789107Q646537R773933J1044483J1868957J3005896J4424692J4937859
9678A84891079J5083627J4952620J4319076J2734721J0386846O685666K808815
9671B61862450p10298m016007p493522j0956696j2863019j3881045j4368677j4271904
9663A83301282j2909663j1902458j0178496q308495o310641m025881k824017j180667
9655A25660964J92857J054235K334445M031607N469638O203836P640123Q922662
$$ plain form
9711 24715878 25360309 26260994 27321376 28455289 29600828 30807059 31621491 33065423 34923923
9702 34923923 36720987 38101470 39423235 41782797 44739314 47443993 50436952 53326384
9694 53326384 56524432 60385845 64525072 69689073 75097128 80394194 86564869 93399615
9686 93399615 101188722 109835259 119609192 130653675 142522632 155528528 169953220 184891079
9678 184891079 199974706 214927326 229246402 241981123 252367969 259053635 261862450
9671 261862450 261152152 257136145 249642623 238685927 225822908 211941863 197573186 183301282
9663 183301282 170391619 158489161 148310665 140002170 133691529 129665648 126841631 125660964
9655 125660964 125853821 126908056 129242501 133274108 138743746 144947582 152587705 161510367
9647A61510367J0956502J2415055J3511737J4170008J4908711J4837515J3288162
9640B55598057J0697472Q177229M708472M37333l498052p231476j0918359j4099242
9632B43871434j6978249j8155825j8320884j8277272j6995603j5900597j4270368
9625A24972636j2451560j0962167r381235p591317o680567n544577m822312m056534
9617F3482367l547480l303728l104001k285131k413531k177477j910000j633367
9609D3107652j742619j952991j919580j426595j322318j499289j605000j285556
9601C0353704j311038j280819r46454j163335j070133q90331m25691o60290j288637
9592B1316976q40417k60624k64890m56722n34366k63091m20386k24066l51152
$$ plain form
9647 161510367 172466869 184881924 198393661 212563669 227472380 242309895 255598057
9640 255598057 266295529 274472758 279181230 279618563 276120511 268889035 257970676 243871434
9632 243871434 226893185 208737360 190416476 172139204 155143601 139243004 124972636
9625 124972636 112521076 101558909 92177674 84586357 77905790 72361213 67538901 63482367
9617 63482367 59934887 56631159 53527158 51242027 48828496 46651019 44741019 43107652
9609 43107652 41365033 39412042 37492462 36065867 34743549 33244260 31639260 30353704
9601 30353704 29042666 27761847 26815393 25652058 24581925 23691594 23265903 22605613 21316976
9592 21316976 20476559 20215935 19951045 19494323 18959957 18696866 18276480 18052414 17701262
9583A7701262j43360o04838k50422r3358k95365n39294j49139r4143k47136k27430
9573A5056777J52359l81927q81412m89055J49992q6633Q0374n1331l10411k97859
9563A2940874J04767Q9791j63010n5782J17917L69856M02587l07835p15153m83166
9553A2300846n38020m60323j02985n15233q32599n05904p82604l06779J24263
9544H380662j1973j97581l91047k70874L7790K69987N9180n6067K58845l98848
9534G680074l25834K56234l733l52685k05126k04308j53681q7632R8374j64349
9524F537334j17397n9897J55954L77897M59973N0538K55425J6437L5645n1213
9514G660696p9938J29615L19469L63082n0353k04081n6774L40753L61116K24387
$$ plain form
9583 17701262 17557902 16953064 16702642 16609284 16313919 15774625 15625486 15531343 15284207 15056777
9573 15056777 15209136 14827209 13945797 13456742 13606734 13520101 13600475 13549144 13238733 12940874
9563 12940874 13045641 13135432 12972422 12916640 13034557 13404413 13807000 13499165 12784012 12300846
9553 12300846 11762826 11302503 11199518 10684285 9851686 9345782 8563178 8256399 8380662
9544 8380662 8368689 8171108 7780061 7509187 7546977 7816964 7876144 7820077 8078922 7680074
9534 7680074 7354240 7610474 7606741 7254056 7048930 6844622 6690941 6603309 6701683 6537334
9524 6537334 6419937 6360040 6515994 6893891 7353864 7404402 7659827 7676264 7711909 7660696
9514 7660696 7580758 7710373 8029842 8392924 8342571 8138490 8081716 8422469 8783585 9007972
9504I007972M63704K52607K29790K60895L11678L1477l14272n18503k94127k33651
9494I197570j44435m65112p71924m71630m68789j83027J44692o42n82687n70329
9484E683687R8320K53436R4149j67658m04918j88046n8068L7311k93813p6542
9474D977858R2363o0312k95982j92847j56974k77355k5307j82372o5216M13394
9464D227250K22309N7362k05184j79869L7030j21709k14689j0610o5819j02109
9454C643962k92098m6588N45357K50539J07489n94680m62593j82121O14163l7213
9444C546217n43299j98296p4860J78078m9276N6206l55586l34612K73585J18732
9434B616889J05943J02939J9391N3774o10663K78790N10883J60075J48644K87417
$$ plain form
9504 9007972 9471676 9724283 9954073 10214968 10526646 10558123 10243851 9725348 9431221 9197570
9494 9197570 9053135 8588023 7816099 7344469 6875680 6692653 6837345 6836703 6254016 5683687
9484 5683687 5782007 6035443 6129592 5961934 5557016 5368970 5310902 5348213 5054400 4977858
9474 4977858 5070221 5009909 4713927 4521080 4364106 4086751 4061444 3879072 3813856 4227250
9464 4227250 4449559 4506921 4301737 4121868 4158898 4037189 3822500 3811890 3746071 3643962
9454 3643962 3351864 3305276 3850633 4101172 4208661 3613981 3151388 2969267 3583430 3546217
9444 3546217 3002918 2804622 2729762 2907840 2858564 2914770 2559184 2224572 2498157 2616889
9434 2616889 2722832 2825771 2845162 2898936 2288273 2567063 3077946 3238021 3386665 3674082
9424C674082J42437r5598l00248J06465j29633L24151J86617j1546k31345j80729
9414C484653M77803O9473q1545o150n539j79413Q9522k9991l65588K917J62932
9403C619074j44169l09308j49242N4925K2039n398r4110L6831K88592j0037R0226
9392C399423M5479q5341J91432K09766k78632m28272k1271k35318k0600N61148
9382C337814J35985J08153Q1172l46952l29934R6064M07723L06126L14492n59961
9372C550682K289j05948J39757l1972j45387K987k33662m70726m01045K76570
9362B583545L01116k11479j70601K7231K40229O52428j02374k73206K96768m4157
9352C299500J44814J19356k34706J36277N3718J40592J03270j15198k31662J61174
$$ plain form
9424 3674082 3816519 3720921 3420673 3527138 3397505 3721656 3908273 3896727 3665382 3484653
9414 3484653 3962456 4031929 3950384 3944234 3938695 3759282 3848804 3818813 3453225 3456142 3619074
9403 3619074 3474905 3165597 3016355 3071280 3093319 3087921 2993811 3030642 3319234 3309197 3399423
9392 3399423 3444902 3359561 3550993 3760759 3482127 3053855 3032584 2797266 2776666 3337814
9382 3337814 3473799 3581952 3663124 3316172 2986238 3082302 3490025 3796151 4110643 3550682
9372 3550682 3552971 3447023 3586780 3554808 3409421 3412408 3178746 2708020 2306975 2583545
9362 2583545 2884661 2673182 2502581 2529812 2770041 3422469 3320095 3046889 3343657 3299500
9352 3299500 3444314 3563670 3328964 3465241 3518959 3659551 3762821 3647623 3415961 3577135
9342C577135M05828j08227l16725J22263J150l0751K36828j8392q948M0219l03572
9331C596808j35248j04334K14235q7308l30082k5766J32555n5031j06732R2441
9321C191538O00097n1897m47976k9291M79051J44222J80037l38229n21176r761
9311C196615N22262J37612N5326l29424p3288M0298j64438L00713J40633j08223
9301C718086m02017k52132J92287M00991L82804j51219m77806J82284L13095L7764
9291C944137J0580J98990K91105j4958K64864M79388l97327j75930k4156K33060
9281D809753j19176O08474M22671j96216m36528k90427P4643M46713M30736l37220
9271E413423M2437j01241J0124M46088K27666L0860l06256l7408k34093J67545
$$ plain form
9342 3577135 3982963 3874736 3558011 3680274 3681424 3650673 3887501 3869109 3860161 3900380 3596808
9331 3596808 3461560 3357226 3571461 3484153 3154071 3128305 3260860 3205829 3099097 3191538
9321 3191538 3791635 3739738 3291762 3262471 3741522 3885744 4065781 3727552 3206376 3196615
9311 3196615 3718877 3856489 3911815 3582391 3509103 3549401 3384963 3685676 3826309 3718086
9301 3718086 3316069 3063937 3256224 3657215 4040019 3888800 3410994 3593278 3906373 3944137
9291 3944137 3954717 4153707 4444812 4429854 4694718 5174106 4776779 4600849 4576693 4809753
9281 4809753 4690577 5299051 5721722 5525506 5088978 4798551 4873194 5319907 5750643 5413423
9271 5413423 5455860 5354619 5364743 5810831 6038497 6069357 5763101 5725693 5491600 5659145
9261E659145N04459k4768k19551R3988R9691L90814K4933l3478J96132K2818R7883
9250F812066K87026j26347r9175Q6255J41077k59511k36530M5673L41726J21067
9240G113327k16357j62404M32071K21424k84907J24830K80091j92881j38081M17773
9230G594886M21292K48270K21410M5367j59269J7763K88097L20042O4818J03409
9220I166085N32783K10464j52150k46151K50277J28384J90735K42046k31535m3309
9210A0047629J29481O2944J73184k92238l63620K75929l5979K05901K06300j38309
9200A0271222n92919J42001K36252Q144O3794L5429j53090J24556p9188M20952
9190A0477153Q0275n02638j9855J94777N04928J83635L0470N81116M5581j64274
$$ plain form
9261 5659145 6163604 6138836 5919285 6013273 6112964 6503778 6528711 6495233 6691365 6714183 6812066
9250 6812066 7099092 6972745 6873570 6959825 7100902 6841391 6604861 6650534 6992260 7113327
9240 7113327 6896970 6734566 7166637 7388061 7103154 7227984 7508075 7315194 7177113 7594886
9230 7594886 8016178 8264448 8485858 8531225 8371956 8389719 8677816 8997858 9062676 9166085
9220 9166085 9698868 9909332 9757182 9511031 9761308 9889692 10080427 10322473 10090938 10047629
9210 10047629 10177110 10240054 10413238 10121000 9757380 10033309 9997330 10203231 10409531 10271222
9200 10271222 9678303 9820304 10056556 10064700 10128494 10163923 10010833 10135389 10056201 10477153
9190 10477153 10557428 10054790 10034935 10229712 10734640 10918275 10948745 11529861 11575442 11411168
9180A1411168K81432J73176j37684p7220P6686M27039M2983L4870q6816P3537
9170A2219171K47686M63207L81521K34298M71061L92804K44319M61140o953K01361
9160A5309615Q47464O09600L87650L26417K48439R24100M66555L06578K49744
9151A9676162J63178K73195J70707L09932J47254N26622L82347K10528N0969M1733
9141B1952627L74183J10590O04797N83840N65267N18649O17283Q86640J75706
9132B6389582O19737R95067R70569Q33638J115493J259753J225311P87924J496045
9123C5693119K054355J328036J564907J928027J680394K246964J991429K323072
9115E0810303K230003K232473K425335K762800K721430K633482L117270L454673
$$ plain form
9180 11411168 11692600 11865776 11728092 11650872 11727558 12154597 12197580 12232450 12145634 12219171
9170 12219171 12466857 12930064 13311585 13545883 14016944 14409748 14654067 15115207 15108254 15309615
9160 15309615 16157079 16766679 17154329 17480746 17729185 18653285 19119840 19426418 19676162
9151 19676162 19839340 20112535 20283242 20593174 20740428 21267050 21649397 21859925 21910894 21952627
9141 21952627 22326810 22437400 23042197 23626037 24191304 24709953 25327236 26213876 26389582
9132 26389582 27009319 28004386 28974955 29808593 30924086 32183839 33409150 34197074 35693119
9123 35693119 37747474 39075510 40640417 42568444 44248838 46495802 48487231 50810303
9115 50810303 53040306 55272779 57698114 60460914 63182344 65815826 68933096 72387769
9107G2387769M126091M633538M679152N212480N750025N697500N817368N871078
9099A14175001O080362O033690M545069M139695M054433L448386K252493J221237
9091A45950366M52798k94148j244563k012768k463640k272718j753012j375176
9083A34987139o96614L59078J373011K460205L651689M606079O168948P202498
9075A60112033Q547803R691098J0845336J2330786J4674519J6374348J7683409
9068B50259332K0080556K2079301K3577823K4283437K5367408K4935836K3183463
9061D13767156K1601484J9000765J6185643J3440595J0168421P164155L365663
9054E04693882K85710k567376o469242j0237551j3537845j5966437j8473206k0835549
$$ plain form
9107 72387769 76513860 81147398 85826550 91039030 96789055 102486555 108303923 114175001
9099 114175001 120255363 126289053 130834122 134973817 139028250 142476636 144729129 145950366
9091 145950366 146403164 146109016 144864453 142851685 140388045 138115327 136362315 134987139
9083 134987139 134290525 134649603 136022614 138482819 142134508 146740587 152909535 160112033
9075 160112033 168659836 178350934 189196270 201527056 216201575 232575923 250259332
9068 250259332 270339888 292419189 315997012 340280449 365647857 390583693 413767156
9061 413767156 435368640 454369405 470555048 483995643 494164064 501328219 504693882
9054 504693882 504979592 502412216 495942974 485705423 472167578 456201141 437727935 416892386
9046D16892386k2045153k2568439k3056501k2295387k2258090k1128519j9058258
9039B64482039j6239566j3813116j1906642r636520p182867m852816l113461j286171
9031A96450880O15144K648057M252716N457472O807528Q740851J0361851J0647176
9023B45981675J0887861R723089P960674O102758L523043N14674k479814n626195
9015B76587765q888394j1275963j2988821j4263343j4367575j5152122j4893764
9008A84757783j3375108j1643500j0774013r978973r093012q178003o495482n432217
9000A09787475m007228l817355l032943k384842j963013j189529K14289P48265
8992I4355119Q09162J327655K264364K730162K675544L345620L560245K785264
$$ plain form
9046 416892386 394847233 372278794 349222293 326926906 304668816 283540297 264482039
9039 264482039 248242473 234429357 222522715 212886195 205703328 200850512 197737051 196450880
9031 196450880 197066024 199714081 203966797 209424269 216231797 224972648 235334499 245981675
9023 245981675 256869536 266592625 274553299 280656057 284179100 284693774 282213960 276587765
9015 276587765 267699371 256423408 243434587 229171244 214803669 199651547 184757783
9008 184757783 171382675 159739175 148965162 138986189 129893177 121715174 115219692 109787475
9000 109787475 105780247 101962892 98929949 96545107 94582094 93392565 93606854 94355119
8992 94355119 95164281 96491936 98756300 101486462 104162006 107507626 111067871 113853135
8984A13853135K304254J537775P06734l17767j413151l435243m752804n090265
8976A03392668o009269n732834n888352o175659o196612n955329n095294l690624
8968E8648695l182823k777796k814678k682336j744916j674615j362704j124538
8960D1284289j342176j923009r98167n65453o77361n92598n06474p37965l93131
8951C3547955k35396l56416k84322n98127n54561p11954l49907M3161l57791l41717
8941B9800925j60497j37100m42848l53695N47791K02436J79706j30495J51776
8932B9657999L70904n776L57861N26257J35758O0887J30404L86901L28795J11269
8922C2061259R6396L18138J28764L20465k19112K52325J158624M02713R20295
$$ plain form
8984 113853135 116157389 117695164 118401898 118084131 116670980 113235737 108482933 103392668
8976 103392668 97383399 91650565 85762213 79586554 73389942 67434613 62339319 58648695
8968 58648695 55465872 52688076 49873398 47191062 45446146 43771531 42408827 41284289
8960 41284289 39942113 38019104 37020937 36455484 35778123 35185525 34679051 33941086 33547955
8951 33547955 33312559 32956143 32671821 32073694 31519133 30807179 30457272 30500433 30142642 29800925
8941 29800925 29640428 29503328 29060480 28706785 29254576 29457012 29636718 29506223 29657999
8932 29657999 30028903 30023127 30380988 30907245 31043003 31103890 31234294 31621195 31949990 32061259
8922 32061259 32157655 32475793 32604557 32925022 32705910 32958235 34116859 34519572 35439867
8913C5439867J061320Q26481P08445O13529J193436J533658J243728J436098J726721
8904D5783283J782096J810789J956888K623876K661276L094405L571690L559865
8896F6844168M060826M717308M454147N319869O442515O873782P645842Q149683
8888A14508140Q674014R173693R290566Q796038P976506O656590N038652L572205
8880A73686404K299815J173788l36028j256464k442564m194281n737507o244902
8872A56948261o611327o740013n646941m822520l779766k724510j385250J79190
8864A25417124J262279K495513L545881M631125O747176Q053762Q851347R109978
8856A70114185J0250588J0935144J1008749J0275674R722927Q838175P105401
$$ plain form
8913 35439867 36501187 37327668 38036113 38649642 39843078 41376736 42620464 44056562 45783283
8904 45783283 47565379 49376168 51333056 53956932 56618208 59712613 63284303 66844168
8896 66844168 70904994 75622302 80076449 85396318 91838833 98712615 106358457 114508140
8888 114508140 123182154 132355847 141646413 150442451 158418957 165075547 170114199 173686404
8880 173686404 175986219 177160007 176823979 175567515 173124951 168930670 163193163 156948261
8872 156948261 150336934 143596921 137949980 133127460 129347694 126623184 125237934 125417124
8864 125417124 126679403 129174916 132720797 137351922 144099098 152152860 161004207 170114185
8856 170114185 180364773 191299917 202308666 212584340 222307267 231145442 238250843
8849B38250843N208091L191787R78997j511991l796456o103450p591401r413871
8841B19212549j0543294j2008415j2524084j2138170j1804921j1548306j0860393
8834A37784966r436191p395158n582419m714669l528952k675274j388518m88103
8826A02575682J125385J916810K497137L452257L700617L751621L882953L408843
8818A26311305K404893J281400r556o20284j881907l345948m353009n031157o128339
8809A08627398o767747p013080p729521p765284o662929o256403n609159m762521
8801E6060754m368956m165664l003507k718006k824179k111100j810803j523323
8793C3535216j892324j506211j151557o14017p76452j067309r07300n07165l94636
$$ plain form
8849 238250843 243458934 246650721 247629718 246117727 242321271 236217821 228626420 219212549
8841 219212549 208669255 196660840 184136756 171998586 160193665 148645359 137784966
8834 137784966 128348775 120953617 115371198 110656529 107127577 104452303 103063785 102575682
8826 102575682 103701067 105617877 108115014 111567271 115267888 119019509 122902462 126311305
8818 126311305 128716198 129997598 129988042 129367758 127485851 124139903 119786894 114755737 108627398
8809 108627398 101859651 94846571 87117050 79351766 72688837 66432434 60823275 56060754
8801 56060754 51691798 47526134 44522627 41804621 38980442 36869342 35058539 33535216
8793 33535216 31642892 30136681 28985124 28371107 27594655 26527346 25620046 25112881 24718245
8784B4718245q54606m09202m15644n98760q06537j021747j085243r22790o88344
8775A7915372l49886O22l75456q25378p77382o30113j88931K10746l73623o23393
8765A3982578n56173p28661k20263l7054n83697l75274j00334M1321o41802n85407
8755A0195234j96282l39329r6857J069O9666j78799l16893o92700j85301J62030
8745H421838K03253m47301k21475l23756l24526O1673j04998q0181J54350L31548
8735G670425m08081m40299m3791l66575k56106L07920K41236J62421k6050m22617
8725F418483j70622K85521L513j77671p1686L75010k18624k84657l15363L6916
8715E880820J13680j48816J4085l09635j09331n2367K56798k81213m03136j24583
$$ plain form
8784 24718245 23863639 23454437 23038793 22440033 21633496 20611749 19526506 18603716 17915372
8775 17915372 17565486 17566108 17190652 16365274 15587892 14957779 14768848 14979594 14605971 13982578
8765 13982578 13426405 12697744 12477481 12440427 11856730 11481456 11381122 11422443 10780641 10195234
8755 10195234 9998952 9659623 9562766 9563835 9633501 9454702 9137809 8445109 8259808 8421838
8745 8421838 8625091 8177790 7956315 7632559 7308033 7369706 7264708 7184527 7338877 7670425
8735 7670425 7262344 6822045 6778254 6411679 6155573 6463493 6704729 6867150 6841100 6418483
8725 6418483 6247861 6533382 6536895 6359224 6287538 6662548 6443924 6159267 5843904 5880820
8715 5880820 5994500 5845684 5859769 5550134 5440803 5388436 5645234 5364021 4960885 4836302
8705D836302j96513M1984L8387J17556K4699J94522l6429M3830j55825r0971j17747
8694D699795k21833l5262M13219M93104J14722l25915l95959m6414j43328J49509
8684D701638l2248k79990k46058P6327K05162k73100J84370K6183n03269l23723
8674C535292o9647L65056l6890j5497K08723R7795m2735k65917j60848L2455L50495
8663C998282j51685j38931K69820k4945l2970p0312J89937j72917p7686K39239
8653D027832o1002j03325l60997n95276n15270L34709j02315l39591K76984M61846
8643C023595O6296r7328Q0187q8929K4607Q5479L21372J31569j69938l57916M63804
8632C482798K96164l51781m89179n2947J66467J16638J76662K0487m02219R9185
$$ plain form
8705 4836302 4639789 4681773 4720160 4837716 4862415 5056937 5020508 5064338 4908513 4817542 4699795
8694 4699795 4477962 4442700 4855919 5349023 5463745 5137830 4741871 4695457 4552129 4701638
8684 4701638 4669390 4389400 4143342 4219669 4424831 4151731 4336101 4362284 3859015 3535292
8674 3535292 3465645 3830701 3793811 3778314 3987037 4084832 4042097 3776180 3615332 3647787 3998282
8663 3998282 3846597 3707666 3977486 3952541 3919571 3849259 4039196 3866279 3788593 4027832
8653 4027832 3966830 3863505 3502508 2907232 2391962 2726671 2624356 2284765 2561749 3023595
8643 3023595 3089891 2992563 3072750 2983821 3008428 3093907 3415279 3546848 3376910 3018994 3482798
8632 3482798 3778962 3427181 2938002 2885055 3051522 3168160 3344822 3365309 2963090 3062275
8622C062275L36534M80229j12024j99718l50959l09686m8065K39194l19763l27353
8612B450664l8613j8506j38183j22596M78998l16200k64579K50636J97810o0126
8602B419305m28205j86803K02690K2985j03651M53355L77975k88162L99873r061
8592B860301j30159J79014L16322L94603M57685M26292Q3016q3414M25913J035807
8582E965380L88300L89960M59695J134536L44702Q76383J722757J99837J58237
8573A1639787k86527m77411j128788j132504j185639j203340p90681k90398r91016
8564D153483n76363m76700l39629j33353q9185J36213k33317m50733l74269k26900
8554A389247O0241m7396M8168j79826P0307K4930j46973O198k4986K86890q0489
$$ plain form
8622 3062275 3398809 3879038 3767014 3567296 3216337 2906651 2858586 3097780 2778017 2450664
8612 2450664 2412051 2393545 2255362 2132766 2611764 2295564 2030985 2281621 2479431 2419305
8602 2419305 1991100 1804297 2006987 2029972 1926321 2379676 2757651 2469489 2869362 2860301
8592 2860301 2730142 2909156 3225478 3620081 4077766 4504058 4587074 4503660 4929573 5965380
8582 5965380 6353680 6743640 7203335 8337871 8682573 9558956 11281713 11481550 11639787
8573 11639787 11353260 10875849 9747061 8614557 7428918 6225578 5434897 5144499 4153483
8564 4153483 3577120 3100420 2760791 2627438 2538253 2674466 2441149 1990416 1616147 1389247
8554 1389247 1449488 1402092 1450260 1270434 1340741 1365671 1218698 1224896 1199910 1486800 1406311
8543A406311j62359j17873M9098J7817K2567J97793M2084k28727o43655R7753
8533F80809M44207k85948j86346K55821L68538J89865j6963q3490l8000l02307
8523A026186l20776L56352L36347K5391m07667k40398J88542L59380K73518P2311
8513A669186n51542k89644K60751j25215k31036l0745n8888L4890J80625M8273
8503I06655N2321j93694P009k51542k1652J64409m6644J11984L50346l1192j03991
8492I44009J07301K42074k99215K20980L43915r8791m06236l7725k34380J57195
8482I39127K02510J18370j54367m27554J24135Q5938o6488l5503j94897j8130
8472E73141j45109J4950P8605J35383N8504k91000m1061K95506J16880k5140j00304
$$ plain form
8543 1406311 1243952 1126079 1175177 1192994 1215561 1413354 1455438 1226711 583056 680809
8533 680809 1125016 839068 652722 908543 1277081 1466946 1449983 1366493 1328493 1026186
8523 1026186 705410 1061762 1398109 1423500 1015833 775435 963977 1323357 1596875 1669186
8513 1669186 1117644 828000 1088751 963536 732500 701755 642867 677757 858382 906655
8503 906655 958976 765282 772291 520749 499097 663506 616862 728846 1079192 1048000 944009
8492 944009 1051310 1293384 994169 1215149 1559064 1460273 1054037 1016312 781932 939127
8482 939127 1141637 1260007 1105640 678086 802221 888159 821671 786168 591271 573141
8472 573141 428032 442982 521587 656970 715474 424474 383413 678919 795799 770659 670355
8461F70355j65275M84095L38100K13694l79823K07181K39740l4013j00541k00531
8451A272982l39493r8144J08234j66050k66666j27746K09268M49263M10098k60893
8441A190853J86204J10785l51492k59715K41340Q5952m87818j13325J33881o4613
8431F72052K66417k51508m23528R630J72221J21479N9449k97724P8149J32589
8421E39226J52919L7719k45356n5317l12112k93807J17808j84900k29849L83178
8411i0491N25629q4305o21607n0870M73784j20500k14468K26578m1045j85103
8401a82398j18877L54780N1593n60081m12677N7523L58613K63318k06339n74147
8391i68692j34605N15271M28199j0496n18874J66107J88359r6502j28523K6154
$$ plain form
8461 670355 505080 989175 1327275 1540969 1161146 1368327 1608067 1574054 1473513 1272982
8451 1272982 933489 835345 943579 777529 510863 383117 592385 1041648 1451746 1190853
8441 1190853 1377057 1487842 1136350 876635 1117975 1203927 716109 602784 736665 672052
8431 672052 938469 686961 263433 273063 445284 566763 626212 328488 406637 539226
8421 539226 692145 729864 484508 429191 117079 -176728 -58920 -243820 -473669 -90491
8411 -90491 435138 350833 -270774 -321644 152140 31640 -182828 43750 2705 -182398
8401 -182398 -301275 53505 105098 -454983 -867660 -810137 -451524 -188206 -394545 -968692
8391 -968692 -1103297 -588026 -159827 -170323 -689197 -523090 -334731 -431233 -559756 -533602
8381e33602q0612l10936K12938L39880l61208J89267O5983L69595J1197j67217
8371b64715J3422k10935l58930L57741M75491J10201k54710k5959M79986P3344
8361C94936k68067o55145j2069M30412J86032j19373R7119l12330k06636J49539
8351c15582L81474l937m00617o5257N9613K29326j32581j34748K17120N4880K08376
8340I8067p9529l24550p7K34285J82549J07991p4469l45687k19992J14192O63243
8329C56023O3975l94675l57595J24437L25415R4435k01440J40436j54495k22093
8319b25577K20610L02928r0456K3829K68914l84126k44226l64018k8223K11973
8309c08372K5175l06386l0623l575J30757J00971K42287J75543j52839k03566
$$ plain form
8381 -533602 -614214 -925150 -712212 -372332 -733540 -544273 -478290 -108695 -97498 -264715
8371 -264715 -251293 -462228 -821158 -463417 12074 122275 -132435 -158394 321592 394936
8361 394936 126869 -528276 -540345 -109933 76099 -43274 53845 -258485 -465121 -315582
8351 -315582 65892 61955 -338662 -403919 -344306 -114980 -247561 -382309 -165189 -110309 98067
8340 98067 18538 -306012 -306089 -71804 110745 218736 144267 -201420 -421412 -307220 356023
8329 356023 419998 25323 -332272 -207835 117580 212015 10575 151011 -3484 -225577
8319 -225577 -4967 297961 207505 231334 500248 116122 -128104 -492122 -520345 -308372
8309 -308372 -283197 -589583 -620206 -623781 -493024 -392053 -149766 25777 -127062 -330628
8299c30628J91109J8352Q5276n6130k71110N8182L45586J68396l26612l67702
8289d85281p9794O1372R4046J18566Q5754m40316l57354P51967P69770L2144m97456
8278E3418j26607L13750r3807k60982o8551K92786j3851k37497j683J33498j50255
8267a59781k90538j84287K32223N01019k80846l63451J53037K48758L00003k3862
8257A32275k16987j43892R163J44568J27719J31215m20962Q0067K4062j01674
8247b34446j16987j5465K62447K3324k13488l52596M26914K75245j62076j85326
8237b92454L02220R8444k28450l3790M98772L49216n53288n98240J94443M32832
8227A69705J3450p0353j4187j56632k07064j58180J53868J96700R6548q3647L56309
$$ plain form
8299 -330628 -139519 -121167 -35891 -92021 -363131 -304949 40637 209033 -117579 -485281
8289 -485281 -565075 -503703 -409657 -291091 -205337 -645653 -1003007 -251040 518730 550874 53418
8278 53418 -73189 240561 146754 -114228 -182779 110007 96156 -141341 -143024 -9526 -159781
8267 -159781 -450319 -634606 -402383 98636 -182210 -545661 -392624 -143866 156137 132275
8257 132275 -84712 -228604 -219441 -74873 52846 184061 -236901 -156834 -132772 -234446
8247 -234446 -351433 -366898 -104451 -81127 -294615 -647211 -220297 54948 -107128 -292454
8237 -292454 9766 108210 -120240 -154030 344742 693958 140670 -457570 -263127 169705
8227 169705 183155 112802 98615 -58017 -265081 -423261 -269393 -72693 23855 -59792 296517
8216B96517L21508m82802k68909J25338M52169k1567j87296l09618p925m1427
8206a24012j92818l63701n2530j22913k37938O59867L98081K08494r04878k56667
8196i89015R89040R87882K53219q58261p02572p21267J98982P09351K93998n61960
8186d00603o40822k35951O71651K38986k96836k65566J24912K25762K89665N63013
8176B74211m6457p13996m24346M72875L62103J84600k78421p02779l80323L91946
8166h60587K46242J33567n1037L24884o6925l78027J74567N86914m8982m72491
8156d11875L39251K71505l75116o34616J34241L61913l44214k05837N1679j64111
8146i77180j9570K7982K16213K31470K96395L932J18632J3092n5914J8750J6275
$$ plain form
8216 296517 618025 135223 -133686 -8348 443821 422254 234958 -74660 -82585 -124012
8206 -124012 -316830 -680531 -733061 -855974 -1093912 -434045 -35964 172530 -732348 -989015
8196 -989015 25 987907 1241126 382865 -319707 -1040974 -841992 -132641 161357 -400603
8186 -400603 -1041425 -1277376 -605725 -366739 -663575 -929141 -804229 -578467 -288802 274211
8176 274211 227754 -486242 -910588 -437713 -75610 108990 -169431 -872210 -1252533 -860587
8166 -860587 -614345 -480778 -531815 -206931 -273856 -651883 -477316 109598 60616 -411875
8156 -411875 -72624 198881 -176235 -810851 -676610 -314697 -658911 -864748 -813069 -977180
8146 -977180 -996750 -968768 -752555 -521085 -224690 -220758 -102126 -89034 -144948 -126198 -109923
8135a09923R4427R3479l55890l24813O19188q3958k52601O8930K7913j67577K6030
8124c64795L49673K45539j81360j99309J26534K50064K16106p1898j45251N8528
8114B83831J81767m02353L3404L42345K13384l59627m53771J94220J57378k3648
8104A66930l47088j0673J35185k79524Q242J9400K30q5744J11988K59643L6173
8093A4762k6324j78892m38765l45630J28451N87750K82577k31257k73080k32441
8083g12849k4070N51227q448m52212P6512K45252J74924k40249k01136k6508q8358
8072g05915L15803L46772J75263j28325m61745k38048K68199J14489R3277J17862
8062a02368j50726r5492K2712L39287J46301r6626K26846j4969m06827l85117
$$ plain form
8135 -109923 -15496 77983 -277907 -602720 16468 -67490 -320091 -251161 -223248 -390825 -364795
8124 -364795 -15122 230417 49057 -150252 -23718 226346 442452 370554 225303 283831
8114 283831 465598 63245 96649 438994 652378 292751 -161020 33200 190578 166930
8104 166930 -180158 -190831 -55646 -335170 -326928 -307528 -307298 -393042 -281054 -21411 14762
8093 14762 -11562 -190454 -629219 -974849 -846398 -258648 23929 -207328 -480408 -712849
8083 -712849 -736919 -185692 -194140 -646352 -569840 -324588 -149664 -389913 -591049 -617557 -705915
8072 -705915 -390112 -43340 131923 3598 -458147 -696195 -427996 -313507 -220230 -102368
8062 -102368 -253094 -348586 -325874 13413 159714 63088 289934 274965 -131862 -516979
8052e16979k90442J95081N14679K72598J00330j33737l72056r4715l23421K50223
8042c98439P5683J1819L4534L5407l9392K77666K94873j45783o90869J85464Q1899
8031b77138n8276r341R6647J57782j86369l46924n3047J71148j01167k356j17000
8020g26041N7356M97763M34807K5688o77055j47369L37315j06286o8324l4569
8010d06715M20670l82202m27117N0190L29690J12820m7714j82226J9586K21924
8000b91094J60673j75741k41746j03357N03066K74505N5068j43823m16582j64797
7990e43828P234O4157K31890m5676l50084r4352l0107L6600L91362N26432o430
7979A87198J02406k17956l01076J26080k89120r5127J15481Q7736l3539k12663
$$ plain form
8052 -516979 -807421 -612340 -97661 174937 275267 141530 -230526 -325241 -648662 -398439
8042 -398439 -322756 -310937 -276403 -240996 -280388 -2722 292151 146368 -544501 -359037 -277138
8031 -277138 -335414 -344755 -248108 -90326 -276695 -623619 -676666 -505518 -606685 -609041 -726041
8020 -726041 -668685 -170922 263885 289573 -387482 -534851 -197536 -303822 -372146 -406715
8010 -406715 13955 -368247 -795364 -745174 -415484 -302664 -350378 -532604 -513018 -291094
8000 -291094 -130421 -306162 -547908 -651265 -148199 126306 181374 37551 -379031 -543828
7990 -543828 -536594 -472437 -240547 -286223 -636307 -730659 -760766 -724166 -332804 193628 187198
7979 187198 289604 71648 -229428 -103348 -392468 -487595 -372114 -284378 -317917 -530580
7969e30580J10749R7219j19762K19467L3884K39299L59210r5568n5261j57161
7959A01496J40758L26564r103q04240j25570J29540k46748L15761J59917j64389
7949a76014k08567K5300K83943M12512J57059k91433l84887K0082M97608L45702
7939F81305l03821p05657l18522K01867K35898q37K7255Q7705k46337l10531Q4686
7928e66989M23733r6399j58788K82667p872j43548j6839M7916o2501j1255N8479
7917b51396k61581r1894J20060K62237j3471k94938J98940J42564j71694N3865
7907c07308J25825k55470l62416r4620L41024O14101l3787k91787J51363j25864
7897b38939L4476M27604l41905k91946o814J6968J24911J6489J17943j0430j55627
$$ plain form
7969 -530580 -419831 -322612 -442374 -222907 -189023 50276 409486 313918 258657 101496
7959 101496 242254 568818 559715 -244525 -370095 -240555 -487303 -171542 -11625 -176014
7949 -176014 -384581 -359281 -75338 337174 494233 202800 -182087 -162005 335603 681305
7939 681305 377484 -328173 -646695 -444828 -208930 -209767 -182512 -94807 -341144 -651675 -566989
7928 -566989 -143256 -239655 -398443 -115776 -123648 -267196 -284035 -236119 -298620 -309875 -251396
7917 -251396 -512977 -604871 -484811 -222574 -236045 -530983 -332043 -189479 -361173 -307308
7907 -307308 -181483 -436953 -799369 -893989 -552965 61136 27349 -264438 -113075 -238939
7897 -238939 -204463 223141 -118764 -410710 -417524 -400556 -275645 -259156 -141213 -151643 -307270
7886c07270j13189J0329L08473K50612m72846k84700J93478J88723k808J18482
7876a10716q832O3318J43381l91281k9362L8974L88847q4157l54123l684K36268
7865a11367J72206J9846J1907l1000R7762k17053K21096L7994K42576k87418l08842
7854a52293O7773j25232O788N4993J89098p8768k02238Q357J26266M6712K40241
7843A81697J17730k37842j0975R277j72717R8781L56678k20154m42633j90511
7833e10669R7227K9906j77371k21772J04279M17862n9743k63292J14226L44899
7823a24448N3514K0465P5659j21897j57444M32201K42423j89243M690m14562J09493
7812f9149K25221L2149k30141k68090J43309M7103K07752K64072k49855p4493
$$ plain form
7886 -307270 -420459 -410130 -101657 148955 -323891 -608591 -415113 -226390 -229198 -110716
7876 -110716 -119548 -56230 87151 -304130 -333492 -294518 94329 10172 -343951 -347635 -111367
7865 -111367 60839 80685 92592 61592 159354 -57699 163397 201391 443967 156549 -152293
7854 -152293 -84520 -209752 -202964 -147971 41127 -37641 -239879 -231522 -105256 -58544 181697
7843 181697 299427 61585 50610 59887 -112830 -14049 342629 122475 -320158 -510669
7833 -510669 -413442 -383536 -560907 -782679 -678400 -260538 -320281 -583573 -469347 -124448
7823 -124448 -70934 -50469 25190 -96707 -254151 178050 420473 231230 235920 -178642 -69149
7812 -69149 156072 188221 -41920 -310010 -166701 -119598 88154 352226 102371 27878
7802B7878M09678K12997k86683j04623N33322K05360M2259M1282J21469k70093
7792I32846j36731N07947L70022l61577k25316j02353J9962M9788K02596K04349
7782A461533l59864n28201O0191J36805q3467l13043k82454J8664K94271J16698
7772E21133J48788l6783m48073K02172K61579Q8767J30358K55794q0848R3625
7762A136512Q5162O7430J55454J25086K72055l07929l01067j51156N7754j09581
7752A029720n50397l69185L26051n0306r0609J81461j26329k13318J96952R8327
7742D32367O6542K93564j75922q7237l52499L22208K05821L7331K79529l01241
7732G20463n42922l31426J68086L37480p3993J08785l14579k26343j40326L41094
$$ plain form
7802 27878 437556 650553 363870 259247 792569 997929 1040188 1081470 1202939 932846
7792 932846 796115 1304062 1674084 1312507 1087191 984838 1004800 1054588 1257184 1461533
7782 1461533 1101669 573468 633659 770464 686997 373954 91500 110164 404435 521133
7772 521133 669921 633138 185065 387237 648816 737583 867941 1123735 1042887 1136512
7762 1136512 1221674 1289104 1444558 1569644 1841699 1533770 1232703 1081547 1139301 1029720
7752 1029720 479323 110138 436189 385883 295274 476735 350406 137088 334040 432367
7742 432367 498909 792473 616551 529314 176815 499023 704844 742175 1021704 720463
7732 720463 177541 -153885 14201 351681 277688 386473 71894 -154449 -294775 46319
7722D6319L0271K87860P5275k93744j82804r0925k3408J79335J04080l44703L8596
7711a73848k64448l08412K6823J80109p3401k7448k506J17682J33272J18553K27331
7700d6293j25072l72080L00248K17317P597n9600K9299l03177K87031L82228k5525
7689B91973k20208l85516J96744J94916K09496r4328m76021j36965j53886M90579
7679h3216K58388J63164k59780l82047R6335N2573J73996j48927l64493R4262
7669c99745L43429M8474L2249k30505N5672K99628J08174j25323m07561k62005
7659e37513r3169N76111K60502j64385P8397k71311L792K75412J63146k75651
7649A5331j13299k16703k51947K56840M36610k38526j04352j86614l13418K40614
$$ plain form
7722 46319 76590 364450 439725 145981 -36823 -127748 -151156 28179 132259 -212444 -173848
7711 -173848 -438296 -746708 -719885 -539776 -613177 -640625 -643131 -525449 -392177 -273624 -46293
7700 -46293 -171365 -543445 -243197 -25880 -18283 -77883 -48584 -351761 -64730 317498 291973
7689 291973 71765 -313751 -117007 77909 287405 193077 -282944 -419909 -573795 -83216
7679 -83216 175172 338336 78556 -303491 -207156 -154583 19413 -129514 -494007 -399745
7669 -399745 -56316 -7842 24407 -206098 -150426 149202 257376 132053 -275508 -537513
7659 -537513 -630682 -54571 205931 41546 119943 -151368 -147576 127836 290982 15331
7649 15331 -97968 -314671 -566618 -309778 126832 -111694 -216046 -402660 -716078 -475464
7639d75464K47235M43703q0056O5748j9418J81396J851m68723J37334k19183m09728
7628e95305j053L87613J80593j85408l21907J286N47003O4351j66984r5199l23504
7617e08514K04497N63169k62012o98110K54740K68117Q5447J9623k5196j16884
7607b15123j71116M11664K1378l29926j96753J4732n4210J82001O2107L0330J39030
7596a05886k20709O1281J49813j12720j78746J09304J75045j56920J32843l5923
7586a82618L20919p370j76929j97351l48230j9264N74205L56196l21219P6571
7576G4910j48515J24441P6185K46331l638k80988l05717k16359M75565N58925
7566F01140j94162k83512l56118K1787L21940J04808J38406j36859k49245k93545
$$ plain form
7639 -475464 -228229 215474 135418 201166 181748 363144 364995 -103728 33606 -185577 -595305
7628 -595305 -596358 -208745 -28152 -213560 -535467 -534181 12822 77173 -89811 -185010 -508514
7617 -508514 -304017 259152 -2860 -700970 -446230 -178113 -92666 -73043 -98239 -215123
7607 -215123 -386239 25425 46803 -283123 -479876 -465144 -519354 -337353 -275246 -244916 -105886
7596 -105886 -326595 -265314 -115501 -228221 -406967 -297663 -122618 -279538 -146695 -182618
7586 -182618 138301 130931 -45998 -243349 -591579 -610843 -36638 319558 -1661 74910
7576 74910 -73605 50836 127021 373352 369714 88726 -216991 -433350 42215 601140
7566 601140 406978 123466 -232652 -210865 111075 215883 354289 217430 -31815 -325360
7556c25360J88424K49703M29731N2994o73800j67400K95636O9341N7590J41310
7546C18169m21435q1364R7918L30184L83873j21925n02571q1696K05438L09985
7536D36576q3791n4726l60965k06018J06425J26020J92940J27317j04580j10285
7526F8913j35953j84351N20735L0030K28779J5510n44429p2121M06825K34528
7516E68466k52104l82447N3560k26069j81066J92579k8846J21206j79599k35102
7506e49422O3701O56953R308j41530l51927k7519M40902J45732O1179m6151j04131
7495A57095q1583K24867j2005n7293N7930Q7876k56853j10661M5129K2360j2287
7484F4575L0149n7048R6560j71767K66611J28984l14200O5036J75548J59655j8512
$$ plain form
7556 -325360 -136936 112767 542498 595492 -78308 -245708 49928 119269 176859 318169
7546 318169 -103266 -184630 -86712 243472 627345 505420 2849 -78847 126591 436576
7536 436576 352785 298059 -62906 -268924 -162499 -36479 156461 283778 179198 68913
7526 68913 -67040 -251391 269344 299374 528153 543663 -766 -72887 333938 568466
7516 568466 316362 -66085 -12525 -238594 -419660 -227081 -255927 -134721 -314320 -549422
7506 -549422 -485721 171232 180540 39010 -312917 -340436 100466 246198 307377 261226 157095
7495 157095 75512 300379 288374 231081 289011 376887 120034 9373 54502 76862 64575
7484 64575 94724 37676 134236 -37531 229080 358064 43864 108900 284448 444103 425591
7473D25591k29382L60269j35269j78145K2583L81215N0328M5296o7053l52621
7463C22812k13883R5796J30080K60277l03363p243J23395k01361R303J86839J23138
7452E25790l0198J13438j14304k2747k63628O9973J7273K54016K26491j53030
7442F23074l96338o4942L91872k8561l19975k68899J22084L52617J63364K67792
7432H42088l0024k13006n47684J04887N30131K62501l39983j54260J67970K53816
7422H76436J14156K5102L59400j92260p55514j5596K70693O7122M5980l64805
7412D30714L7548K64041j81158K8258J20031M37508n3378k51230k79259j69321
7402C83754M51503L66058r4377j35939M78960o6522n12197j16382K83221k04672
$$ plain form
7473 425591 196209 556478 421209 243064 265647 646862 697190 742486 675433 322812
7463 322812 108929 204725 334805 595082 291719 284476 407871 206510 215813 402652 525790
7452 525790 495592 609030 494726 471979 208351 278324 295597 549613 776104 623074
7442 623074 226736 161794 553666 525105 205130 -63769 58315 410932 574296 842088
7432 842088 812064 599058 51374 156261 686392 948893 608910 454650 622620 876436
7422 876436 990592 1015694 1375094 1182834 427320 411724 682417 749539 795519 430714
7412 430714 468262 732303 551145 579403 699434 1136942 1083564 832334 553075 383754
7402 383754 835257 1201315 1106938 970999 1449959 1383437 871240 754858 1038079 833407
7392H33407j57465j11381L20846M07464l11845J99275K58941j76965N28793K17826
7382B008896n24315n30757J88774L30832J04014J41559j42006j48528m3446j49935
7372A235088k9388M35360J81175K65923k55762l99419J59142M84365j01167l36643
7362A638674k16623O0355L90902L14158j46058j54223p7003O8213L6934r5035
7352A820294L584l4917K37368L08388K01575N5479j00338q8935n1567L76506K79949
7341C007386j39233l51029L01726M27352K38830M9008n40217n57330J56808O53453
7331C246754L89057p8825L2794q4746j80538L34362P6350K94715J30592k70237
7321C890278o1655O17296L75175j50555k87395J09226L13560L93698O021j37985
$$ plain form
7392 833407 675942 564561 885407 1292871 981026 1180301 1439242 1262277 1791070 2008896
7382 2008896 1484581 953824 1142598 1473430 1577444 1719003 1576997 1428469 1385023 1235088
7372 1235088 1205700 1641060 1822235 2088158 1832396 1432977 1592119 2076484 1975317 1638674
7362 1638674 1422051 1482406 1873308 2187466 2041408 1887185 1810182 1878395 1915329 1820294
7352 1820294 1823878 1788961 2026329 2334717 2536292 2591771 2491433 2402498 2350931 2727437 3007386
7341 3007386 2868153 2517124 2818850 3246202 3485032 3534040 2993823 2436493 2593301 3246754
7331 3246754 3635811 3556986 3589780 3505034 3324496 3658858 3735208 4029923 4160515 3890278
7321 3890278 3828623 4445919 4821094 4670539 4383144 4492370 4805930 5199628 5205649 5067664
7311E067664l11401M05610M95391L45285k58239R6510N12270K39312K62913K3236
7301F878551J23024J11973L17180L70033L37248L1541M19755L77352J90057K84015
7291I440729P9351Q9770J78579L75138M25716L92081N42267J16467M04592N56613
7281A2601303O74084N71590M46415P55502Q60374Q02101M17599L54428O90924
7272A8174320P27407Q65529J065666O32127O88315J423241Q59242N24020J098005
7263B6057872J435373J386257J266065J567940J227021R93198P89150J173486
7255C5896362J415293R72328N99780R26147J000981J155548J002654N82524M03451
7246D3955068O05173P98227M55216L65297M44329M61074j75368L9086N48027J62009
$$ plain form
7311 5067664 4756263 5161873 5657264 6002549 5744310 5840820 6353090 6592402 6855315 6878551
7301 6878551 7001575 7113548 7430728 7800761 8138009 8169550 8589305 8966657 9156714 9440729
7291 9440729 9520080 9609850 9788429 10163567 10589283 10981364 11523631 11640098 12044690 12601303
7281 12601303 13275387 13846977 14293392 15048894 15909268 16711369 17128968 17483396 18174320
7272 18174320 18901727 19767256 20832922 21465049 22153364 23576605 24435847 24959867 26057872
7263 26057872 27493245 28879502 30145567 31713507 32940528 33933726 34722876 35896362
7255 35896362 37311655 38283983 38883763 39809910 40810891 41966439 42969093 43551617 43955068
7246 43955068 44560241 45358468 45813684 46178981 46623310 47084384 46909016 46948102 47496129 47658138
7236D7658138q04974n05702k49769l43397l81514m36251j013937r52330p76101
7227D2194163r55755q49036r51644j432478j080394j033970r68085j315418j250401
7218C2356982j075788j205489j268268j443549q55110j086248j172444r96060
7210B3254026j016919j219868o62636p64478q10260o53949p13393j015847n40729
7201A5855947l09623m10201o32509n67132q58429m63079m59175m06125K01481
7192A1951155m39554r29496m33997K35120l39355o51822j19325o347k59129n19851
7182H487399k28927k94605l65433m91103n1176r7035j67620j80898k70952n8377
7172F281273n2470j14449o8263j29143M2239k46204m25737J9552k55016O3090
$$ plain form
7236 47658138 46853164 46347462 46097693 45754296 45372782 44936531 43922594 42970264 42194163
7227 42194163 41238408 40389372 39437728 38005250 36924856 35890886 34922801 33607383 32356982
7218 32356982 31281194 30075705 28807437 27363888 26508778 25422530 24250086 23254026
7210 23254026 22237107 21017239 20354603 19590125 18779865 18125916 17412523 16396676 15855947
7201 15855947 15546324 15136123 14503614 13936482 13078053 12614974 12155799 11749674 11951155
7192 11951155 11511601 10582105 10148108 10383228 10043873 9392051 9272726 9266379 9007250 8487399
7182 8487399 8258472 7963867 7598434 7107331 7056155 6959120 6791500 6610602 6339650 6281273
7172 6281273 6228803 6114354 6046091 5916948 5959187 5712983 5287246 5306798 5051782 5114872
7162E114872m00729m49462K75224m37560k03883J32751N7235O922j65152K87330
7152D217548n42542k29330j64496J66238J28966P9654k74728k61447l16685j95191
7142B607987j90356J15628K48282Q7398j46774m71522j7813O5178j69877K02058
7132B330189J98418j34477n21815k09288L99113L71674k92384m82718p7836L4156
7122A615032J58266M7826j30654M3817K43151M6698j33666l2941j40378l04239
7112A412912L58831K52456j60286k67651j72427k00443k3964K24284J33693j44693
7102A412712j81758J75242M70387K04265l78764k38835L0043J33906j33760l12059
7092A181379j52827K15269p3113k36082L71938m8644J45824P5397K56177J42643
$$ plain form
7162 5114872 4714143 4264681 4539905 4102345 3898462 4031213 4088448 4095370 3930218 4217548
7152 4217548 3675006 3445676 3281180 3447418 3576384 3656038 3381310 3119863 2803178 2607987
7142 2607987 2417631 2533259 2781541 2868939 2722165 2250643 2232830 2298008 2128131 2330189
7132 2330189 2528607 2394130 1872315 1663027 2062140 2433814 2141430 1658712 1580876 1615032
7122 1615032 1773298 1821124 1690470 1734287 1977438 2024136 1890470 1857529 1717151 1412912
7112 1412912 1771743 2024199 1863913 1596262 1423835 1223392 1199428 1423712 1557405 1412712
7102 1412712 1230954 1406196 1876583 2080848 1702084 1463249 1493292 1627198 1493438 1181379
7092 1181379 1028552 1243821 1170708 934626 1306564 1257920 1403744 1479141 1735318 1877961
7082A877961k75866j62949j32399o1677K73096k77807j16771j89549l28610J32749
7072G38178L86165K26089M2114k35181k85947M31347K31280p20227L543L27651
7062A145012l0928P3257l81263l63508L1549K503m6453R6258k75477o1575L07756
7051D97131j17890J66736K08331J55113l47374j78136j81088j70642K38971J78048
7041D49200j28126j13305K29812M26926p2280p49942J80451M03511N425k23460
7031D08212K52492k13076l89663j97688K34630N39475j19374o60597k0307O94910
7021E29014J214l28562J07246k01714J39080L05220K15944Q2691l72824m67919
7011I390j95083L81963N59377L5313L9047j35455l94112j32048K95910K27559
$$ plain form
7082 1877961 1602095 1439146 1306747 1245070 1518166 1240359 1123588 934039 605429 738178
7072 738178 1124343 1350432 1392546 1157365 871418 1302765 1534045 813818 817361 1145012
7062 1145012 1114084 1187341 806078 442570 474119 476622 430169 526427 250950 189375 497131
7051 497131 379241 545977 754308 909421 562047 383911 202823 32181 271152 449200
7041 449200 321074 207769 437581 864507 792227 42285 222736 626247 631672 408212
7031 408212 660704 447628 57965 -139723 94907 634382 515008 -145589 -165896 529014
7021 529014 530228 201666 308912 107198 246278 551498 767442 850133 477309 9390
7011 9390 -185693 196270 755647 790960 830007 694552 300440 168392 464302 691861
7001F91861K66741k34526j08155L03428o5454L1316J21167j57094k83806k2010
6991E43468l02461K5314K71668J81543l92060j05765O8722L6679K14355P8169
6981F19632l81347K44323q5395j11513J96640j27636k12986Q0149k5462L9959
6971B36364M40427J71544Q8926l60910m04591k8538K34150L580m25688l03170
6961c47906M25933K04005N5577k88658q7742J71284J73764j57827R2283L0924
6951B71637J2995Q9572K26434K07195k87914l80931J03664M60466J72714j75850
6941F99982m56777n36131k29768L43036L84182K80220k6428j34525O7012K23314
6931F14117J2713K3109J51066l75780m73547j77040K72816L81404K00947j34888
$$ plain form
7001 691861 958602 724076 615921 919349 853895 885211 1006378 849284 565478 543468
6991 543468 241007 266321 537989 719532 327472 221707 290429 327108 541463 619632
6981 619632 238285 482608 397213 285700 482340 354704 141718 221867 196405 236364
6971 236364 676791 848335 937261 576351 171760 143222 377372 380952 -44736 -347906
6961 -347906 78027 282032 337609 48951 -38791 132493 306257 148430 240713 271637
6951 271637 284632 374204 600638 807833 519919 138988 242652 703118 875832 699982
6941 699982 243205 -292926 -522694 -179658 204524 484744 458316 323791 390803 614117
6931 614117 626830 649939 801005 425225 -48322 -225362 47454 428858 629805 494917
6921D94917j31854j31908l1489K77196N57165K23628m99774n58106l25849K3240
6911a02834K92970M8361l33435l13375k79943M12841N04903J7467j13122R6289
6901B30122M93042J19587l18716k22460l15201M88715J33257j97777J03286j90050
6891C23805p9213k14754k52562L62066K51494L6751k0866K12735k55852k75012
6881H8592j07225K41490N31081N53843j51914o77030j48733J95876M71007k4726
6871I72261m41991k54479k0755M5394L75731L3393k21766j5011k23133m9120k56552
6860e6028J75451K0949n07080J09818M38687K62102j50607J25753o8236Q8923
6850D39732N9188K26513j10154R2546J68118k88959o52579j18263L36387J35973
$$ plain form
6921 494917 363063 231155 199666 476862 1034027 1257655 757881 199775 -126074 -102834
6911 -102834 190136 238497 -94938 -408313 -688256 -275415 229488 246955 133833 230122
6901 230122 723164 842751 524035 301575 -13626 475089 608346 410569 513855 323805
6891 323805 244592 29838 -222724 139342 390836 427587 406721 619456 363604 88592
6881 88592 -18633 222857 753938 1307781 1155867 478837 330104 525980 996987 972261
6871 972261 530270 275791 255036 300430 676161 709554 487788 472777 249644 200524 -56028
6860 -56028 119423 140372 -366708 -256890 181797 443899 293292 419045 350809 439732
6850 439732 498920 725433 615279 707825 875943 586984 -65595 -183858 152529 288502
6840B88502L2521J17136J27965j77566j05815K08807M4968J28021j7810J24627
6830G71356J639j20664P6228j72466O3462k02462m9854M9602J66334j98320J02131
6819D86986J96620M09021M76441n06770o79511J71749L31487j83478l21029J58468
6809E39984J11309k88366J83307K95071j03388j808r4387j97632J70143L38908
6799I53141p5648j55305k40215L3269L83583J4354k53868J9311p1068L18039N6403
6788I81996m05063N6702L4299K17035M0921J4575J65420J98326l12048k12644
6778G79519k00475K24650J67020l172j18163J81695J32902M9013j09500N9160
6768A162649j48881k90537J75322K48456K86441m9360j1874m5136L39875j39415
$$ plain form
6840 288502 321023 438159 566124 388558 282743 491550 536518 664539 646729 771356
6830 771356 772995 652331 728559 556093 619555 417093 367239 416841 583175 384855 486986
6819 486986 683606 1092627 1569068 1062298 382787 554536 886023 702545 381516 539984
6809 539984 651293 362927 546234 841305 737917 736109 641722 444090 614233 953141
6799 953141 877493 722188 481973 515242 898825 913179 659311 678622 607554 925593 981996
6788 981996 576933 633635 667934 884969 925890 940465 1105885 1304211 992163 779519
6778 779519 579044 803694 970714 967542 849379 1031074 1163976 1212989 1103489 1162649
6768 1162649 1013768 723231 898553 1147009 1433450 1384090 1372216 1327080 1666955 1527540
6758A527540m33662k58101n2876P1174Q0166N7978j57263j23029K70655M7982
6748A030564M31881L75638n84309m35110M24170o879m3107J84544L67378k71876
6738A472894m66349q1826P6396K51928j16061N5969J06621k40258j48724J36068
6728A046658J87202Q13666K57954n84106k57308J50530L88206L4840m01986k14635
6718A421021k86059k01711L67934L54671J85322J7753j39809L36791l5316P3208
6708B093805N4157Q6729O8641k64269j87061L32367Q872k73112k20896J76871
6698A876104K8301m15055O1715l1047J33973R359P1882J37886L47787m1694P4913
6687B254124L47718J31539q5827l0238l77323J00961p0723m59550K56882J97734
$$ plain form
6758 1527540 1093878 835777 782901 854075 934241 992219 834956 711927 982582 1030564
6748 1030564 1462445 1838083 1253774 818664 1242834 1235955 1192848 1377392 1744770 1472894
6738 1472894 1006545 924719 1001115 1253043 1136982 1192951 1299572 1059314 910590 1046658
6728 1046658 1233860 2047526 2305480 1721374 1464066 1614596 2002802 2037642 1635656 1421021
6718 1421021 1134962 933251 1301185 1655856 1841178 1858931 1719122 2055913 2020597 2093805
6708 2093805 2147962 2234691 2303332 2039063 1852002 2184369 2193241 1920129 1699233 1876104
6698 1876104 1904405 1489350 1551065 1520018 1653991 1663350 1735232 1873118 2220905 2179211 2254124
6687 2254124 2601842 2733381 2647554 2617316 2239993 2340954 2270231 1810681 2067563 2265297
6677B265297K06921J74358j86480l37205J36665l37641K40292j4380R1098o2293
6667B176632O1801J8827K3088p0561K01116L55575l49231k93862j35751l1131
6657A956503J21209L74532J05334K78455k45833l33381m15306p2881K55685K57756
6647B282073L39030k04806l71395K47195L89140L5902q7507K16668p7116L2369
6637B801553J83458k74156j20867k9639l8232J44855K55010J51890o3331l3423
6627B977118k21685J84923N25082J76210k44853l20754j69378L22120l750J35299
6617C360332M33189p6237m38555N799K18683K93730m1280j67374k21994K91328
6607C657621N48393k70945O945p4439M2463L42527J3331j70212j96091J30595
$$ plain form
6677 2265297 2472218 2646576 2460096 2122891 2259556 1921915 2162207 2147827 2238925 2176632
6667 2176632 2238433 2257260 2280348 2209787 2410903 2766478 2417247 2123385 1987634 1956503
6657 1956503 2077712 2452244 2557578 2836033 2590200 2256819 1841513 1768632 2024317 2282073
6647 2282073 2621103 2416297 2044902 2292097 2681237 2717139 2629632 2846300 2769184 2801553
6637 2801553 2985011 2710855 2589988 2560349 2522117 2666972 2921982 3073872 3010541 2977118
6627 2977118 2755433 2940356 3465438 3641648 3396795 3076041 2906663 3228783 3225033 3360332
6617 3360332 3793521 3717284 3278729 3284528 3503211 3796941 3755661 3588287 3366293 3657621
6607 3657621 4206014 3935069 3942014 3867575 3910038 4252565 4265896 4095684 3899593 4030188
6597D030188L2250k05931L40551J48661K0898j1031J780J60720j41764L53078
6587D729400k3383m05233K22961J07253j86093m13543L46187O54828J39867j96254
6577D975990J19299K2628p2180M59670L03673j52405J66908J44724j22095k56595
6567E589617J60468K36817J63761l02525P6218M83196N00806K32013J06521Q0422
6557G327314j89133J95613Q7726R8583J04858O10840L93407J8922J10224N20108
6547I278462M40751l25251k5262L57626L46858K54520K88290N53424J54270J48855
6537A1472543M19734k044R4334L23932P77765N28574O5062J64509M68145M77056
6527A4789610K29883K08864O13428M46299J15404P58293N78379L77861M30976
$$ plain form
6597 4030188 4062438 3856507 4197058 4345719 4366617 4355586 4357366 4518086 4376322 4729400
6587 4729400 4706017 4300784 4523745 4630998 4444905 4031362 4377549 5032377 5172244 4975990
6577 4975990 5095289 5117917 5045737 5505407 5809080 5656675 5823583 5968307 5846212 5589617
6567 5589617 5750085 5986902 6150663 5848138 5924356 6407552 6908358 7140371 7246892 7327314
6557 7327314 7138181 7333794 7421520 7520103 7624961 8235801 8629208 8648130 8758354 9278462
6547 9278462 9719213 9393962 9368700 9726326 10073184 10327704 10615994 11169418 11323688 11472543
6537 11472543 11892277 11890233 11984567 12308499 13086264 13614838 13679900 13844409 14312554 14789610
6527 14789610 15019493 15228357 15841785 16288084 16403488 17161781 17740160 18118021 18548997
6518A8548997O28542L79174P80292R38380L28109R3589N66039P56017Q12675P01296
6508B4533110N87207K06938O73291J059212R70315J302848R57042R66516R74765
6499C2231244J106146J229602J336879J418774J610816J263806J203394K005913
6491D3406574K232047J613195J696960K364849K412268K167342K227781L079890
6483F1200906L231672K712408K819190K501517L111316L759503K850702K290105
6475H4477319K371187K675196L040530K514035J815691K095204J613557J026890
6467A01629609P58199P48378N81582o56550j445189j799999k110175k444704k517877
6458I2743274k743147l214323k750319k325588k778327k774236j763104j408272
$$ plain form
6518 18548997 19177539 19556713 20337005 21275385 21603494 21697083 22263122 23019139 23831814 24533110
6508 24533110 25120317 25327255 26000546 27059758 28030073 29332921 30289963 31256479 32231244
6499 32231244 33337390 34566992 35903871 37322645 38933461 40197267 41400661 43406574
6491 43406574 45638621 47251816 48948776 51313625 53725893 55893235 58121016 61200906
6483 61200906 64432578 67144986 69964176 72465693 75577009 79336512 82187214 84477319
6475 84477319 86848506 89523702 92564232 95078267 96893958 98989162 100602719 101629609
6467 101629609 102387808 103136186 103717768 103061218 101616029 99816030 97705855 95261151 92743274
6458 92743274 90000127 86785804 84035485 81709897 78931570 76157334 74394230 72985958
6450G2985958j561709j192066j030452m50161j09641Q3667K87731m8901M56141
6441F9420567J514613J622675J304305J437467J653654K109512K399357K943431
6433H4405581L010489K671860K610320K632366L755717L860034L932208L999611
6425A10878186L438787L830327M237867M165074L483012K599440K307969K364616
6417A37305278J458987M72932J02320o77496j536529j592435j272740j293130
6409A32967187j146830j522996j870626j204550p98266m39641m71059k77163p7665
6400A25158391L91210M68516j68227J79636P39357P57334J87810L16128K32925
6391A28263080J51131K36327N5761L66057L34077j63940m09117n21989n38700
$$ plain form
6450 72985958 71424249 70232183 69201731 68751570 68641929 68725596 69013327 68964426 69420567
6441 69420567 70935180 72557855 73862160 75299627 76953281 79062793 81462150 84405581
6433 84405581 87416070 90087930 92698250 95330616 99086333 102946367 106878575 110878186
6425 110878186 114316973 118147300 122385167 126550241 130033253 132632693 134940662 137305278
6417 137305278 138764265 139237197 139339517 138662021 137125492 135533057 134260317 132967187
6409 132967187 131820357 130297361 128426735 127222185 126423919 125984278 125513219 125236056 125158391
6400 125158391 125549601 126018117 125849890 126029526 126768883 127526217 127714027 128030155 128263080
6391 128263080 128414211 128650538 128706299 129072356 129406433 129242493 128833376 128311387 127772687
6382A27772687o25689k94957m84672j127126j436888j067056j353206j533689
6374A19849404j355297j627291k306351j884820j613225j984860j707513j535801
6366A05834246q39779j007460q86909q26377p55450k25628m25397m30351n67866
6357I9869029j27595j59677o44832p38037j350682j298790j639677k323222k243587
6348H9342930j827860k898147l348412l057658k748214k696264l116372k841880
6340F6808123k509680k790767k949400k812421k306494k066525k148102j451248
6332D7773486j326361j653080j231306j247079p91445n72177m38813m22422q81318
6323C9209485m87599J23803J94212O5489N6333L40408J23821M82069Q64815M40549
$$ plain form
6382 127772687 127146998 126852041 126367369 125240243 123803355 122736299 121383093 119849404
6374 119849404 118494107 116866816 114560465 112675645 111062420 109077560 107370047 105834246
6366 105834246 104994467 103987007 103100098 102273721 101518271 101292643 100867246 100436895 99869029
6357 99869029 99741434 99581757 98936925 98198888 96848206 95549416 93909739 91586517 89342930
6348 89342930 87515070 84616923 81268511 78210853 75462639 72766375 69650003 66808123
6340 66808123 64298443 61507676 58558276 55745855 53439361 51372836 49224734 47773486
6332 47773486 46447125 44794045 43562739 42315660 41524215 40952038 40513225 40090803 39209485
6323 39209485 38721886 38845689 39039901 39105390 39161723 39502131 39625952 40108021 40972836 41413385
6313D1413385j6953L94042J156872O62657M82076L9721k75053o94972j041012
6304D2120763m86826p15258j620858j557079j006841j166315j213052j084815
6296C3269719q62819j146779j192940n56343k63671q80501r62888q49873n31969
6287B6021936m42884o15559m84526j070064n60787m78874l95100m95512q03625
6278B0675005m83117o67083j023133k59230J36347m67779q16046o79313j35575
6269A6280076l35059q76210q17560m55378n30130o2993p1410p11741n62958o03113
6259A1253524O0845r6143m64891l99441l36051n16116j13104j83315l38386j00598
6249H766324k79850n21710l70442J66273L0410k82410l86442k78020J92261N5025
$$ plain form
6313 41413385 41396432 41790474 42947346 43610003 44092079 44131800 43856747 43161775 42120763
6304 42120763 41633937 40918679 39297821 37740742 36733901 35567586 34354534 33269719
6296 33269719 32406900 31260121 30067181 29510838 29247167 28366666 27403778 26553905 26021936
6287 26021936 25579052 24963493 24478967 23408903 22848116 22369242 21974142 21478630 20675005
6278 20675005 20191888 19524805 18501672 18242442 18378789 17911010 17094964 16415651 16280076
6269 16280076 15945017 15068807 14251247 13795869 13265739 13202746 13131336 12419595 11856637 11253524
6259 11253524 11314369 11218226 10753335 10353894 10017843 9501727 9388623 9205308 8866922 8766324
6249 8766324 8486474 7964764 7594322 7760595 7791005 7508595 7122153 6844133 7036394 7091419
6239G091419l26565j05923R9902n9274j90279l1674j28131r6468k22397k00237
6229E830373j26748m37560j92897K80126O7012j80279k46326O3081q9237k38029
6219D729516j43982J44779M9592o82939k10576O4384n9528j76502Q284J45689
6209C868717k05262K06857q4241k98139L22259K91996p6050n95726J0809L21096
6199C762316P6143k76089l31797J7970N1149j31177K8343m0688Q2721J34079j80161
6188C192809R4377K29541J20991l5286j70790n39013m1538L46524k37443l68399
6178B591773L30333K50594k39179j54805k01574K65064K09932k11067r6404J21592
$$ plain form
6239 7091419 6764854 6658931 6758833 6699559 6509280 6477606 6349475 6253007 6030610 5830373
6229 5830373 5703625 5266065 5073168 5353294 5420306 5240027 4993701 5056782 4967545 4729516
6219 4729516 4585534 4730313 4779905 4096966 3886390 3950774 3891246 3714744 3723028 3868717
6209 3868717 3663455 3870312 3786071 3487932 3810191 4102187 4026137 3430411 3441220 3762316
6199 3762316 3838459 3562370 3230573 3248543 3299692 3168515 3196858 3156170 3238891 3372970 3192809
6188 3192809 3287186 3516727 3637718 3602432 3431642 2892629 2851091 3197615 2960172 2591773
6178 2591773 2922106 3172700 2933521 2778716 2577142 2842206 3052138 2841071 2744667 2866259
$$ [...]
##END NTUPLES=NMR SPECTRUM
##END=
