##TITLE=1H_CA-9407-4
 200.13MHz,CDCl3.
 8 sc
 
 11.12.2025
##JCAMPDX= 6.0         $$ Bruker NMR JCAMP-DX V2.0
##DATA TYPE= NMR SPECTRUM
##DATA CLASS= NTUPLES
##ORIGIN= UXNMR, Bruker Analytische Messtechnik GmbH
##OWNER= pz
$$ XWIN-NMR		Version 3.5
$$ Thu Dec 11 15:39:22 2025 Russian Standard Time (UT+4h)  she@DPX200
##.OBSERVE FREQUENCY= 200.1313
##.OBSERVE NUCLEUS= ^1H
##.ACQUISITION MODE= SIMULTANEOUS
##.ACQUISITION SCHEME= undefined
##.AVERAGES= 8
##.DIGITISER RES= 18
##SPECTROMETER/DATA SYSTEM= spect
##.PULSE SEQUENCE= zg30
##.SOLVENT NAME= CDCl3
##.SHIFT REFERENCE= (INTERNAL, CDCl3, 0, 15.4373)
##AUDIT TRAIL= $$ (NUMBER, WHEN, WHO, WHERE, WHAT)
$$ ##TITLE= Audit trail, XWIN-NMR		Version 3.5
$$ ##JCAMPDX= 5.01
$$ ##ORIGIN= Bruker BioSpin GmbH
$$ ##OWNER= she
$$ F:/spectra/data/she/nmr/H-C/1/pdata/1/auditp.txt
$$ ##AUDIT TRAIL=  $$ (NUMBER, WHEN, WHO, WHERE, WHAT)
(   1,<2025-12-11 15:38:06.79 +0400>,<she>,<DPX200>,
      <created by zg, POWCHK disabled, PULCHK disabled
       configuration hash MD5:
       00 E9 B6 7A A2 85 ED C7 34 08 36 98 17 FE 4E 26
       data hash MD5: 16K
       1E 69 00 6B 40 F6 6A 83 62 AF 42 4F 48 F0 41 13>)
(   2,<2025-12-11 15:38:09.89 +0400>,<she>,<DPX200>,
      <Start of raw data processing
       efp BC_mod = 2 LB = 0.25 FT_mod = 6 PKNL = 1 PHC0 = -3501.588 PHC1 = 8.99234 SI = 16K 
       data hash MD5: 16K
       58 6F E3 19 04 7A B9 FE F0 2B C7 38 2B 00 C8 08>)
(   3,<2025-12-11 15:38:26.53 +0400>,<she>,<DPX200>,
      <pk PHC0 = -115.8445 PHC1 = 3.8 
       data hash MD5: 16K
       C8 FB A3 6D BF 69 C6 1B A5 D7 26 2A C1 ED 31 FB>)
(   4,<2025-12-11 15:38:30.81 +0400>,<she>,<DPX200>,
      <abs ABSG = 5 
       data hash MD5: 16K
       90 C5 87 77 8B 71 3B DC 28 80 A0 C0 BC 51 4C E9>)
$$ ##END=
$$ 
$$ hash MD5
$$ 61 0A 77 1E 6E 8D 59 83 E0 46 21 53 92 74 7B C1
##$RELAX= 
##$RELAX= 
##$RELAX= 
##$RELAX= 
##$RELAX= 
##$RELAX= 
$$ Bruker specific parameters
$$ --------------------------
##$DU= <F:/spectra>
##$EXPNO= 1
##$NAME= <H-C>
##$PROCNO= 1
##$TYPE= <nmr>
##$USER= <she>
##$AMP= (0..31)
100 100 100 100 100 100 100 100 100 100 100 100 100 100 100 100 100 100 
100 100 100 100 100 100 100 100 100 100 100 100 100 100 
##$AQSEQ= 0
##$AQ_mod= 1
##$AUNM= <au_zg>
##$AUTOPOS= <>
##$BF1= 200.13
##$BF2= 200.13
##$BF3= 200.13
##$BF4= 200.13
##$BF5= 200.13
##$BF6= 200.13
##$BF7= 200.13
##$BF8= 200.13
##$BYTORDA= 1
##$CFDGTYP= 0
##$CFRGTYP= 5
##$CHEMSTR= <none>
##$CNST= (0..31)
1 1 145 1 1 1 1 1 1 1 1 1 1 1 1 1 1 1 1 1 1 1 1 1 1 1 1 1 1 1 1 1 
##$CPDPRG= <>
##$CPDPRG1= <>
##$CPDPRG2= <>
##$CPDPRG3= <>
##$CPDPRG4= <mlev>
##$CPDPRG5= <mlev>
##$CPDPRG6= <mlev>
##$CPDPRG7= <mlev>
##$CPDPRG8= <mlev>
##$CPDPRGB= <>
##$CPDPRGT= <>
##$D= (0..31)
0 0.7 0 0 0 0 0 0 0 0 0 0.03 0 0 0 0 0 0 0 0 0 0 0 0 0 0 0 0 0 0 0 0 
##$DATE= 1765453086
##$DBL= (0..7)
120 120 120 120 120 120 120 120 
##$DBP= (0..7)
150 150 150 150 150 150 150 150 
##$DBP07= 0
##$DBPNAM0= <>
##$DBPNAM1= <>
##$DBPNAM2= <>
##$DBPNAM3= <>
##$DBPNAM4= <>
$$ [...]
##$SUBNAM3= <"">
##$SUBNAM4= <"">
##$SUBNAM5= <"">
##$SUBNAM6= <"">
##$SUBNAM7= <"">
##$SUBNAM8= <"">
##$SUBNAM9= <"">
##$SW= 18.0517328524113
##$SWIBOX= (0..15)
0 0 2 0 0 0 0 0 0 0 0 0 0 0 0 0 
##$SW_h= 3612.71676300578
##$TD= 16384
##$TD0= 1
##$TE= 0
##$TE2= 300
##$TE3= 300
##$TEG= 300
##$TL= (0..7)
0 120 120 120 120 120 120 120 
##$TP= (0..7)
150 150 150 150 150 150 150 150 
##$TP07= 0
##$TPNAME0= <>
##$TPNAME1= <>
##$TPNAME2= <>
##$TPNAME3= <>
##$TPNAME4= <>
##$TPNAME5= <>
##$TPNAME6= <>
##$TPNAME7= <>
##$TPOAL= (0..7)
0.5 0.5 0.5 0.5 0.5 0.5 0.5 0.5 
##$TPOFFS= (0..7)
0 0 0 0 0 0 0 0 
##$TUNHIN= 0
##$TUNHOUT= 0
##$TUNXOUT= 0
##$USERA1= <user>
##$USERA2= <user>
##$USERA3= <user>
##$USERA4= <user>
##$USERA5= <user>
##$V9= 5
##$VALIST= <valist>
##$VCLIST= <CCCCCCCCCCCCCCC>
##$VD= 0
##$VDLIST= <DDDDDDDDDDDDDDD>
##$VPLIST= <PPPPPPPPPPPPPPP>
##$VTLIST= <TTTTTTTTTTTTTTT>
##$WBST= 1024
##$WBSW= 4
##$XGAIN= (0..3)
0 0 0 0 
##$XL= 0
##$YL= 0
##$YMAX_a= 221025
##$YMIN_a= -351386
##$ZGOPTNS= <>
##$ZL1= 120
##$ZL2= 120
##$ZL3= 120
##$ZL4= 120
##$ABSF1= 15.48906
##$ABSF2= -2.562789
##$ABSG= 5
##$ABSL= 3
##$ALPHA= 0
##$AQORDER= 0
##$ASSFAC= 0
##$ASSFACI= 0
##$ASSFACX= 0
##$ASSWID= 0
##$AUNMP= <proc_1d>
##$AZFE= 0.1
##$AZFW= 0.1
##$BCFW= 0
##$BC_mod= 2
##$BYTORDP= 0
##$COROFFS= 0
##$CY= -3
##$DATMOD= 1
##$DC= 0
##$DFILT= <>
##$DTYPP= 0
##$F1P= 0
##$F2P= 0
##$FCOR= 1
##$FTSIZE= 16384
##$FT_mod= 6
##$GAMMA= 0
##$GB= 0
##$INTBC= 1
##$INTSCL= 3.241238e-09
##$ISEN= 128
##$LB= 0.25
##$LEV0= 0
##$LPBIN= 0
##$MAXI= 10000
##$MC2= 0
##$MEAN= 0
##$ME_mod= 0
##$MI= 1.114404
##$NCOEF= 0
##$NC_proc= -7
##$NLEV= 6
##$NOISF1= 3.799351
##$NOISF2= 2.8
##$NSP= 0
##$NTH_PI= 0
##$NZP= 0
##$OFFSET= 15.43728
##$PC= 1
##$PHC0= -3617.432
##$PHC1= 12.79234
##$PH_mod= 1
##$PKNL= yes
##$PPARMOD= 0
##$PSCAL= 0
##$PSIGN= 0
##$REVERSE= no
##$SF= 200.130016893936
##$SI= 16384
##$SIGF1= 3
##$SIGF2= 2
##$SINO= 0.751879
##$SIOLD= 32768
##$SREGLST= <19F.Aceton>
##$SSB= 0
##$STSI= 16384
##$STSR= 0
##$SW_p= 3612.71676300578
##$SYMM= 0
##$S_DEV= 0
##$TDeff= 16384
##$TDoff= 0
##$TI= <>
##$TILT= no
##$TM1= 0
##$TM2= 0
##$TOPLEV= 0
##$USERP1= <user>
##$USERP2= <user>
##$USERP3= <user>
##$USERP4= <user>
##$USERP5= <user>
##$WDW= 1
##$XDIM= 16384
##$YMAX_p= 462595711
##$YMIN_p= -723904
$$ End of Bruker specific parameters
$$ ---------------------------------
##NTUPLES= NMR SPECTRUM
##VAR_NAME=  FREQUENCY,     SPECTRUM/REAL,   SPECTRUM/IMAG
##SYMBOL=    X,             R,               I
##VAR_TYPE=  INDEPENDENT,   DEPENDENT,       DEPENDENT
##VAR_FORM=  AFFN,          ASDF,            ASDF
##VAR_DIM=   16384,         16384,           16384
##UNITS=     HZ,            ARBITRARY UNITS, ARBITRARY UNITS
##FACTOR=    0.220516191357247, 1,           1
##FIRST=     3089.46304740416, 0,            0
##LAST=      -523.253715601623, 0,           0
##MIN=       -523.253715601623, -723904,     0
##MAX=       3089.46304740416, 462595711,    0
$$ Real data points
##PAGE= N=1
##DATA TABLE= (X++(R..R)), XYDATA
$$ [...]
5888B6702760p03856p95425p74392p75051p75915o74704o43450n45193m62481
5879B0552293m31671k52404k11190n8573k918N0311J33567K40302L10859L85205
5869B0715781M28145N86864N68054N92876O82925P35134P31565O98903O62474
5860B6402721O84321O04284N39625N24297L89936L31148K52386K06257J50301
5851C0085276P0167L7763Q8223m3406M3751l1795N3002L8161J9234L3739Q0927
5840C0475042J00020J34168J50691J85106K36291K51820L64211L77657L97502
5831C2672508M61253M77882N29175N78411O23071O01356N94711O80318P32102
5822C7950787P27361P89679Q36631Q36692R51855R16719J109212J126827J127747
$$ y = [26702760, 25998904, 25203479, 24429087, 23654036, 22878121, 22203417, 21559967, 21014774, 20552293, 20120622, 19868218, 19657028, 19598455, 19595537, 19645848, 19779415, 20019717, 20330576, 20715781, 21143926, 21730790, 22298844, 22891720, 23574645, 24309779, 25041344, 25740247, 26402721, 27087042, 27691326, 28230951, 28755248, 29145184, 29476332, 29728718, 29934975, 30085276, 30155443, 30193206, 30281429, 30238023, 30281774, 30249979, 30302981, 30341142, 30360376, 30394115, 30475042, 30575062, 30709230, 30859921, 31045027, 31281318, 31533138, 31897349, 32275006, 32672508, 33133761, 33611643, 34140818, 34719229, 35342300, 35943656, 36538367, 37218685, 37950787, 38678148, 39467827, 40304458, 41141150, 42093005, 43009724, 44118936, 45245763, 46373510]
5813D6373510J188292J248627J239929J238305J155149J212493J037528R61458
5805E5655291Q60615O26221M44216K64013L3807k42347m97609o96329r30125j217021
5795E4300732j405637j574164j668921j776683j823807j790681j775216j732065
5787D0753558j581627j477267j431242j250315j187525j059805j026201r60979
5779C0778597q86615r11973q21108p76960p67312p25438p01380o06906n40400
5770B4040505n46462m52164l28253k25298j63828J6272R5776K37331K73594L67894
5760B3315367L83458M21578K87510J75262k1862k16308m40046n87565q01689r37552
5750B1578153j008114j021251r73656r67247r04973q34327p91587o82274n99228
$$ y = [46373510, 47561802, 48810429, 50050358, 51288663, 52443812, 53656305, 54693833, 55655291, 56515906, 57142127, 57586343, 57850356, 57884163, 57641816, 57144207, 56447878, 55517753, 54300732, 52895095, 51320931, 49652010, 47875327, 46051520, 44260839, 42485623, 40753558, 39171931, 37694664, 36263422, 35013107, 33825582, 32765777, 31739576, 30778597, 29891982, 28980009, 28158901, 27381941, 26614629, 25889191, 25187811, 24580905, 24040505, 23494043, 23041879, 22713626, 22488328, 22324500, 22340772, 22436548, 22673879, 22947473, 23315367, 23698825, 24120403, 24407913, 24583175, 24561313, 24345005, 23904959, 23317394, 22515705, 21578153, 20570039, 19548788, 18575132, 17607885, 16702912, 15868585, 15076998, 14394724, 13795496]
5741A3795496n79053m97978m89852m09053l72333l29522k62284k21827j87036
5732A0446558j49749j10455o9556r1069q941J0412R003K0225R9210O8901L9336
5721A0263875j2697N849o4129j44274j06607k16771k29894k37676k73164k33482
5711H751030k46850k65275j77683k38265k49007j62680j09735j21774j65453r9920
5701F914388j01452p6716m1892J4500q4700n9760j7570l2665L730J4061J7465
5690F549389L1158R527M662K7870J7230J1933L6444R5980R5502P7194M1500J37883
5678G136272J26477J03769P0349J74856J34229K09328K35933K05841K30163L10884
5668H938101L80098L66631M08123M72471N43053O07072P08640P30035Q31565Q73363
$$ y = [13795496, 13216443, 12718465, 12228613, 11819560, 11447227, 11117705, 10855421, 10633594, 10446558, 10296809, 10186354, 10116798, 10025729, 10016788, 10027200, 10036203, 10056428, 10155638, 10224539, 10263875, 10251178, 10257027, 10192898, 10048624, 9942017, 9725246, 9495352, 9257676, 8984512, 8751030, 8504180, 8238905, 8061222, 7822957, 7573950, 7411270, 7301535, 7179761, 7014308, 6914388, 6812936, 6736220, 6694328, 6708828, 6624128, 6564368, 6546798, 6514133, 6517863, 6531924, 6549389, 6580547, 6590074, 6594736, 6622606, 6639836, 6651769, 6688213, 6784193, 6879695, 6956889, 6998389, 7136272, 7262749, 7366518, 7436867, 7611723, 7745952, 7955280, 8191213, 8397054, 8627217, 8938101, 9318199, 9684830, 10092953, 10565424, 11108477, 11715549, 12424189, 13154224, 13985789, 14859152]
5658A4859152J003307J051114J079847J039058J079263J000382R16255P62749
5650B2791127N23933L01213q63k08620m40003o09684p52646q31235q47098r46084
5640A8980040q81152p54028p12774p18464n54077m87537l81156k33501q2802O3127
5630A4237676R6353J85530J56621J94340J21378R2086J31563J58905J41985L08766
5620A5825203L59416M62292N56828O58176Q21016Q39988J018389J154274J288044
5611B2983626J459101J675977J888219K142742K328778K652891K912700L129794
5603D1173828L446375L705465M059018M322005M577911M662708M295144L715002
5595G3957456L096707K260459J412652N41268k41775q74429j498232k056824k492871
$$ y = [14859152, 15862459, 16913573, 17993420, 19032478, 20111741, 21112123, 22028378, 22791127, 23315060, 23616273, 23615410, 23406790, 22966787, 22357103, 21604457, 20773222, 19926124, 18980040, 18098888, 17344860, 16632086, 15913622, 15359545, 14872008, 14490852, 14257351, 14174549, 14237676, 14334029, 14519559, 14676180, 14870520, 14991898, 15083984, 15215547, 15374452, 15516437, 15825203, 16184619, 16646911, 17203739, 17861915, 18682931, 19522919, 20541308, 21695582, 22983626, 24442727, 26118704, 28006923, 30149665, 32478443, 35131334, 38044034, 41173828, 44620203, 48325668, 52384686, 56706691, 61284602, 65947310, 70242454, 73957456, 77054163, 79314622, 80727274, 81268542, 81026767, 80152338, 78654106, 76597282, 74104411]
5586G4104411l016336l318337l532122l750181l763683l776721l624674l474408
5578D5847949l299247l054769k775420k530222k253058k052138j761388j562388
5570B6559319j225326q89067n92742k42588r4774j29508l01648n00921o77717
5561B1905028q08678r64969r30188p78803n97167n04291l92420k38720j17460
5552A6572332N126O4219J45012K45920K66638M21260N32242N98383P19434Q88467
5542B0459033R38092J100325J205937J370155J516620J691603J878116K015163
5534C2175044K051194K038943J925774J734246J519446J204692R39639N47184
5526D4136162K76277j14431n06074q43066j150800j438847j616821j877122j947337
$$ y = [74104411, 71088075, 67769738, 64237616, 60487435, 56723752, 52947031, 49322357, 45847949, 42548702, 39493933, 36718513, 34188291, 31935233, 29883095, 28121707, 26559319, 25333993, 24444926, 23852184, 23609596, 23514822, 23385314, 23083666, 22582745, 21905028, 21096350, 20131381, 19201193, 18422390, 17825223, 17320932, 16928512, 16689792, 16572332, 16577458, 16641677, 16786689, 17032609, 17299247, 17720507, 18252749, 18851132, 19570566, 20459033, 21397125, 22497450, 23703387, 25073542, 26590162, 28281765, 30159881, 32175044, 34226238, 36265181, 38190955, 39925201, 41444647, 42649339, 43588978, 44136162, 44412439, 44298008, 43791934, 42948868, 41798068, 40359221, 38742400, 36865278, 34917941]
5517C4917941j952358k042442j965750j888386j837875j734592j656431j478954
5509B0361153j319510j258851j106894r99877q88173q33481p72835o61172n82470
5500A1937890n20586m30534m17246l38401k74274k82049k05218k23160j61946
5491I084476r2622j22384o3558j2099N533N3159M4858J23680K00960K21735K98709
5480I742447L10798L66037M55210M77748N86904O43468P38437Q02720P99406P82978
5470A5706153P22074O97533O60107N12695L51318K48124m5569k12867l94290o00257
5460A7645021o50763p97572q43041r05739r05178q46918q15600p94501p52385
5451A0333324o70250n72781n61230n20441m27226m05239m08868l07283l18999
$$ y = [34917941, 32965583, 30923141, 28957391, 27069005, 25231130, 23496538, 21840107, 20361153, 19041643, 17782792, 16675898, 15676021, 14787848, 13954367, 13181532, 12520360, 11937890, 11417304, 10986770, 10569524, 10231123, 9956849, 9674800, 9469582, 9246422, 9084476, 8991854, 8869470, 8805912, 8793813, 8799346, 8852505, 8897363, 9021043, 9222003, 9443738, 9742447, 10053245, 10419282, 10874492, 11352240, 11939144, 12582612, 13321049, 14123769, 14923175, 15706153, 16428227, 17125760, 17785867, 18298562, 18649880, 18898004, 18852435, 18639568, 18245278, 17645021, 16994258, 16196686, 15353645, 14447906, 13542728, 12695810, 11880210, 11085709, 10333324, 9663074, 9090293, 8529063, 8008622, 7581396, 7176157, 6767289, 6460006, 6141007]
5442F141007k34722k80822k27513j83838j90392j70181j52460j70378j41022q7344
5432D302335j45154j18741j30010m5405r0193m1044q1931l7545o2418j17409l9425
5421C393060j1150j26298l8509j2111p1729o0644l3831j967l8710n3362l7640
5410B907109l9932o3350o8350l6732Q904k6730k8539k0807m9927K5682L2299O379
5398B646006K5710L8803j1510J0093j9543j2114j4504m7730j3937l2311k2830
5387B546133l9502k5680J9376m265k5584L78J0236m694M5453K4489K209j7560
5375B530989J3382K1005K8335O9047K3758O3407J12838P6522J32826J44113J38232
5364C354454J46605J70241J86501J78849Q5530J30559J14939N5420J73725K11454
$$ y = [6141007, 5906285, 5625463, 5397950, 5214112, 5023720, 4853539, 4701079, 4530701, 4389679, 4302335, 4157181, 4038440, 3908430, 3863025, 3772832, 3731788, 3649857, 3612312, 3549894, 3432485, 3393060, 3381910, 3255612, 3217103, 3204992, 3133263, 3072619, 3038788, 3036821, 2998111, 2944749, 2907109, 2867177, 2803827, 2735477, 2698745, 2707649, 2680919, 2652380, 2631573, 2581646, 2607328, 2639627, 2646006, 2671716, 2710519, 2699009, 2709102, 2689559, 2677445, 2662941, 2615211, 2601274, 2568963, 2546133, 2506631, 2480951, 2500327, 2496062, 2470478, 2470856, 2481092, 2476398, 2521851, 2546340, 2548549, 2530989, 2544371, 2565376, 2593711, 2662758, 2686516, 2749923, 2862761, 2939283, 3072109, 3216222, 3354454, 3501059, 3671300, 3857801, 4036650, 4122180, 4252739, 4367678, 4423098, 4596823, 4808277]
5354D808277K58154K85987L12006L57268M18062M88383N60558O55270Q19701R74876
5344I938542J122727J266357J604574K398417L456232N084151P527628J0001548
5336D2400176J0345016P545279M268553J156284k423414n838299q169821q276128
5328D1007646p114325o083886n106833m102465l194125k398472j809050j405217
5320I793273j153544r99828p62671o27980n13811m21108k97809k76935k57779
5311D481808k24982j94164j77119j88141j68552r9215j24510j02036n0111j1481
5301C141497m1541j511j1823k942l4624k5312k5584O93j8838N948l6569n1491
5289B897903k7072m5420j17225m4867o3920m2892q9369p0325o5734j16814o7639
$$ y = [4808277, 5066431, 5352418, 5664424, 6021692, 6439754, 6928137, 7488695, 8143965, 8963666, 9938542, 11061269, 12327626, 13932200, 16330617, 19786849, 24871000, 32398628, 42400176, 52745192, 60290471, 64559024, 65715308, 63291894, 57453595, 49283774, 41007646, 33893321, 27809435, 22702602, 18600137, 15406012, 13007540, 11198490, 9793273, 8639729, 7639901, 6877230, 6249250, 5735439, 5314331, 5016522, 4739587, 4481808, 4256826, 4062662, 3885543, 3697402, 3528850, 3429635, 3305125, 3203089, 3152978, 3141497, 3099956, 3098445, 3086622, 3083680, 3049056, 3023744, 2998160, 2998853, 2980015, 2985963, 2949394, 2897903, 2870831, 2825411, 2708186, 2663319, 2599399, 2556507, 2467138, 2396813, 2331079, 2214265, 2146626]
5278B146626p3339r6768l7939r8555j17605k4946r2039K0762k8356m0297q2374
5267A475170m164L4910j9689m8713O3838j9271l7000l4168o275k8646o0004L2118
5255A348106L3382m9854N1493k9917P430n3704J9896J0755k7686l4643J7879l1303
5243A261834m0175P939k4661k8501m1883l5678o594R685j6387J7993m458J3092
5231A112206q1884r829K2429j5631o67Q592j362m2360p033K6531J1324l4053L1498
5218A019761o11l410O509n823L8752m4074N341L4381o435l0267M452m6218L1121
5205A003479l6610K6508R801o6059J2571N920J5653j2388m6617Q6J7665p414K7318
5192I49913p700p212N5217j5439L0585j2928n071O5423o3710j3552L5296k7943
$$ y = [2146626, 2073287, 1976519, 1938580, 1840025, 1722420, 1697474, 1605435, 1626197, 1597841, 1557544, 1475170, 1471006, 1505916, 1486227, 1437514, 1501352, 1482081, 1445081, 1410913, 1404638, 1375992, 1315988, 1348106, 1381488, 1331634, 1383127, 1353210, 1360640, 1306936, 1326832, 1337587, 1309901, 1275258, 1293137, 1261834, 1221659, 1229598, 1204937, 1176436, 1134553, 1098875, 1092281, 1101966, 1085579, 1103572, 1099114, 1112206, 1030322, 1020493, 1042922, 1027291, 1026624, 1035216, 1033854, 991494, 984461, 1010992, 1022316, 988263, 1019761, 1019150, 1015740, 1022249, 1016426, 1055178, 1011104, 1016445, 1050826, 1044391, 1014124, 1018576, 972358, 1003479, 966869, 993377, 1003178, 937119, 949690, 955610, 971263, 958875, 912258, 912344, 930009, 922595, 949913, 942213, 935001, 990218, 974779, 1005364, 992436, 987365, 1052788, 989078, 975526, 1010822, 982879]
5180I82879r043k0734J7381J2670k2948l658j6308o444L7103k3199L3597j3887
5168I67409K927J9789l9567L9185n212j3128P975j06r633O7368k5157K4901N0551
5155A087302k1336K7522P853m889j3805j7860j1455J4258m3126J3970l2380L5294
5143A041348J7980k3731M3697l5473M3899m40j7468M1152L5097k1062N9791n2832
5131A131958p818J7610M430K0815n2199K4171O20k593r866k2696J4623J0048P990
5118A137093M0585n486j3379O8585n1530J4982J8809K4615J6655k6519k0233K3577
5106A227754J1392J5886j8800j7206l300K8366J3631k3502l3581O2022N286j6611
5094A251337J0327k1896P201Q960k0568k669L4877p86l940l4902K2304n0200M9464
$$ y = [982879, 973836, 953102, 970483, 983153, 960205, 956547, 940239, 933795, 970898, 947699, 981296, 967409, 970336, 990125, 950558, 989743, 984531, 971403, 979378, 979272, 969639, 1037007, 1011850, 1036751, 1087302, 1065966, 1093488, 1101341, 1096452, 1082647, 1064787, 1053332, 1067590, 1024464, 1038434, 1006054, 1041348, 1059328, 1035597, 1079294, 1043821, 1087720, 1087280, 1069812, 1110964, 1146061, 1124999, 1184790, 1131958, 1124140, 1141750, 1146180, 1166995, 1114796, 1138967, 1139587, 1136994, 1127128, 1104432, 1119055, 1129103, 1137093, 1177678, 1172192, 1158813, 1227398, 1175868, 1190850, 1209659, 1234274, 1250929, 1224410, 1204177, 1227754, 1239146, 1255032, 1236232, 1219026, 1215726, 1244092, 1257723, 1234221, 1200640, 1262662, 1267948, 1251337, 1261664, 1239768, 1246969, 1255929, 1235361, 1232692, 1267569, 1266783, 1262843, 1227941, 1250245, 1200045, 1249509]
5081A249509k707L7179J7672P557o335l317K6654K4689K878J7129N4935L3724
5069A459567q360O3220q833L6677o562N1537l3388J9841M6138L7473j4689L9394
5057A682015N939L3042r463j8995M0945k3399Q800p912j745l085l0972l9259K2831
5044A658742m962j8230M9817N4212L8891q786K5163K4948q338K3420N6835K2850
5032A914562k4175L0922j8533K9712j4531R0955l036J6454J0134L8874O436N2746
5020B130520L7018O3419K9275Q0619O0791J7787j2305o756j5479k3859p839j3700
5008B339491j7333J522k0904r250R917K2887j6485Q4796L7950K7264L1158N764
4996B496777N9609J1677M4835M0079J1254m260J3129N6216K7408R358L3670L7355
$$ y = [1249509, 1246802, 1283981, 1301653, 1309210, 1302875, 1299558, 1326212, 1350901, 1353779, 1370908, 1425843, 1459567, 1451207, 1514427, 1505594, 1542271, 1535709, 1587246, 1553858, 1573699, 1619837, 1657310, 1642621, 1682015, 1687954, 1720996, 1711533, 1692538, 1733483, 1710084, 1718884, 1710972, 1709227, 1706142, 1675170, 1635911, 1658742, 1653780, 1635550, 1685367, 1739579, 1778470, 1769684, 1794847, 1819795, 1811457, 1834877, 1891712, 1914562, 1890387, 1921309, 1902776, 1932488, 1917957, 2008912, 2005876, 2022330, 2032464, 2071338, 2077774, 2130520, 2167538, 2230957, 2260232, 2340851, 2401642, 2419429, 2407124, 2400368, 2384889, 2361030, 2353191, 2339491, 2322158, 2323680, 2302776, 2293526, 2303443, 2326330, 2309845, 2394641, 2432591, 2459855, 2491013, 2496777, 2556386, 2568063, 2612898, 2652977, 2664231, 2659971, 2673100, 2729316, 2756724, 2766082, 2799752, 2837107]
4984B837107K4208O1699R5075M3591M2453M6714P7063K3494N9758J03062O0097
4973C474321L6795J13016P9120J00148O2100J38129J57219P6169J10163J34471
4963D481651J76151J01946J51577J61323J58893J42796J82178J82037J93251K13236
4953F145039J95312K99218K06281K68831K91685L13500L04168L68167K79301L47755
4943I019257M33110N44666O84682Q15400R57959R79515R04361O28826K41713m3269
4933A5166220l46945m90105m96113m86451l24483j91311j07200M294P3459J72898
4923A2974263K82877K43934L23327L02258M12700M88322O65901Q82489Q37709
4914A7413780P84386P13320L96839O8381k08498n10676o41823p91877p96091o50078
$$ y = [2837107, 2861315, 2923014, 3018089, 3061680, 3104133, 3150847, 3227910, 3251404, 3311162, 3414224, 3474321, 3511116, 3624132, 3703252, 3803400, 3865500, 4003629, 4160848, 4237017, 4347180, 4481651, 4657802, 4759748, 4911325, 5072648, 5231541, 5374337, 5556515, 5738552, 5931803, 6145039, 6340351, 6639569, 6845850, 7114681, 7406366, 7719866, 8024034, 8392201, 8671502, 9019257, 9452367, 9997033, 10681715, 11497115, 12455074, 13434589, 14338950, 14967776, 15209489, 15166220, 14819275, 14329170, 13833057, 13346606, 13022123, 12830812, 12723612, 12727906, 12801365, 12974263, 13257140, 13501074, 13824401, 14126659, 14539359, 15027681, 15693582, 16576071, 17413780, 18198166, 18911486, 19308325, 19376706, 19168208, 18657532, 18015709, 17223832, 16427741, 15777663]
4904A5777663n63779m61044l86424k68067j77825j74565p3667K1471m8804K2577
4894A3667536J01002J34147J26897J50316K08273K10751J85901J94854J96490
4885A5176167J67534J58139J19290J27306J26951J24062J16577J03410J27733
4876A6347169J08444J39800J43872J28218J19380J44924P9255J71273J57176R1470
4866A7630981O2721O5634J22784J02072J64361J42550J78031K28424K58094K98667
4856A9254319L58438L98245M41179N11453N36110O17792O44969O53433O22284
4847B4038222N89059O01394N04621L50011L32339K49070R0845K4148q1245j16218
4837B6582246k54123k41157k97925l66111m58638m05636m99358m90627n33772
$$ y = [15777663, 15213884, 14752840, 14366416, 14098349, 13920524, 13745959, 13672292, 13693763, 13644959, 13667536, 13768538, 13902685, 14029582, 14179898, 14388171, 14598922, 14784823, 14979677, 15176167, 15343701, 15501840, 15621130, 15748436, 15875387, 15999449, 16116026, 16219436, 16347169, 16455613, 16595413, 16739285, 16867503, 16986883, 17131807, 17211062, 17382335, 17539511, 17630981, 17693702, 17759336, 17882120, 17984192, 18148553, 18291103, 18469134, 18697558, 18955652, 19254319, 19612757, 20011002, 20452181, 20963634, 21499744, 22117536, 22762505, 23415938, 24038222, 24627281, 25228675, 25733296, 26083307, 26415646, 26664716, 26755561, 26779709, 26698464, 26582246, 26328123, 26086966, 25789041, 25422930, 24964292, 24558656, 24059298, 23568671, 23034899]
4828B3034899m62346m93683n06739m56935m06883l94620k75393k26657k02539
4819A9609104j88723r3524l2073p1031l6472Q620m6386j8020r833p2556l6924
4808A9012182j25663j18859j46321j86858k05031k17904k23945k05919k31283
4799A7350399j06111j65846j23474j18614m8341M6267J16999Q3640K46672K41407
4789A7522998L36465L53635L57655L71474L84619L81923M60487L79374M23187
4780B0971817M29828L70353L89960L62534M11322M17086M36921M83996N35781
4771B4809598N39627O42970P05699Q01631Q30724Q57829R64511R84696J009425
4762C2146710J101657J181427J177638J247816J314223J330555J230992J223198
$$ y = [23034899, 22572553, 22078870, 21572131, 21115196, 20708313, 20313693, 20038300, 19811643, 19609104, 19420381, 19326857, 19294784, 19223753, 19187281, 19195901, 19149515, 19131495, 19121662, 19049106, 19012182, 18886519, 18767660, 18621339, 18434481, 18229450, 18011546, 17787601, 17581682, 17350399, 17244288, 17078442, 16954968, 16836354, 16788013, 16834280, 16951279, 17034919, 17281591, 17522998, 17859463, 18213098, 18570753, 18942227, 19326846, 19708769, 20169256, 20548630, 20971817, 21401645, 21771998, 22161958, 22524492, 22935814, 23352900, 23789821, 24273817, 24809598, 25349225, 25992195, 26697894, 27499525, 28330249, 29188078, 30152589, 31137285, 32146710, 33248367, 34429794, 35607432, 36855248, 38169471, 39500026, 40731018, 41954216]
4754D1954216J066871Q16843N81020L30680J27493q6085j21540j52073j02472
4745D4414953j55477q759L9535J46759J67147K42673L12397L68537M25697L91100
4735D6344562L73948L42967K41553R2573k2373j89095l39552n73988o61291p12678
4725D4896626q16128q23505q64070p81141p62978p28590o27962n72987n51212
4716C8368053n45303m86310m38706m20877m45048l96171l53211l75219l48136
4707C4559072k76036k05789j00459k8014J773J43111J69296K90293L65349L78589
4697C5297185M24956N12248N04661N75218N99129O43451P11258P34773Q45804
4688D0848683R12193R77541J114986J224963J347460J459254J544135J653424
$$ y = [41954216, 43021087, 43837930, 44418950, 44749630, 44877123, 44791038, 44669498, 44517425, 44414953, 44259476, 44250717, 44290252, 44437011, 44604158, 44846831, 45159228, 45527765, 45953462, 46344562, 46718510, 47061477, 47303030, 47395603, 47373230, 47184135, 46844583, 46270595, 45609304, 44896626, 44080498, 43256993, 42392923, 41611782, 40848804, 40120214, 39492252, 38919265, 38368053, 37822750, 37336440, 36897734, 36476857, 36031809, 35635638, 35282427, 34907208, 34559072, 34283036, 34077247, 33976788, 33948774, 33950547, 34093658, 34262954, 34553247, 34918596, 35297185, 35722141, 36234389, 36739050, 37314268, 37913397, 38556848, 39268106, 40002879, 40848683, 41760876, 42738417, 43853403, 45078366, 46425826, 47885080, 49429215, 51082639]
4680E1082639J723238J782253J853795J980831K020626K108898K109913K275123
4672F6937316K355926K514554K609785K797102K899759L056477L119615L232188
4664H9522722L231335L147089L048699K812707K544865K226752J906166J508155
4656A09948490J109964P66968L89647j6899k90986o18707r26670j167262j409211
4647A07785334j634900j813448j946616k032763k088538k132043k083173j927990
4639I2125863j854079j666263j507825j213741j018247p67333n59738l82152j93402
4630H2963083q4227k4796p3205j66098l73813n38927p95274r79193j175956j416448
4620G7335146j508163j517042j489158j459656j282611j218604j042349q71756
$$ y = [51082639, 52805877, 54588130, 56441925, 58422756, 60443382, 62552280, 64662193, 66937316, 69293242, 71807796, 74417581, 77214683, 80114442, 83170919, 86290534, 89522722, 92754057, 95901146, 98949845, 101762552, 104307417, 106534169, 108440335, 109948490, 111058454, 111825422, 112215069, 112198170, 111907184, 111288477, 110361807, 109194545, 107785334, 106150434, 104336986, 102390370, 100357607, 98269069, 96137026, 94053853, 92125863, 90271784, 88605521, 87097696, 85883955, 84865708, 84098375, 83538637, 83156485, 82963083, 82878856, 82854060, 82780855, 82614757, 82240944, 81702017, 80906743, 79927550, 78751594, 77335146, 75826983, 74309941, 72820783, 71361127, 70078516, 68859912, 67817563, 66945807]
4612F6945807o86376n25799l00230j67956P6605K17635L79536M41131O25559P93608
4602F7799520Q35865R82326J128124J249376J388505J573296J795747K041295
4594G8794054K295500K708945L218477L895968M703181N715009O772359P751154
4586A15854647Q230565P983850O886091N215255L189711J244497m84185j540682
4578A46579749j819955j454840o12687N49917K068351L776928N747304P941457
4570A62776224J0555330J3402897J6275609J8591293J9783321J9377528J7162551
4563B77924753J3243743P757207J487637m859475j0240931j4256413j6539030
4556B54517491j7032795j5922233j3549936j0436480p291066m643096k804727
$$ y = [66945807, 66259431, 65733632, 65433402, 65265446, 65342051, 65559686, 65939222, 66380353, 67005912, 67799520, 68635385, 69617711, 70745835, 71995211, 73383716, 74957012, 76752759, 78794054, 81089554, 83798499, 87016976, 90912944, 95616125, 101331134, 108103493, 115854647, 124085212, 132069062, 138955153, 144170408, 147360119, 148604616, 148120431, 146579749, 144759794, 143304954, 142692267, 143242184, 145310535, 149087463, 154834767, 162776224, 173331554, 186734451, 203010060, 221601353, 241384674, 260762202, 277924753, 291168496, 298925703, 300413340, 295553865, 285312934, 271056521, 254517491, 237484696, 221562463, 208012527, 197576047, 190284981, 185641885, 182837158]
4549A82837158k023417k263786l415249n174581o926725q477121r550359j0008745
4541A34997175r774688r206678q249910p235867o263328n477203m823213m266615
4533G9699673l772353l456822l149504k923920k707146k413234k263542k001694
4525E7011458j851451j653391j529124j327348j200400j100157r44717p79752
4517D6625118p40507o04905n34358n54109m56721m77312n12996n90288o41916
4508D1512006p25398p86731q69415r50069r54372r31553r33439q94421q44269
4499C3622339p92545p07715o08113n64515m34806m07495l27898k29475j91094
4490B9358683j27557j26576k2448r7991o6692p485m3937k18669j49574k60800
$$ y = [182837158, 180813741, 178549955, 175134706, 169960125, 163033400, 154556279, 145005920, 134997175, 125222487, 116015809, 107765899, 100530032, 94266704, 88789501, 83966288, 79699673, 75927320, 72470498, 69320994, 66397074, 63689928, 61276694, 59013152, 57011458, 55160007, 53506616, 51977492, 50650144, 49449744, 48349587, 47404870, 46625118, 45884611, 45279706, 44745348, 44191239, 43734518, 43257206, 42744210, 42153922, 41512006, 40786608, 39999877, 39130462, 38180393, 37226021, 36294468, 35361029, 34466608, 33622339, 32829794, 32122079, 31513966, 30949451, 30514645, 30107150, 29779252, 29549777, 29358683, 29231126, 29104550, 29082102, 28984111, 28917419, 28909934, 28865997, 28647328, 28497754, 28236954]
4480B8236954k76599l20527k96492l63848l97868l50661k88163k79990j97989
4471B5464817j27666n8971K0016O1214K32496K78196K50868M14075N28926N25804
4461B7589775O28059O73806P57627P70431Q21363R44348R28482R47257J100436
4452C5161584J172837J285181J423318J601148J813858K058696K262047K687645
4444D9466314K909751L335140L744253M259434M781086N387676O188884P032744
4436H7105282Q012888R022458J0254698J1491376J2612873J3447738J3761801
4429A65709114J3206078J1501812Q867412N250770J225401k821617o515731r486401
4421A86936838j1532603j2663920j2922887j2664190j1970221j1068967j0066579
$$ y = [28236954, 27960355, 27639828, 27343336, 26979488, 26581620, 26230959, 25942796, 25662806, 25464817, 25337151, 25278180, 25298196, 25359410, 25591906, 25870102, 26120970, 26535045, 27063971, 27589775, 28217834, 28891640, 29649267, 30419698, 31241061, 32185409, 33113891, 34061148, 35161584, 36334421, 37619602, 39042920, 40644068, 42457926, 44516622, 46778669, 49466314, 52376065, 55711205, 59455458, 63714892, 68495978, 73883654, 80072538, 87105282, 95118170, 104140628, 114395326, 125886702, 138499575, 151947313, 165709114, 178915192, 190417004, 199284416, 204535186, 205760587, 202938970, 196423239, 186936838, 175404235, 162740315, 149817428, 137153238, 125183017, 114114050, 104047471]
4414A04047471r059073q144892p284596o485567n787548n131117m502416l937863
4406E3714399l454749l075820k635142k343907k089382j879713j672468j665939
4398C4897279j530053j451317j272080j333331j188589j097409r89101r56404
4390B5078995q24114p34102o78633o69990o25109n27251o07633m86026n23460
4381A9402677n60806n22497n25381m44712m52036m66600m24720l97972m32754
4372A5175199m33880l67981l59662m04718l38803l03698l18617k05292j47501
4363A2295047j30323o5896j7592P9415M1900p3280j1971j30570k16329k66301
4353A1504100l13693k75936l01896l00241l27388k36365l14698k40052k07347
$$ y = [104047471, 94988398, 86843506, 79558910, 73073343, 67285795, 62154678, 57652262, 53714399, 50259650, 47183830, 44548688, 42204781, 40115399, 38235686, 36563218, 34897279, 33367226, 31915909, 30643829, 29310498, 28121909, 27024500, 26035399, 25078995, 24254881, 23520779, 22842146, 22172156, 21547047, 21019796, 20412163, 19926137, 19402677, 18841871, 18319374, 17793993, 17349281, 16897245, 16430645, 16005925, 15607953, 15175199, 14741319, 14373338, 14013676, 13608958, 13270155, 12966457, 12647840, 12442548, 12295047, 12164724, 12098828, 12081236, 12160651, 12202551, 12129271, 12117300, 11986730, 11770401, 11504100, 11190407, 10914471, 10612575, 10312334, 9984946, 9748581, 9433883, 9193831, 8986484]
4344H986484k24628k29412k26717j68240k36664j74697j59494j43151j44090j55775
4334G123616j20258n3440j52736o6100j14207q0672j33566j05528r6888q3894
4324F116327r7392o5300p4630l1049m8057k9685j8181n0205k1944r629r787M3760
4312E704228K6880j4306L96j257K3955j741l3915M7032M7035M292k2227K4218
4300E804590L7335p34K3866O6181n167J9514O4574P5419L8079J8865O5335J11576
4288F319433N8089P3543R8748J16737Q9278J69175J70633J33644J53850K06642
4278G589772J54947J76059J44078R8690Q2918N2929N7335K9615L8046J485O6356
4267H492230K6781N4889O8258J93714J15715J41782J58593J91117J99539K75063
$$ y = [8986484, 8761856, 8532444, 8305727, 8137487, 7900823, 7726126, 7566632, 7423481, 7279391, 7123616, 7003358, 6949918, 6797182, 6731082, 6616875, 6536203, 6402637, 6297109, 6200221, 6116327, 6018935, 5953635, 5879005, 5847956, 5799899, 5770214, 5752033, 5701828, 5679884, 5670255, 5660468, 5704228, 5731108, 5716802, 5717198, 5715941, 5739896, 5738155, 5704240, 5751272, 5798307, 5802599, 5780372, 5804590, 5841925, 5841191, 5865057, 5931238, 5926071, 5945585, 6010159, 6085578, 6123657, 6142522, 6207857, 6319433, 6377522, 6451065, 6549813, 6666550, 6755828, 6925003, 7095636, 7229280, 7383130, 7589772, 7744719, 7920778, 8064856, 8163546, 8246464, 8299393, 8356728, 8386343, 8424389, 8425874, 8492230, 8519011, 8573900, 8642158, 8835872, 8951587, 9093369, 9251962, 9443079, 9642618, 9917681]
4257I917681K36063K73845K71900L20987L73091L91072M37264M89286N16710N72725
4247A3800624O22950O78778P23245O93503P30017P56599P50027P74508P60020
4238B0290271Q08589Q35097R14668Q96259J034119J018357J085063J091856J113387
4229B9087666R82460R67781R12023Q08593O76414O37515O12113N70348O03685
4220C5858598O69685O51529O36603O67151N83790N28968L16716J15362n8006k50360
4210C9720036l98887m35596o03152o17882o14978n56078n49130n66818n84396
4201C4793119n78669p51499q11738r27200r44990j122845j144727j111431j145386
4192B6254634j114089j073282j013890r56315r41152q52998q32167q77347q52311
$$ y = [9917681, 10153744, 10427589, 10699489, 11020476, 11393567, 11784639, 12221903, 12711189, 13227899, 13800624, 14423574, 15102352, 15825597, 16519100, 17249117, 18005716, 18755743, 19530251, 20290271, 21098860, 21933957, 22848625, 23744884, 24779003, 25797360, 26882423, 27974279, 29087666, 30070126, 31037907, 31949930, 32758523, 33434937, 34072452, 34684565, 35254913, 35858598, 36528283, 37179812, 37816415, 38483566, 39067356, 39596324, 39913040, 40028402, 39970396, 39720036, 39321149, 38885553, 38282401, 37664519, 37049541, 36493463, 35944333, 35377515, 34793119, 34214450, 33462951, 32651213, 31724013, 30779023, 29656178, 28511451, 27400020, 26254634, 25140545, 24067263, 23053373, 22097058, 21155906, 20302908, 19470741, 18593394, 17741083]
4183A7741083q54055q29768q00832p77231p77329p02287o80704n74606n86620
4174A1157651n66390m88930m67887m76655m45925l73310l86531l50233l27995
4165G273795k92351l08030k29059k66048k45875j77389j67243k15004j36271j56383
4155E080142j13568j57131r7595j14502j15105m3895j08851r5462p5144p4401
4145D084488r8430r0373j35131l3036q9696k0498m6969l9986l8907l6416m1106
4134C413940k4610r9852n7656M5694j5317P547m232O623J2805q714J5683m7577
4122C244334k4285j4975k4222j6977k3137k981m7407j24816p2674n2740j05710
4111B734410p0086j23990j9629q8784j08896n0225j6857n2440n7156j166k215
$$ y = [17741083, 16887028, 16057260, 15256428, 14479197, 13701868, 12999581, 12318877, 11744271, 11157651, 10591261, 10102331, 9634444, 9157789, 8711864, 8338554, 7952023, 7601790, 7273795, 6981444, 6673414, 6444355, 6178307, 5932432, 5755043, 5587800, 5372796, 5236525, 5080142, 4966574, 4809443, 4711848, 4597346, 4482241, 4438346, 4329495, 4234033, 4158889, 4084488, 3986058, 3895685, 3760554, 3727518, 3637822, 3617324, 3570355, 3530369, 3491462, 3455046, 3413940, 3389330, 3289478, 3231822, 3277516, 3262199, 3269746, 3265514, 3272137, 3284942, 3276228, 3291911, 3244334, 3220049, 3205074, 3180852, 3163875, 3140738, 3137757, 3090350, 2965534, 2892860, 2840120, 2734410, 2664324, 2540334, 2520705, 2431921, 2323025, 2272800, 2255943, 2203503, 2146347, 2145181, 2142966]
4100B142966m7836o5263J2637l1463j9040n7991j8037j1597l6686k4918o381l4146
4088A802245q565r49j9794P82P987L063l3297k0901j9851j0378n8209Q36m1463
4075A601506k8606K4225m1214l347J810n1189q387j5816J2443J2519n6407k407
4063A445130j1918j4339j188J3787L5301R787k6253k2434l5461K582J9390q624
4051A405760n37J3849N821j0836L9004j7653l3565k7539K7665k2922j1317k3196
4039A344534L1843p783p5583j6248N9145k0456n7879j121L728j1095J8448L632
4027A271165N966l3184j4464L525l626j9066L16J049j5138j3222J365k411n5269
4014A127006L2294l047J5244j04411Q726k3990n501r911N5099M215J63K0008J6863
$$ y = [2142966, 2095130, 2029867, 2042504, 2011041, 1992001, 1934010, 1915973, 1904376, 1867690, 1842772, 1836391, 1802245, 1793680, 1792731, 1772937, 1773719, 1781706, 1784769, 1751472, 1730571, 1710720, 1700342, 1642133, 1642969, 1601506, 1572900, 1597125, 1555911, 1552564, 1554374, 1503185, 1494798, 1478982, 1491425, 1503944, 1447537, 1445130, 1433212, 1418873, 1417685, 1431472, 1466773, 1476560, 1450307, 1427873, 1392412, 1394994, 1414384, 1405760, 1405223, 1419072, 1424893, 1414057, 1453061, 1435408, 1401843, 1374304, 1401969, 1379047, 1367730, 1344534, 1376377, 1368594, 1293011, 1276763, 1335908, 1315452, 1257573, 1256452, 1260180, 1249085, 1267533, 1271165, 1277131, 1243947, 1229483, 1233008, 1229382, 1210316, 1210632, 1211681, 1196543, 1183321, 1184686, 1182275, 1127006, 1159300, 1156253, 1171497, 1067086, 1075812, 1051822, 1046321, 1036410, 1091509, 1095724, 1095887, 1115895, 1132758]
4001A132758m8457R463P067R194m0786k1845o035R903k9882j9278J503N50m636
3988I99519j2331J8515l763k3660J0006R519o0509j8971r315L1888k3095k2182
3976H95621j9531k3651j6240K1445J8734j9150J444J6655M634m3262J145L9659
3964H77503j6765k5335m5179L7821k1014o309J2639J0915j9516p197j7584J7693
3952G97672r417j341o340K9128J0140J5436L9370l7794M416M6168j9746o7416
3940H00276j1464N4544J7191l1928r487J4705k8799R904J3066J1872Q056K3804
3928H71740J4362j1562j8036K248l72j11L0219o102j4220k1110L3271J5211j2229
3915H83309j2157K7314J9473j5240M3191J3330N3982n4224k6950n671k8906P867
$$ y = [1132758, 1084301, 1093764, 1100831, 1110025, 1069239, 1047394, 1041359, 1051262, 1021380, 1002102, 1003605, 1004155, 999519, 987188, 1005703, 1001940, 978280, 988286, 997805, 937296, 918325, 909010, 940898, 917803, 895621, 876090, 852439, 836199, 857644, 876378, 857228, 858672, 875327, 879961, 836699, 837844, 877503, 860738, 835403, 790224, 828045, 807031, 800722, 813361, 824276, 804760, 797563, 779979, 797672, 788255, 786914, 780574, 809702, 819842, 835278, 874648, 836854, 841270, 887438, 867692, 800276, 788812, 843356, 860547, 828619, 819132, 833837, 805038, 814942, 828008, 839880, 847936, 871740, 886102, 874540, 856504, 858752, 858380, 858269, 888488, 882386, 868166, 847056, 880327, 895538, 883309, 871152, 898466, 917939, 902699, 945890, 959220, 1013202, 958978, 932028, 926357, 897451, 905318]
3903I05318K2359j1083M910l7197J9753P955p0671K9549K4029J0475L8621k941
3891I41077k53k1636k5155O7337J7404L722m5158K0461j123k6777k1614N640n1660
3878H62265k8554J7827L3666J15J3329M6741M93J5222P0295M2737j8182K5699
3866A081653J07575N6731j3914L0286J736j751j7738J4513J5337k5318m8868L819
3854A204061L2625k9363k2454K1629l5828l9492J7428k6411k7780o3284M1884
3843A073015j0797n4049J4980K502o7045k081J3821L4602l2513Q888L0751M5556
3831A057630p944N46K4654J6810k2994k1244j5323m0881O091J3018N041j7637
3819I97767J3434P954L7728J003M8579N09J531j6852J271j1365L1369Q126K9984
$$ y = [905318, 927677, 916594, 921504, 884307, 904060, 912015, 841344, 870893, 894922, 905397, 944018, 941077, 940824, 919188, 894033, 961370, 978774, 982496, 937338, 957799, 956676, 929899, 908285, 913925, 862265, 833711, 851538, 885204, 885319, 898648, 945389, 945882, 961104, 1031399, 1074136, 1055954, 1081653, 1189228, 1245959, 1232045, 1262331, 1264067, 1262316, 1244578, 1259091, 1274428, 1249110, 1200242, 1204061, 1236686, 1207323, 1184869, 1206498, 1170670, 1131178, 1148606, 1122195, 1094415, 1031131, 1073015, 1062218, 1008169, 1023149, 1025651, 958606, 956525, 970346, 1004948, 972435, 981323, 1012074, 1057630, 1049686, 1050232, 1074886, 1091696, 1068702, 1047458, 1032135, 991254, 997345, 1010363, 1015404, 997767, 1011201, 1019155, 1056883, 1057886, 1106465, 1106974, 1108505, 1091653, 1092924, 1081559, 1112928, 1121054, 1151038]
3806A151038l5554O433p450k2762j4311K1922K6062L8373j3522N867O827J519
3794A164442j0045J8521L0024j8468R377M7517J7018j9254K5471K4967P1610j6689
3782A344491j0558O0496M8406K2274L3829L8628M9378K2422P8080L7477N0017
3771A774940L7138N4626M3150M5122M3506R6188J5150L2778L1305M0010M2780
3760B256693Q5266J06184J15881k216N4708L0047Q614J9639K7510O1619K2124
3749B786069K067L8879J41k2360J5346k3137m164m4509M735l7257l3140k5575
3737B657095j401l0492p078k3377N463p9457r653k8927r32n0909R979L768K3797
3724B467876l4221k3551J4749k9467k2432P495K4825m8295r58q271p475L6420
$$ y = [1151038, 1115484, 1121917, 1114467, 1091705, 1077394, 1099316, 1125378, 1163751, 1150229, 1156096, 1162923, 1164442, 1154397, 1172918, 1202942, 1184474, 1193851, 1241368, 1258386, 1239132, 1264603, 1289570, 1361180, 1344491, 1333933, 1394429, 1442835, 1465109, 1498938, 1537566, 1586944, 1609366, 1687446, 1724923, 1774940, 1812078, 1866704, 1909854, 1954976, 1998482, 2094670, 2109820, 2142598, 2173903, 2213913, 2256693, 2341959, 2448143, 2564024, 2561808, 2616516, 2646563, 2655177, 2674816, 2702326, 2763945, 2786069, 2788136, 2827015, 2827156, 2804796, 2820142, 2797005, 2792841, 2748332, 2753067, 2715810, 2682670, 2657095, 2655694, 2625202, 2618124, 2594747, 2600210, 2520753, 2511100, 2482173, 2481241, 2430332, 2440311, 2444079, 2467876, 2433655, 2410104, 2424853, 2395386, 2372954, 2380449, 2405274, 2356979, 2356021, 2347750, 2340275, 2376695]
3712B376695J6227J3255J0871j6422q16L9340J0836l8938M2512N7675o025K0258
3700B525468N8671K3825n034J7494m176j6025M3052L3289L2877k5988n4525M2610
3688B671538L1037k1199K5579L0724N4341K7346L7629P0070K3197J4761J09891
3677C074914L1875J2297o12M7391P0947K8426J9679O8203L3233M4429O4596M2015
3665C537393K2903K7793O0044O9013M3504O2430P4489P0369L5768R4712R5883
3654D194301J9481P2814Q7020M0749O6578P1195Q9758P9789K5999R6259O8193
3643D912136O4620L0305O2905M9756O0097J5817R8898J4486m750M6833j7722L475
3631E336856J1441L7876M3780L62J6830N2151m4124q674L1043M9505M7546L9589
$$ y = [2376695, 2392922, 2406177, 2417048, 2400626, 2399810, 2439150, 2449986, 2411048, 2453560, 2511235, 2505210, 2525468, 2584139, 2607964, 2602930, 2620424, 2616248, 2600223, 2643275, 2676564, 2709441, 2683453, 2628928, 2671538, 2702575, 2681376, 2706955, 2737679, 2792020, 2819366, 2856995, 2927065, 2950262, 2965023, 3074914, 3106789, 3119086, 3118474, 3165865, 3236812, 3265238, 3284917, 3353120, 3386353, 3430782, 3495378, 3537393, 3560296, 3588089, 3648133, 3717146, 3760650, 3823080, 3897569, 3967938, 4003706, 4098418, 4194301, 4213782, 4286596, 4373616, 4414365, 4480943, 4552138, 4641896, 4721685, 4747684, 4843943, 4912136, 4976756, 5007061, 5069966, 5119722, 5179819, 5195636, 5294534, 5309020, 5304270, 5351103, 5333381, 5336856, 5348297, 5386173, 5429953, 5430315, 5447145, 5499296, 5455172, 5446498, 5477541, 5527046, 5574592, 5614181]
3619E614181K7364K2940r224M8357N2449P5947M771N629Q1166O5340N4692N4717
3607F098329M8474N8144J01451P6348P7480P4275J16355J29623J21040J29159
3597G030678Q4288J39667J61791J29571K03352J56170J60073J74564J82550J80071
3587H602775J53762K01044K49296J65268K02682K18412J86211J61094J89307J89700
3577A0519551J74117J10667K12542K10583J78851J59808J50872J63020J80036
3568A2060047J45761J57489J46295Q3243J46646J31053J29199J05048J36172J30760
3558A3371713O3878R5986J24588J09210O7297J49158J63803J31953R1630K05745
3548A4574961J86788J08070K05812K39414K44921K20394K96387K66791L36904
$$ y = [5614181, 5641545, 5664485, 5655261, 5703618, 5756067, 5832014, 5836785, 5842414, 5923580, 5988920, 6043612, 6098329, 6146803, 6204947, 6306398, 6382746, 6460226, 6534501, 6650856, 6780479, 6901519, 7030678, 7114966, 7254633, 7416424, 7545995, 7749347, 7905517, 8065590, 8240154, 8422704, 8602775, 8756537, 8957581, 9206877, 9372145, 9574827, 9793239, 9979450, 10140544, 10329851, 10519551, 10693668, 10804335, 11016877, 11227460, 11406311, 11566119, 11716991, 11880011, 12060047, 12205808, 12363297, 12509592, 12592835, 12739481, 12870534, 12999733, 13104781, 13240953, 13371713, 13435591, 13531577, 13656165, 13765375, 13832672, 13981830, 14145633, 14277586, 14369216, 14574961, 14761749, 14869819, 15075631, 15315045, 15559966, 15780360, 16076747, 16343538, 16680442]
3539A6680442K63103L72608L11574M14999L99620M29931M09719M19640M54260
3530B0155896N03777N06421N37379N91608O69081O48029O69180P62353P98894
3521B5842618P60961Q54220Q75555R18068Q75688R03394J003382R45852J024788
3512C4004526J076519J169362J120256J250158J281278J410881J391999J493589
3504D4198568J619016J708700J846502J945099K112251K284933K432732K706527
3496F0854328K896644L135419L506757L829086M166891M585608N053244N591753
3488I3619730O076569O671242P274060P966073Q569132R301468R986894J0435559
3480A59900727J0907887J1274733J1401884J1235851J0901134J0242242R268957
$$ y = [16680442, 16943545, 17316153, 17627727, 18042726, 18442346, 18872277, 19281996, 19701636, 20155896, 20659673, 21166094, 21703473, 22295081, 22964162, 23612191, 24281371, 25043724, 25842618, 26603579, 27457799, 28333354, 29251422, 30127110, 31030504, 32033886, 32979738, 34004526, 35081045, 36250407, 37370663, 38620821, 39902099, 41312980, 42704979, 44198568, 45817584, 47526284, 49372786, 51317885, 53430136, 55715069, 58147801, 60854328, 63750972, 66886391, 70393148, 74222234, 78389125, 82974733, 88027977, 93619730, 99696299, 106367541, 113641601, 121607674, 130176806, 139478274, 149465168, 159900727, 170808614, 182083347, 193485231, 204721082, 215622216, 225864458, 235133415]
3473B35133415Q115703O873068N631259M247042L067318K095514J327267O39383
3465B67129969R1801l59693q45545j431007k241990l141832m290717n529530o881660
3456B42499796q102847r352617j0330895j0955538j1405346j1574304j1472206
3449A69306043j1120325j0644900j0056841r356692q723434q048886p394090o673346
3441I7287529o114614n562897m985200m518550m091190l681053l252526k919459
3433F2162040k674304k367639k078337j875705j687438j526431j254633j104348
3425D7593205q74281n78529l08266j22135j31315l21119m43950p89508j063248
3416D2960854j282258j364155j300805j223758j046327r32879q51651p67459o68369
$$ y = [235133415, 243249118, 250122186, 255753445, 260000487, 263067805, 265163319, 266490586, 267129969, 267221770, 266862077, 266016532, 264585525, 262343535, 259201703, 254910986, 249381456, 242499796, 234396949, 225044332, 214713437, 203757899, 192352553, 180778249, 169306043, 158185718, 147540818, 137483977, 128127285, 119403851, 111354965, 103960875, 97287529, 91172915, 85610018, 80624818, 76106268, 72015078, 68334025, 65081499, 62162040, 59487736, 57120097, 55041760, 53166055, 51478617, 49952186, 48697553, 47593205, 46718924, 46140395, 45832129, 45709994, 45578679, 45257560, 44813610, 44024102, 42960854, 41678596, 40314441, 39013636, 37789878, 36743551, 35810672, 34959021, 34191562, 33523193]
3407C3523193n95052n41197m79100l52609l86783l74111k30160k35068j53464
3398C0175649j07255p2702j2916J07738L48302N48167R52872J525296J702563
3389C5167714J334757Q49826L50228j55698p63690j238556j264301j124185q88731
3380C2267364o75816m45156k36171m5462J58466L04457M58311N59894P31891P69831
3370C3847609R28981R63700J066570J057394R83661J021567R55358Q27578Q09341
3361D2461759P72303R00303R23220Q47103O95247K90967j1185l25320o88351q84090
3351D4981956j054333r57387q45995q40180o79424n53982m43792l63170k23222
3342C9020471r8868M6884J51170L65331L98323N31751O82617Q22879R26718J013124
$$ y = [33523193, 32928141, 32386944, 31907844, 31555235, 31168452, 30794341, 30564181, 30329113, 30175649, 30068394, 29995692, 29982776, 30090514, 30438816, 30986983, 31939855, 33465151, 35167714, 36502471, 37352297, 37702525, 37546827, 36783137, 35544581, 34280280, 33156095, 32267364, 31591548, 31146392, 30910221, 30864759, 31023225, 31327682, 31785993, 32345887, 33077778, 33847609, 34776590, 35740290, 36806860, 37864254, 38847915, 39869482, 40824840, 41652418, 42461759, 43234062, 44134365, 45057585, 45904688, 46599935, 46890902, 46879717, 46554397, 45866046, 44981956, 43927623, 42970236, 42124241, 41284061, 40604637, 40050655, 39606863, 39243693, 39020471, 38921603, 38968487, 39119657, 39484988, 39883311, 40415062, 41097679, 41920558, 42847276, 43860400]
3332D3860400J098240J227600J286894J442055J619966J726816J919543K102343
3324E6283857K319262K588975K791073L074449L416503L631234L907729M110365
3316H2123447M356817M509935M626684M726848M688970M548776M417934M119180
3308A18118591L816682L403205L039562K595513K144502J719599J428278J085330
3300A37351262Q20594N64643M15757K88143J68903J31772P4779j0547m3848k8013
3290A39733445j40927j87504k02921j38992j42495m9693L7472R4298K16858K99295
3280A39518836L45814M42361M36089L50189K60281P1716j62619m66434q48844
3271A39947389j148800j629101j958562k273230k655316k856520l024170l096542
$$ y = [43860400, 44958640, 46186240, 47473134, 48915189, 50535155, 52261971, 54181514, 56283857, 58603119, 61192094, 63983167, 67057616, 70474119, 74105353, 78013082, 82123447, 86480264, 90990199, 95616883, 100343731, 105032701, 109581477, 113999411, 118118591, 121935273, 125338478, 128378040, 130973553, 133118055, 134837654, 136265932, 137351262, 138171856, 138736499, 139152256, 139440399, 139609302, 139741074, 139815853, 139805306, 139761458, 139733445, 139592518, 139405014, 139202093, 139063101, 138920606, 138870913, 138908385, 139002683, 139219541, 139518836, 139864650, 140307011, 140743100, 141093289, 141353570, 141425286, 141262667, 140796233, 139947389, 138798589, 137169488, 135210926, 132937696, 130282380, 127425860, 124401690, 121305148]
3263A21305148l150555l231514l064279l037332k922217k876598k864603k855144
3255I7302906k882311k937087k939263l111637l138500l185401l190903l146445
3247G2771359l102094k983352k846252k703620k464804k265683k119757j864830
3239E2420967j681098j503912j366839j239528j162030j155024j156269j050584
3231D2105683j086164j073685j075977j071657j049819r84333r29216q01779p34782
3222C3298271o40689n24238m31510l45129l01343j51586q4189o2910j8673j7544
3212C0720460O696J2801J2104P4810P6218O5672Q3155N6943K5689O714k4039j33799
3200C0983424k74467l31886m14499n56795o25790p01106p11314p74222p79360
$$ y = [121305148, 118154593, 114923079, 111858800, 108821468, 105899251, 103022653, 100158050, 97302906, 94420595, 91483508, 88544245, 85432608, 82294108, 79108707, 75917804, 72771359, 69669265, 66685913, 63839661, 61136041, 58671237, 56405554, 54285797, 52420967, 50739869, 49235957, 47869118, 46629590, 45467560, 44312536, 43156267, 42105683, 41019519, 39945834, 38869857, 37798200, 36748381, 35764048, 34834832, 34033053, 33298271, 32657582, 32133344, 31701834, 31356705, 31055362, 30903776, 30819587, 30756677, 30738004, 30720460, 30727156, 30739957, 30752061, 30826871, 30903089, 30968761, 31051916, 31108859, 31134548, 31141262, 31117223, 30983424, 30708957, 30377071, 29962572, 29405777, 28779987, 28078881, 27367567, 26593345, 25813985]
3191B5813985p53866p62513p10492o45820n86902n20184m85783l87436m12429
3182B0548560l39253k85797k05841j81579j46745j42989q3340p4385j90289j85324
3172A8713018j41711j74071k56272j90354j28553k11521j77590q5531r8501q2424
3162A7166490j05597o2858n224Q115M1810N9940P6119J12535J81815J86863J95016
3151A7855024K88335K66089K35465K71591L12507L04581K84962K86831K88202
3142B0393587K89765K55835L16773L45000L54828L41131M63393M91662N37969
3133B3789943N81939O63800P18277P15625Q71630R30560J040532J103788J256458
3124C1672552J335261J486973J609522J804256J884317K074092K287306K464473
$$ y = [25813985, 25060119, 24297606, 23587114, 22941294, 22354392, 21834208, 21348425, 20960989, 20548560, 20209307, 19923510, 19717669, 19536090, 19389345, 19246356, 19163016, 19088631, 18898342, 18713018, 18571307, 18397236, 18140964, 17950610, 17822057, 17610536, 17432946, 17347415, 17248914, 17166490, 17060893, 16998035, 16992811, 17000926, 17042736, 17102676, 17178795, 17291330, 17473145, 17660008, 17855024, 18143359, 18409448, 18644913, 18916504, 19229011, 19533592, 19818554, 20105385, 20393587, 20683352, 20939187, 21255960, 21600960, 21955788, 22296919, 22760312, 23251974, 23789943, 24371882, 25035682, 25753959, 26469584, 27341214, 28271774, 29312306, 30416094, 31672552, 33007813, 34494786, 36104308, 37908564, 39792881, 41866973, 44154279, 46618752]
3116D6618752K599670K651309K725246K754252K682220K738959K840340K958984
3108F8569732L189933L492031M009158M548028N122942N922909O734622P691386
3100A09280741Q736160R841695J1079945J2469095J4007151J5871242J8133583
3093A99419612K0852695K4189510K7906814L1511283L4155758L5013850L3026825
3086D06076347K7710434J9472869R336061j421296j1687029k0245430k6245741
3079D02996215k9700528l1008862l0700248k9416921k7466196k5202407k2869550
3072B06631503k0515768j8256122j6003033j3983755j2223442j0667174r302115
3065A05680094q132144p059416o223867n454420m824675m355713l846506l391896
$$ y = [46618752, 49218422, 51869731, 54594977, 57349229, 60031449, 62770408, 65610748, 68569732, 71759665, 75251696, 79260854, 83808882, 88931824, 94854733, 101589355, 109280741, 118016901, 127858596, 138938541, 151407636, 165414787, 181286029, 199419612, 220272307, 244461817, 272368631, 303879914, 338035672, 373049522, 406076347, 433786781, 453259650, 462595711, 461174415, 449487386, 429241956, 402996215, 373295687, 342286825, 311586577, 282169656, 254703460, 229501053, 206631503, 186115735, 167859613, 151856580, 137872825, 125649383, 114982209, 105680094, 97547950, 90488534, 84264667, 78810247, 73985572, 69629859, 65783353, 62391457]
3057F2391457l049707k662612k442731k073689j918917j750195j551590j445839
3049D5496177j397469j299501j289563j229157j235107j298879j174248j276240
3041C5296013j167802j130998j120454j162046j111839j040136r92597r74769
3033B6595372r44670q66167q90242q20848q17094p70768p74868p59907o48554
3024A9302254o22667n59284m95283m84369m14915m14620l23104k94267l90332
3015A5303413l06025l36796l53781l10311l23811l32656l34394l67066k81800
3006A2356773l02517k96073k94937k87942k56769k59072k75398k54607k76629
2997I852829k40261k45796k15641k15281k04416k46611j89683k77956j55990j26573
$$ y = [62391457, 59341750, 56679138, 54236407, 52162718, 50243801, 48493606, 46942016, 45496177, 44098708, 42799207, 41509644, 40280487, 39045380, 37746501, 36572253, 35296013, 34128211, 32997213, 31876759, 30714713, 29602874, 28562738, 27570141, 26595372, 25650702, 24784535, 23894293, 23073445, 22256351, 21485583, 20710715, 19950808, 19302254, 18679587, 18120303, 17625020, 17140651, 16725736, 16311116, 15988012, 15693745, 15303413, 14997388, 14660592, 14306811, 13996500, 13672689, 13340033, 13005639, 12638573, 12356773, 12054256, 11758183, 11463246, 11175304, 10918535, 10659463, 10384065, 10129458, 9852829, 9612568, 9366772, 9151131, 8935850, 8731434, 8484823, 8295140, 8017184, 7861194, 7734621]
2987G734621j99463j33589j41885j38695j16493j83240j32498r1163j33174q6489
2977F377932r5988n3167p4438p3154L876l5125r6700Q894o7951k2341m1206k3681
2965E806951j2147o1722l9268m4755r1652m1982p3468m1598j13920r9312l5717
2954E151410p6751o6776q8091r8150o0972j04504l8162n8428m2438n7745k5855
2943D433538m5996k2707l8065o223p4698m7304k5258m2392o3256p4325o0304n6614
2931C876396k7192q7394m1052q8116o6117n2456k3956l7361m0710n8642p7032
2920C276368l6745o8551o0074j5724J1998l1122l5751R333l1469j3274j0417M3648
2908C038220k455O283J5068J7839j6342o758m6679o4712m0707n8614n7140n3338
$$ y = [7734621, 7535158, 7401569, 7259684, 7120989, 7004496, 6821256, 6688758, 6597595, 6464421, 6377932, 6281944, 6228777, 6154339, 6081185, 6085061, 6049936, 5953236, 5962130, 5894179, 5871838, 5830632, 5806951, 5794804, 5733082, 5693814, 5649059, 5557407, 5515425, 5441957, 5400359, 5286439, 5187127, 5151410, 5074659, 5007883, 4919792, 4821642, 4760670, 4656166, 4618004, 4559576, 4517138, 4459393, 4433538, 4387542, 4364835, 4326770, 4320547, 4245849, 4198545, 4173287, 4130895, 4067639, 3993314, 3933010, 3876396, 3849204, 3761810, 3720758, 3632642, 3566525, 3514069, 3490113, 3452752, 3412042, 3353400, 3276368, 3239623, 3171072, 3110998, 3095274, 3107272, 3076150, 3040399, 3049732, 3018263, 3004989, 2994572, 3038220, 3035765, 3042048, 3057116, 3074955, 3058613, 3051855, 3005176, 2940464, 2899757, 2841143, 2784003, 2730665]
2896B730665k9356j4568o1087l9885l7621k5473l0211o8652K2078k2982o0942
2885B361966p876k2994k2323j0190p477M740l2334J265P8603q352K8555j3226
2873B350357N743M000n5173k2305j0381m5768J0262n7816o8220r8225o0490l0184
2861A921800l6418l8276k7383m9271N599N99K818l0357n3470k650O227k762l6303
2848A660153q694k8826j8081l2687J0238k3896k9945N58N209j5268l4900n995
2836A477866K8269m7109O319K7699p619J7309k1814l2102K9241m4316j8470K8711
2824A443984j7957l0942j0126O235L8479P195L0040N9348O2026M7551M2993P1980
2812A750806R5554N1833J20663Q5811R3168J09559J74551J38737R2905Q0902J40480
$$ y = [2730665, 2701309, 2686741, 2625654, 2585769, 2548148, 2522675, 2492464, 2423812, 2445890, 2422908, 2361966, 2354090, 2331096, 2308773, 2298583, 2291106, 2295846, 2263512, 2264777, 2343380, 2335028, 2363583, 2350357, 2356100, 2360100, 2304927, 2282622, 2272241, 2226473, 2236735, 2178919, 2110699, 2012474, 1951984, 1921800, 1885382, 1847106, 1819723, 1770452, 1776051, 1776650, 1779468, 1749111, 1695641, 1692991, 1699218, 1696456, 1660153, 1651459, 1622633, 1604552, 1571865, 1582103, 1558207, 1528262, 1528820, 1534029, 1518761, 1483861, 1477866, 1506135, 1459026, 1465345, 1493044, 1485425, 1502734, 1480920, 1448818, 1478059, 1433743, 1415273, 1443984, 1426027, 1395085, 1384959, 1391194, 1429673, 1436868, 1466908, 1526256, 1588282, 1635833, 1678826, 1750806, 1846360, 1898193, 2018856, 2104667, 2197835, 2307394, 2481945, 2620682, 2713587, 2794489, 2934969]
2801B934969k3064J3062l2062r6711o4824j49503j61550j23593j40356j33710
2791B022658j54623q0436p2291r6329q0424j06151m3277k6899n6208l4863K2761
2780A293918p7293j4668l4954L6316m195m1927R905J1752m1514q001o6567l6237
2768A026535k2522o620j5196n8502l1141M6738m2353J568j4096J8201J0881l6604
2756H76889j7754L9514l0969k399j8512j9126l0289k8713K2635m2276n7429L0077
2744G21648R603J4972l0235o1332K2460k2448j871N030l2467j3689q516r032P414
2731F01537n6343M1040J6533n0556j1784N5742l6602q188k8165R215j7695j2100
2719E02634M5634J5211j8696k5833k5784N6261n2962J9902M118m3312J6749K1964
$$ y = [2934969, 2911905, 2924967, 2892905, 2796194, 2731370, 2581867, 2420317, 2296724, 2156368, 2022658, 1868035, 1787599, 1715308, 1618979, 1538555, 1432404, 1389127, 1362228, 1306020, 1271157, 1293918, 1216625, 1201957, 1167003, 1203319, 1199124, 1157197, 1167102, 1178854, 1137340, 1129339, 1062772, 1026535, 1004013, 997393, 982197, 923695, 892554, 939292, 896939, 898507, 884411, 902612, 913493, 876889, 859135, 898649, 867680, 865281, 846769, 827643, 797354, 768641, 791276, 749000, 691571, 721648, 731251, 746223, 715988, 654656, 677116, 654668, 652797, 657827, 625360, 611671, 603155, 594123, 601537, 545194, 586234, 602767, 552211, 540427, 596169, 559567, 551379, 523214, 532429, 514734, 502634, 548268, 563479, 544783, 518950, 493166, 549427, 496465, 516367, 520485, 477173, 493922, 515886]
2707E15886J9821J3775j1972R027J6467o1744L0318r953P747r42K0042L7011j3924
2694E71559o1506N1692l4191j6568J2963K066N7965m1251r860K3137l7104j2256
2682E06646O455j5302K1705l9289j45J4251j6769J493L425j2470J0077l613O1591
2669E38055J486J2874M6121l4754q673K2129J9437J8220l4265k6997j1573l4453
2657E07607j0724P038j0033Q260k8173j711J7532j7165j1143L0182K948k8613
2645D66005J5692N2751K0340P836M8845O66M322m6991K6348j1169k6866m978j2069
2632E40732n258L0161l9116M674k1826k8229J5862m005j8007o728l271K9752k6069
2619D68672J9449M1768m3197j8609L4989l9184J3636j2063K8661j2298O069P341
$$ y = [515886, 535707, 549482, 537510, 546537, 563004, 501260, 531578, 521625, 529372, 528430, 548472, 585483, 571559, 510053, 561745, 527554, 510986, 523949, 526015, 583980, 542729, 532869, 556006, 518902, 506646, 513101, 497799, 519504, 480215, 480070, 494321, 477552, 479045, 482470, 470000, 480077, 476464, 538055, 539541, 552415, 598536, 563782, 555109, 577238, 596675, 614895, 580630, 553633, 542060, 507607, 496883, 503921, 493888, 502148, 473975, 472264, 489796, 472631, 461488, 491670, 494618, 466005, 481697, 534448, 554788, 562624, 611469, 612135, 616457, 569466, 595814, 584645, 557779, 552801, 540732, 535474, 565635, 526519, 531193, 509367, 481138, 497000, 492995, 474988, 468260, 464989, 494741, 468672, 488121, 529889, 486692, 468083, 503072, 463888, 477524, 465461, 494122, 481824, 487893, 495234]
2607D95234j1416J1188k1100L829r479l052n056J0869m4527J0035j7662L1079
2595D49942k0797k793J5851o516l5305K7893O225p903r737M1235j3217k8966J6291
2582D32203k3184m2472O119j5236l0034p060J2643K3585n482m9782M1124L3577
2570C76001K557j4122j6889o803J4262k0556K0249m8515j0815M3901J3386O833
2558C59489l643j5288J991k3077K8085L4326k2141J5685m0550J5576k0252l8918
2546B91283n289P868M539P818k0307M513n765q766K9617K5860k4022Q67o2878
2533B45338N5343l1007J6849j9315k266P107M1688k7293l3742m3296J4017J0423
2521B33846l4291K6070J2568J9673j1915j8900j1352O1790l7627M3443l5065j6599
$$ y = [495234, 483818, 495006, 473906, 477735, 468256, 465204, 460148, 471017, 426490, 436525, 418863, 449942, 429145, 426352, 442203, 435687, 400382, 428275, 434500, 426597, 416860, 458095, 444878, 415912, 432203, 409019, 366547, 372666, 357430, 327396, 320336, 332979, 356564, 351082, 301300, 342424, 376001, 378558, 364436, 347547, 340744, 355006, 334450, 354699, 306184, 295369, 339270, 352656, 359489, 355846, 340558, 342549, 319472, 347557, 381883, 359742, 375427, 334877, 350453, 330201, 291283, 285994, 293862, 298401, 306219, 285912, 290425, 284660, 275894, 305511, 331371, 307349, 308216, 245338, 300681, 269674, 286523, 267208, 264942, 272049, 313737, 286444, 252702, 209406, 223423, 233846, 199555, 225625, 238193, 257866, 245951, 227051, 215699, 277489, 239862, 283305, 248240, 231641]
2509B31641K0070M0599k7582k7671J1109N8842j2239Q37P521l2935J8670k8707
2497B60155j3837J4773j5045L3985q236J3455k1607j6150k582l194o82M3247m293
2484B79989m358J9703l7268P363J1461N3266L176l8130n827J8225k5310L367l011
2471B82646l677l8183K2722K9936k3595m8268P163k106N9630k2670k9155j6947
2459B17496M6479K5977J7561k3472P096j7642l771J7368k2528j0037J6372J0285
2447B81184q15K838K6338Q635k7536L5332j6878j5428J9745l147M03K1451l2179
2434B99943K6549m3401o013M0483J2472n7572L7689k3042K6260m947K1094j0692
2422C18823j1154k5584j3233K4612K6871j1674m415J6968K9164J0560k4255J9524
$$ y = [231641, 251711, 292310, 264728, 237057, 248166, 307008, 294769, 295606, 303127, 270192, 288862, 260155, 246318, 261091, 246046, 280031, 271795, 285250, 263643, 247493, 244911, 241717, 241035, 284282, 279989, 275631, 295334, 258066, 265429, 276890, 330156, 333332, 295202, 289375, 307600, 282290, 285657, 282646, 278969, 240786, 263508, 293444, 269849, 221581, 228744, 226638, 286268, 263598, 234443, 217496, 263975, 289952, 307513, 284041, 291137, 273495, 269724, 287092, 264564, 254527, 270899, 281184, 280369, 283207, 309545, 318180, 290644, 325976, 309098, 293670, 313415, 310268, 310671, 332122, 299943, 326492, 283091, 277078, 317561, 330033, 272461, 310150, 287108, 313368, 308421, 329515, 318823, 307669, 282085, 268852, 293464, 320335, 308661, 304246, 321214, 350378, 360938, 336683, 356207]
2410C56207L9230L5023J0301N6759K5304M3761K1759P720N4242R0015L150P086
2398G50557K965M2821K6706N8605O3471J33821J06086J61905J12771J11929J28814
2387A700451J24878J45126J57492J73745K17164K98692M53890O83108J059431
2378E013977J763830K607482K786136J890066J024630L42116n83239j484265k139072
2369A1221661k131207j663739j340774j159780r08351o92726n19976l15128k29417
2360B260563j79597j96208j89550j38316j38139k10679j09139o9740p7782p1425
2350H79988q0650o6644k7995m0272m6281l6782K1803j7959L3136J4532k9800m2315
2338E60761R313l9458k1238p758O676k5498l5405Q860j8550N347j0631m018J8249
$$ y = [356207, 395437, 430460, 440761, 497520, 522824, 566585, 588344, 596064, 650306, 740321, 743471, 750557, 753522, 796343, 823049, 881654, 945125, 1078946, 1185032, 1346937, 1459708, 1571637, 1700451, 1825329, 1970455, 2127947, 2301692, 2518856, 2817548, 3271438, 3954546, 5013977, 6777807, 9385289, 12171425, 14061491, 15086121, 15428237, 14844998, 13360733, 11221661, 9090454, 7426715, 6085941, 4926161, 4017810, 3325084, 2805108, 2489980, 2260563, 2080966, 1884758, 1695208, 1556892, 1418753, 1208074, 1098935, 1029195, 951413, 879988, 799338, 732694, 704699, 664427, 618146, 581364, 603167, 585208, 618344, 632876, 603076, 560761, 570074, 530616, 509378, 501620, 508296, 482798, 447393, 456253, 437703, 443050, 432419, 428401, 446650]
2325D46650k7793k7554N0285l8889m5337K3851l1455m2610k8717j3391k5402k6178
2313B13460K732J5285m1315O831M6644K1931R850k7209L4389j740o6892l1099
2301A82867Q830j1324j6033L83k608m2554N825L4948J0042k0155K9152P0J6104
2288A95547M378j1943l8610Q85j4549K4977m9482j3085j4376K6069j5505j3804
2276H0502K9243j8376j1315j3376K2227O1388j9285J3014Q005J5994L3521o8387
2264A33155k3509j3627m145K8692M528O996N8088m1323J8853n9721L4895K5481
2252A68363j3731J0207M6581O353k4550m9379m0487M2064o6638j4556j5867J9135
2240F7495J7262p720L8473M897l0364L2422j0003J0558K9480J2157n388j7351
$$ y = [446650, 418857, 391303, 441588, 402699, 357362, 381213, 349758, 307148, 278431, 265040, 239638, 213460, 216192, 231477, 190162, 196993, 243637, 265568, 275418, 248209, 282598, 280858, 213966, 182867, 191697, 180373, 164340, 164723, 162115, 119561, 125386, 160334, 170376, 150221, 179373, 179443, 195547, 199925, 187982, 149372, 150257, 135708, 160685, 111203, 98118, 83742, 109811, 94306, 80502, 109745, 91369, 80054, 66678, 88905, 150293, 131008, 144022, 152027, 168021, 201542, 133155, 109646, 96019, 91874, 120566, 125094, 132090, 190178, 148855, 167708, 107987, 142882, 168363, 154632, 164839, 211420, 217773, 193223, 143844, 103357, 145421, 78783, 64227, 48360, 67495, 84757, 77037, 115510, 120407, 90043, 122465, 112462, 123020, 152500, 164657, 159269, 141918]
2228A41918J9920l5001m6912j2149k125J1369j665l5867M7861L554r964R476l0665
2215E9750J5738p99o821K5167L1085m3339J0778K1239Q842J2818n7156j9665K4838
2202H2475K2624J744k2043P324M75j5102K597J3770L9724l0347m9469L6305L3382
2189A23459j947K9989m1206M2690j7615j6352K4923m7808j5065K8842J5445L0882
2177A56237n978k75j5377j635o29J5220l3417k1984r788J1557J8451l4238J4354
2164I2498N327j6619J666L8717j4833N078n4893L3190j1387n407q045L903N562
2151G4757j3740J1920k8303l1420J5374K1703P774J0114K988L5763l2211M362
2139G9081P155L843J9077K5793j6965j3450k8899K4821r859k7404K14K064K3044
$$ y = [141918, 161838, 126837, 79925, 67776, 65651, 77020, 75355, 39488, 87349, 90903, 80939, 90415, 59750, 75488, 74689, 67868, 93035, 124120, 80781, 91559, 112798, 121640, 134458, 77302, 57637, 82475, 105099, 106843, 84800, 92124, 92599, 77497, 80094, 93864, 133588, 103241, 53772, 90077, 123459, 121512, 151501, 110295, 152985, 135370, 119018, 143941, 96133, 81068, 109910, 125355, 156237, 150259, 149984, 134607, 132972, 132343, 147563, 114146, 92162, 82374, 93931, 112382, 78144, 92498, 97825, 81206, 82872, 121589, 106756, 111834, 56941, 90131, 78744, 73337, 65292, 69195, 74757, 61017, 72937, 44634, 13214, 28588, 50291, 58065, 68179, 71167, 106930, 74719, 79081, 86236, 90079, 109156, 134949, 117984, 104534, 75635, 100456, 90597, 63193, 63407, 65471, 88515]
2126H8515J5982p322R168j4471l1492L8289n944j2673K2583L3407O01k9699l4127
2113G2817L3609k6285k8184L7308j3795m2621n341J8588R878r066J3782M8901
2101A09591l3955k490o983J6148l5785l3252L2770o778j0857J9654r565m1052
2089b554n5278L395J7854K5671K5591l2540J7421K9098p52j1800L560K083J5869
2076C7618O111R925m5585K7102m3192J4938k0094N05K1265K8410n3656K9154q413
2063D088K6508L1096k0607j3011m4244J1469K3698L135j6035Q671k2724J7434
2051I478j0155K2707m3328k7549L0228K0999K5254K826K991J751q364l2539j1379
2038a7080j5882K0607j5961j4006N008J2776k2831o0155O241J9328J6386K6552
$$ y = [88515, 104497, 97175, 106343, 91872, 60380, 98669, 92725, 80052, 102635, 136042, 136643, 106944, 72817, 106426, 80141, 51957, 89265, 75470, 32849, 27508, 46096, 55974, 46908, 60690, 109591, 75636, 73146, 66163, 82311, 46526, 13274, 46044, 39266, 28409, 48063, 38498, -2554, -57832, -54437, -36583, -10912, 14679, -17861, -440, 28658, 27906, 16106, 19666, 21749, 37618, 43729, 53654, 8069, 35171, -8021, 6917, -13177, -12672, 8593, 37003, -16653, 12501, 4088, 30596, 61692, 41085, 28074, -16170, -4701, 18997, 22132, 6097, 14768, -7956, 9478, -677, 22030, -21298, -48847, -18619, 2380, 27634, 30460, 33451, 35202, 26838, -5701, -17080, -32962, -12355, -28316, -42322, -37314, -24538, -47369, -107524, -101283, -81955, -65569, -39017]
2026c9017M9889k0442K5270l1714j4044K1178P687m1267L3084r296K4132l9979
2014c4519r295O1962m387n9433K4991k039j9665J5880K9225P713K0727p471L1936
2001E5625o4179L799j7806k5255P3896l6843K0466J3129K8383j1546J3773l2715
1989B0727L4433p385K7248k465n486L031j7322j0070j337k0849l0048j594J7267
1976F150k1486J0389R70m9097P18K813K2221J8626k4472k5417K8551O471K3055
1963e08j0782K0127m25n2911k0115O611L1080J7516l4073j8942K4010K604J2601
1950b3207J1111j8123o46K481m5308K3799j5672K8738j7932J0769L5173k798k8314
1937c9929j6763k2239n275J797M582M9098k0330j7321J6427j015O070O778K7813
$$ y = [-39017, 10872, -9570, 15700, -16014, -30058, -8880, -1193, -42460, -9376, -18672, 5460, -34519, -43814, 18148, 13761, -45672, -20681, -22720, -42385, -26505, 2720, 10433, 31160, 23689, 55625, -8554, -4755, -22561, -47816, 26080, -10763, 9703, 22832, 51215, 39669, 53442, 20727, 55160, 47775, 75023, 72558, 67072, 70103, 52781, 42711, 41374, 20525, -9523, -11117, 6150, -15336, -4947, -3977, -53074, -52356, -49543, -27322, -8696, -33168, -58585, -30034, -23563, -508, -11290, 8837, 8412, -44499, -64614, -58003, -26923, -9407, -43480, -62422, -38412, -35808, -23207, -12096, -30219, -30865, -28384, -73692, -49893, -65565, -36827, -54759, -43990, -8817, -11615, -39929, -56692, -78931, -84206, -82409, -77827, -28729, -49059, -66380, -49953, -50968, -44898, -38120, -10307]
1924a0307K7018n0877L4808J7606J1576j9460k3441O044j3223L0688j4566J78
1912c956l1776j5331K7339K4812l3871M291J1725j3399L0J1907J0585l124P338
1899c430K1879m485j9518R306j8607p97k4436K7236R91O223o230L9087n3196L035
1885b2942j996J1557p856j2653N711N6839p180j7404j8978k2059J6022K0416J5351
1872A4828j0325j9172r82R939m0820r725m733J4809j4320m4877L0172K2022k5061
1859g8245L0536L3849j1247k2972O8369L6121j210l1002K335n511l1428K1207
1847A0802J0193n1535k7088L8101J362p87J4104L3336k4899m4459K0559j7270
1835c7581J4878k4201k1049L4381j694K6788K0887k7960K9399q98j0578k2511
$$ y = [-10307, 16711, -34166, 642, 18248, 29824, 10364, -13077, -7033, -20256, 10432, -4134, -3956, -35732, -51063, -23724, 1088, -32783, -28492, -16767, -30166, -30136, -18229, -7644, -10768, -3430, 18449, 13964, -5554, 3752, -14855, -15652, -40088, -12852, -11861, -5638, -11868, 27219, -25977, -22942, -24938, -13381, -21237, -33890, -28179, 28660, 21480, 4076, -14902, -36961, -20939, -523, 14828, 4503, -14669, -15651, -5712, -46532, -56257, -60990, -46181, -60501, -105378, -75206, -53184, -78245, -47709, -13860, -25107, -48079, 20290, 56411, 55201, 24199, 26534, 21023, -10405, 10802, 20995, -30540, -57628, -19527, -18165, -18952, -4848, 28488, 3589, -40870, -20311, -37581, -22703, -46904, -67953, -33572, -35266, -8478, 12409, -15551, 13848, 12950, 2372, -20139]
1823b0139P2301k5391N862l0393L0315k7608p903p3092J3584N2107j0590j8273
1811c9220Q359K5688k0276K2448j093j2399n082K4510l737J2408J7440m824k5544
1798a322J956j8665m874j7785O7503m5226m1525J3693J9291l1422L371J6942Q871
1785b9192L4970j210L012m8518K5907R671p429l0543K1254j9102O729p407m3466
1772h5324K8191J5415M4860k5753O246j1472k295N864J0579k4034J9621k0384
1760c8486J1298J9217l8523K7226l291k3007J2118J740N0470j8622l2402k9073
1748f1335M9702J755N5688j3675K065L985j2666R891O16j3553l781l0064k8387
1735c9759L09j1134L2984k3762k3187j4132R327N731K8264j0050k4739J1374j6140
$$ y = [-20139, 52162, 26771, 32633, 2240, 32555, 4947, -2956, -76048, -62464, -10357, -20947, -39220, -30861, -5173, -25449, -3001, -4094, -16493, -21575, 2935, -802, 11606, 29046, 24222, -1322, 634, -18031, -22905, -40690, 26813, -18413, -59938, -46245, -26954, -58376, -55005, -38063, -29192, 5778, 4568, 7580, -40938, -15031, -5360, -12789, -43332, -22078, -41180, -34451, -41858, -85324, -57133, -41718, 3142, -22611, -16365, -27837, -30132, -24268, -13689, -37723, -18102, -38486, -27188, -7971, -46494, -19268, -22559, -45566, -33448, -31708, 18762, 140, -32262, -61335, -11633, -9878, 45810, 32135, 34200, 38185, 25519, 35410, 36026, 22473, 18692, -11372, -39759, -39450, -50584, -17600, -41362, -64549, -78681, -69354, -63623, -35359, -45409, -70148, -58774, -74914]
1722g4914J2973J1221P441m921M6836j6324m5435K9890L004Q569J1457j7146L0937
1709C588K8555m7699L7535m0978o142K2978k4993k0678j6718j7357O0187l2194
1697e3916M285k3082O635n040k5325P138M1105k2521M4121k1864j314L1873j7805
1684c5710M2728k3944J4249j3101o738n3383P795L057L023m2408K0380M5758n2175
1671i0469P076J5072l239J4779k511J2432K5165j0499J26L0558P367K1671m4013
1658a6485k5258l8477K5433o956k2409R058Q079L5200l8606K8280l1796K1636
1646e2301J2247M8015m0464Q535R176k1989l739l0819k1019K5809n46J3474M3814
1633i807n562J2673j118j3647j2052L866k4070r82m6665J4348l1422P935J6700
$$ y = [-74914, -61941, -50720, -43279, -48200, -1364, -17688, -63123, -33233, -30229, -21660, -10203, -27349, 3588, 32143, -15556, 21979, -18999, -25141, -2163, -27156, -47834, -64552, -81909, -21722, -53916, -49631, -72713, -66078, -71118, -96443, -89305, -48200, -70721, -26600, -48464, -49778, -17905, -35710, 7018, -16926, -2677, -15778, -22516, -75899, -68104, -65047, -62024, -104432, -84052, -38294, -90469, -83393, -68321, -71560, -56781, -59292, -46860, -21695, -32194, -32068, -1510, 5857, 27528, -16485, -41743, -80220, -54787, -61743, -84152, -75094, -67015, -31815, -70421, -42141, -73937, -52301, -40054, 7961, -32503, -23968, -14792, -36781, -40520, -71339, -92358, -66549, -67095, -53621, -9807, -15369, -2696, -3814, -17461, -29513, -25647, -49717, -50699, -97364, -83016, -114438, -106503, -89803]
1620h9803l82k4435J6513L0531L0716N5000J1923J0801m0411J3562K727j0938
1608E804j2664o557k9694k0203J0645J9520m6224J3892J4861n0804J459O618O8305
1595b5042m176K8239k3502l3005N656p01r754m296j2669j0462J0940j6155j6745
1582a11672M956L6708P840J600L6538J5417n705j509J1003j0456p421J561L3193
1569A2053j380o0850M994J3984k3327j9818K9379l4780J0664j6976j0851k4315
1557a21223M6058M0762J3564l5331l8085M4601P067Q969J1060J6964k7999J5244
1545a8349m836j2163k5053k259J3086m8924O941J1183L321j3163R190Q224Q17
1532g1985j150J1387L7620L6531j5051l3740L8992k6471j5589J6232j3506k402
$$ y = [-89803, -90185, -114620, -98107, -67576, -36860, 18140, 30063, 40864, 453, 14015, 16742, 5804, -6860, -13417, -43111, -63314, -52669, -33149, -79373, -65481, -50620, -101424, -99965, -93347, -25042, -29218, -979, -24481, -57486, -51830, -52531, -62285, -66581, -79250, -89712, -78772, -94927, -111672, -106716, -70008, -62168, -60568, -24030, -8613, -14318, -15827, -4824, -15280, -22701, -21140, 12053, 10673, -50177, -45183, -31199, -54526, -74344, -44965, -79745, -69081, -86057, -96908, -121223, -75165, -34403, -20839, -56170, -94255, -49654, -42587, -33618, -22558, -5594, -33593, -18349, -23185, -35348, -60401, -62660, -49574, -98498, -91557, -80374, -77053, -90216, -81026, -72802, -71985, -73135, -61748, -24128, 12403, -2648, -36388, 2604, -23867, -39456, -23224, -36730, -39132]
1520c9132j9555R171L7041o7694Q402L8743J987k6974O054m970J2974k9763K5428
1507d8288j3748j7935J3739J8964k8759K4769j9101Q1418K4858j1562N38k2164
1495B729J1342P523j007k7990k2753l6010J7326j4154L4111l1721n681J5999j7658
1482f7944L488J0986l0242N3034l0725K1203j4063P6835J6100l1009l2237J8826
1470e748l1802j5413R934Q591J6162k4278j5641l2304j0450M8501r373k8953M7875
1457d2899K03L0085j6122m863M1431l6335m4135N5555k2208q52N117r787K232
1444d2578l9317O0551M2690q1094j2208J396M724Q643m81o226L708Q999N3226
1431B033l4280l0376K9966L039L5171j594k2895J3041l5632K5470l9330q22K2170
$$ y = [-39132, -58687, -49516, -12475, -80169, -71767, -33024, -31037, -58011, -51957, -56927, -43953, -73716, -48288, -62036, -79971, -66232, -47268, -76027, -51258, -70359, 11059, 35917, 24355, 24893, 2729, 14071, 21594, 20587, -7403, -30156, -66166, -48840, -62994, -28883, -60604, -66285, -50286, -67944, -64456, -53470, -83712, -30678, -61403, -40200, -54263, 22572, 38672, 7663, -24574, -5748, -37550, -52963, -43029, -34438, -18276, -42554, -58195, -90499, -100949, -52448, -61821, -90774, -42899, -42696, -12611, -28733, -33596, 7835, -28500, -72635, -17080, -39288, -40140, -35023, -44810, -42578, -81895, -21344, 21346, -59748, -71956, -70560, -65836, -57193, -57674, -63900, -60192, -51193, 2033, -32247, -62623, -32657, -29618, 5553, 3959, -18936, -5895, -41527, -16057, -55387, -56209, -34039]
1418c4039l860J2771J17j9288K476j2112j804N5259o9480K0304p018K0234J1140
1405b5300L662J0562j5951k0983N8024j5296J2809J457j8351k0699r216O494J2142
1392b0646k3532J5012j8741L579N732j3149J8412K8329l2169L4254P005l5511
1380c1425K2065o5666K4226j7810K3012L574l0975m6690L3979p389K4129J522
1368f7448q306K1552M147J0013l442J0067O826k4403J7612K0661L0061l4267l2146
1355d9073j0954L247j5229Q591k104j2462L7241J367L49M1374n575n011o917J5964
1341H08j4977K596l129J7611p992J4812l1550K8307K992J426j6195m2083L0708
1328a6666J6719k6993l8711L7040l6045M0452l8814L8149K5836j3536j0678K9148
$$ y = [-34039, -37899, -25128, -25011, -44299, -41823, -53935, -55739, -480, -69960, -49656, -56674, -36440, -25300, -21638, -11076, -27027, -48010, 10014, -5282, 7527, 8984, -9367, -30066, -39282, -32788, -20646, -44178, -29166, -47907, -44328, -38596, -51745, -33333, -5004, -37173, -2919, 4086, -31425, -9360, -75026, -50800, -68610, -45598, -42024, -72999, -119689, -85710, -93099, -68970, -67448, -75754, -54202, -50055, -40042, -43484, -33417, -26591, -50994, -33382, -12721, 17340, -16927, -49073, -60027, -56780, -72009, -63418, -65522, -77984, -40743, -39376, -39027, 2347, -3228, -8239, -15156, 808, -14169, -11573, -14702, 2909, -5083, 9729, -21821, 6486, 9478, 10904, -5291, -47374, -16666, 53, -26940, -65651, -28611, -64656, -24204, -63018, -24869, 967, -12569, -23247, 5901]
1316E901l7094L234J8739N564k8780L3467K8867O814n3241j129k013L6410o191
1303A0548m7294L1945K5218m2872p057l1575J5603M4381l8332J0383J1929K6882
1291I759m158M7135k5181M4082q698L552p368n682k2111j2137n2739j3104K6981
1278a9669j6461m3790j4651Q958L9585N533L5335q230n836J8369K179J1011l5513
1265b3180k513J4440j2824J6519j1513k93J7830j8007l2399l717k1110L5627o359
1252d7499o96N3795J210K8389l1290j6582j485K8564r199J7308k8018J7330m8679
1239c6852j036J8564M5267k8754K9131k1478j376k0372Q910j0478j1676J9297
1227a0853j2969K226K7656j1551p914q39m2162k380K2784K4911K852M881K0429
$$ y = [5901, -31193, -27959, -9220, -3656, -32436, 1031, 29898, 36712, -16529, -17658, -19671, 16739, 10548, -36746, -4801, 20417, -22455, -29512, -61087, -45484, -1103, -39435, -29052, -17123, 9759, 5601, 52736, 27555, 71637, 62939, 66491, 59123, 53441, 31330, 19193, -33546, -46650, -19669, -36130, -79920, -94571, -85613, -46028, -40495, -5160, -13390, -19226, -857, 1322, 12333, -23180, -25693, -11253, -24077, -7558, -19071, -19364, -1534, -19541, -51940, -55657, -76767, -41140, -47499, -48195, 5600, 6810, 35199, 3909, -12673, -14158, 14406, 5207, 22515, -5503, 11827, -36852, -37888, -19324, 25943, -2811, 26320, 4842, 3466, -16906, -7996, -18474, -30150, -10853, -23822, -21596, 6060, -5491, -13405, -14244, -56406, -58786, -36002, -11091, -8239, -3358, 17071]
1214A7071j401k7084K6822o5184N7765l2005L66k1917M0040j7953K7894l8955
1202c4541j1805J2260M404J1223N206o597L8649k5400J9147J0215k3574K7488
1190B6675m4334M755q755k4772n7349j6578J2677L8797k7685J2151M3822K1567
1178a9029J2834L0119q141J2976p898J2574m0889K943K9358k9365l3441J7328
1166b0631m4699J463J3445o183o740Q838j2132K9820J8389p020n249O583k8495
1153e2611K9868K1126j1818j0740l896J2533k0887p327J4029m968q152L2194l1530
1140d2179j9169L6075M486q905k7172l1047K5442j3113K2219k3755k3400M0311
1128f0207N3370j1786Q223k623n921Q403q16R010K0102N317J2874l3285M427n6657
$$ y = [17071, 15670, -11414, 15408, -49776, 7989, -24016, -23650, -45567, -5527, -23480, 4414, -34541, -46346, -34086, -29682, -18459, -13253, -19850, 18799, -6601, 12546, 22761, -813, 26675, -17659, -12904, -21659, -46431, -103780, -120358, -107681, -68884, -96569, -84418, -40596, -19029, -6195, 23924, 15783, 28759, 20861, 33435, -7454, -4511, 24847, -4518, -37959, -20631, -65330, -63867, -50422, -56605, -63345, -54507, -66639, -36819, -18430, -25450, -30699, -24116, -52611, -22743, -1617, -13435, -24175, -28071, -15538, -36425, -43752, -29723, -34691, -42843, -10649, -42179, -61348, -25273, -20787, -29692, -56864, -87911, -62469, -75582, -53363, -77118, -100518, -60207, -6837, -18623, -10400, -13023, -18944, -10541, -11357, -2347, 17755, 23072, 35946, 2661, 7088, -49569]
1114d9569k3171m067J6346j2853L0252j9063J8075L6410k8109K5424J0827J9888
1102B0390j8849O064K7800j0075l586K370m3302K7799j9872l1446l50l904p944
1089e4905M1266p689j467j1393J5176K8089J3107K8085k9762L307K2863k7563
1077A9114L5407m527p048m0513l0475J5925k9566o256O195M699J3912L5908m6347
1064c3572Q109L956R547L831N215L646j6060J0913M47o523K1719J6542m2537J3032
1050a735K1608j8248J4755K5563k9104l8048K0571k1003L4969k9674K5706J4572
1038A9932l2450L347J1576n026j3941k8751J8437J9811N720K0797J098k3320p148
1025i918l728J7323o725J9030j6464l0362J5339j1857K4702l4237J5129k8836
$$ y = [-49569, -72740, -76807, -60461, -73314, -43062, -62125, -44050, -7640, -35749, -10325, 502, 20390, 1541, 7605, 35405, 25330, 21744, 24114, -19188, 8611, -11261, -42707, -43057, -46961, -54905, -13639, -21328, -22795, -34188, -19012, 9077, 22184, 50269, 20507, 23814, 46677, 19114, 54521, 49994, 42946, 2433, -28042, -12117, -41683, -47939, -41744, -37045, -23133, 12775, -33572, -25463, -21507, -11960, -8129, -2914, 732, -15328, -4415, -3968, -10491, 11228, 27770, -14767, -1735, 19873, 1625, 16380, 41943, 12839, -25209, -4638, -25641, 9328, -20346, 5360, 19932, -12518, -9171, 2405, -2621, -16562, -45313, -26876, -7065, -1345, 19452, 20550, -2770, -9918, -13646, 3677, -3048, 15982, -482, -30844, -15505, -27362, -2660, -36897, -21768, -50604]
1013e0604P4638j4134P2123p826O699m1431N9922m2637q788j0369l7831k3041
1001b3279l8706l601j6588K8163J4070J7096l3791K1732K878J596K1575J7299
989H444R69M4690J0712L508J7045k1129M462Q175o1024L007J1564m380l0935k2822
975b7714r4K9130l5876K2236J3525K5367J299j3727K1800L3039n2218n368K3004
962C4403p442L715k040J5161o758j2212K8622J8014m4883n0358L8769k3853q665
949a7527j0854J8320Q288k3651M14K2347j40p906K8165L608j8853K8251j58J449
935C1753j5337K3172R436l0093k5670R848M0041p2953Q7L2725K0382n9483r452
922d5544j6224J6957J478K0441m340l982M9162K9619O80Q900J1658o1811K2765
$$ y = [-50604, 24034, 9900, 82023, 74197, 80896, 39465, 99387, 56750, 47962, 37593, -238, -23279, -61985, -65586, -82174, -54011, -39941, -22845, -56636, -34904, -32026, -30430, -8855, 8444, 9413, 54103, 64815, 68323, 85368, 64239, 68701, 76876, 15852, 18859, 30423, 26043, -4892, -27714, -27808, 1322, -34554, -12318, 1207, 26574, 27873, 14146, 35946, 68985, 16767, 11399, 34403, 26961, 30676, 28636, 43797, 37039, 24827, 53449, 71463, 26580, -23778, 14991, -8862, -17527, -28381, -10061, -1773, -25424, -25010, -2663, -2803, -10709, 17456, 21064, 2211, 30462, 30304, 31753, 16416, 39588, 49024, 18931, -6739, 3109, 43150, -29803, -29716, 3009, 23391, -36092, -45544, -61768, -44811, -43333, -22892, -27232, -31214, 17948, 47567, 48247, 57147, 68805, 6994, 29759]
909B9759n726k1489l5104p01r831l960j0583L8174K3026m5888J4910K0474N7988
896E1049l679o223J7380j1385k3047J6958j7345j6519k4891k0823k587J5331j9657
883d5438j0177J0098K5723j4665j2308P99L9868o094J2544q951J8916O1203L299
870G4817n2663j0171K0293n529j4471k6818k4603k5066j1586L541M1532K0671
858a0053n74j8828M6643k3823O374K6137j9374k2236K7896M170r699k2457J4360
845a464L6020k1704K35J5366j0960M163K3546k8036p320j4792J3094q450j5414
832a5716j7095l6187K0495j8926K8111L7969J2298o5882L5297N47J6066J7626
820A4603M900K0895K287M2612j4186k0393r015n326m8406l8527J7778j0138n3107
$$ y = [29759, 24033, 2544, -32560, -33261, -43092, -47052, -57635, -19461, 3565, -42323, -27413, -6939, 51049, 47370, 41147, 58527, 47142, 24095, 41053, 23708, 7189, -17702, -38525, -41112, -25781, -45438, -55615, -45517, -19794, -34459, -46767, -45968, -6100, -12194, 350, -8601, 10315, 71518, 74817, 22154, 11983, 32276, 26747, 12276, -14542, -39145, -64211, -75797, -72256, -30724, -10053, -10627, -29455, 17188, -6635, -261, 25876, 6502, -15734, 12162, 16332, 6633, -15824, -1464, 34556, 12852, 13087, 28453, 17493, 21656, 45202, 17166, 9846, -4946, 8148, -302, -15716, -32811, -68998, -48503, -67429, -39318, -1349, 10949, -54933, -19636, -19089, -3023, 14603, 19503, 40398, 42685, 85297, 71111, 50718, 41703, 36377, -12029, -50556, -32778, -42916, -96023]
807i6023L7478K0797j5726k619J928P4752o315l6110K2800N2924k268k2362M2293
794G1549k3790k4947n5891M6460l8125K521j687k0775j9566L2160P745R44J2090
781a1312q405K9868k0766L5835j2183J6142o953j3805m613j2071m7995N4750m0283
768d1791p472K6853n060N1185j0889J7127j4217K6077J7793k1776j131O776m1470
755B005J2564o724R335k6471l6924j8475M5048Q573O518L2368J2369J6970l2342
742B4814J8565N584J8499k9649O23J9075j4135l5196j0272L0893j0574j282k4428
729g483j6170L5106k660k5485K1105o361J4024j5008K4596K1919k4079j5153j6426
716a2075K8457q044j8130Q878P076l9466K5567K0846q992J0932J9127J1888RK8079
$$ y = [-96023, -58545, -37748, -53474, -56093, -54165, 20587, 14272, -21838, 962, 53886, 51618, 29256, 71549, 47759, 22812, -33079, 13381, -24744, -22223, -23910, -44685, -64251, -32091, -24346, -23402, -11312, -19717, 10151, -10615, 25220, 13037, 29179, 22226, 8421, 3808, -8263, -56258, -1508, -41791, -49263, -22410, -27470, 23715, 12826, 29953, 15736, 41813, 59606, 37830, 36699, 43475, 2005, 14569, 7845, 17180, -9291, -46215, -64690, -19642, -11069, -4551, 27817, 40186, 57156, 24814, 43379, 48963, 67462, 37813, 38436, 57511, 43376, 8180, -2092, 28801, 18227, 16945, -7483, -23653, 11453, 8793, -16692, 4413, -1948, 12076, -2932, 21664, 43583, 19504, 4351, -12075, 16382, 8338, -9792, -914, 6162, -33304, -7737, 13109, 4117, 15049, 34176, 46064, 46073, 74152]
702G4152N0188n4761L581k920l8162l0116m5j0949K7726l1258J5586l4366L2721
689A377K2077J684j4978N0373J7893J8919L139j0862q649k352m48n6725k565m32
675A8451q709k1532p962k3340J3346k0330M2017p352K5238k7274j3223K3674M3993
662C6997l7824L8036j5620J2501M242J9568k5421r031J7456R775p7641M4237K4919
649D2194k8964j0973k3312K6364K2013k4065R105J87m7455N7745J3042k4030J0545
636B2396J907J7048M1150l283J2002r403j3811j3191o9l082K089K537J2101m2246
622B6145k5038K826J4635k234K707M456R781m258k0713J0692L0724k6678p178
609A5867K718K7043L6831N978j8318M25l8618j954k84l14k3044R623R374l3886
$$ y = [74152, 124340, 69579, 73160, 70240, 32078, 1962, 1917, -9032, 18694, -12564, 3022, -31344, 1377, 23454, 25138, 10160, 60533, 78426, 97345, 100484, 89622, 80973, 78621, 78173, 21448, 18883, 18451, 9742, -11790, -19752, -43092, -29746, -50076, -8059, -15411, 9827, -17447, -30670, -6996, 36997, -827, 37209, 21589, 34090, 38332, 57900, 32479, 23448, 40904, 50679, -26962, 17275, 42194, 13230, 2257, -21055, 5309, 27322, 3257, 12362, 12549, -34906, 22839, 35881, 11851, 22396, 24303, 41351, 82501, 79218, 91220, 81817, 68006, 54815, 54746, 51664, 53753, 56290, 68391, 26145, 1107, 3933, 18568, 16334, 19041, 23497, 33278, 29020, 8307, 18999, 49723, 23045, 15867, 18585, 45628, 82459, 88437, 70119, 70544, 31926, 29972, 29688, 29374, 6330, 15953, 25327, -8559]
595h559j068O6320L508j5890K7189p691N1305l6532l7141K8086M2949j5867J8357
582A14966j5159k2422k1256j550l7777p777L9310K9873k8668M389Q766j140P885
569F9440l4430L0654J1629j6948k5838J0679l3004J102J099K3893n1317o14K3648
556I993Q374r376J5219J72J762J154J6136M5154K6045o780l2749Q168j567j5592
542F6113j6902o1275M825K2521o655J0611P85l6432K1703K1193J9286J7659J021
529F4453K0674o2940l0477K702P907R292o450k245K6045K6368L9278j4355K8373
516A08625J2716j1558j8580j3039j2358j9739J0063k6354o483l1331Q691L8999
504C9652n1861n179J8197P0148l4063K5374j443J2052J4115k0233l4682m887j6354
$$ y = [-8559, -9627, 56693, 60201, 44311, 71500, 63809, 115114, 78582, 41441, 69527, 112476, 96609, 114966, 99807, 77385, 56129, 54579, 16802, 9025, 48335, 78208, 49540, 53929, 62695, 61555, 69440, 35010, 65664, 77293, 60345, 34507, 45186, 12182, 13284, 14383, 38276, -13041, -13655, 9993, 18367, 8991, 24210, 24382, 26144, 27298, 43434, 88588, 114633, 107853, 75104, 83272, 81705, 66113, 49211, -12064, -7239, 15282, 8627, 19238, 20023, -16409, 5294, 26487, 45773, 63432, 64453, 85127, 22187, -8290, -5588, 2319, 11611, 5161, 2916, 28961, 55329, 94607, 80252, 108625, 121341, 109783, 91203, 78164, 65806, 46067, 56130, 29776, 23293, -8038, 653, 39652, -12209, -17388, 809, 70957, 36894, 62268, 60825, 72877, 86992, 66759, 32077, 27190, 10836]
491A0836L9479K088n6262L4290R865q462k5412Q198k6963L4868k308L5466L249
478E8932j5892J4406k1109j91K4524L8826J2526m6402j2275L5648j7350k4597
466D7046L7476n2944K603P566K659o858l2237K9788k7510k4979N1125P014j4268
453B6481J7957L3001l964m8655l169N7880l8052R673K6234j6084j3364k6942M9799
440G0795j3383p098M770m37j6749j337K070n231k4613L5079J9975K215R037J6023
426I1116k0106l4586k0353o120l930L2453j0627O116Q820J4879n415M1263o5905
413B7605Q092j9670m003L3014N617l1209M2189K3595n6639L683m5938M8893l2009
400C220K5401j5339K03l5886O9415k9708K5328k4281M88N842j4134J923L8849
$$ y = [10836, 50315, 52403, -3859, 30431, 40296, 31834, 6422, 14620, -12343, 22525, 20217, 55683, 58932, 43040, 57446, 36337, 36146, 60670, 99496, 112022, 65620, 53345, 88993, 71643, 47046, 84522, 31578, 34181, 41747, 44406, 37548, 5311, 35099, 7589, -17390, 33735, 40749, 26481, 44438, 77439, 73475, 24820, 21651, 79531, 41479, 51152, 77386, 61302, 47938, 20996, 70795, 57412, 50314, 55084, 54647, 37898, 36561, 38631, 33400, 8787, 43866, 63841, 66056, 75093, 91116, 71010, 36424, 16071, 9951, 6021, 38474, 27847, 33963, 42783, 57662, 52247, 93510, 27605, 35697, 16027, 12024, 45038, 50655, 19446, 61635, 85230, 28591, 32274, -13664, 35229, 3220, 28621, 13282, 13485, -22401, 47014, 17306, 42634, 18353, 18841, 24683, 10549, 12472, 51321]
387E1321k9758J6420k2024J6165J2236l4527K0191J9697k4270K3420L1927l3117
375D7681K9826r97L397l6769L158l1629L6838l6888n863J808L7425j1563K0862
362E7286P191J8653N818l8496q708O150j6257K9099m6421L222M4381J5129k6662
349E0385L987K900j5141k4070O993k6065J3386L3731j3363K5936m2113l972J3008
336B5602J1176K644K2395k097L902k5337j2438N2230l9640N226L0510l5081M808
323D3900l1501L996K4624k4328k3226J4940n0093R3099m0272K7574J7048M59j5972
310D0248N597j0220Q345J0030M8006j7847l1160L8682m3740L0748o273j4871m8030
297I515K2180J0951J0529J3518P279l3030j4563k7144K1475J8595j9057J3460
$$ y = [51321, 21563, 37983, 15959, 32124, 44360, 9833, 30024, 49721, 25451, 48871, 80798, 47681, 77507, 76510, 79907, 43138, 46296, 14667, 51505, 14617, 8754, 10562, 47987, 36424, 57286, 64477, 83130, 88948, 50452, 41744, 47894, 31637, 60736, 14315, 17537, 61918, 77047, 50385, 54372, 57272, 42131, 18061, 25054, -1011, 12375, 46106, 32743, 58679, 16566, 12594, 25602, 36778, 39422, 61817, 59720, 63622, 38285, 25847, 78077, 38437, 43663, 74173, 39092, 43900, 12399, 16395, 41019, 16691, -6535, 8405, -41688, 51411, 11139, 38713, 55761, 56220, 40248, 45845, 35625, 43970, 54000, 102006, 84159, 52999, 91681, 47941, 78689, 72416, 57545, 9515, 31695, 42646, 53175, 66693, 73972, 40942, 26379, -765, 20710, 39305, 20248, 33708]
285C3708P0126n7423k4234K0598M1611l225k2286O891p23M064J7276m4009m491
272C7883L5118n9602m78K5175n340J8246q963O184L458l9268R737r955j0804K1310
258B2701K5952n404m50M333m030j7702j875k155L4070k7773J9259k1315j9705
245E906J7061K4319R887J0886O127K4855k1321l1514n819K0082K051p693n390
232D9437k8664n739p468N3900N392j7727J9495K0746k715j6298k2306J8023m442
219F1634o638L2240j5901j9376L7825j9981K8399l8297j6611q036O190J1612K7902
206H0962m4367M979M057K2777K4780l2603J2599L0029k8511J2655j5998l194O641
193G4806k1559j6920J3344L1753P119p674L872L5882m4458K0885k3940K780j2926
$$ y = [33708, 103834, 46411, 22177, 42775, 84386, 81161, 58875, 65766, 65043, 69107, 86383, 42374, 37883, 73001, 13399, 12921, 38096, 32756, 51002, 42039, 48223, 51681, 12413, 22150, 12195, 1391, 22701, 48653, 43249, 42799, 47132, 43102, 25400, 23525, 21370, 55440, 27667, 46926, 25611, 5906, 22967, 47286, 57173, 68059, 74186, 99041, 77720, 46206, 40387, 60469, 62520, 54827, 49437, 20773, 15034, 7566, 61466, 66858, 49131, 68626, 89372, 86657, 70359, 48053, 66076, 61634, 54996, 87236, 71335, 51959, 89784, 69803, 98202, 59905, 43294, 35258, 41448, 53060, 80962, 36595, 41574, 45631, 68408, 93188, 60585, 73184, 103213, 74702, 87357, 71359, 68165, 74806, 53247, 36327, 49671, 81424, 88543, 80869, 84741, 120623, 76165, 97050, 73110, 75890, 62964]
180F2964q027O449p122j7902J765j8384J5453P164J7034R976j4445L5228K406
167I2559l2859K1156n530l1936N661K3456M4578J1124m2586K8350q8467o946L0454
154D9014j0171K2923l274j4866L134j6718L3558J4009k7851K6775m265r752J7967
141H0483k4466J9908k8582J961O152r284R418q219p327J6586J2154O125J8085
128I2994m9906K1207J5531J1550n8261O714J4097L3718j2226q704p409J25l8237
115B1193L5795L361p124j537K994K7939J2886J634J6953q76j8650j6861P182L64
101H5253J5641J8616r366j1526o9084K0241k3494J4218J6929l413M1497Q839k5786
88G8565K8802m986k3604J2091m30K381k4712j8199p981k3851K4328l206J4199
$$ y = [62964, 54937, 61386, 54264, 36362, 38127, 19743, 35196, 42360, 59394, 69370, 54925, 90153, 92559, 59700, 80856, 75326, 43390, 49051, 72507, 117085, 128209, 85623, 113973, 25506, 18560, 49014, 38843, 61766, 58492, 43626, 46760, 30042, 63600, 77609, 49758, 76533, 72268, 62516, 80483, 56017, 75925, 47343, 49304, 55456, 46172, 55590, 47371, 40044, 56630, 68784, 74909, 92994, 43088, 64295, 79826, 91376, 33115, 39829, 53926, 87644, 75418, 66714, 59305, 59430, 21193, 56988, 60349, 53225, 51688, 54682, 82621, 95507, 97141, 114094, 113218, 94568, 77707, 84889, 85253, 100894, 119510, 110144, 98618, 29534, 49775, 26281, 40499, 57428, 54015, 95512, 104351, 78565, 107367, 102381, 78777, 90868, 90438, 92819, 68107, 49908, 41927, 18076, 42404, 39198, 53397]
75E3397L120l9208o023K2530Q369J0195J8909j5681K3213O302p329j2346L4666
62A00114j0530j9790P023M330q362K1418m718j1304k4374K477L8189o439J1000
49I9034n380J0412j9169l0286J3810N853l421L3851l3663j4446Q343j5161L4686
36H4463K4873j0883P268P028K754j7171J1412O368j3757k3349R931l2220L4125
23I0842r205j4646J3680j1924j8274L5766p028J7583p800j0738j2820J993J6175
10H3604L1546k2931j6751O962r286L947p255k366K709N058
0G5237
$$ y = [53397, 56517, 17309, 11286, 33816, 42185, 52380, 71289, 55608, 78821, 85123, 77794, 65448, 100114, 89584, 69794, 76817, 81147, 72785, 94203, 89485, 78181, 53807, 56284, 94473, 88034, 99034, 93654, 104066, 84897, 54611, 68421, 74274, 70853, 104704, 71041, 56595, 64938, 49777, 84463, 109336, 98453, 105721, 112749, 115503, 98332, 109744, 116112, 102355, 79006, 88937, 56717, 90842, 81637, 66991, 80671, 68747, 50473, 86239, 79211, 96794, 88994, 78256, 65436, 67429, 83604, 115150, 92219, 75468, 82430, 73144, 77091, 69836, 67470, 70179, 75237]
$$ Imaginary data points
##PAGE= N=2
##DATA TABLE= (X++(I..I)), XYDATA
16383b398114M042M5860M6127R318N1616N9247P0335K2239j7541M3745J3796L3266
16371b016064L9784M1089M6530J2491K2491N4153J7128L4286N1140N3659J6384
16360a626929L4523P3806K4134K8007J5319R1275L4965j2444L3026O9433J704
16349a233181L3035L9906K4302K0232M8724N4884R254K5103M1623K8783M9490
16338h57845N8765R916L8357J6652K9019M5266J4858L7989R429K9401N0213O2616
16326d55364M321M0253K3473L0454N0705J1082M1417M3320K9426L3081J252M7041
16314i9539O1358J5779L1771L5167J4762L7961M9182J7473K3735M3377R815L4416
16302B75257K5013L501O3912M0749R391L9218K6523L4616K0342K4085O0337K0618
$$ y = [-2398114, -2394072, -2348212, -2302085, -2292767, -2241151, -2181904, -2111569, -2089330, -2106871, -2063126, -2049330, -2016064, -1976280, -1935191, -1888661, -1876170, -1853679, -1799526, -1782398, -1748112, -1696972, -1643313, -1626929, -1592406, -1518600, -1494466, -1466459, -1451140, -1359865, -1324900, -1337344, -1304318, -1234885, -1233181, -1200146, -1160240, -1135938, -1115706, -1066982, -1012098, -1002844, -977741, -936118, -907335, -857845, -799080, -789164, -750807, -734155, -705136, -659870, -645012, -607023, -597594, -568193, -517980, -455364, -451043, -410790, -387317, -356863, -306158, -295076, -253659, -210339, -180913, -147832, -146580, -99539, -38181, -22402, 9369, 44536, 59298, 97259, 146441, 163914, 187649, 231026, 240841, 275257, 300270, 303771, 367683, 408432, 417823, 457041, 483564, 518180, 538522, 562607, 622944, 643562]
16290F43562L7916r744K9247L7745M623R009L3630M810N9772M5550K653M203K5663
16277I28639N0531R299N5257K3216K5088j5066M2424M4727K0859k0827L5734N7204
16265A257085L0436Q528L8682J5303L7008L0347L2459L8749J5058M382J2516k4039
16253A496514Q874K6083L9274l0779O8467K3608N4493q782O0131J5206n146L2897
16241A780840K3928L0869Q987L5156j1836N3766k136L1391q000P721l4355L6192
16229A952523K3190m099J6272L9262J0191K9528J6784Q0090K2008J1216M157K4287
16217B225409k0137L3376J1875L6995k1314K0130K3451N907j3557O638k2553O4495
16205B350715K9412K9640J6179j3306K2659M283J1099J8385K9891L1412j9350
$$ y = [643562, 681478, 671734, 700981, 738726, 743349, 752358, 785988, 790798, 850570, 896120, 898773, 902976, 928639, 979170, 988469, 1043726, 1066942, 1092030, 1076964, 1119388, 1164115, 1184974, 1164147, 1199881, 1257085, 1287521, 1296049, 1334731, 1350034, 1387042, 1417389, 1449848, 1488597, 1503655, 1508037, 1520553, 1496514, 1505388, 1531471, 1570745, 1539966, 1608433, 1632041, 1686534, 1677752, 1737883, 1753089, 1747943, 1780840, 1804768, 1835637, 1844624, 1879780, 1867944, 1921710, 1919574, 1950965, 1942965, 1950686, 1916331, 1952523, 1975713, 1971614, 1987886, 2027148, 2037339, 2066867, 2083651, 2163741, 2185749, 2196965, 2201122, 2225409, 2205272, 2238648, 2250523, 2287518, 2266204, 2286334, 2309785, 2315692, 2302135, 2308773, 2286220, 2350715, 2380127, 2409767, 2425946, 2412640, 2435299, 2439582, 2450681, 2469066, 2498957, 2530369, 2511019]
16194B511019O130L5725K4301L6284J4465J0880L168j6325k1149K6928k093N0505
16182B679838J2947P629k7925k0705J9485k9409p4L4320N599M1002k290N6379
16170B776796K5256o507K6764N4808j899k3009r241K1034j0504k1598j1013L5829
16158B856716Q516J6709k5387n732K2518R76M2202k6780K8229N956L7996m0733
16146B921186J6648O5021K1222r230j3819j40J0714L681k2400O773l8780Q97K868
16133B964641J0083p398K4198N3779N4540j7960j093k896l5632K6208N906L9058
16121C113434O613n4246l51o486k56j0890L7642K3678J0557o091Q31j923K2092
16108C134604j2170J4510J3308P355J0056l5878l920K257N3875J4143l8748K3159
$$ y = [2511019, 2517149, 2552874, 2577175, 2613459, 2627924, 2638804, 2641972, 2625647, 2604498, 2631426, 2629333, 2679838, 2692785, 2700414, 2672489, 2651784, 2671269, 2641860, 2641786, 2676106, 2681705, 2722707, 2720417, 2776796, 2802052, 2795545, 2822309, 2877117, 2875218, 2852209, 2842968, 2864002, 2853498, 2831900, 2820887, 2856716, 2865232, 2881941, 2856554, 2850822, 2873340, 2874316, 2916518, 2889738, 2917967, 2923923, 2961919, 2921186, 2937834, 3002855, 3024077, 3014847, 3001028, 3000888, 3011602, 3015283, 2992883, 2999656, 2960876, 2961773, 2964641, 2974724, 2967326, 2991524, 3045303, 3099843, 3081883, 3080790, 3077894, 3042262, 3068470, 3074376, 3113434, 3120047, 3065801, 3065450, 3058964, 3058708, 3047818, 3085460, 3109138, 3119695, 3113604, 3114435, 3112512, 3134604, 3122434, 3136944, 3150252, 3157607, 3167663, 3131785, 3127865, 3130122, 3183997, 3198140, 3159392, 3182551]
16096C182551K2940r706K062j4118n162k1554J5128J4979m2081J5015L7507o616
16084C190945j7812j3197L4767J2575j8333L5497r644l296k3249M6907K9689j1588
16072C253261j3164L2148n36l3168J1429j8581J0429k6659M724k520k943r909
16060C204511L9247P746K0682J2492n814j0747p445J8262N102k6773n214L8196
16048C290245q709n620N729J4574r439m9804l2812k155L357j3879M6439r053p804
16035C221069J2425K2839L3347k2302L1386j3126j1750N92K5688l912R77n249
16023C291984j1929k1899j345R305J5051m2553K0942J753m635J6766K4912J1824
16011C310176j8493l5443K0126K4830l0910J8823N0546j9674n0594J0179L7275
$$ y = [3182551, 3205491, 3195785, 3197847, 3183729, 3178567, 3157013, 3172141, 3187120, 3145039, 3160054, 3197561, 3190945, 3173133, 3159936, 3194703, 3207278, 3188945, 3224442, 3214798, 3211502, 3188253, 3235160, 3264849, 3253261, 3240097, 3272245, 3271709, 3238541, 3249970, 3231389, 3241818, 3215159, 3219883, 3217363, 3214420, 3204511, 3243758, 3251504, 3272186, 3284678, 3278864, 3268117, 3260672, 3278934, 3284036, 3257263, 3252049, 3290245, 3281536, 3275916, 3281645, 3296219, 3286780, 3236976, 3204164, 3202009, 3205366, 3191487, 3237926, 3228873, 3221069, 3233494, 3256333, 3289680, 3267378, 3298764, 3285638, 3273888, 3274480, 3300168, 3296256, 3297233, 3291984, 3280055, 3258156, 3256811, 3266116, 3281167, 3238614, 3259556, 3261309, 3256674, 3273440, 3298352, 3310176, 3291683, 3256240, 3276366, 3301196, 3270286, 3289109, 3339655, 3319981, 3269387, 3279566, 3316841]
$$ [...]
##END NTUPLES=NMR SPECTRUM
##END=
