##TITLE=1H_CA-9407-3
 200.13MHz,CDCl3.
 8 sc
 
 11.12.2025
##JCAMPDX= 6.0         $$ Bruker NMR JCAMP-DX V2.0
##DATA TYPE= NMR SPECTRUM
##DATA CLASS= NTUPLES
##ORIGIN= UXNMR, Bruker Analytische Messtechnik GmbH
##OWNER= pz
$$ XWIN-NMR		Version 3.5
$$ Thu Dec 11 15:31:24 2025 Russian Standard Time (UT+4h)  she@DPX200
##.OBSERVE FREQUENCY= 200.1313
##.OBSERVE NUCLEUS= ^1H
##.ACQUISITION MODE= SIMULTANEOUS
##.ACQUISITION SCHEME= undefined
##.AVERAGES= 8
##.DIGITISER RES= 18
##SPECTROMETER/DATA SYSTEM= spect
##.PULSE SEQUENCE= zg30
##.SOLVENT NAME= CDCl3
##.SHIFT REFERENCE= (INTERNAL, CDCl3, 0, 15.4891)
##AUDIT TRAIL= $$ (NUMBER, WHEN, WHO, WHERE, WHAT)
$$ ##TITLE= Audit trail, XWIN-NMR		Version 3.5
$$ ##JCAMPDX= 5.01
$$ ##ORIGIN= Bruker BioSpin GmbH
$$ ##OWNER= she
$$ F:/spectra/data/she/nmr/H-C/1/pdata/1/auditp.txt
$$ ##AUDIT TRAIL=  $$ (NUMBER, WHEN, WHO, WHERE, WHAT)
(   1,<2025-12-11 15:29:56.01 +0400>,<she>,<DPX200>,
      <created by zg, POWCHK disabled, PULCHK disabled
       configuration hash MD5:
       00 E9 B6 7A A2 85 ED C7 34 08 36 98 17 FE 4E 26
       data hash MD5: 16K
       C4 9F 67 7C 55 F6 B9 56 07 3E 46 A8 52 12 14 7C>)
(   2,<2025-12-11 15:29:59.03 +0400>,<she>,<DPX200>,
      <Start of raw data processing
       efp BC_mod = 2 LB = 0.25 FT_mod = 6 PKNL = 1 PHC0 = -3508.099 PHC1 = 16.99234 SI = 16K 
       data hash MD5: 16K
       1A 8D 09 47 6F 9D 63 82 11 8C 77 00 21 30 18 FB>)
(   3,<2025-12-11 15:30:28.71 +0400>,<she>,<DPX200>,
      <pk PHC0 = 0.5592344 PHC1 = -0.8 
       data hash MD5: 16K
       3D 98 33 96 B2 20 FF 18 F2 A7 D2 CD 6C A7 6F C6>)
(   4,<2025-12-11 15:30:32.98 +0400>,<she>,<DPX200>,
      <abs ABSG = 5 
       data hash MD5: 16K
       00 0C EE 74 15 50 A4 4A 46 C5 9B F8 54 6A 9A F5>)
$$ ##END=
$$ 
$$ hash MD5
$$ CC 54 04 46 0C 06 67 5C 21 29 42 74 82 A7 08 E2
##$RELAX= 
##$RELAX= 
##$RELAX= 
##$RELAX= 
##$RELAX= 
##$RELAX= 
$$ Bruker specific parameters
$$ --------------------------
##$DU= <F:/spectra>
##$EXPNO= 1
##$NAME= <H-C>
##$PROCNO= 1
##$TYPE= <nmr>
##$USER= <she>
##$AMP= (0..31)
100 100 100 100 100 100 100 100 100 100 100 100 100 100 100 100 100 100 
100 100 100 100 100 100 100 100 100 100 100 100 100 100 
##$AQSEQ= 0
##$AQ_mod= 1
##$AUNM= <au_zg>
##$AUTOPOS= <>
##$BF1= 200.13
##$BF2= 200.13
##$BF3= 200.13
##$BF4= 200.13
##$BF5= 200.13
##$BF6= 200.13
##$BF7= 200.13
##$BF8= 200.13
##$BYTORDA= 1
##$CFDGTYP= 0
##$CFRGTYP= 5
##$CHEMSTR= <none>
##$CNST= (0..31)
1 1 145 1 1 1 1 1 1 1 1 1 1 1 1 1 1 1 1 1 1 1 1 1 1 1 1 1 1 1 1 1 
##$CPDPRG= <>
##$CPDPRG1= <>
##$CPDPRG2= <>
##$CPDPRG3= <>
##$CPDPRG4= <mlev>
##$CPDPRG5= <mlev>
##$CPDPRG6= <mlev>
##$CPDPRG7= <mlev>
##$CPDPRG8= <mlev>
##$CPDPRGB= <>
##$CPDPRGT= <>
##$D= (0..31)
0 0.7 0 0 0 0 0 0 0 0 0 0.03 0 0 0 0 0 0 0 0 0 0 0 0 0 0 0 0 0 0 0 0 
##$DATE= 1765452595
##$DBL= (0..7)
120 120 120 120 120 120 120 120 
##$DBP= (0..7)
150 150 150 150 150 150 150 150 
##$DBP07= 0
##$DBPNAM0= <>
##$DBPNAM1= <>
##$DBPNAM2= <>
##$DBPNAM3= <>
##$DBPNAM4= <>
$$ [...]
##$SUBNAM3= <"">
##$SUBNAM4= <"">
##$SUBNAM5= <"">
##$SUBNAM6= <"">
##$SUBNAM7= <"">
##$SUBNAM8= <"">
##$SUBNAM9= <"">
##$SW= 18.0517328524113
##$SWIBOX= (0..15)
0 0 2 0 0 0 0 0 0 0 0 0 0 0 0 0 
##$SW_h= 3612.71676300578
##$TD= 16384
##$TD0= 1
##$TE= 0
##$TE2= 300
##$TE3= 300
##$TEG= 300
##$TL= (0..7)
0 120 120 120 120 120 120 120 
##$TP= (0..7)
150 150 150 150 150 150 150 150 
##$TP07= 0
##$TPNAME0= <>
##$TPNAME1= <>
##$TPNAME2= <>
##$TPNAME3= <>
##$TPNAME4= <>
##$TPNAME5= <>
##$TPNAME6= <>
##$TPNAME7= <>
##$TPOAL= (0..7)
0.5 0.5 0.5 0.5 0.5 0.5 0.5 0.5 
##$TPOFFS= (0..7)
0 0 0 0 0 0 0 0 
##$TUNHIN= 0
##$TUNHOUT= 0
##$TUNXOUT= 0
##$USERA1= <user>
##$USERA2= <user>
##$USERA3= <user>
##$USERA4= <user>
##$USERA5= <user>
##$V9= 5
##$VALIST= <valist>
##$VCLIST= <CCCCCCCCCCCCCCC>
##$VD= 0
##$VDLIST= <DDDDDDDDDDDDDDD>
##$VPLIST= <PPPPPPPPPPPPPPP>
##$VTLIST= <TTTTTTTTTTTTTTT>
##$WBST= 1024
##$WBSW= 4
##$XGAIN= (0..3)
0 0 0 0 
##$XL= 0
##$YL= 0
##$YMAX_a= 824977
##$YMIN_a= -742054
##$ZGOPTNS= <>
##$ZL1= 120
##$ZL2= 120
##$ZL3= 120
##$ZL4= 120
##$ABSF1= 15.48797
##$ABSF2= -2.563879
##$ABSG= 5
##$ABSL= 3
##$ALPHA= 0
##$AQORDER= 0
##$ASSFAC= 0
##$ASSFACI= 0
##$ASSFACX= 0
##$ASSWID= 0
##$AUNMP= <proc_1d>
##$AZFE= 0.1
##$AZFW= 0.1
##$BCFW= 0
##$BC_mod= 2
##$BYTORDP= 0
##$COROFFS= 0
##$CY= -3
##$DATMOD= 1
##$DC= 0
##$DFILT= <>
##$DTYPP= 0
##$F1P= 0
##$F2P= 0
##$FCOR= 1
##$FTSIZE= 16384
##$FT_mod= 6
##$GAMMA= 0
##$GB= 0
##$INTBC= 1
##$INTSCL= 3.241238e-09
##$ISEN= 128
##$LB= 0.25
##$LEV0= 0
##$LPBIN= 0
##$MAXI= 10000
##$MC2= 0
##$MEAN= 0
##$ME_mod= 0
##$MI= 1.114404
##$NCOEF= 0
##$NC_proc= -5
##$NLEV= 6
##$NOISF1= 3.799351
##$NOISF2= 2.8
##$NSP= 0
##$NTH_PI= 0
##$NZP= 0
##$OFFSET= 15.48907
##$PC= 1
##$PHC0= -3507.54
##$PHC1= 16.19234
##$PH_mod= 1
##$PKNL= yes
##$PPARMOD= 0
##$PSCAL= 0
##$PSIGN= 0
##$REVERSE= no
##$SF= 200.130006531956
##$SI= 16384
##$SIGF1= 3
##$SIGF2= 2
##$SINO= 0.751879
##$SIOLD= 32768
##$SREGLST= <19F.Aceton>
##$SSB= 0
##$STSI= 16384
##$STSR= 0
##$SW_p= 3612.71676300578
##$SYMM= 0
##$S_DEV= 0
##$TDeff= 16384
##$TDoff= 0
##$TI= <>
##$TILT= no
##$TM1= 0
##$TM2= 0
##$TOPLEV= 0
##$USERP1= <user>
##$USERP2= <user>
##$USERP3= <user>
##$USERP4= <user>
##$USERP5= <user>
##$WDW= 1
##$XDIM= 16384
##$YMAX_p= 341454154
##$YMIN_p= -347564
$$ End of Bruker specific parameters
$$ ---------------------------------
##NTUPLES= NMR SPECTRUM
##VAR_NAME=  FREQUENCY,     SPECTRUM/REAL,   SPECTRUM/IMAG
##SYMBOL=    X,             R,               I
##VAR_TYPE=  INDEPENDENT,   DEPENDENT,       DEPENDENT
##VAR_FORM=  AFFN,          ASDF,            ASDF
##VAR_DIM=   16384,         16384,           16384
##UNITS=     HZ,            ARBITRARY UNITS, ARBITRARY UNITS
##FACTOR=    0.220516191357247, 1,           1
##FIRST=     3099.82766799788, 0,            0
##LAST=      -512.889095007897, 0,           0
##MIN=       -512.889095007897, -347564,     0
##MAX=       3099.82766799788, 341454154,    0
$$ Real data points
##PAGE= N=1
##DATA TABLE= (X++(R..R)), XYDATA
$$ [...]
8127 55789 76482 64203 39108 27355 47871 25952 -6985 -3663 16203 37760 9142 -13114
8115 -13114 -26242 -15942 27198 7944 1721 26537 4174 8489 2702 8123 45139 34631 14646
8102 14646 2059 9264 35670 50541 54019 46817 35091 32623 43279 19168 40499 74696 48883
8089 48883 36497 24884 48200 22130 38775 64351 55300 44446 23193 46907 66046 65844
8077 65844 36258 36318 47893 79580 52696 35422 39957 28261 41965 34797 20914 29868 50423
8064 50423 20951 25384 79948 81714 48301 34346 39420 35833 42157 45867 62046 90026 65181
8051 65181 55267 67403 53124 64400 77268 78000 64751 49143 63693 75229 60801 35968
8039 35968 55061 74340 97623 88475 89486 98050 97525 118234 89436 75093 114090 80516 74803
8026 74803 84625 76022 105974 117814 87554 83624 81574 75850 65714 73143 87896 137915 130512
8013 130512 75752 84868 121513 112479 95930 106620 109824 100948 104105 117519 112409 98544 145040
8000 145040 183156 157128 145574 156077 183561 182293 148777 147021 185831 176505 162683 141583
7988 141583 145944 165775 170930 160172 148963 163764 168243 166964 153975 168298 174908 170593 200835
7975 200835 184297 180423 166825 179283 167812 203630 254791 268399 292775 296699 276160 269889
7963 269889 284583 261746 237695 269343 271242 258578 253326 288919 296001 275765 286032 275933
7951 275933 268829 249524 246428 244891 247420 244294 190271 184479 161451 179361 194162 190960 195360
7938 195360 184057 215739 201110 181780 149384 171973 172321 189773 195995 178053 183534 162284
7926 162284 132824 154544 169565 156936 180399 215317 223046 213445 215340 232822 241472 221565
7914 221565 229440 248286 261691 263648 265729 295047 273018 258977 256895 240375 227276 231328 240521
7901 240521 283440 313941 307249 338435 335971 330860 312987 311595 324562 308296 300907 316235 280122
7888 280122 315507 334001 325193 354587 348356 311264 279513 285974 304180 329081 329793 345970 343514
7875 343514 338659 337658 334196 286519 284534 297532 301387 301316 299045 291402 285521 282432 266850 259114
7861 259114 283425 267270 255085 271750 283727 253596 245192 261915 268555 256472 288420 300385
7849 300385 288244 290521 244178 273971 276561 261438 246036 248442 261713 241855 228210 250827
7837 250827 251517 261996 230423 244841 247491 235056 226975 215598 244484 253485 248815 233636 208347
7824 208347 221884 254384 248274 225960 219275 185388 195912 203555 202164 218164 211047 196288 233181
7811 233181 241447 234058 122066 88309 169181 210335 220934 232592 244242 243969 236028 197845
7799 197845 213648 198373 189059 197201 236346 217044 229356 238601 228729 197870 194821 207108 251920
7786 251920 273045 306255 280990 255112 253887 250254 241882 248799 279851 306174 307631 260124 267537
7773 267537 292147 309983 311198 287249 271273 299448 297262 256066 289241 288287 308588 306905 275751
7760 275751 312839 359492 353821 314222 287030 255492 263232 274529 269936 244402 257962 316402
7748 316402 334217 367474 344368 354614 359716 352248 356191 329596 325621 312649 320082 333455 341630
7735 341630 297772 298321 313684 314370 287126 321713 346408 328553 329768 317632 296977 327547 338618
7722 338618 371499 357360 363720 373771 371811 420773 441108 434842 459982 466649 478019 535496
7710 535496 540486 528728 547926 558837 500937 509061 547738 555744 518461 498232 532769 533073 554241
7697 554241 550006 560539 549343 556231 544371 505509 529196 507580 479903 495926 518293 526165
7685 526165 522626 529432 542634 577305 580758 604006 619278 638504 691460 736501 759320 781406
7673 781406 841133 900130 958856 972589 1008641 1032617 1019596 1040134 1072838 1058289 1078448 1110441
7661 1110441 1083635 1068036 1046162 1040566 1000539 1013757 1017939 1008269 1049011 1073737 1077921 1064073
7649 1064073 1070445 1078363 1092141 1107561 1107534 1121573 1101720 1057198 1037268 1016402 952673 883440
7637 883440 839713 757657 694134 685078 644434 633289 620080 591427 591657 551293 553062 529838
7625 529838 523134 540386 547616 524560 482449 491276 492076 516570 527873 501128 502542 508668 475886
7612 475886 440939 460582 447886 456104 473070 500608 494365 500304 515780 500189 502940 538660
7600 538660 561805 562328 560469 624847 627142 662672 703157 781971 836520 880818 917307 936100
7588 936100 949381 935544 945540 964795 996356 1017091 1010580 993491 951896 953345 956300 897092
7576 897092 926847 932712 933117 959192 968228 995578 1041286 1030646 1009991 993138 981582 968303
7564 968303 967008 974733 976402 937062 907782 862491 801027 721766 669288 657525 565616 530895
7552 530895 557350 549670 522105 548999 529884 511122 482753 448323 485237 442197 404854 435052
7540 435052 443319 412879 435647 409453 419127 406842 375601 376204 387070 407193 423764 415609 424026
7527 424026 417504 421303 413478 398161 396267 431436 411976 391264 405248 386705 427844 421830 404267
7514 404267 399599 406102 439148 463667 437917 428228 475245 478520 534411 616672 689446 747501
7502 747501 781669 723529 643993 570841 523823 506837 492650 457411 417312 391887 375537 379480
7490 379480 399151 401681 358191 342884 349004 379435 358893 365934 315912 318582 385243 399208
7478 399208 367227 389178 414960 372733 325966 330519 364523 359893 354544 357564 357595 346485 397424
7465 397424 391867 374423 419181 409926 377783 368681 406583 409184 364043 371143 407254 391604 399748
7452 399748 415409 397481 382217 362665 401403 413471 398389 359052 342750 355545 381370 376087
7440 376087 406027 415458 387743 374519 402536 430305 421856 413851 424583 464968 469210 438983
7428 438983 443393 479529 474086 464477 418231 399574 399122 428723 469600 461661 474933 484826 475981
7415 475981 525980 507407 496302 500322 504017 495476 546548 543484 520391 540860 562550 600569
7403 600569 577163 580203 602846 602163 592404 639778 686145 695710 734237 767612 791864 855808 904587
7390 904587 949660 975900 1026940 1069579 1133097 1213101 1298196 1409026 1521160 1641106 1720076
7379 1720076 1772970 1819080 1809438 1823352 1821253 1781433 1748227 1713946 1722321 1685566 1591198 1495475
7367 1495475 1395461 1287986 1185994 1061037 971828 925053 860062 826412 826206 797817 795924
7356 795924 757973 774463 741345 721256 713291 733817 723053 675473 662186 690458 711272 707872
7344 707872 773665 763760 760483 812241 879099 866606 860474 925452 971313 1070766 1121541 1179188
7332 1179188 1253890 1330737 1420550 1543242 1598161 1672437 1731722 1737516 1726494 1710526 1690568
7321 1690568 1698363 1748433 1725018 1705700 1649811 1583661 1505005 1366472 1286568 1203205 1128230
7310 1128230 1037687 970490 932983 863421 796643 725714 736088 722596 705346 697631 679245 665019
7298 665019 652546 636427 657272 663807 670458 629665 628794 616754 626789 629060 653084 628039 587966
7285 587966 578797 571019 577473 602050 586188 575211 566259 587175 593659 585359 563352 552247 553983
7272 553983 571319 569287 547897 534121 545898 539816 547889 566000 592260 592826 578311 569485 581757
7259 581757 557389 554259 584482 570966 566659 549396 557286 547032 557930 577085 589982 609723
7247 609723 597662 565678 546727 565357 559288 572608 590333 598785 587099 574098 607392 567125
7235 567125 580824 615818 540790 543428 542205 562756 551288 560962 594068 610516 610420 610692 611615 591256
7221 591256 596481 585001 603971 602834 593496 584975 616330 655832 635653 619136 622145 623855 630827
7208 630827 659600 657356 633121 634218 607413 612692 628679 649910 664085 685372 672365 691087
7196 691087 698544 698806 723525 723342 706140 738069 712500 696741 712131 750674 779555 770046 759521
7183 759521 777645 788509 821942 826567 823349 827501 873227 873692 899158 896441 917584 923116 939812
7170 939812 949320 966603 995711 1013618 994052 984987 979207 998941 1016255 1008103 1018082 1077763 1065915
7157 1065915 1105005 1098984 1105788 1128802 1159282 1200284 1251629 1308855 1391266 1456494 1485629 1529977
7145 1529977 1539754 1544624 1588411 1604135 1665423 1685991 1737923 1807955 1900503 1964054 2056382 2152863
7133 2152863 2191634 2249631 2424595 2533756 2713302 2895485 3027117 3113904 3243944 3381209
7123 3381209 3557807 3719056 3867910 4024378 4281178 4610374 5083556 5585716 6181629 6922850
7113 6922850 7846371 8844138 10051747 11659585 13787300 17044590 22496219 31739664 46234838
7104 46234838 64144848 76395976 78934470 70429161 56984614 43738086 32912986
7097 32912986 25477429 19839057 15459138 12062813 9674813 7930811 6761608 5926943
7089 5926943 5373955 4953544 4657624 4367299 4066749 3725648 3461258 3189471 2978875 2780529
7079 2780529 2612221 2413774 2322885 2201507 2139427 2049432 1968081 1879158 1793812 1706986 1671474
7068 1671474 1623975 1582646 1503939 1472238 1449414 1438927 1422566 1377069 1296805 1285634 1238650
7057 1238650 1214468 1195711 1189657 1172339 1188165 1189624 1167759 1122377 1108478 1091544 1112226 1089625
7045 1089625 1069937 1054465 1025717 970493 972426 959546 981160 949057 911179 920792 880830 867239
7033 867239 842978 801752 793769 810207 811772 803605 786401 807994 776514 691753 690386 691098 726139
7020 726139 703704 705759 674820 657234 656612 661720 644538 675699 671204 663532 613021 559023 579953
7007 579953 582380 570437 548623 550967 611486 598233 599086 550885 492012 510506 499386 479961
6995 479961 495385 535291 524027 463977 492991 522863 517499 550434 539341 524456 498174 473233
6983 473233 448640 461131 479168 466115 459338 450013 475938 499083 487339 496069 482783 473987
6971 473987 453112 461545 429631 404275 418512 419850 440973 468347 448267 442158 396425 378927
6959 378927 391962 400007 402172 361013 339370 385760 409554 416906 407623 399430 412366 414679 406329
6946 406329 430244 417392 384393 389198 386887 372880 360828 344404 369988 405087 394229 380107
6934 380107 397250 398153 398973 375188 381536 383805 341501 320713 333138 317002 365698 422396 386806
6921 386806 359606 325144 319718 285294 287425 325256 333911 345186 333469 330185 332606 317620 328402
6908 328402 364245 323400 349670 350184 341675 335211 312721 322771 371829 337565 323194 325245 334692
6895 334692 331252 346843 366448 324145 319321 304450 271297 301898 325436 344713 354489 341550
6883 341550 310148 308550 292546 292780 323700 346734 335060 328820 341709 332895 335957 345609 300939
6870 300939 324783 346642 365972 318460 325627 300982 268913 271205 284171 292373 270774 250647
6858 250647 279438 323680 330297 321298 298497 310455 280425 306370 267251 292756 295687 308250
6846 308250 322281 326290 285101 261690 255851 260108 275935 270943 286301 284518 248475 298587 343052
6833 343052 286753 268134 279280 289680 298119 263841 254797 234132 268783 268104 297287 286826
6821 286826 297963 282373 283020 256312 282017 289665 297061 266211 281870 277271 297864 303355 245687
6808 245687 231544 253222 269527 258758 264297 256097 260941 238491 238765 263574 267158 258093 256567
6795 256567 275104 288684 284260 291195 316179 288702 253885 273807 264650 255738 265727 267805 270091
6782 270091 305242 289561 266242 275813 290519 305823 290309 287861 274989 238965 243473 235227
6770 235227 246995 229380 257597 275971 274429 263877 274190 272723 259863 259041 233944 248966
6758 248966 267485 271866 252448 261772 269389 263085 276634 251198 284133 293104 267221 279010 320769
6745 320769 299112 273237 289679 325443 311463 308484 310409 320129 310102 310591 308041 330701 312910
6732 312910 304289 309395 309806 265002 263166 325177 296231 265479 268542 274717 313921 286091 292603
6719 292603 302016 293615 309354 312556 315635 302388 289656 334600 313898 320842 363020 328730 327243
6706 327243 334884 348957 346025 355801 380210 430075 492528 588185 690875 690300 661343 606414
6694 606414 532811 512389 461134 411573 363759 343051 352323 356954 334668 290347 287243 332778
6682 332778 315123 338097 335692 292973 316272 304300 302104 311901 314531 294717 290326 298294 268545
6669 268545 264717 257482 264228 275855 282084 273260 265473 248305 259520 288770 279158 253771 265830
6656 265830 264371 272151 277286 290603 272976 296055 281447 286491 308015 289292 291335 292293 295842
6643 295842 269289 270706 293993 273706 308351 307916 310537 314539 281969 258609 270602 304684 300357
6630 300357 316729 311275 340714 315416 306621 306361 290137 317924 331826 302467 281786 316160
6618 316160 309783 281552 294206 300146 326174 349088 344271 324478 320991 281028 266184 304115
6606 304115 292460 303254 301343 284205 292378 298306 293239 319054 317069 306353 294404 278745 265768
6593 265768 255875 267550 269017 269834 270259 300743 299290 315817 323574 282160 240748 268425 299237
6580 299237 289739 275592 253385 251181 251881 252402 260087 297014 295361 263500 245032 260031 281369
6567 281369 268162 283325 330160 328832 321924 295551 291341 306444 304708 288135 289478 327615 314036
6554 314036 297954 309601 325088 335242 306884 278449 287844 304933 304405 283353 305427 341122
6542 341122 341089 346939 349662 331130 351378 355976 347554 335841 352815 338758 339482 335676 332570 348414
6528 348414 357922 374199 343420 355443 383490 369915 328053 354500 354021 356845 342907 311511
6516 311511 333076 333928 337705 343203 335781 355183 393201 381675 415732 398640 363895 383023 445114
6503 445114 418592 426134 455585 487869 498497 474623 448781 447243 484820 487433 483633 482909 518104
6490 518104 518275 499378 492751 506924 450125 460057 464338 449843 417347 420744 411737 405585 400528
6477 400528 380603 373691 384184 430732 388869 392764 392550 373593 355012 361895 377274 375647 365996
6464 365996 344868 348005 340273 359189 387794 375168 382361 397257 412376 428044 395436 377902
6452 377902 409655 437215 443373 416848 424942 431908 405319 421953 448222 421354 392385 462556
6440 462556 490842 488471 479510 464391 450063 436773 439134 453709 438772 433718 429193 412690 415361
6427 415361 400098 395120 397011 433574 448353 449413 455183 459797 446621 411655 446735 470531 450997
6414 450997 435629 440601 419700 403162 437190 477841 499847 475714 460201 431987 425944 406078
6402 406078 431730 457875 438071 443234 452501 473041 471916 487324 482772 506821 518206 502703
6390 502703 535105 572241 564940 594066 638993 680399 682974 730850 790461 844684 907918 1002065
6378 1002065 1101992 1129638 1155658 1159023 1144499 1055079 1002648 952486 940368 955327 931317 947294
6366 947294 978445 993819 1031143 1041443 1081872 1122970 1158813 1163877 1169017 1173829 1177473 1227704
6354 1227704 1264613 1331271 1365930 1475329 1692928 1956128 2270798 2609812 2947500 3272346
6344 3272346 3448269 3434838 3283662 3016678 2716933 2392329 2108064 1856428 1649082 1487903
6334 1487903 1338440 1235690 1141455 1042118 1018148 977009 985022 990379 970713 936033 901958
6323 901958 837870 796804 762358 730837 722203 680187 644315 631785 596790 596184 620806 602485
6311 602485 581368 565923 552287 562076 589741 598056 598545 623531 618128 614341 647050 634829 671795
6298 671795 646515 650498 669190 656870 581608 543059 576696 569365 568561 564580 531136 571190 589998
6285 589998 588499 585680 606709 622816 637053 661513 652428 672646 641810 608845 578739 601221
6273 601221 626721 607761 598170 597598 606495 612782 627841 622256 612742 579046 582631 566860 577957
6260 577957 596783 623464 608822 633586 631491 642036 649042 633423 627780 637800 652662 638163
6248 638163 637566 621435 626337 642909 672063 647239 635834 611574 641699 651417 647674 656298 657161
6235 657161 656591 621871 625937 619935 618625 636534 628826 662260 687167 694879 678989 667516 681140
6222 681140 697486 683534 676360 651450 687588 727336 764574 769283 748678 769566 784270 754074
6210 754074 775815 753220 760780 776928 776284 831814 821243 827204 863730 852006 823687 835616
6198 835616 843351 871819 893181 854015 858307 890901 905635 908878 907882 965854 963954 969886 993186
6185 993186 1016639 1054560 1081809 1124597 1160967 1206240 1256745 1286905 1325095 1354905 1364902 1345766
6173 1345766 1384725 1419986 1403207 1421919 1471609 1514436 1617902 1720236 1828552 1930766 1977125
6162 1977125 1978725 1972438 1982667 1933469 1875034 1865869 1845485 1832396 1826392 1793925 1785484 1792588 1833874
6149 1833874 1861615 1823524 1809062 1803533 1777800 1750263 1716589 1697696 1666172 1622182 1547081 1431627
6137 1431627 1413069 1423212 1424888 1439967 1428538 1418437 1426249 1477607 1520362 1544328 1592876 1644848
6125 1644848 1703061 1796707 1876687 1989065 2142661 2285375 2483641 2651133 2711772 2713749 2604428
6114 2604428 2465031 2256883 2087409 1910150 1787422 1731301 1660278 1560103 1551645 1533729
6104 1533729 1514169 1518135 1509155 1507240 1465114 1471673 1457176 1466241 1486043 1489000 1473950 1464529 1478403
6091 1478403 1496086 1466733 1438694 1430532 1437072 1412753 1385861 1383887 1417868 1419503 1387650 1378959
6079 1378959 1380894 1400038 1407648 1404935 1429434 1419592 1409515 1430474 1431567 1451371 1449516 1455042 1477017
6066 1477017 1509858 1505130 1500078 1516569 1530550 1546812 1579724 1606819 1619420 1598177 1610524 1636561
6054 1636561 1660012 1671159 1668664 1695802 1682776 1690079 1715863 1735679 1760421 1790992 1809632 1865412
6042 1865412 1926948 1967594 1976455 2026833 2093157 2185699 2247133 2312663 2404146 2502433 2583322 2726471
6030 2726471 2852889 3017398 3195023 3331226 3523059 3744355 3931020 4081084 4165172 4195155
6020 4195155 4154274 4099928 4024832 3915443 3810233 3727071 3661574 3645428 3631756 3659602 3683013
6009 3683013 3715339 3779295 3807677 3871845 3924486 4040490 4134082 4252926 4388677 4512605 4656157
5998 4656157 4776481 4863921 4954879 5037231 5149340 5230539 5254121 5242548 5254890 5257412 5214947
5987 5214947 5135450 5071186 5043290 4962891 4878797 4818433 4777166 4773173 4703781 4637206 4647959 4608482
5975 4608482 4577790 4576394 4553579 4563175 4550673 4525846 4498902 4487235 4462987 4410471 4358423 4323340
5963 4323340 4288177 4270394 4277334 4298491 4331256 4361973 4379021 4451870 4564277 4698709 4795420
5952 4795420 4920880 5086528 5300948 5520591 5758950 6024100 6354844 6748931 7197657 7664079
5942 7664079 8238058 8882762 9574438 10303069 11028871 11752710 12334861 12719719 12865199 12815087
5932 12815087 12576555 12184371 11702811 11181937 10752562 10336193 9927482 9585161 9312015
5923 9312015 9068414 8842122 8678582 8578049 8513467 8466899 8451511 8468255 8552332 8608317 8677845
5912 8677845 8777803 8883450 9031349 9155746 9306051 9534529 9776584 10056652 10354118 10671836
5902 10671836 11031977 11455697 11964372 12498784 13071062 13720407 14395174 15085100 15775655
5893 15775655 16438538 17001316 17517586 17777577 17845398 17726370 17409603 16979145 16506651 15979354
5883 15979354 15403309 14849522 14346400 13884813 13547100 13252218 13024769 12903890 12814810 12770038
5873 12770038 12830307 13013793 13214264 13456658 13770847 14176562 14648206 15154264 15713292 16274997
5863 16274997 16864957 17484519 18187272 18830712 19509059 20201625 20905442 21525661 22108455
5854 22108455 22659441 23132557 23557142 23903031 24217870 24394079 24476929 24479493 24472858 24345944
5844 24345944 24191312 24039770 23851620 23672027 23414637 23217588 23084844 22979744 22976301 23011092
5834 23011092 23123332 23257403 23479770 23745161 24016473 24367639 24650598 24945708 25314424
5825 25314424 25682411 26091314 26548904 27035993 27541452 28107588 28711191 29457328 30199455
5816 30199455 30959768 31687174 32405713 33102710 33761896 34338789 34816282 35181243 35407948
5807 35407948 35412349 35260039 34967934 34513385 33907372 33181703 32420312 31616168 30808191 29985506
5797 29985506 29075101 28127318 27158633 26182306 25160147 24170289 23200227 22303686 21511203
5788 21511203 20799415 20158335 19610630 19126755 18676191 18285647 17881394 17502569 17095861
5779 17095861 16694278 16280391 15853632 15435109 15008005 14642981 14367485 14119082 13992543
5770 13992543 13946038 14039351 14226477 14491404 14854934 15201571 15572897 15917097 16025445 15950100
5760 15950100 15625797 15092840 14406518 13660255 12911068 12116992 11390987 10690430 10104169
5751 10104169 9556490 9104921 8722856 8337608 8032211 7759523 7562289 7321601 7125239
5742 7125239 6965719 6859331 6806140 6755112 6656964 6618686 6598542 6566274 6613993 6630447 6677409
5731 6677409 6712381 6745449 6814056 6822818 6815147 6742413 6593048 6403891 6243269 6057790 5841136
5720 5841136 5672407 5487666 5292533 5154332 5035816 4951298 4831649 4764961 4702403 4660259
5710 4660259 4643207 4656281 4625943 4610813 4623437 4666230 4696585 4743533 4811202 4863691 4915689
5699 4915689 4970243 5064691 5094315 5114562 5090182 5054850 5036505 5007949 5026037 5059370 5051456 5097598
5687 5097598 5142633 5241895 5315754 5378938 5427261 5498961 5547611 5580039 5593709 5616376 5671820
5676 5671820 5701876 5720250 5778248 5830907 5886205 5890836 5873005 5827067 5811929 5692369 5581074
5665 5581074 5442969 5327994 5206214 5051828 4931783 4861266 4780158 4644887 4568873 4560868
5655 4560868 4547218 4527794 4518208 4513857 4519822 4559248 4606454 4680787 4803330 4927903 5112972
5644 5112972 5243461 5291702 5284760 5269663 5222404 5223256 5242305 5298613 5358435 5445666 5568841 5660049
5632 5660049 5808033 5997222 6212843 6458920 6709406 7017969 7357494 7767592 8240344 8773454
5622 8773454 9377111 10033682 10775093 11624581 12545921 13595411 14734886 15899813 17105875
5613 17105875 18187957 18929492 19240779 19137371 18749989 18155563 17440403 16625774 15779829
5604 15779829 14856732 14000405 13166919 12329000 11553589 10880384 10288211 9749178 9298737
5595 9298737 8878331 8520595 8281438 8048880 7880272 7746425 7659321 7618502 7602946 7650165
5585 7650165 7794553 8037371 8337728 8721804 9106698 9398267 9468253 9414092 9291070 9213480
5575 9213480 9204227 9297424 9415952 9599625 9880039 10222261 10633468 11118925 11679835 12312632
5565 12312632 13050614 13881802 14815048 15861266 16996234 18236115 19640718 21161973 22778993
5556 22778993 24439301 26051876 27596272 28994550 30081917 30858597 31289431 31251557 30769318
5547 30769318 29816042 28466577 26942480 25266113 23535444 21879561 20226501 18662482
5539 18662482 17227157 15879660 14675348 13578592 12622915 11791222 11063199 10438949 9834943
5530 9834943 9307710 8888518 8511404 8195413 7921024 7652334 7439260 7269562 7122436 6993919
5520 6993919 6888806 6797637 6715594 6658860 6633436 6626937 6605123 6659438 6698454 6724808 6781920
5509 6781920 6839106 6928586 7047216 7143236 7282910 7477701 7698077 7928135 8192840 8521557
5499 8521557 8914248 9323395 9793405 10370528 10985378 11699098 12533425 13461720 14490615
5490 14490615 15618531 16822260 18147908 19525366 20917954 22308623 23651165 24889187
5482 24889187 26011155 26906067 27504744 27723696 27655899 27250580 26537702 25585599 24455181
5473 24455181 23153190 21829313 20507341 19131061 17713142 16406938 15158585 13976652
5465 13976652 12903220 11897962 11010995 10233379 9544983 8925860 8361013 7878705 7459487
5456 7459487 7056549 6730993 6466596 6223429 5984407 5790183 5589781 5431144 5289247 5197571
5446 5197571 5106739 5055965 5024700 4997696 4987965 4997233 5025094 5094424 5178111 5276612 5364585 5519416
5434 5519416 5752534 5993728 6278219 6623807 7003113 7432364 7940989 8477663 9016582 9599992
5424 9599992 10252504 10841662 11378031 11872295 12263908 12512733 12616440 12537393 12299534 11881877
5414 11881877 11364415 10729919 10084461 9488418 8855242 8235894 7588881 6996435 6467308
5405 6467308 5964349 5518992 5118494 4779027 4469050 4202792 3994987 3785373 3594250 3406894
5395 3406894 3294272 3162073 3014470 2871391 2752069 2679962 2603551 2541052 2508845 2423788
5385 2423788 2359514 2307980 2274484 2234512 2268092 2249878 2232561 2222911 2240563 2251077 2283570 2323354
5373 2323354 2317322 2325454 2338948 2339680 2332152 2337884 2327444 2318815 2277084 2267278 2239717 2219240 2182649
5360 2182649 2176366 2114737 2110085 2094169 2066629 2035412 1984036 1935528 1924491 1873849 1810779 1746319
5348 1746319 1730936 1716970 1679694 1647073 1630667 1578645 1556384 1556147 1522871 1507307 1498529 1506015
5336 1506015 1482392 1465249 1454795 1436909 1431524 1461382 1421697 1414223 1402256 1371943 1391983 1374601
5324 1374601 1322756 1290368 1289527 1307246 1271961 1243594 1216435 1176283 1157597 1162654 1182660 1187551
5312 1187551 1179480 1224475 1216637 1242485 1218724 1200067 1222355 1257815 1243264 1258718 1272284 1236918
5300 1236918 1207331 1215481 1234259 1231796 1227962 1195430 1212020 1221032 1193961 1180299 1192325 1151988
5288 1151988 1155079 1141193 1169563 1170743 1118871 1105927 1079278 1056256 1071070 1061935 1059665 1047559
5276 1047559 1070560 1116558 1124282 1161817 1223097 1334331 1454420 1573476 1621981 1591107 1502516
5265 1502516 1382927 1320441 1248840 1238014 1189958 1171471 1164891 1123774 1131688 1158190 1163338 1166563
5253 1166563 1171244 1212398 1203413 1205761 1212607 1194273 1235986 1252972 1243529 1243489 1238663 1260166 1237699
5240 1237699 1224515 1206837 1204470 1253613 1214892 1211260 1201027 1193503 1198939 1150460 1137049 1126909
5228 1126909 1137408 1149451 1166713 1196891 1242536 1325890 1392684 1473931 1535555 1636765 1647543
5217 1647543 1602816 1515152 1399672 1356186 1298238 1244246 1195897 1143207 1080003 1069255 1061201
5206 1061201 1050739 1060887 1091703 1109192 1126387 1126079 1122506 1162565 1155143 1166928 1127285 1142454
5194 1142454 1144665 1160594 1184135 1207246 1226015 1213380 1214466 1213859 1223538 1242940 1282494 1278327 1297415
5181 1297415 1294796 1337596 1364400 1353954 1360340 1386458 1393318 1431722 1454307 1476432 1473731 1456949
5169 1456949 1389890 1366955 1384929 1372364 1382010 1351737 1361157 1333257 1328533 1336079 1337207 1327547 1352026
5156 1352026 1403842 1412190 1403736 1445511 1425960 1419786 1447657 1455846 1477371 1472997 1510735 1534589
5144 1534589 1540059 1545915 1524059 1522292 1507393 1523498 1541858 1541934 1556207 1576143 1633557 1698322 1740604
5131 1740604 1759252 1773352 1793171 1780642 1761855 1775178 1750829 1753340 1798356 1830967 1865537 1907757
5119 1907757 1923183 1976129 2024958 2052627 2161282 2219695 2280547 2335148 2375034 2313048 2215113
5108 2215113 2149618 2078491 2009633 2002311 1989624 1974877 1993412 2037036 2055152 2011410 1987852 1959739
5096 1959739 1907855 1891382 1895407 1853149 1827082 1812350 1786096 1786663 1755185 1772877 1791435 1801649
5084 1801649 1799555 1803746 1834444 1815094 1831253 1859172 1886717 1874466 1869989 1825261 1846149 1944819
5072 1944819 1978154 2015096 2007332 2031841 2093528 2117439 2156228 2174159 2176583 2161914 2176940 2225919
5060 2225919 2281473 2280471 2332339 2409167 2467277 2552697 2609649 2601976 2613060 2669710 2714874 2719138
5048 2719138 2745621 2744748 2730800 2702834 2671584 2668722 2633710 2675189 2667804 2636746 2628748 2663883
5036 2663883 2706619 2755998 2808133 2830129 2913697 2995264 3098375 3157537 3211211 3262749 3303100
5025 3303100 3360202 3398398 3405462 3412035 3403110 3415698 3451947 3492129 3502132 3581042 3642218 3697204
5013 3697204 3745971 3828802 3885384 3940385 4013248 4093814 4151617 4229424 4340196 4416504 4501162
5002 4501162 4556981 4609762 4666726 4721625 4815432 4878840 4954446 5056614 5215982 5381934 5528143
4991 5528143 5645663 5824709 6010350 6241809 6489081 6783800 7132801 7423195 7749391 8045611
4981 8045611 8292309 8596841 8854417 9146382 9480426 9839648 10290516 10929414 11788599 12859036
4971 12859036 14118113 15620014 17317609 19183544 21471298 24467495 28700347 35340129
4963 35340129 45961299 61909997 81899938 101412608 115497560 119001144 111865615
4956 111865615 96981042 79432631 63448204 50487928 40767932 33484950 27922518
4949 27922518 23697783 20627789 18398376 16832832 15700594 14874976 14274381 13830628 13476593
4940 13476593 13177887 12913083 12745983 12651375 12602375 12629788 12751319 12892597 13081550 13294951
4930 13294951 13523044 13756043 13996825 14226789 14462652 14726452 15070702 15485610 16064908
4921 16064908 16786964 17706321 18924720 20371317 22107283 24273694 26920068 30599302
4913 30599302 36176972 44889429 58068387 75348914 92831834 107202166 115769344 116285159
4905 116285159 109009401 95496703 79814624 65237417 53162435 44162620 37375328
4898 37375328 32154983 28083517 25004044 22769488 21100803 19821401 18797865 17923533
4890 17923533 17186079 16541952 15940541 15406960 14991687 14626082 14343623 14137819 14014992
4881 14014992 13954718 13988765 14051781 14139977 14205016 14237369 14220043 14153332 14080413 13982491 13868100
4870 13868100 13780616 13709347 13644129 13594223 13605550 13622871 13650465 13761318 13840398 13974562 14116629
4859 14116629 14208724 14248112 14322258 14353193 14332280 14254762 14193958 14146790 14046000 14012184 13973265
4848 13973265 13963072 13960211 13980215 14051877 14105981 14190848 14312525 14472342 14717779 14942369 15215583
4837 15215583 15516763 15839605 16207162 16556838 16951854 17273429 17567250 17808813 17994853
4828 17994853 18057721 18094799 18075199 17949554 17759395 17542499 17258990 16899354 16540932 16195083
4818 16195083 15823361 15430202 15111585 14822729 14557160 14277079 14089713 13978190 13881282 13814984
4808 13814984 13808286 13835880 13852982 13844673 13839532 13885463 13843474 13751815 13622952 13446056 13268409
4797 13268409 12985198 12706079 12419394 12153384 11857447 11604621 11381375 11128961 10913987
4788 10913987 10763378 10625376 10484126 10348046 10230902 10141071 10001284 9939964 9893613 9835199
4778 9835199 9769663 9732206 9725430 9739041 9749625 9774643 9860178 10008805 10177427 10349806 10492357
4767 10492357 10622290 10798789 10968048 11151150 11318881 11530160 11753748 11955817 12217593
4758 12217593 12458111 12626170 12851638 13058931 13238090 13368638 13528314 13744351 14001998
4749 14001998 14278035 14563631 14902486 15297412 15735426 16233549 16798928 17316323 17802160
4740 17802160 18251451 18728093 19146057 19508732 19817405 20053073 20205533 20238929 20217819 20136429
4730 20136429 19950646 19736671 19512252 19249539 18961153 18698525 18442600 18223486 18069467
4721 18069467 17936523 17860952 17838892 17871808 18003733 18131370 18279591 18470700 18681257 18907461
4711 18907461 19076693 19228835 19357973 19433220 19450746 19383953 19280694 19143702 18969631 18782593
4701 18782593 18601869 18454369 18367070 18290709 18277191 18280139 18314740 18299084 18309528 18256566 18160254
4690 18160254 18020664 17844368 17613794 17379266 17228078 17053146 16917415 16861949 16864635 16861601
4680 16861601 16918508 17022544 17212566 17440688 17696061 18030379 18436962 18869010 19367101 19944564
4670 19944564 20631451 21359361 22180720 23082555 24063949 25157383 26344904 27630344 29008309
4661 29008309 30487921 31997238 33558143 35084687 36590467 38137737 39634098 41023134
4653 41023134 42339960 43569511 44702059 45829053 46912795 47919731 48794752 49556224
4645 49556224 50080302 50403907 50565437 50460395 50104158 49534942 48764969 47814650 46684305
4636 46684305 45428384 44059355 42643530 41176503 39754723 38441504 37231043 36132693
4628 36132693 35173934 34324610 33529501 32917843 32425834 32023264 31759648 31585020 31526090 31528741
4618 31528741 31602188 31732569 31894097 32170745 32459637 32883578 33370036 33946430 34654840 35463303
4608 35463303 36341635 37295262 38265423 39159894 39876360 40240857 40293383 40090320 39686891 39155542
4598 39155542 38519194 37808442 37088192 36362138 35696874 35053355 34441548 33893175 33395860
4589 33395860 32934145 32473033 32133222 31907525 31740474 31702098 31765489 31946288 32190040 32513095
4579 32513095 32922572 33353776 33819524 34240349 34650369 35019151 35340739 35693254 36033602
4570 36033602 36425254 36826544 37271694 37671445 37983295 38212149 38354666 38446405 38583561 38847711
4560 38847711 39276495 39849884 40537819 41309212 42098503 42776467 43301809 43613733 43687433 43599295
4550 43599295 43388182 43106208 42848315 42622420 42548460 42597059 42766907 43018772 43405917 43916321
4540 43916321 44514868 45246440 46161046 47320172 48707527 50400531 52412850 54783414 57518755
4531 57518755 60667548 64292513 68340215 72885659 78174113 84444615 92132192 101752987
4523 101752987 113817251 128354105 144750106 161513299 176589097 187977052 194070167
4516 194070167 194011936 187913512 176546816 161509435 144748409 127989860 112493165 98908021
4508 98908021 87325711 77667602 69667763 63150606 57839150 53537548 50002945 47117589
4500 47117589 44730595 42774901 41156328 39836538 38763565 37737657 36840191 35969143
4492 35969143 35105500 34196335 33220729 32185924 31139361 30117766 29096525 28076906 27109794
4483 27109794 26231072 25389639 24611418 23898138 23294225 22753480 22339281 21925725 21592055
4474 21592055 21308526 21110117 20932290 20793501 20744787 20701890 20666042 20608511 20534071 20362334
4464 20362334 20125350 19813941 19413204 18985937 18469867 17957591 17450669 16999754 16594547
4455 16594547 16188807 15875738 15627034 15416440 15217163 15044104 14923155 14860762 14810808 14817480
4445 14817480 14814005 14854094 14922859 15027975 15115747 15223696 15314588 15410154 15534791 15630506 15681491
4434 15681491 15743446 15812639 15906731 16048068 16188602 16332766 16561993 16829044 17140430 17538760
4424 17538760 17969484 18430367 18944418 19587268 20325104 21040673 21876245 22780182 23789047
4415 23789047 24837437 25979797 27225393 28625165 30202465 32006490 34131184 36571091
4407 36571091 39337533 42561212 46349912 50702560 55629093 61217607 67650193 75005799
4399 75005799 83430676 92983294 103686905 115165391 126504144 136470025 143542406 146438833
4391 146438833 144652454 138680185 129617111 118776664 107378961 96278556 85953374
4384 85953374 76705405 68584098 61527456 55506810 50414134 46013934 42225530 38967345
4376 38967345 36083265 33535171 31276105 29281192 27546760 25969295 24525646 23228001
4368 23228001 22038034 20930688 19977101 19115193 18380216 17744170 17207819 16772406 16416171
4359 16416171 16120956 15814416 15523229 15230647 14925746 14667151 14482629 14233910 13945271
4350 13945271 13640905 13321119 12950939 12582227 12256582 11905843 11590670 11388401 11241237
4341 11241237 11136385 11013148 10833741 10556031 10198953 9856567 9498054 9152481 8852644
4332 8852644 8612065 8452076 8314801 8186228 8035741 7929982 7749541 7567978 7468702 7365532
4322 7365532 7215177 7075216 6973778 6880463 6755861 6655650 6557692 6490338 6478432 6453074
4312 6453074 6407653 6391594 6387396 6368049 6265447 6134873 6060952 5996562 5950186 5886818 5846190
4301 5846190 5843027 5864654 5907250 5916013 5941454 6015427 6089083 6133938 6204000 6257911 6345866 6397973
4289 6397973 6471707 6569104 6716567 6900684 7118585 7311937 7622730 7932711 8352984 8885801
4279 8885801 9772325 11171248 13500697 17303229 22841323 27684328 29864790 28584254
4271 28584254 24780681 20732431 17067492 14534330 12741703 11319596 10179179 9377145
4263 9377145 8785606 8413709 8148947 8011867 7910106 7849744 7788712 7714124 7628046 7569123
4253 7569123 7546044 7511088 7480107 7513103 7523959 7571971 7601931 7689349 7816561 7927366 7987594
4242 7987594 8128469 8251082 8368280 8462806 8588817 8727504 8854164 9011559 9206260 9378738
4232 9378738 9569910 9779926 9968817 10138602 10290832 10412663 10566397 10695172 10867168 11034691
4222 11034691 11211448 11419253 11680644 11979530 12274954 12623850 12968769 13348664 13720845
4213 13720845 14083760 14450834 14828387 15175125 15537018 15935617 16390931 16914835 17510692
4204 17510692 18158047 18863950 19525382 20190699 20826001 21350538 21720295 22020836 22256468
4195 22256468 22449154 22591696 22775175 23079079 23385061 23807117 24305177 24762117 25160031
4186 25160031 25440890 25520580 25428571 25186088 24755824 24244605 23755118 23266871 22862195 22494081
4176 22494081 22217005 22006558 21775813 21593732 21281784 20870697 20420669 19793817 19075307
4167 19075307 18327303 17529986 16789513 16078501 15451164 14870656 14352505 13867882 13396151
4158 13396151 12948321 12508801 12015944 11560895 11080766 10609349 10127353 9712473 9309102
4149 9309102 8907700 8512386 8172891 7871645 7572251 7282892 7039152 6850844 6633990 6417803
4139 6417803 6248036 6090975 5935166 5767816 5667169 5554895 5386292 5280241 5173326 5068776
4129 5068776 4924829 4793392 4705431 4605278 4469302 4351471 4287747 4186637 4064217 3953611
4119 3953611 3848727 3736418 3666892 3627589 3530277 3460688 3392560 3332981 3262666 3220312 3206086
4108 3206086 3151253 3092746 3043444 2983550 2928609 2910324 2856571 2814138 2766188 2745251 2679575
4097 2679575 2655877 2666012 2679812 2684469 2679118 2663733 2607336 2578658 2515997 2505867 2481672 2447752
4085 2447752 2386636 2321544 2257024 2207772 2159206 2110031 2034550 1962018 1893268 1891416 1878623 1841248
4073 1841248 1777719 1754252 1743011 1718858 1668852 1671581 1657509 1607743 1598910 1569248 1565123 1541532
4061 1541532 1527496 1527350 1515557 1536120 1503645 1509621 1526095 1535258 1552002 1491660 1450434 1453450
4049 1453450 1444706 1464599 1392693 1329222 1347838 1343407 1300156 1285573 1304575 1318043 1303839 1282702
4037 1282702 1289521 1252171 1220693 1220147 1249751 1254483 1262676 1222451 1224147 1243811 1243107 1206081 1190277
4024 1190277 1173133 1149019 1171594 1180020 1151625 1160556 1149702 1126997 1164741 1137710 1119605 1146471
4012 1146471 1141956 1144903 1121937 1110452 1135761 1154476 1161639 1151606 1128761 1145777 1136144 1102940
4000 1102940 1134367 1118511 1103017 1082471 1066664 1104515 1103432 1083289 1088874 1121575 1148491 1155417
3988 1155417 1156415 1146225 1202153 1199788 1195065 1177105 1144466 1140274 1123389 1137976 1102051 1073378
3976 1073378 1066768 1069296 1050274 1050009 1019255 1035666 1022400 1035861 1030879 1029306 1061084 1062152 1056765
3963 1056765 1055546 1033334 1025906 1040568 1037275 1045376 1076981 1093925 1117025 1100221 1080656 1088297
3951 1088297 1066962 1092308 1059101 1059630 1084051 1080922 1107114 1082222 1073114 1105851 1116435 1096486
3939 1096486 1109675 1154847 1154959 1149598 1144857 1158721 1127692 1120882 1125518 1112635 1077658 1078325 1121342
3926 1121342 1122095 1121584 1130919 1111829 1094294 1063097 1095644 1110442 1076229 1097528 1111779 1148474
3914 1148474 1151429 1148793 1182050 1147601 1143096 1169281 1209390 1170588 1144605 1156637 1135663 1122434
3902 1122434 1136307 1118809 1153011 1152911 1151746 1130371 1116900 1148081 1160059 1160923 1160072 1195859 1170784
3889 1170784 1181083 1195523 1194188 1194655 1201782 1205993 1190684 1218394 1223074 1209518 1208729 1203841 1211708
3876 1211708 1211717 1212219 1223066 1237027 1255734 1301921 1282298 1276177 1255798 1265411 1264993 1269274 1321779 1359966
3862 1359966 1344822 1349851 1343598 1382736 1419854 1468952 1497492 1559397 1630271 1643645 1716642 1760618
3850 1760618 1730672 1784236 1807977 1768281 1771681 1746128 1732887 1698306 1657440 1661515 1630388 1595940
3838 1595940 1572076 1531336 1507223 1508105 1506309 1514323 1505421 1477922 1470018 1457627 1432231 1411788 1406267
3825 1406267 1376928 1411450 1431819 1449192 1472598 1486970 1482874 1484432 1482514 1457642 1441902 1422700
3813 1422700 1409540 1445067 1443823 1496311 1507511 1505723 1528973 1539615 1515149 1487313 1508277 1544990
3801 1544990 1577006 1560283 1585832 1629096 1660949 1650073 1622962 1648054 1686160 1700381 1713385
3790 1713385 1733137 1743230 1744942 1768193 1796183 1822086 1832689 1794332 1784947 1817703 1849209 1841630
3778 1841630 1844129 1868256 1900985 1903036 1897383 1936781 1982319 2008374 2011729 2055027 2105170 2121103
3766 2121103 2124419 2102421 2117859 2150802 2141973 2169142 2225734 2232284 2244887 2275720 2271597 2297611
3754 2297611 2357268 2408793 2452595 2478315 2475680 2492679 2551971 2543023 2564170 2585457 2603076 2655015
3742 2655015 2659332 2709186 2713251 2765249 2819293 2866183 2904284 2965424 2996345 3023748 3061315 3079126
3730 3079126 3135021 3192633 3204781 3242386 3260019 3271139 3309418 3321482 3323290 3328605 3376716 3376868
3718 3376868 3377066 3432598 3441058 3415352 3424352 3441024 3451971 3446961 3478235 3456239 3449641 3465293 3462665
3705 3462665 3475538 3492215 3522099 3528042 3502975 3536062 3536729 3534439 3537941 3525605 3569320 3619780
3693 3619780 3611837 3619954 3618333 3638581 3649553 3671244 3741550 3784300 3789297 3804188 3859200 3877355
3681 3877355 3927568 3974407 4062271 4107103 4153680 4234515 4288291 4348164 4414054 4509526 4587738
3670 4587738 4653687 4731910 4784851 4872730 4946877 5016063 5098282 5146094 5207484 5274858 5340215
3659 5340215 5412601 5472986 5531386 5573331 5593201 5668170 5727119 5771414 5861004 5925179 6002619
3648 6002619 6069060 6151019 6237044 6320170 6394974 6454817 6524633 6594933 6659018 6745829 6795116
3637 6795116 6865192 6920166 6974704 7005403 7022097 7071444 7115732 7168966 7201565 7260395 7296511
3626 7296511 7329625 7372275 7425136 7467097 7473291 7538908 7547300 7540945 7549965 7527163 7497319 7428923
3614 7428923 7394330 7359614 7362810 7316878 7273742 7225376 7204804 7185841 7163128 7127488 7104641 7062897
3602 7062897 7044185 7023202 6993696 6993244 6962904 6972038 6967698 6951862 6926406 6898684 6903421 6904197 6931855
3589 6931855 6963322 6989669 7017763 7072256 7126136 7207171 7251938 7298125 7366817 7433183 7521965
3578 7521965 7646107 7762082 7854153 7983303 8085486 8177806 8322378 8396568 8475861 8560811
3568 8560811 8661242 8770637 8892795 9006411 9141608 9263606 9376685 9532364 9654704 9817692
3558 9817692 9931166 10089741 10224034 10368280 10520488 10712268 10881211 11036807 11247056 11463824
3548 11463824 11680109 11918014 12151278 12380003 12605304 12811404 13040720 13265598 13494973
3539 13494973 13672503 13795118 13911822 14056808 14192130 14302249 14411152 14544984 14701096
3530 14701096 14836999 14952294 15079205 15239477 15355121 15516747 15657251 15807941 15969640
3521 15969640 16124865 16226282 16335847 16455118 16582798 16704873 16850045 16973143 17134283
3512 17134283 17340299 17552596 17817270 18108779 18466411 18813125 19183636 19553427 19968710
3503 19968710 20467738 20929228 21416128 21963596 22517651 23136244 23768985 24434511 25139779
3494 25139779 25895869 26736695 27581651 28481363 29440006 30381898 31406671 32530106 33692395
3485 33692395 34900316 36168731 37534700 39016950 40584122 42250980 44057051 45983857
3477 45983857 48070225 50357381 52851307 55515233 58406266 61556995 64935596 68582370
3469 68582370 72499676 76545700 80685951 84876807 89006011 93003446 96793984 100336565
3461 100336565 103573364 106698285 109663015 112513211 115380431 118301880 121334504 124594539
3453 124594539 128091509 131875124 135974505 140374353 145050212 149850894 154655193 159282067
3445 159282067 163474274 166950235 169489441 170992181 171291204 170467317 168712650 166336183
3437 166336183 163566151 160666968 157849124 155246307 152804707 150541848 148319265 145828565
3429 145828565 142929033 139409771 135158360 130116892 124350503 118129310 111524925 104808283
3421 104808283 98282203 92071651 86383284 81155966 76346835 71804874 67599329 63750195
3413 63750195 60304565 57262457 54619608 52308050 50256725 48477569 46897138 45480626
3405 45480626 44250588 43131169 42108959 41169727 40335744 39609337 38949929 38281429 37631929
3396 37631929 37093172 36606960 36136530 35676168 35308445 34990622 34747408 34622121 34719521 35017986
3386 35017986 35340494 35403134 34967181 34094656 33082608 32046468 31082201 30318470 29621891
3377 29621891 29010020 28489072 28054869 27651089 27326218 27066554 26876431 26769828 26643984
3368 26643984 26579513 26534352 26540560 26529192 26535081 26567019 26595728 26664181 26786178 26943278 27188164
3357 27188164 27583808 28128753 28805690 29508045 30148948 30674937 31120907 31505552 31943553
3348 31943553 32521472 33170008 33842315 34618489 35348916 36053241 36732083 37322074 37784948
3339 37784948 38054942 38150565 38060421 37750705 37267381 36687575 36017631 35250048 34508468 33813187
3329 33813187 33109009 32409187 31823204 31318493 30874493 30514584 30271553 30161547 30095504 30105218
3319 30105218 30193349 30327982 30516362 30779466 31096578 31416292 31725327 32062252 32485357 32916025
3309 32916025 33404784 33985221 34672035 35367060 36150876 37066434 38112805 39288062 40595217
3300 40595217 42077064 43780645 45690022 47833974 50229004 52823427 55757285 58918105
3292 58918105 62317593 65890176 69598081 73395887 77129848 80737095 84077209 87007027
3284 87007027 89520323 91553456 93063311 94083747 94698561 94990472 95018418 94949531 94930200
3275 94930200 95000071 95326504 95963653 96990330 98357259 100081823 102075252 104279430 106640864
3266 106640864 109016186 111324346 113421547 115159456 116385264 117004318 116974858 116167562 114596644
3257 114596644 112345090 109485031 106143280 102424913 98451177 94447942 90453412 86589851
3249 86589851 82983770 79641956 76514432 73678228 71109555 68678863 66385827 64132764
3241 64132764 61933906 59776419 57586634 55314834 53039673 50734712 48380884 46129072
3233 46129072 43936377 41837779 39864860 37972561 36205778 34624451 33190131 31870198
3225 31870198 30655861 29533360 28592884 27713667 26970227 26320852 25744520 25264191 24892680
3216 24892680 24611720 24424747 24287469 24162578 24159627 24210227 24256885 24302955 24382158 24455684 24470513
3205 24470513 24472653 24416932 24320265 24164863 24003903 23837643 23642199 23492411 23310370 23157168
3195 23157168 23104863 23092260 23098405 23112411 23116440 23075474 23009534 22874859 22658496 22377182 22017478
3184 22017478 21547749 21030317 20504407 19954632 19376590 18837195 18258068 17767618 17351615
3175 17351615 16912427 16547367 16250857 15981829 15755375 15580560 15393604 15226536 15096116
3166 15096116 14988775 14875972 14849225 14819263 14740416 14696938 14696220 14689869 14715102 14751351 14765159
3155 14765159 14753902 14708898 14636338 14626168 14611835 14615692 14593876 14563261 14488907 14345210 14223643
3144 14223643 14082483 13948241 13823168 13733769 13670592 13629571 13561687 13519379 13553315 13619561 13676007
3133 13676007 13752261 13855851 13953614 14063799 14211542 14321126 14430538 14594468 14724589 14846994
3123 14846994 14948515 15009151 15073968 15141664 15187183 15265583 15383633 15535263 15727240 15929249
3113 15929249 16147901 16433438 16719658 17035212 17448090 17903792 18422839 18982651 19595736
3104 19595736 20272115 21024686 21866669 22851910 23880054 24937377 26064925 27234737 28463589
3095 28463589 29748868 31076480 32454919 33830068 35216775 36586731 37966300 39418013
3087 39418013 40981206 42604778 44293656 46013504 47825981 49702036 51634913 53609641
3079 53609641 55599036 57543186 59321045 61006230 62598555 64183221 65788793 67547138
3071 67547138 69502895 71798322 74460167 77609370 81335155 85634517 90611626 96311325
3063 96311325 102725340 109887666 117868972 126936298 137580485 150465482 166296012 185891570
3055 185891570 209667575 237411825 267702352 297406857 322378024 338071974 341454154
3048 341454154 332289886 312813633 286790559 257991432 229402321 202815370 178976777
3041 178976777 158148758 140273505 125086254 112298982 101491681 92354769 84659918
3034 84659918 78137860 72614889 67928600 63918696 60559387 57780082 55585249 53852004
3026 53852004 52450204 51317194 50261184 49213336 48188578 47225809 46240304 45312910 44362875
3017 44362875 43255467 41931908 40369705 38517833 36595234 34691716 32875579 31167845
3009 31167845 29603388 28233507 26967336 25814728 24720699 23750411 22872412 22056618 21303388
3000 21303388 20553182 19898255 19300599 18774667 18302209 17891635 17571701 17323656 17133894
2991 17133894 16993521 16851154 16646531 16320342 15880000 15381971 14814180 14265995 13737769
2982 13737769 13249239 12829188 12500484 12181310 11930708 11763558 11668117 11623337 11602092 11657507
2972 11657507 11728986 11731298 11615615 11366435 11049989 10677821 10276661 9868012 9455141 9085482
2962 9085482 8773439 8482554 8198844 7934225 7730442 7511297 7333306 7158885 6969182 6804637
2952 6804637 6641944 6481429 6304567 6156443 5999582 5860102 5727027 5613200 5473612 5387172
2942 5387172 5273732 5184125 5089955 5003893 4925708 4887431 4829623 4678127 4611158 4545314 4460860
2931 4460860 4382240 4257636 4208290 4158460 4078425 4042517 3991231 3934678 3863098 3807905 3760830
2920 3760830 3717533 3650255 3574972 3514746 3432005 3361710 3298192 3246363 3180175 3139891 3093213
2909 3093213 3038144 3013584 2925074 2886158 2871800 2833802 2799751 2764580 2723014 2695614 2651962
2898 2651962 2662599 2605846 2529378 2496278 2459688 2435720 2413542 2341877 2265203 2231487 2206955
2887 2206955 2158720 2182193 2209627 2177872 2177811 2199975 2209112 2207678 2201367 2139690 2116612 2076225 2036485
2874 2036485 2023416 1979072 1925667 1872491 1842785 1797103 1771657 1734867 1674187 1668418 1682445 1705586
2862 1705586 1687182 1671603 1679345 1677906 1707790 1696476 1663016 1652096 1663566 1678769 1683861 1687937
2850 1687937 1687183 1674415 1643458 1624149 1615592 1662730 1639545 1599531 1544517 1550000 1546866 1511462
2838 1511462 1527944 1521733 1543115 1536368 1500868 1489208 1461532 1472166 1483081 1483799 1501588 1464195
2826 1464195 1457563 1453163 1437383 1445450 1461136 1460266 1443272 1430569 1423418 1454172 1496146 1474407 1454375
2813 1454375 1463307 1455760 1438429 1468160 1484780 1483143 1487321 1464038 1435343 1448516 1441432 1425262
2801 1425262 1414939 1429046 1423080 1415209 1417949 1392299 1407548 1417965 1443764 1397578 1386150 1398549
2789 1398549 1405835 1391422 1395870 1432795 1417183 1390396 1403519 1422874 1453026 1523399 1531084 1572663
2777 1572663 1653699 1716812 1771370 1824071 1882601 1975844 2096247 2218158 2322657 2423610 2480066
2766 2480066 2491279 2445623 2357050 2230360 2119474 1992083 1872157 1782934 1631397 1549057
2756 1549057 1477235 1386646 1363821 1283752 1234818 1234556 1194352 1172651 1109700 1054793 1077553 1064442
2744 1064442 1026508 1010103 979480 964291 946312 916533 933568 930461 893325 879866 890341 885378
2732 885378 844756 884065 902725 879742 868260 845618 822097 824601 788615 765352 741507 751562
2720 751562 757618 722423 709391 698956 675338 694842 689859 699000 724842 704812 671486 679984
2708 679984 704658 697717 712666 721241 688064 680677 704441 666180 684380 673569 651959 679821
2696 679821 672656 614586 592863 597986 604087 610379 600917 596897 615844 607511 600982 602924 622540
2683 622540 593870 605812 628702 580703 568594 579271 593137 561405 544401 534202 532364 542916
2671 542916 528252 537926 564003 555760 547225 554215 557451 558006 570721 589530 582938 563778 557453
2658 557453 541570 562242 560095 551715 548310 525387 525750 513883 512572 515570 525335 527663 526434 514953
2644 514953 496346 522197 517864 466334 471907 479633 471753 451050 462718 485030 447621 450612 466870
2631 466870 465946 468802 494092 501981 462631 442274 432737 472364 467614 477439 459053 439100 431260
2618 431260 439441 423503 382531 417344 453258 467046 459983 451819 444352 422842 416432 408298 422216
2605 422216 427875 416882 439390 425935 398065 392303 431358 455698 452353 475953 501079 534857
2593 534857 540550 499687 489690 517330 501694 479207 498948 477061 424597 413769 412160 409710
2581 409710 435868 444968 452814 445054 393505 387747 410843 393896 393394 389258 397448 373598 384994
2568 384994 368535 364987 365788 359171 382038 357351 316510 351052 349487 364141 375750 357873 327759
2555 327759 330799 339789 316974 298457 336315 378864 383881 322999 319614 335957 325942 318382 315222
2542 315222 331565 318252 337006 317598 298538 291294 315157 335784 367557 340536 332629 330662
2530 330662 290850 297409 307280 276628 290042 302077 292175 320189 339923 347048 317487 316457 343988
2517 343988 339779 316915 300796 314083 311206 309027 336615 355620 320107 299276 276619 282374
2505 282374 301890 268919 310761 331223 311251 293371 281109 293973 307325 299835 268794 269723
2493 269723 265321 257609 274855 292436 307371 324612 289176 294386 287305 269568 257550 261488 255236
2480 255236 271635 281596 285329 259703 295157 314012 259347 245746 242036 242665 260579 268845 294031
2467 294031 280307 256191 264847 254924 237596 261005 280672 258323 266455 271112 261418 247676 252895
2454 252895 247896 304067 262523 250313 257311 256034 260940 242692 268466 280495 258202 229101
2442 229101 235906 219027 224410 248755 280973 259183 244949 258601 249930 233797 236332 255156
2430 255156 221591 195644 201891 216479 242493 244321 278857 269513 269347 272670 249413 266126 251482
2417 251482 237973 241810 252762 236822 257049 250135 243627 265769 264306 278175 270000 252057 271676
2404 271676 262234 294926 272510 271463 290522 294893 284151 281180 314003 305801 310478 293500 304344
2391 304344 308443 313651 331991 274896 270950 307341 308222 331894 336018 321932 319321 340725 335894
2378 335894 344644 396544 408555 410793 446339 442921 430892 416571 442526 456465 473355 469365
2366 469365 469381 489570 518806 529446 562437 565797 573263 599320 616071 610753 660658 700175 732984
2353 732984 751788 828466 874738 917457 985421 1051157 1129919 1168362 1296305 1483994 1686380
2342 1686380 1810778 1930286 1997954 2111317 2257854 2441868 2684553 3108758 3585548 4417686
2332 4417686 5719546 7890042 11381654 16286138 20352703 21968972 20563360 17158263
2324 17158263 13570184 10435012 8200015 6513676 5226372 4165735 3391829 2845758
2316 2845758 2531548 2296697 2207000 2110174 2056416 1942570 1777768 1574655 1384567 1259754
2306 1259754 1146387 1072203 1002665 911789 858427 827714 808017 763268 703749 666623 664092
2295 664092 623899 601859 593848 570568 562650 537581 516123 484085 470175 440415 391672 438132
2283 438132 447503 419002 420755 425371 468406 436506 397398 407364 385324 358866 343616 338464 368762
2270 368762 342574 345920 332385 309396 295284 281787 311899 312850 331391 302267 293180 284794 287301
2257 287301 275465 259431 237545 236848 259631 222481 216454 249233 230781 238112 218927 219860 205824
2244 205824 224863 230131 244097 251403 240538 234973 238894 239494 219512 177653 165758 203403 155027
2231 155027 158864 156687 156511 181091 188502 181834 193239 192815 178162 176716 184245 172198 127794 148138
2217 148138 147338 125576 151883 156342 158559 108295 106703 132344 115515 154744 151315 125841 131188
2204 131188 133175 162363 146012 137697 134991 124643 119331 141252 137363 92994 91179 89644 96198
2191 96198 101906 80783 84270 108600 121973 110047 110481 105145 82792 68872 77644 88473 113262
2178 113262 93139 107114 121920 107198 84066 82177 110827 120350 86094 65274 50408 76938
2166 76938 116205 130587 125490 91411 91884 121012 110578 89076 85802 106166 139341 126150 100091
2153 100091 89997 110938 128997 92022 62140 62129 79665 110613 99608 70143 79365 104412
2141 104412 124219 94915 78245 64361 50308 28694 67586 75372 78973 89011 76949 69970
2129 69970 81843 98982 109792 96682 110931 93425 73232 98520 72116 48159 75743 101155
2117 101155 82686 76551 71547 52254 29756 67662 80990 95217 70561 49369 51103 73886
2105 73886 48088 35998 33923 100456 85393 76018 72725 46286 49248 48356 65774 77259 51447
2092 51447 44811 26004 48069 56650 72829 57459 19773 56377 75398 105825 103665 105937 79145
2079 79145 66887 51714 14930 30516 53982 32824 29308 37465 24885 16689 48249 102175
2067 102175 112061 94517 48872 77666 93107 92563 119110 149390 185025 165109 146664 110095
2055 110095 68453 76274 80970 73199 67779 67087 81342 69430 48415 53127 41294 24093 87525
2042 87525 119437 109519 58422 59434 72937 75607 60621 37275 20543 4248 18838 35690
2030 35690 53807 58812 52638 64440 39211 23503 34438 39326 26298 54411 92845 70567
2018 70567 67385 21509 37003 42889 45333 47489 49122 60502 94579 72263 36204 6392 15896
2005 15896 53030 59236 19704 22909 51005 25911 27594 23519 9244 -9479 3662 11338 44329
1992 44329 31645 28237 10514 -298 12754 1502 15810 23303 8015 15220 19789 38568 29421
1979 29421 7717 40941 58581 42083 53061 42937 32326 8958 4811 1825 8475 7634 24817
1966 24817 -4501 -4388 21188 18689 44413 60457 41326 22147 9068 24222 63629 62800 13656
1953 13656 -22220 9910 27603 27412 25215 26935 29702 47770 35590 34508 38846 56633 61907
1940 61907 8776 -3437 3504 28612 26642 17265 17139 34762 40476 30675 39758 36958 27789 -7431
1926 -7431 -8014 -7671 -12672 16579 5659 4889 2473 36848 41292 29932 22307 62129 65249 54463
1912 54463 55668 -25083 -7468 29540 -2229 2947 38253 26774 26275 24895 23802 3881 -25076
1899 -25076 -36581 -4678 -31685 -7173 -4422 -21519 -30390 -17009 -9135 35815 48898 34220
1887 34220 5923 -8082 14265 6539 4965 11263 8322 13616 10375 46166 59506 54052 84367
1874 84367 70455 42302 6576 2401 10195 52691 44086 17031 12555 -11322 -1062 -2348 -12860
1861 -12860 24491 18015 14731 25137 8717 106 15655 35626 20749 23154 -1281 15634 -3977
1848 -3977 -22234 21184 17390 -8112 -7016 -6902 -31436 -10571 -9119 3634 13914 -5934 -20295
1835 -20295 -14974 1408 -8152 -419 -543 -32528 -18192 30315 33997 46771 33138 31064 375
1822 375 -12613 -4807 -10108 9486 11152 11493 3418 9346 30816 35763 38543 33326 5794 14684
1808 14684 19091 6771 -7118 32689 25334 -6140 -1337 15460 3973 -19606 -11236 19025 15183
1795 15183 -5106 -26709 -21361 -7247 37360 27877 1056 -8817 -5305 -13352 -3479 -5204 -15558
1782 -15558 -1203 -8217 -1656 5040 12081 39800 46347 75223 82805 12995 -25607 -40691 -10818
1769 -10818 -3452 -7861 21298 12476 4140 -5843 -35451 -38925 -42937 -56267 -66940 -39107 -414
1756 -414 872 19296 -730 -4187 -13682 -40034 -40986 -49638 -59078 -31947 -33575 4273 -6403 -3753
1742 -3753 -2688 -25548 -29506 -58336 -41003 -27978 20415 13510 -21389 -32885 -18482 -7605 1976
1729 1976 -47136 -61098 -25954 -9428 -3732 -6423 -18609 -14500 2898 -8226 -27050 -29425 -28905
1716 -28905 -27929 -60607 -42682 -53794 -30966 20033 26599 -4107 -27028 -25025 -5015 24205 -11607
1703 -11607 -28563 -44517 -8441 10872 -1980 -5183 -2527 3254 1139 -9295 -23485 -13093 -38222
1690 -38222 -55358 -42167 -8697 -28590 -43648 -53985 -21264 -3500 25623 8951 9021 -12981
1678 -12981 -26585 4375 -8412 -33975 -40652 -35275 -48994 -40644 -41448 -43125 -33492 -24507 19180
1665 19180 29438 30072 5877 -12425 -1462 13832 10037 -63337 -86853 -76287 -37444 -29738 -13911
1652 -13911 -18812 -18130 10475 20973 19218 4497 -15910 10256 8505 15169 1307 493 330 -39718
1638 -39718 12451 41899 -249 -17982 -43102 -19657 -24906 -14854 5805 12154 -16860 -33548
1626 -33548 -19690 -33249 -40802 -15199 -7298 27981 34186 25572 -14212 -30338 -33460 -58688 -50205
1613 -50205 -41130 -40558 -48257 -11426 -33686 -50632 -53940 -40256 -20336 -20577 8051 694 11613
1600 11613 36162 13971 -402 -25701 -33673 -22309 -11914 -50377 -82233 -72008 -22693 -708
1588 -708 2409 28813 -19441 -13906 5941 5177 9878 5447 11577 -28760 -16323 -11806 -23805 -8013
1574 -8013 1691 -8798 -36427 -37241 -1081 10976 -17019 -29157 -43899 -78899 -58026 -30068 -12121
1561 -12121 -56296 -58557 -26688 -48042 -10525 20914 24110 -36066 -63856 -18195 -12189 -4576 -15656
1548 -15656 -42927 -8481 -33817 -35738 -22216 15352 33101 11375 -4312 20746 5623 -27539
1536 -27539 -36678 -26150 -41735 -54541 -30297 -53128 -43366 -39235 -44738 -32599 28380 19466 216
1523 216 -8359 -18828 -15099 161 -7405 32865 1867 5721 -20052 -30873 -14760 -14372 -30783
1510 -30783 -54724 -52292 -31835 -18930 -7322 543 1753 -16394 -20620 -7753 -14084 18343 17582
1497 17582 19154 4564 -3694 -320 15012 16566 -11187 -21038 -9083 -47588 -30870 -11295 3883
1484 3883 9803 13 28337 12176 -5267 -10974 -45701 -30126 -7990 21394 11903 11778 18799
1471 18799 12756 -9749 -58604 -49759 -24668 -37628 -38487 -44491 -17225 8261 -6196 10248 -4266
1458 -4266 -8061 -4699 -14193 -30462 -31123 -29228 -40442 -8953 2638 -24100 -10987 9039 -4788
1445 -4788 -39871 -36404 -25048 -45912 -45471 -49499 -26128 -25601 -15339 5938 -9732 8333 19699
1432 19699 -15248 -15809 -24071 -51447 -20649 -15057 -18275 -40263 -26834 -7209 -25673 -5397 2614
1419 2614 5051 -28095 -57929 -57650 -58347 -36750 -15824 -47573 -38309 -46935 -47526 -14087 -23629 -25066
1405 -25066 -29646 -26063 -11734 -48833 -60389 -39269 -32440 6024 5562 -17424 -5755 -28505 -69827
1392 -69827 -73661 -62168 -66528 -74231 -47945 -23680 -24940 4907 -26848 -59936 -39838 -35836 -50612
1379 -50612 -38288 -17362 -25653 -29291 -48509 -74723 -74031 -24098 -14913 -23225 -10242 9817 -26032
1366 -26032 -8085 19899 -15326 -34433 -17128 -2744 -2075 -11893 -11134 -12528 10222 19340 -349
1353 -349 -14098 -1538 15830 4175 7141 -9391 -4111 -12106 -19375 -30323 -30038 -36899 -28122 -34969
1339 -34969 -35804 -41442 -10428 16081 -5505 -60379 -40398 5478 -13951 -14829 -23453 -13529 -6516
1326 -6516 21472 25214 35219 -19449 -31920 -23108 -46874 -50145 -34133 -24705 8566 -29035 -28810
1313 -28810 -20852 -11636 -4007 -22619 -9637 -9271 -40228 -46733 6791 7870 -3435 24720 -8232
1300 -8232 -11711 -17143 -27395 -17305 -31620 -35147 -19970 16084 1530 -12816 -1756 -12490 -2458
1287 -2458 -641 -11264 -17114 -12588 -32882 -77864 -26712 -40488 -43586 -10807 -22873 -38425 -1374
1274 -1374 -14934 -15205 8182 -23135 -25187 1804 -5400 -8821 -29443 -45110 -22152 21124 7255
1261 7255 -6776 -10707 1999 8119 -23465 -24336 -13718 -21544 8463 23930 11158 9642 -19513
1248 -19513 -37039 -54292 -26942 -35043 -63577 -42097 -24639 -47809 -54302 -46447 -38608 -7445 -14254
1235 -14254 -2561 -10052 18385 19704 4770 13526 -1315 -39064 -43265 -28231 -44600 -56432 -61984
1222 -61984 -41003 -45460 -11246 3499 -17335 -27450 -27200 20487 41927 3589 16249 -477
1210 -477 -24313 -10319 21753 18362 -12369 7829 -5819 -7282 -33756 -30595 -36405 8418 23762
1197 23762 29593 14634 -38289 -37002 -71848 -59537 -36620 -14657 2780 -37835 -6224 -1994
1185 -1994 -491 3435 -12295 -27437 -43395 -60231 -66095 -12704 -2804 10981 -16058 -27523 -30950
1172 -30950 21229 4912 26285 -17852 -29795 -5388 -18996 11767 42700 20755 1464 -19641
1160 -19641 -29963 -28209 -24672 -5487 2946 19069 -4492 -13778 -39204 -39715 -34503 -27957 -602
1147 -602 -16290 9736 -2844 -43614 -21413 -87 32635 40142 39834 31691 16664 13537 -2944
1134 -2944 15690 24483 -7982 -36229 -23789 -26760 -40054 -21498 -25631 -26627 -33368 -23175 -56843
1121 -56843 -53237 -44452 -51325 -25279 22679 14290 -9771 -30363 -33928 -18268 -16135 -4773 -28522
1108 -28522 -24556 -58000 -64246 -78746 -55018 -20693 -31987 -37143 -17081 -2892 15851 21747 -20619
1095 -20619 18318 -16002 -7629 9186 31446 -8596 -26456 -34735 -41617 -47974 -71245 -71748 -13741
1082 -13741 14722 12480 21033 5326 -4102 -13975 3631 -4382 5992 8198 -3468 -37101 -50297
1069 -50297 -25084 -30848 -22328 -22330 -29580 -24941 -39209 30424 5328 -28364 -13621 49 -12986
1056 -12986 -40124 -33258 -28358 -18574 -12499 -33026 -12960 -27568 -52939 -45361 -53101 -62352 -65995
1043 -65995 -29617 -12142 -24878 -1698 16629 22471 2476 -18707 -1918 -4643 308 -19846
1031 -19846 -20428 -22707 -34922 -8248 5688 -4800 -21482 -36243 -45196 -18636 17518 9159 -44653
1018 -44653 -16252 -14620 -14906 -27866 -15645 44051 9295 -25728 -9806 20549 -21423 -30491 -26834
1005 -26834 1158 -10031 -26320 -17983 -4800 -32006 -7429 -6543 -57971 -56197 1363 15187 20756
992 20756 7783 -5773 -17430 -21287 17289 2762 32259 45509 34467 -3316 -9336 -6802 21301
979 21301 -8649 -35267 -20297 4998 -23671 -58402 -34683 -10698 17866 21065 11024 19828
967 19828 -10572 -37946 -18926 5477 -17791 -43227 11089 -2644 -14655 -15921 -8913 11522
955 11522 5083 10588 18082 9624 -8071 -17725 -36801 -7125 -26694 -1512 11807 25781 6182
942 6182 -17833 -13940 -8067 -23812 -2709 29564 3639 -7444 885 11818 -4192 9785 20366
929 20366 -22424 -8929 48285 60196 38075 -30817 -15822 -15398 14859 26756 27450 12133 -7204
916 -7204 7562 -15038 -19141 -7198 1075 20201 -753 -13909 2896 13231 -8131 -12068 -28635
903 -28635 -21416 -29261 -16186 5180 4338 30440 -8728 -13328 -9353 -10681 2282 2041 20641 3467
889 3467 -8537 -12234 15104 29971 -12488 -43346 -26551 -39532 2326 16144 17260 -443 -8379
876 -8379 -10654 -35702 -20388 10424 3300 -8410 6306 -7897 4490 -40 -4659 -3973 -33099
863 -33099 -25713 -35254 -35624 2738 10579 -5733 20627 31146 7487 -9515 -7950 13016 20993
850 20993 32174 10902 69287 32389 23773 1231 -2980 -10570 12371 21510 25813 2131 17124
837 17124 43731 65746 66722 25582 28120 33378 -22610 -4304 60621 32410 4176 9274 6222
824 6222 34887 6901 -29483 -14437 -17278 9339 5343 29033 14778 18344 -29156 -21623 -8820
811 -8820 -37799 18145 40894 7462 -7969 10255 947 -26270 -36553 -35150 -10569 1423 -13424
798 -13424 -12903 1464 -14206 -44892 -41891 -1352 -6109 -11368 -15826 -33610 -13331 43381 44959
785 44959 -6347 -46759 -13059 -23372 -29445 -19884 -7873 -6478 1950 21410 18475 9644 5206
772 5206 -6728 24814 24740 -6290 -11677 2324 39776 23993 6284 -29302 -24164 -8533 17043
759 17043 7940 -19665 -4285 -6410 45919 89186 47800 -34682 -37219 -1791 10280 -10812 -28821
746 -28821 17661 3047 -18490 -11480 -44391 -51273 -7688 44572 19723 -10950 -31167 644
734 644 -10343 -17325 7688 13708 16034 19172 23929 12350 11215 29800 23578 4752 7492 15482
720 15482 679 8380 -1652 -13331 -11142 -9928 23336 25012 67816 46223 20561 6708 29828
707 29828 -22466 -2928 -4082 6759 1735 23043 36903 9295 -7637 11623 32793 19869
695 19869 -34181 -18845 -11038 -13873 14325 7240 14336 2015 -9655 24826 21782 -3929 51222
682 51222 40095 12624 6794 10146 7090 37572 18015 39687 14898 30982 23847 3528 11552
669 11552 -17246 5532 7143 -5443 1832 4901 23043 26566 3870 -12098 6664 -25063 522
656 522 26104 8529 23551 23972 -3167 -2876 19535 48772 48100 27111 27848 36304 15157 -3853
642 -3853 -3859 -768 20530 32738 17502 -2726 1166 1321 49068 20234 2769 33802 43413 56327
628 56327 33243 -1397 -5144 3503 -31531 -23441 17174 21742 68182 45210 -18936 -16983 -18629
615 -18629 4696 33659 12091 -14483 -4508 -25507 -7938 42584 42801 22456 6525 45047 18598
602 18598 -10466 26005 52754 35133 11267 10347 35816 28583 22054 37804 37158 29121 19179 32034
588 32034 18791 41074 42230 35329 37575 44147 45813 31706 8856 19024 29904 7773 23677
575 23677 52018 70659 39832 3343 11661 17478 8118 7670 18988 29237 34211 2084 -42586
562 -42586 -23465 -14749 10657 17747 21303 32113 40381 37538 16229 27300 37637 81433 84355
549 84355 43287 67084 54606 69253 80717 54293 48377 39753 45717 62040 27146 9736 59695
536 59695 28080 7035 43384 14428 15556 18017 33804 13359 -16242 -12811 -21973 -3293 -21854
523 -21854 -23192 -16205 -15541 -34736 592 19413 25650 38330 36168 15006 25590 -7186 14578
510 14578 38774 6943 5307 12829 36109 48210 55797 41355 16936 36467 48306 35568 23199
497 23199 7484 22988 8364 38052 32285 66934 67573 71201 76280 32474 20714 32094 27119
484 27119 4726 -12218 14292 31473 6117 -4140 225 23772 20268 12838 13946 36012 2754
471 2754 -3288 18617 36766 18792 16865 21876 53190 61624 25328 18849 4406 56627 34078
458 34078 22851 32112 41628 37574 28225 35934 25960 46771 51702 38027 23248 19118 47413 50599
444 50599 22364 27284 19542 42031 45918 16681 8347 22707 31202 12325 15079 34735 5963
431 5963 43885 49618 38863 43096 21598 24797 21353 11455 27250 38422 59286 39043 6444
418 6444 -5497 -1194 25935 9813 14039 11727 29241 2861 -9010 25643 4557 -13832 36324
405 36324 49204 37447 46858 32360 48266 61590 56507 54759 39098 27951 30414 43900 32664
392 32664 39449 85687 85292 54449 48511 46874 46654 41387 37442 45939 27926 31376 24078 75148
378 75148 66531 21773 43385 53617 37755 39354 -91 26178 35781 12617 32688 35866 -1860
365 -1860 -8051 25337 66445 60145 -50 27502 13202 31818 37460 51131 63583 41974 67139
352 67139 32209 21693 71334 97164 92604 68314 55886 43921 15247 22354 61895 23223
340 23223 26896 -2573 60190 76354 65839 46184 25962 22016 50308 29395 24906 17876 2531
327 2531 21105 25350 28629 52603 39999 39809 44028 43475 66836 65716 70258 51913 16143 5090
313 5090 10819 65375 65787 55006 67590 46510 39390 41111 76633 73730 65505 36314 53672 52218
299 52218 67841 32909 14844 22425 46363 59299 31518 36227 40026 15902 45897 67281 82997
286 82997 73439 48119 30039 26144 33202 40258 49771 44554 49051 33055 41396 70852 46452 66261
272 66261 66400 36379 52854 51631 57795 48021 12495 65466 57055 41134 11831 43733 69691
259 69691 44190 65216 59611 49339 76843 53587 48241 46077 30591 11198 -11289 11763 27146
246 27146 13891 49659 65622 73791 58459 68846 68206 55152 51827 31768 52119 97919 116606
233 116606 98337 94414 92703 89282 97102 104858 63918 65261 52504 58572 32654 26231 53033
220 53033 72003 98190 79405 56845 35411 56743 72620 21535 14336 55674 35551 47138
208 47138 47497 23574 36032 17404 28981 22483 30919 18686 15498 -2841 28282 78628 77857
195 77857 65303 43525 7963 28526 33970 62035 69233 69453 68340 54229 50626 29725 37327
182 37327 48628 52667 39004 47514 62867 42827 47626 61122 67311 78521 85146 60502 75796
169 75796 72795 66196 59306 57787 56819 44910 57140 80901 79887 89860 75824 57655 79003 62223
155 62223 32610 50625 69808 47295 38681 56756 43064 63812 81362 79210 65943 51081
143 51081 45139 57881 53084 60084 62860 62681 45675 39265 50929 55894 53593 64622 85569 65815
129 65815 51862 51470 51552 62365 41291 37849 66839 59479 63590 51835 54560 42452 32421 19172
115 19172 37270 46501 45985 38389 78706 88227 90719 70697 93462 74862 29570 48691 49049 44043
101 44043 68594 39731 38373 36655 52158 62901 80693 73933 75637 40395 36099 74823 81536
88 81536 67702 43889 58599 50801 46160 61497 69939 65698 61728 79203 66267 48597 45713
75 45713 47184 57947 42079 73465 87742 96926 111331 95050 74742 96335 84481 66275 61484
62 61484 71436 61362 40527 76131 72762 78431 70434 75422 81370 55052 37952 52839 71550
49 71550 50478 47789 79825 73228 84614 83106 58331 55689 49871 51938 65543 72727 67826 52084
35 52084 31923 45335 42603 54723 59960 68217 83160 89302 72824 67060 53714 55898 81094
22 81094 87877 71256 66975 73779 98010 80254 75543 72822 62695 74291 62092 71846 74160 70955
8 70955 68769 63824 83237 59013 50127 68935 56419 28576
0 28576
$$ Imaginary data points
##PAGE= N=2
##DATA TABLE= (X++(I..I)), XYDATA
16383 -1654182 -1650294 -1622554 -1610360 -1605305 -1591626 -1553996 -1529106 -1531019 -1504046 -1446088 -1420080 -1432036
16371 -1432036 -1400215 -1349991 -1345164 -1332665 -1300632 -1263755 -1216823 -1207126 -1180848 -1173463 -1182751 -1144975
16359 -1144975 -1119236 -1100579 -1054971 -1032290 -1015691 -993754 -966011 -932276 -915227 -899787 -880271
16348 -880271 -851231 -854430 -840781 -799364 -766523 -784056 -743998 -704547 -670979 -666397 -648604 -615079
16336 -615079 -598891 -580034 -582140 -560248 -511606 -486171 -485169 -468695 -439685 -414154 -373694 -328673
16324 -328673 -341845 -319664 -297728 -284697 -247004 -209146 -194361 -200489 -211674 -203576 -158148 -124082
16312 -124082 -125850 -100616 -51691 -32193 -12461 16622 17495 -7609 47811 80166 71384 90687
16300 90687 138241 170813 214443 201578 197118 215200 238789 276454 289110 298195 305632 313441
16288 313441 344539 363219 358668 400170 413069 416323 435625 458033 508948 509054 520994 558485
16276 558485 557496 583560 613130 605684 622360 645008 657098 683559 670420 668220 709008 744943
16264 744943 746625 760764 771746 770059 796317 813564 822811 839928 879534 887220 903969 923650
16252 923650 935483 939005 929938 969596 969116 970725 1009340 1020529 1006116 1034218 1011827 1033146
16240 1033146 1043003 1067787 1086898 1048961 1069353 1120511 1141395 1146135 1186841 1201464 1197094 1176113
16228 1176113 1186389 1201635 1223064 1231515 1265707 1259596 1253731 1278309 1288221 1326919 1331502 1326468
16216 1326468 1330521 1326099 1381336 1389974 1384297 1376711 1371544 1408909 1400083 1432736 1447219 1440324 1444328
16203 1444328 1450315 1468589 1469311 1463613 1473942 1485846 1530706 1531248 1544633 1560890 1558183 1532715 1519856
16190 1519856 1541329 1578186 1579074 1623120 1642722 1652561 1648430 1629903 1628596 1631856 1640070 1644191 1643571
16177 1643571 1625566 1623153 1656986 1665949 1677469 1703750 1688965 1701882 1683390 1693115 1707348 1724077
16165 1724077 1712460 1744334 1784823 1792460 1762081 1765323 1761423 1740246 1758168 1784901 1782699 1763977
16153 1763977 1759208 1738389 1755950 1781970 1789576 1819230 1801876 1801769 1829485 1845165 1846902 1859197
16141 1859197 1829140 1807141 1830678 1866353 1842937 1850594 1845997 1838328 1870924 1851124 1869559 1838776
16129 1838776 1838418 1846947 1849160 1869801 1896832 1875350 1865262 1863580 1828851 1874147 1920003 1900948
16117 1900948 1909985 1890313 1883009 1879695 1889549 1904939 1949333 1933600 1949969 1933424 1912875 1897148
16105 1897148 1920990 1939365 1904249 1931325 1923638 1906968 1958620 1981435 1953793 1962382 1964913 1968005
16093 1968005 1961074 1948972 1957346 2000797 1991065 1956255 1956674 1974402 1957966 1957217 1954199 1980196 1986851
16080 1986851 1983919 1977467 1963925 1946077 1965749 2004869 1994023 1983781 1973504 1993191 2004775 2010632
16068 2010632 2004120 1987145 2010502 2025408 2022088 2003456 1991349 1987981 2018684 2023417 1986753 1978601
16056 1978601 2016654 2010222 2004806 1986750 1991222 1965261 1974772 1988528 2002194 2026748 2012669 1970440
16044 1970440 1971479 1998396 2004371 2023258 2024667 2011581 2031278 2041553 2031654 1996641 1996851 1986616
16032 1986616 1974411 1983978 1975173 2001887 1996688 2009979 1989882 1952232 1961651 1986834 1964799 1993325
16020 1993325 2012957 1972692 1960765 1973578 2000778 1991642 2004277 1990969 2003574 1998831 1996199 2037274
16008 2037274 2040799 2022491 2016568 2031568 1994845 1995460 1989510 1976892 1999080 1988944 2000946 2002336
15996 2002336 1972140 1972828 1958382 1992215 1999709 2014428 1997956 1975026 1984623 1995102 1972937 1991046
15984 1991046 2006771 2021610 2028228 2041884 2010619 2017525 2022717 2004251 2024530 2037978 2054564 2052224
15972 2052224 2034047 2014583 2032177 2049868 2019834 2009071 2020086 1993293 1998630 2004858 1999467 1993339
15960 1993339 1999180 2013898 2039579 2030819 1994521 1977184 1992136 2012778 2007877 2017920 2052745 2057445
15948 2057445 2026946 2043188 2050220 2024533 2036150 2043717 2010287 2015976 2025040 1987508 1990510 2025017
15936 2025017 2011758 2014889 2065258 2055214 2046333 2012527 2035561 2045988 2052272 2061074 2041414 2013956
15924 2013956 1991761 1992860 2004611 2021086 2045607 2075592 2076874 2047874 2052803 2053327 2039659 2042439
15912 2042439 2026236 2011444 2004823 2010744 2011569 2044714 2052033 2044631 2031752 2035292 2029874 2019258 2030085
15899 2030085 2021033 2013672 2036511 1985141 2011769 2053047 2026851 2009298 2021150 2055812 2073934 2073524
15887 2073524 2035488 2048866 2052568 2019145 2038673 2058921 2015427 2020055 2050098 2056246 2073477 2060530
15875 2060530 2024162 2051840 2049270 2055730 2051048 2047151 2062982 2067800 2064705 2060763 2018333 1995343 2026869
15862 2026869 2024886 2035865 2027195 2044030 2070059 2076042 2055005 2070641 2092844 2098442 2087701 2052432
15850 2052432 2058587 2056540 2032486 2043196 2041287 2063784 2059585 2049052 2035896 2055599 2021913 1998494
15838 1998494 2052976 2054032 2037087 2045462 2046685 2020789 2031653 2038729 2030322 2003847 2042127 2071971
15826 2071971 2068964 2015362 2034541 2064546 2056281 2049850 2034980 2027678 2060116 2053820 2032176 2051980
15814 2051980 2056484 2038426 2035993 2057041 2034984 2009957 2050199 2064128 2070824 2038347 2024697 2044624
15802 2044624 2023612 1999359 2031125 2033192 2041985 2062233 2059395 2070491 2065076 2050192 2043860 2006584
15790 2006584 2017864 2042887 2073187 2088259 2085272 2086386 2061091 2063379 2053707 2036497 2057347 2075728
15778 2075728 2057498 2062340 2069908 2055455 2020934 2032368 2051316 2032492 2034781 2037421 2037885 2061615
15766 2061615 2066197 2092198 2068718 2065023 2047356 2021873 2042995 2073497 2064290 2063393 2066801 2084423
15754 2084423 2100619 2070321 2054631 2057949 2060680 2063680 2062241 2080239 2112461 2099277 2054776 2049208
15742 2049208 2040959 2069010 2053929 2052358 2064886 2074862 2055637 2071050 2110405 2101010 2110779 2119766
15730 2119766 2088254 2021843 2037628 2070324 2068467 2057892 2050712 2054673 2059448 2070878 2058055 2073779
15718 2073779 2088012 2073730 2059977 2044773 2035358 2078719 2089327 2111116 2078176 2058910 2041865
15707 2041865 2056364 2083611 2088823 2084318 2086126 2083181 2070759 2070170 2067656 2069403 2063753 2094138 2093009
15694 2093009 2095365 2065214 2086496 2111491 2098610 2088273 2046939 2081001 2101618 2107438 2116547 2109221
15682 2109221 2099653 2106700 2083183 2030933 2062127 2091334 2104989 2086070 2102973 2098658 2078545 2088879
15670 2088879 2091102 2060778 2062371 2076783 2099982 2106280 2115645 2120720 2091241 2107460 2102146 2100461 2077106
15657 2077106 2078532 2082854 2077557 2105520 2047159 2044320 2048433 2083054 2091727 2083315 2072499 2091958 2117071
15644 2117071 2122333 2088444 2116366 2106101 2110046 2111026 2092579 2091529 2125105 2120340 2086364 2083994 2114994
15631 2114994 2122485 2088021 2078176 2076916 2089993 2105178 2095296 2064304 2059784 2086303 2095132 2098277 2072470
15618 2072470 2035676 2053829 2061312 2077267 2106738 2130058 2104240 2101403 2102386 2091749 2105679 2097953
15606 2097953 2106713 2126489 2117273 2130290 2122974 2117692 2097707 2112671 2123907 2116491 2114103 2099660
15594 2099660 2089193 2130189 2117136 2067311 2067333 2097740 2083725 2073684 2098065 2087148 2122215 2131623
15582 2131623 2093300 2093395 2082781 2100003 2073655 2087297 2112294 2105817 2115876 2101473 2103890 2086371
15570 2086371 2075278 2101763 2128493 2135417 2110746 2100924 2094689 2111193 2117810 2105088 2089436 2068732
15558 2068732 2091766 2102226 2094359 2100898 2105568 2128685 2136573 2118911 2149848 2156452 2139124 2141346
15546 2141346 2115297 2102328 2087292 2101134 2101143 2094807 2101818 2113288 2122980 2109265 2103146 2117565 2168137
15533 2168137 2148372 2123547 2122794 2159989 2171382 2160527 2179478 2132929 2115293 2125666 2150024 2134042
15521 2134042 2122961 2090240 2096772 2125186 2148382 2107470 2116841 2131604 2086808 2102342 2116391 2118608
15509 2118608 2105482 2126008 2093723 2102283 2112457 2115037 2104369 2107772 2140024 2181570 2189551 2144265
15497 2144265 2145941 2141575 2150929 2116543 2101546 2106451 2127296 2123183 2119415 2142061 2110602 2091422
15485 2091422 2126445 2155970 2172289 2126411 2127343 2134145 2116672 2138387 2157539 2146350 2148155 2160184
15473 2160184 2145984 2136296 2100597 2134543 2121639 2115662 2113021 2136371 2140152 2140470 2155022 2147812 2129225
15460 2129225 2147119 2155179 2122004 2109774 2143592 2154785 2145709 2182898 2198328 2175193 2137184 2156657
15448 2156657 2151816 2150520 2155027 2165725 2167158 2160879 2153065 2126451 2117733 2115640 2140256 2148428 2153076
15435 2153076 2158749 2158577 2138800 2141201 2152673 2159426 2160248 2156498 2155130 2144246 2112887 2134275 2109445
15422 2109445 2130456 2164411 2146348 2140441 2126276 2153249 2177276 2182814 2165049 2172192 2170469 2180745
15410 2180745 2148790 2097573 2119721 2122354 2160887 2167989 2173244 2140960 2163701 2162777 2137087 2158617
15398 2158617 2151059 2143960 2144952 2135326 2152600 2125365 2140732 2148978 2156079 2169528 2151459 2132779 2123148
15385 2123148 2135033 2161821 2161588 2164230 2211560 2187029 2185122 2140528 2123553 2138519 2168375 2135681
15373 2135681 2125582 2155758 2175741 2154510 2169041 2168729 2164714 2185752 2139222 2137692 2140208 2163043
15361 2163043 2184855 2185038 2189661 2177822 2184484 2174548 2167688 2152176 2154484 2188521 2208424 2186918 2182165
15348 2182165 2194215 2164638 2167630 2169885 2177859 2174495 2189830 2230220 2198769 2177878 2123284 2125652
15336 2125652 2145140 2194425 2189172 2167617 2163904 2156766 2149790 2151187 2159525 2161322 2180856 2183090 2169982
15323 2169982 2170498 2153240 2158341 2165968 2170998 2168047 2166127 2153907 2137445 2142129 2166868 2139826 2146242
15310 2146242 2161850 2159705 2141872 2122896 2152759 2170933 2176142 2171218 2174557 2201112 2195689 2189801
15298 2189801 2181490 2160985 2153120 2149983 2147320 2155562 2166266 2157016 2166003 2126563 2164556 2183251 2137707
15285 2137707 2145213 2196585 2184007 2184096 2215995 2219886 2178187 2139947 2146647 2188872 2197450 2184006 2190554
15272 2190554 2195045 2193740 2182798 2160833 2165006 2151138 2176576 2198457 2197102 2153118 2190663 2207178
15260 2207178 2182354 2196150 2170666 2163050 2168867 2135489 2126878 2150299 2195075 2198518 2200029 2194642
15248 2194642 2199633 2202393 2176245 2206332 2202122 2169115 2156856 2165486 2160545 2162217 2161759 2192485 2206507
15235 2206507 2184996 2156150 2140771 2154764 2171601 2140089 2176611 2211698 2197670 2200813 2200973 2230583
15223 2230583 2216383 2182342 2197930 2183077 2195759 2226473 2211698 2199135 2180004 2158056 2195129
15212 2195129 2230090 2219106 2207342 2209794 2213869 2198024 2181760 2142577 2161147 2162851 2191610 2188787
15200 2188787 2197509 2200276 2156796 2153041 2188102 2190503 2221786 2234613 2196999 2197804 2213187 2202848
15188 2202848 2170394 2195428 2204777 2198163 2202030 2183092 2186836 2222585 2228167 2205640 2197737 2188068 2199384
15175 2199384 2217271 2210953 2230280 2215276 2219250 2198987 2167483 2191956 2224939 2250135 2255699 2187082
15163 2187082 2199121 2237496 2225941 2221619 2216603 2216071 2217289 2207903 2212050 2210409 2211874 2210106 2233760
15150 2233760 2207358 2179348 2200603 2199208 2236544 2218907 2193618 2193021 2174723 2209830 2206410 2194609
15138 2194609 2190029 2156534 2205565 2231185 2238138 2223018 2208528 2212100 2165794 2172754 2197304 2212804
15126 2212804 2216997 2248197 2241783 2219779 2185031 2197914 2189654 2224603 2215283 2184787 2200556 2211779
15114 2211779 2223775 2226261 2230930 2221019 2269895 2261496 2257729 2225709 2212951 2227529 2218005 2229084
15102 2229084 2212453 2226337 2252793 2224465 2256008 2240452 2208460 2216633 2226974 2201770 2189954
15091 2189954 2210478 2229481 2234944 2227075 2227395 2250145 2219289 2222113 2234770 2215766 2234251 2231889
15079 2231889 2212842 2203153 2214984 2213100 2217259 2236216 2238489 2218839 2230964 2235096 2207636 2186097
15067 2186097 2202088 2226826 2245779 2244191 2231763 2187237 2223921 2222219 2230264 2254736 2252679 2231753
15055 2231753 2247782 2236964 2209421 2236284 2225009 2217573 2237308 2210380 2196673 2225671 2222099 2232785
15043 2232785 2231263 2222151 2177085 2174985 2202297 2249081 2232157 2262026 2253199 2239358 2225099 2228103
15031 2228103 2209852 2202768 2182652 2204226 2245085 2239191 2267870 2289816 2277676 2259827 2248861 2210627
15019 2210627 2201196 2240427 2264492 2281199 2293049 2301789 2277005 2270803 2260993 2248101 2256325 2248592
15007 2248592 2243067 2250480 2262002 2238975 2238002 2183596 2211756 2253526 2221814 2210505 2236955 2225587
14995 2225587 2207072 2218718 2242115 2252048 2253569 2226088 2226239 2241213 2255902 2259015 2252510 2236371
14983 2236371 2255990 2246248 2278055 2254934 2234563 2226385 2218994 2244545 2240726 2233331 2238744 2240090 2248217
14970 2248217 2253947 2215928 2234189 2291169 2280770 2274980 2283718 2275220 2265520 2253689 2254372 2242810 2256530
14957 2256530 2239003 2274032 2274667 2274552 2262854 2269675 2283817 2253189 2219371 2224568 2243999 2263854
14945 2263854 2276496 2271584 2233905 2246536 2272399 2257350 2260986 2282536 2284903 2289878 2269165 2261460
14933 2261460 2272369 2233445 2241348 2245253 2239610 2269438 2266503 2227596 2245532 2252230 2239369 2253702
14921 2253702 2228212 2245041 2242997 2250727 2257674 2271815 2269890 2298209 2269331 2240373 2268697 2225294
14909 2225294 2245119 2272768 2283756 2286501 2263363 2290520 2300064 2274674 2271463 2265368 2284076 2272302
14897 2272302 2256850 2274864 2279983 2268658 2279850 2281431 2263711 2269986 2274639 2258770 2285373 2304593
14885 2304593 2292589 2277098 2271791 2272480 2264608 2261178 2281340 2267217 2289394 2301844 2311489 2306124 2298398
14872 2298398 2271497 2269088 2270098 2270224 2292288 2284858 2302194 2303597 2288070 2292954 2289739 2300173 2308056
14859 2308056 2284385 2295457 2300132 2308019 2347246 2329513 2351209 2337649 2320829 2306010 2281466 2298854
14847 2298854 2300404 2253425 2239213 2257437 2266791 2257560 2260300 2271727 2317501 2306802 2289093 2273728
14835 2273728 2282706 2263668 2213663 2246786 2283637 2296232 2289096 2292918 2267287 2292052 2293589 2290093
14823 2290093 2306306 2312710 2295968 2307986 2312480 2301943 2291870 2276359 2314003 2315095 2286441 2305067
14811 2305067 2309720 2286234 2292944 2324585 2301034 2311644 2305973 2292468 2297377 2288165 2285409 2311501
14799 2311501 2300459 2312450 2295136 2271036 2260181 2286044 2303376 2295996 2313527 2300758 2279223
14788 2279223 2298486 2304366 2297363 2299469 2281113 2297823 2311527 2300881 2292168 2259272 2279732 2284371
14776 2284371 2285711 2296003 2307878 2309948 2301913 2327606 2316396 2310118 2293026 2265431 2302866 2333441
14764 2333441 2324249 2338395 2320492 2296208 2272453 2295120 2294077 2310208 2340787 2309529 2303106 2301033
14752 2301033 2326709 2302574 2273842 2275365 2256298 2303736 2308415 2284711 2313448 2328153 2333469 2340268
14740 2340268 2338785 2312118 2321647 2330540 2321284 2326764 2341281 2369821 2358158 2357215 2347288 2322223 2318906
14727 2318906 2309902 2318338 2326829 2312208 2279765 2281693 2314999 2344047 2326406 2322757 2317332 2330903
14715 2330903 2328310 2294634 2295145 2290759 2279807 2295593 2283895 2286247 2285012 2303871 2340924 2330119
14703 2330119 2366447 2357722 2319711 2300630 2297321 2311215 2323216 2328785 2302512 2282741 2292228 2320446
14691 2320446 2324160 2299464 2346156 2349012 2342495 2331264 2313963 2305402 2332359 2318678 2324500 2338506
14679 2338506 2323132 2312962 2300549 2349661 2348643 2314786 2308141 2336058 2336277 2305522 2348736 2375031
14667 2375031 2345422 2285079 2313510 2336437 2339343 2335751 2331337 2350227 2365689 2358235 2369323 2365465
14655 2365465 2358208 2344716 2340134 2338610 2313770 2336699 2345082 2336319 2328904 2316407 2321222 2331590 2334636
14642 2334636 2325729 2346423 2366525 2380498 2354585 2344794 2332674 2320549 2354047 2302519 2320726 2358504
14630 2358504 2350618 2349076 2314406 2339431 2375233 2383928 2356789 2319023 2322458 2338213 2363858 2364231
14618 2364231 2354442 2326484 2318874 2339112 2333555 2342614 2386121 2382855 2369797 2375434 2363163 2366109 2379718
14605 2379718 2370581 2346821 2329259 2342934 2350740 2370777 2385260 2369186 2361782 2366923 2370565 2388551
14593 2388551 2388115 2377728 2374010 2370123 2364812 2391361 2409620 2404271 2374806 2355219 2372130 2360305
14581 2360305 2328060 2338538 2359121 2370117 2375187 2375228 2380641 2392508 2369904 2365749 2372383 2359192 2348192
14568 2348192 2374247 2387483 2380625 2369444 2372827 2361170 2365692 2378952 2385147 2361361 2382701 2357791
14556 2357791 2338441 2324106 2355907 2350677 2386406 2412623 2357347 2337770 2352338 2377676 2373890 2381570
14544 2381570 2398002 2412930 2401312 2371432 2374401 2393717 2374939 2366251 2374429 2343211 2332788 2326126
14532 2326126 2343804 2359929 2348817 2370853 2358440 2357908 2340133 2334825 2337317 2349687 2355489 2358698
14520 2358698 2351231 2358664 2341732 2340697 2367234 2388886 2387757 2388895 2356402 2317887 2332383 2358782
14508 2358782 2334665 2360057 2413276 2407022 2366182 2351424 2356383 2379489 2403803 2406908 2398783 2372536
14496 2372536 2381297 2392445 2400553 2401094 2385036 2408231 2382746 2391330 2412911 2383649 2351963 2379863
14484 2379863 2393373 2394802 2394110 2390387 2377566 2360947 2366378 2352125 2356150 2369635 2390856 2376692
14472 2376692 2356760 2353889 2333700 2379115 2396653 2410107 2392026 2419842 2409753 2384448 2389740 2410886
14460 2410886 2378913 2360492 2382398 2386572 2373604 2352534 2358108 2422787 2417331 2407438 2450582 2428012
14448 2428012 2405511 2399683 2415403 2395771 2382633 2409807 2410363 2403410 2422792 2386844 2355163 2401845
14436 2401845 2409137 2400309 2414188 2415028 2401623 2396013 2433925 2426998 2413930 2409353 2421631 2410386 2422067
14423 2422067 2439550 2427758 2406464 2403245 2399404 2386610 2377093 2391911 2374299 2399819 2444806 2465154
14411 2465154 2429528 2435627 2437989 2429364 2406855 2423509 2437660 2412546 2403586 2392936 2434661 2417116
14399 2417116 2409332 2464182 2423585 2424622 2442081 2430453 2445737 2448460 2441611 2417745 2413198 2394232
14387 2394232 2421796 2439605 2418605 2411140 2403644 2404682 2414202 2453915 2458259 2460934 2420537 2446459
14375 2446459 2428845 2420249 2430632 2442633 2416193 2402827 2418165 2411221 2421473 2405325 2400833 2418609
14363 2418609 2437944 2441943 2449200 2447722 2447138 2432517 2438160 2429062 2421500 2428992 2437421 2417076 2429018
14350 2429018 2431545 2437787 2437331 2415473 2427745 2436635 2462157 2438072 2405742 2416700 2412950 2407748 2437075
14337 2437075 2447775 2408993 2395058 2437722 2460979 2444256 2433201 2438130 2464586 2454432 2466499
14326 2466499 2449908 2463508 2461971 2469048 2439639 2390736 2388205 2416370 2438494 2482818 2491974 2457092
14314 2457092 2465598 2498734 2466321 2451247 2459272 2442917 2466408 2460854 2473543 2469820 2473502 2449907
14302 2449907 2446318 2453471 2467832 2452957 2443053 2445047 2433980 2430457 2428031 2441437 2465116 2450286
14290 2450286 2445562 2468931 2444888 2446790 2438149 2420160 2395168 2401854 2445196 2464378 2453797 2425033
14278 2425033 2414626 2417962 2447977 2457453 2446309 2432790 2431134 2470116 2454452 2462584 2432764 2443364
14266 2443364 2447957 2471834 2446186 2418221 2432689 2476142 2444399 2442745 2518275 2499690 2498052 2494289
14254 2494289 2462869 2430054 2426850 2464124 2455212 2438707 2461851 2473646 2483512 2503712 2487505 2453961
14242 2453961 2460167 2496312 2475733 2447152 2463212 2462572 2447108 2460080 2479635 2466280 2492149 2454186
14230 2454186 2443119 2463176 2459320 2485251 2463800 2460445 2458746 2461904 2449143 2401763 2431849 2435840
14218 2435840 2437683 2457295 2476856 2453194 2446398 2441299 2423654 2442225 2462503 2458125 2437563 2461013
14206 2461013 2463733 2451307 2471762 2461049 2485946 2460516 2443866 2463835 2469645 2476907 2486396 2454527
14194 2454527 2444379 2474804 2473095 2465627 2485288 2488182 2493675 2478856 2462465 2479150 2449752 2470509
14182 2470509 2508152 2481628 2447477 2458413 2485909 2445573 2473113 2485821 2473568 2460649 2470813
14171 2470813 2491829 2498929 2522441 2507161 2476520 2480675 2482705 2477761 2466823 2487822 2477835 2478910
14159 2478910 2466411 2454902 2476395 2469709 2472195 2482050 2484792 2493916 2499213 2479805 2478355 2508076 2522899
14146 2522899 2514966 2491769 2466116 2500552 2494182 2475960 2507679 2495550 2486242 2485527 2499978 2513341
14134 2513341 2491874 2505916 2530477 2535311 2499945 2512374 2512695 2481955 2476976 2496789 2505188 2472525
14122 2472525 2468698 2475261 2463865 2466673 2449492 2477357 2502928 2493222 2500586 2483837 2494694 2535662
14110 2535662 2494729 2491756 2463181 2472831 2482939 2490329 2482317 2477846 2505340 2505711 2488381 2523316 2483062
14097 2483062 2482557 2497504 2492933 2498594 2505196 2505243 2501546 2507348 2505038 2520168 2545917 2548704 2547930 2528699
14083 2528699 2490512 2472363 2484072 2522138 2500780 2511289 2531611 2568008 2550014 2572000 2578650
14072 2578650 2557377 2534108 2504719 2494420 2525938 2543376 2573111 2559467 2529121 2510707 2514060
14061 2514060 2536225 2558229 2544924 2480945 2528938 2534890 2522205 2527745 2484876 2442798 2473183 2514091
14049 2514091 2505136 2499231 2477555 2496853 2543551 2547362 2561496 2533873 2538198 2542995 2515472 2509792
14037 2509792 2526440 2536662 2542309 2565461 2556277 2551586 2523519 2506667 2508014 2534001 2565281 2560717
14025 2560717 2551030 2565418 2572590 2520041 2529486 2555664 2566618 2571467 2547941 2539927 2529916 2541399
14013 2541399 2543683 2552631 2543845 2565261 2534154 2504315 2533546 2533164 2532902 2564973 2549659 2564473 2572479
14000 2572479 2564844 2581905 2555742 2562473 2573315 2585787 2574050 2557812 2569005 2578315 2539218 2524092
13988 2524092 2526429 2534723 2567539 2517477 2523670 2503473 2492101 2489695 2509410 2524608 2529189 2527377
13976 2527377 2522213 2546538 2521322 2500050 2541132 2535168 2525969 2545589 2533902 2522095 2529666 2545220
13964 2545220 2535516 2506849 2538749 2511800 2504883 2548974 2545841 2556770 2579679 2570667 2555736 2543404
13952 2543404 2524071 2563959 2554491 2548283 2516665 2537987 2566853 2544355 2516996 2542485 2578302 2574627
13940 2574627 2560975 2561860 2556335 2546778 2551211 2559307 2566974 2548127 2516576 2520967 2533413 2571834 2565697
13927 2565697 2590429 2585485 2577773 2558835 2601080 2595147 2581979 2562284 2568692 2565447 2561041 2570708 2566607
13914 2566607 2544456 2543487 2563004 2563298 2575287 2563113 2533361 2525337 2546768 2570941 2547835 2510087
13902 2510087 2550817 2539723 2532166 2534973 2555193 2554344 2536417 2557080 2568774 2572507 2578159 2582329 2642965
13889 2642965 2610005 2604228 2580648 2605695 2615368 2601645 2580886 2568751 2543725 2550799 2551009 2549756
13877 2549756 2582469 2598239 2571600 2509586 2530283 2555270 2537778 2571829 2602482 2569475 2573399
13866 2573399 2546643 2539907 2568469 2570161 2580706 2584652 2597634 2573058 2567613 2536229 2543169 2552089
13854 2552089 2595897 2584820 2570975 2567445 2575955 2610412 2594743 2565838 2560090 2579403 2566256 2571827
13842 2571827 2566758 2591274 2613015 2585012 2569216 2626542 2606840 2613553 2590230 2580972 2556576 2535954
13830 2535954 2548393 2559606 2548107 2578487 2580709 2568169 2603072 2628739 2619028 2628138 2597367 2613573
13818 2613573 2624195 2603913 2609039 2608479 2593059 2578541 2579810 2564931 2572377 2573871 2595998 2605409 2602718
13805 2602718 2598755 2574306 2574431 2579736 2563110 2578510 2607219 2605708 2610389 2612517 2606999 2610660 2604161
13792 2604161 2630953 2630891 2590765 2585543 2587451 2601454 2625105 2622989 2607457 2563960 2581849 2631800
13780 2631800 2634448 2620895 2591560 2581746 2596738 2566176 2614067 2591071 2582784 2578149 2584535 2597344
13768 2597344 2615077 2615442 2598250 2609572 2614433 2642750 2659254 2614957 2640707 2650441 2645014 2612376
13756 2612376 2570293 2634174 2630198 2603008 2593768 2605413 2596191 2617412 2623857 2607883 2606367 2615560
13744 2615560 2579674 2578434 2611025 2609905 2573692 2561162 2594059 2617893 2628893 2637889 2606592 2593832
13732 2593832 2604710 2621267 2623809 2621427 2621118 2637532 2625989 2608973 2587591 2586451 2612029 2633749
13720 2633749 2629695 2624455 2617578 2628756 2626028 2654735 2664008 2645403 2658115 2679593 2639019 2617987
13708 2617987 2644760 2654382 2667379 2633321 2631149 2607240 2600259 2625409 2619397 2607382 2641580 2649556
13696 2649556 2653449 2625838 2633850 2626659 2615096 2616206 2608138 2613151 2609641 2604005 2619397 2645161 2653531
$$ [...]
##END NTUPLES=NMR SPECTRUM
##END=
