##TITLE=1H_CA-9399-0
 200.13MHz,CDCl3,
 8 sc
 
 25.11.2025
##JCAMPDX= 6.0         $$ Bruker NMR JCAMP-DX V2.0
##DATA TYPE= NMR SPECTRUM
##DATA CLASS= NTUPLES
##ORIGIN= UXNMR, Bruker Analytische Messtechnik GmbH
##OWNER= pz
$$ XWIN-NMR		Version 3.5
$$ Tue Nov 25 15:37:21 2025 Russian Standard Time (UT+4h)  she@DPX200
##.OBSERVE FREQUENCY= 200.1313
##.OBSERVE NUCLEUS= ^1H
##.ACQUISITION MODE= SIMULTANEOUS
##.ACQUISITION SCHEME= undefined
##.AVERAGES= 8
##.DIGITISER RES= 18
##SPECTROMETER/DATA SYSTEM= spect
##.PULSE SEQUENCE= zg30
##.SOLVENT NAME= CDCl3
##.SHIFT REFERENCE= (INTERNAL, CDCl3, 0, 15.4869)
##AUDIT TRAIL= $$ (NUMBER, WHEN, WHO, WHERE, WHAT)
$$ ##TITLE= Audit trail, XWIN-NMR		Version 3.5
$$ ##JCAMPDX= 5.01
$$ ##ORIGIN= Bruker BioSpin GmbH
$$ ##OWNER= she
$$ F:/spectra/data/she/nmr/H-C/1/pdata/1/auditp.txt
$$ ##AUDIT TRAIL=  $$ (NUMBER, WHEN, WHO, WHERE, WHAT)
(   1,<2025-11-25 15:34:26.21 +0400>,<she>,<DPX200>,
      <created by zg, POWCHK disabled, PULCHK disabled
       configuration hash MD5:
       00 E9 B6 7A A2 85 ED C7 34 08 36 98 17 FE 4E 26
       data hash MD5: 16K
       72 3D FD 8C D5 83 A3 DA 91 74 87 EE CD 3C F9 24>)
(   2,<2025-11-25 15:35:53.51 +0400>,<she>,<DPX200>,
      <Start of raw data processing
       efp BC_mod = 2 LB = 0.25 FT_mod = 6 PKNL = 1 PHC0 = -3140.239 PHC1 = 4.792339 SI = 16K 
       data hash MD5: 16K
       4E 54 87 90 54 21 46 C9 E9 0F C4 29 62 1A 34 7C>)
(   3,<2025-11-25 15:36:43.21 +0400>,<she>,<DPX200>,
      <pk PHC0 = -111.0748 PHC1 = -2.2 
       data hash MD5: 16K
       CE 77 C5 4A 99 B6 CE 99 61 38 7A 4F 8D 35 C4 D7>)
(   4,<2025-11-25 15:36:49.18 +0400>,<she>,<DPX200>,
      <abs ABSG = 5 
       data hash MD5: 16K
       63 A7 FE 70 6C AA F2 A1 09 C8 12 C1 5F CE E2 9F>)
$$ ##END=
$$ 
$$ hash MD5
$$ EF D0 99 98 16 F9 C4 92 58 55 2E EB 3A 89 2A 8A
##$RELAX= 
##$RELAX= 
##$RELAX= 
##$RELAX= 
##$RELAX= 
##$RELAX= 
$$ Bruker specific parameters
$$ --------------------------
##$DU= <F:/spectra>
##$EXPNO= 1
##$NAME= <H-C>
##$PROCNO= 1
##$TYPE= <nmr>
##$USER= <she>
##$AMP= (0..31)
100 100 100 100 100 100 100 100 100 100 100 100 100 100 100 100 100 100 
100 100 100 100 100 100 100 100 100 100 100 100 100 100 
##$AQSEQ= 0
##$AQ_mod= 1
##$AUNM= <au_zg>
##$AUTOPOS= <>
##$BF1= 200.13
##$BF2= 200.13
##$BF3= 200.13
##$BF4= 200.13
##$BF5= 200.13
##$BF6= 200.13
##$BF7= 200.13
##$BF8= 200.13
##$BYTORDA= 1
##$CFDGTYP= 0
##$CFRGTYP= 5
##$CHEMSTR= <none>
##$CNST= (0..31)
1 1 145 1 1 1 1 1 1 1 1 1 1 1 1 1 1 1 1 1 1 1 1 1 1 1 1 1 1 1 1 1 
##$CPDPRG= <>
##$CPDPRG1= <>
##$CPDPRG2= <>
##$CPDPRG3= <>
##$CPDPRG4= <mlev>
##$CPDPRG5= <mlev>
##$CPDPRG6= <mlev>
##$CPDPRG7= <mlev>
##$CPDPRG8= <mlev>
##$CPDPRGB= <>
##$CPDPRGT= <>
##$D= (0..31)
0 0.7 0 0 0 0 0 0 0 0 0 0.03 0 0 0 0 0 0 0 0 0 0 0 0 0 0 0 0 0 0 0 0 
##$DATE= 1764070465
##$DBL= (0..7)
120 120 120 120 120 120 120 120 
##$DBP= (0..7)
150 150 150 150 150 150 150 150 
##$DBP07= 0
##$DBPNAM0= <>
##$DBPNAM1= <>
##$DBPNAM2= <>
##$DBPNAM3= <>
##$DBPNAM4= <>
$$ [...]
##$SUBNAM3= <"">
##$SUBNAM4= <"">
##$SUBNAM5= <"">
##$SUBNAM6= <"">
##$SUBNAM7= <"">
##$SUBNAM8= <"">
##$SUBNAM9= <"">
##$SW= 18.0517328524113
##$SWIBOX= (0..15)
0 0 2 0 0 0 0 0 0 0 0 0 0 0 0 0 
##$SW_h= 3612.71676300578
##$TD= 16384
##$TD0= 1
##$TE= 0
##$TE2= 300
##$TE3= 300
##$TEG= 300
##$TL= (0..7)
0 120 120 120 120 120 120 120 
##$TP= (0..7)
150 150 150 150 150 150 150 150 
##$TP07= 0
##$TPNAME0= <>
##$TPNAME1= <>
##$TPNAME2= <>
##$TPNAME3= <>
##$TPNAME4= <>
##$TPNAME5= <>
##$TPNAME6= <>
##$TPNAME7= <>
##$TPOAL= (0..7)
0.5 0.5 0.5 0.5 0.5 0.5 0.5 0.5 
##$TPOFFS= (0..7)
0 0 0 0 0 0 0 0 
##$TUNHIN= 0
##$TUNHOUT= 0
##$TUNXOUT= 0
##$USERA1= <user>
##$USERA2= <user>
##$USERA3= <user>
##$USERA4= <user>
##$USERA5= <user>
##$V9= 5
##$VALIST= <valist>
##$VCLIST= <CCCCCCCCCCCCCCC>
##$VD= 0
##$VDLIST= <DDDDDDDDDDDDDDD>
##$VPLIST= <PPPPPPPPPPPPPPP>
##$VTLIST= <TTTTTTTTTTTTTTT>
##$WBST= 1024
##$WBSW= 4
##$XGAIN= (0..3)
0 0 0 0 
##$XL= 0
##$YL= 0
##$YMAX_a= 291374
##$YMIN_a= -473705
##$ZGOPTNS= <>
##$ZL1= 120
##$ZL2= 120
##$ZL3= 120
##$ZL4= 120
##$ABSF1= 15.48687
##$ABSF2= -2.56498
##$ABSG= 5
##$ABSL= 3
##$ALPHA= 0
##$AQORDER= 0
##$ASSFAC= 0
##$ASSFACI= 0
##$ASSFACX= 0
##$ASSWID= 0
##$AUNMP= <proc_1d>
##$AZFE= 0.1
##$AZFW= 0.1
##$BCFW= 0
##$BC_mod= 2
##$BYTORDP= 0
##$COROFFS= 0
##$CY= -3
##$DATMOD= 1
##$DC= 0
##$DFILT= <>
##$DTYPP= 0
##$F1P= 0
##$F2P= 0
##$FCOR= 1
##$FTSIZE= 16384
##$FT_mod= 6
##$GAMMA= 0
##$GB= 0
##$INTBC= 1
##$INTSCL= 3.241238e-09
##$ISEN= 128
##$LB= 0.25
##$LEV0= 0
##$LPBIN= 0
##$MAXI= 10000
##$MC2= 0
##$MEAN= 0
##$ME_mod= 0
##$MI= 1.114404
##$NCOEF= 0
##$NC_proc= -7
##$NLEV= 6
##$NOISF1= 3.799351
##$NOISF2= 2.8
##$NSP= 0
##$NTH_PI= 0
##$NZP= 0
##$OFFSET= 15.48687
##$PC= 1
##$PHC0= -3251.314
##$PHC1= 2.592339
##$PH_mod= 1
##$PKNL= yes
##$PPARMOD= 0
##$PSCAL= 0
##$PSIGN= 0
##$REVERSE= no
##$SF= 200.13000697205
##$SI= 16384
##$SIGF1= 3
##$SIGF2= 2
##$SINO= 0.751879
##$SIOLD= 32768
##$SREGLST= <19F.Aceton>
##$SSB= 0
##$STSI= 16384
##$STSR= 0
##$SW_p= 3612.71676300578
##$SYMM= 0
##$S_DEV= 0
##$TDeff= 16384
##$TDoff= 0
##$TI= <>
##$TILT= no
##$TM1= 0
##$TM2= 0
##$TOPLEV= 0
##$USERP1= <user>
##$USERP2= <user>
##$USERP3= <user>
##$USERP4= <user>
##$USERP5= <user>
##$WDW= 1
##$XDIM= 16384
##$YMAX_p= 413369246
##$YMIN_p= -297207
$$ End of Bruker specific parameters
$$ ---------------------------------
##NTUPLES= NMR SPECTRUM
##VAR_NAME=  FREQUENCY,     SPECTRUM/REAL,   SPECTRUM/IMAG
##SYMBOL=    X,             R,               I
##VAR_TYPE=  INDEPENDENT,   DEPENDENT,       DEPENDENT
##VAR_FORM=  AFFN,          ASDF,            ASDF
##VAR_DIM=   16384,         16384,           16384
##UNITS=     HZ,            ARBITRARY UNITS, ARBITRARY UNITS
##FACTOR=    0.220516191357247, 1,           1
##FIRST=     3099.38736345314, 0,            0
##LAST=      -513.329399552644, 0,           0
##MIN=       -513.329399552644, -297207,     0
##MAX=       3099.38736345314, 413369246,    0
$$ Real data points
##PAGE= N=1
##DATA TABLE= (X++(R..R)), XYDATA
$$ [...]
$$ plain form
5758 19992901 19661225 19442988 19204383 18976901 18797943 18641019 18544503 18413254 18284676 18198685
5748 18198685 18108461 17995469 17941063 17900761 17827295 17757064 17750864 17787267 17782444 17804615 17859406
5737 17859406 17960308 18082453 18193707 18322795 18359004 18321552 18291648 18117954 17835203 17535196
5727 17535196 17129239 16712608 16237266 15755858 15264781 14820736 14398668 14004872 13646605
5718 13646605 13256346 12840410 12505143 12219034 11892514 11617422 11382780 11144699 10907528
5709 10907528 10736965 10568257 10388907 10280289 10152777 10042744 9967607 9841443 9759911 9696950
5699 9696950 9598356 9525087 9510915 9420512 9299786 9172886 9076496 8963892 8872165 8837186 8770907
5688 8770907 8707426 8664517 8575638 8466394 8316507 8200515 8112318 8042400 7915635 7861120 7830093
$$ packed form
5758A9992901l31676k18237k38605k27482j78958j56924r6516j31249j28578q5991
5748A8198685r0224j12992n4406m0302p3466p0231o200L6403m823K2171N4791
5737A7859406J00902J22145J11254J29088L6209l7452k9904j73694k82751l00007
5727A7535196m05957m16631m75342m81408m91077m44045m22068l93796l58267
5718A3646605l90259m15936l35267k86109l26520k75092k34642k38081k37171
5709A0907528j70563j68708j79350j08618j27512j10033p5137j26164q1532o2961
5699I696950r8594p3269j4172r0403j20726j26900r6390j12604r1727l4979o6279
5688H770907o3481m2909q8879j09244j49887j15992q8197o9918j26765n4515l1027
$$ plain form
5677 7830093 7796546 7774923 7750257 7716936 7725538 7729508 7733227 7737445 7796502 7852249 7898321 7954407
5665 7954407 7995903 8062139 8144053 8221478 8284183 8357940 8458806 8580332 8706024 8863973 8982998
5654 8982998 9112183 9234705 9356635 9458349 9561407 9654711 9762490 9880238 9944210 10031136
5644 10031136 10205018 10366698 10509394 10688051 10846510 11044187 11278950 11558202 11845200
5635 11845200 12139892 12456105 12789678 13157290 13555103 13928999 14292143 14674564 15009345
5626 15009345 15338098 15571623 15759868 15845349 15884480 15874146 15835243 15780470 15672893 15536174
5616 15536174 15396564 15280796 15173071 15086438 15048597 15037736 15060886 15117850 15169603 15260334 15378405
5605 15378405 15575998 15771682 16031470 16335670 16645815 16977689 17353318 17783219 18268472
$$ packed form
5677G830093l3547k1623k4666l3321Q602L970L719M218N9057N5747M6072N6086
5665G954407M1496O6236Q1914P7425O2705P3757J00866J21526J25692J57949J19025
5654H982998J29185J22522J21930J01714J03058R3304J07779J17748O3972Q6926
5644A0031136J73882J61680J42696J78657J58459J97677K34763K79252K86998
5635A1845200K94692L16213L33573L67612L97813L73896L63144L82421L34781
5626A5009345L28753K33525J88245Q5481L9131j0334l8903n4773j07577j36719
5616A5536174j39610j15768j07725q6633l7841j0861K3150N6964N1753R0731J18071
5605A5378405J97593J95684K59788L04200L10145L31874L75629M29901M85253
$$ plain form
5596 18268472 18788317 19331573 19950920 20657619 21432657 22295504 23277135 24319835 25483680
5587 25483680 26762994 28201994 29790139 31522882 33387052 35459917 37713776 40164520
5579 40164520 42848768 45798849 49039004 52546484 56262031 60202435 64352523 68588976
5571 68588976 72838040 76953730 80750835 84134805 86848015 88802348 89888576 90095087
5563 90095087 89530400 88216264 86286554 83835692 81067029 78114737 75098352 72062221
5555 72062221 69061698 66198978 63472290 60888674 58464797 56162942 53959637 51897334
5547 51897334 49905610 47991147 46118875 44265889 42459197 40699488 38994867 37330875
5539 37330875 35746032 34284020 32805710 31428106 30115001 28892228 27723514 26596029
$$ packed form
5596A8268472N19845N43256O19347P06699P75038Q62847R81631J042700J163845
5587B5483680J279314J439000J588145J732743J864170K072865K253859K450744
5579D0164520K684248K950081L240155L507480L715547L940404M150088M236453
5571F8588976M249064M115690L797105L383970K713210J954333J086228K06511
5563I0095087n64687j314136j929710k450862k768663k952292l016385l036131
5555G2062221l000523k862720k726688k583616k423877k301855k203305k062303
5547E1897334j991724j914463j872272j852986j806692j759709j704621j663992
5539C7330875j584843j462012j478310j377604j313105j222773j168714j127485
$$ plain form
5531 26596029 25596522 24662700 23788568 22974537 22233199 21531645 20889977 20262830 19697578
5522 19697578 19185391 18677905 18235018 17798199 17363640 16935531 16520812 16169035 15840333
5513 15840333 15472736 15137818 14862885 14582051 14320394 14092427 13883183 13646397 13409641
5504 13409641 13153367 12953217 12754777 12574067 12439129 12294692 12136271 12031221 11895619
5495 11895619 11758178 11629226 11505433 11409664 11354740 11243506 11142097 11013555 10884457 10717754
5485 10717754 10508856 10291590 10091731 9866161 9666213 9425856 9178681 8966563 8732406
5476 8732406 8543148 8375861 8190688 8050256 7923795 7774628 7624504 7489083 7387476 7217569
5466 7217569 7073326 6938664 6809450 6720622 6595048 6514740 6434798 6338519 6222721 6125234
$$ packed form
5531B6596029r99507r33822q74132q14031p41338p01554o41668o27147n65252
5522A9697578n12187n07486m42887m36819m34559m28109m14719l51777l28702
5513A5840333l67597l34918k74933k80834k61657k27967k09244k36786k36756
5504A3409641k56274k00150j98440j80710j34938j44437j58421j05050j35602
5495A1895619j37441j28952j23793r5769n4924j11234j01409j28542j29098j66703
5485A0717754k08898k17266j99859k25570j99948k40357k47175k12118k34157
5476H732406j89258j67287j85173j40432j26461j49167j50124j35421j01607j69907
5466G217569j44243j34662j29214q8828j25574q0308p9942r6279j15798r7487
$$ plain form
5456 6125234 6065535 6032592 6009111 5957311 5923377 5919279 5913894 5862300 5851679 5803540 5779572 5775113
5444 5775113 5747362 5729414 5676964 5668998 5646185 5646097 5656682 5650556 5667465 5687800 5724196 5723543 5757889
5431 5757889 5779729 5815131 5823014 5866409 5882260 5937998 5965973 6039948 6126865 6169876 6201379 6231143
5419 6231143 6257643 6302475 6329233 6309502 6285979 6280672 6274007 6265344 6256189 6195491 6109017 6027493
5407 6027493 5952220 5896793 5783496 5675758 5652812 5620497 5543193 5467159 5437915 5355814 5273362
5396 5273362 5215945 5167861 5083506 5006387 4986567 4972829 4936462 4926281 4911441 4883191 4886777 4886505
5384 4886505 4878227 4885328 4853268 4817426 4797570 4809177 4789723 4755392 4763885 4766315 4784042 4803466
5372 4803466 4852322 4883000 4867607 4886240 4942066 4963926 4979421 4993240 5036397 5070799 5069982 5094830
$$ packed form
5456F125234n9699l2943k3481n1800l3934m098n385n1594j0621m8139k3968m459
5444E775113k7751j7948n2450p966k2813q8J0585o126J6909K0335L6396o53L4346
5431E757889K1840L5402P883M3395J5851N5738K7975P3975Q6917M3011L1503K9764
5419F231143K6500M4832K6758j9731k3523n307o665q663r155o0698q6474q1524
5407F027493p5273n5427j13297j07738k2946l2315p7304p6034k9244q2101q2452
5396E273362n7417m8084q4355p7119j9820j3738l6367j0181j4840k8250L586k72
5384D886505q278P101l2060l5842j9856J1607j9454l4331Q493K430J7727J9424
5372D803466M8856L0678j5393J8633N5826K1860J5495J3819M3157L4402q17K4848
$$ plain form
5360 5094830 5104482 5111632 5104455 5150468 5175598 5222953 5214556 5216123 5233250 5230360 5220510 5230961 5197358
5347 5197358 5187454 5233064 5233269 5224241 5234953 5226367 5232855 5249037 5270676 5262623 5246066 5274055 5317995
5334 5317995 5367146 5410562 5464593 5502499 5611545 5654445 5699833 5725402 5786668 5868623 5966645
5323 5966645 5989389 6027889 6103326 6184105 6241216 6271165 6309061 6369476 6462740 6516978 6576537
5312 6576537 6652491 6752436 6851663 6945921 7022650 7140282 7312927 7505192 7693899 7929194
5302 7929194 8145516 8455672 8818113 9205569 9591075 10047497 10578752 11178699 11937914 12757679
5292 12757679 13626020 14590643 15691820 16856797 18021771 19150967 20156063 21042380 21725667
5283 21725667 22243436 22604685 22813546 22907330 22885063 22829437 22752912 22612262 22456094 22320631
$$ packed form
5360E094830R652P150p177M6013K5130M7355q397J567J7127k890r850J0451l3603
5347E197358r904M5610K05r028J0712q586O488J6182K1639q053j6557K7989M3940
5334E317995M9151M3416N4031L7906J09046M2900M5388K5569O1266Q1955R8022
5323E966645K2744L8500P5437Q0779N7111K9949L7896O0415R3264N4238N9559
5312F576537P5954R9945R9227R4258P6729J17632J72645J92265J88707K35295
5302G929194K16322L10156L62441L87456L85506M56422N31255N99947P59215Q19765
5292A2757679Q68341R64623J101177J164977J164974J129196J005096Q86317O83287
5283B1725667N17769L61249K08861R3784k2267n5626p6525j40650j56168j35463
$$ plain form
5273 22320631 22174060 22089597 22096431 22233452 22502959 22914507 23437074 24200220 25174085 26387734
5263 26387734 27843342 29518636 31332340 33268255 35215223 36997053 38633616 39990944
5255 39990944 41031118 41873292 42443992 42775884 42844855 42545711 41842213 40806845 39448938
5246 39448938 37849007 36109690 34298192 32559896 30965613 29508445 28263096 27268903
5238 27268903 26452103 25841157 25498371 25307750 25224489 25301073 25402155 25599839 25859646 26101118
5228 26101118 26360190 26595331 26792204 26942113 26980329 26862503 26497926 25913473 25084633 24117482
5218 24117482 23017470 21799334 20498989 19269269 18069851 16927703 15867294 14870111
5210 14870111 13993734 13163748 12452324 11846606 11250648 10734583 10241007 9803684 9417145
$$ packed form
5273B2320631j46571q4463O834J37021K69507M11548N22567P63146R73865J213649
5263B6387734J455608J675294J813704J935915J946968J781830J636563J357328
5255C9990944J040174Q42174N70700L31892O8971k99144p03498j035368j357907
5246C9448938j599931j739317j811498j738296j594283j457168j245349r94193
5238B7268903q16800o10946l42786j90621q3261P6584J01082J97684K59807K41472
5228B6101118K59072K35141J96873J49909L8216j17826l64577n84453q28840r67151
5218B4117482j100012j218136j300345j229720j199418j142148j060409r97183
5210A4870111q76377q29986p11424o05718n95958n16065m93576m37323l86539
$$ plain form
5201 9417145 9057051 8765133 8443875 8219054 8007359 7744216 7569028 7423978 7278072 7146220
5191 7146220 7022879 6889692 6763307 6670262 6568903 6511306 6423106 6341102 6273189 6207773 6179900
5180 6179900 6162619 6144809 6115247 6083863 6008470 5927656 5896558 5871293 5812374 5760786 5764196 5731291
5168 5731291 5691952 5684601 5697472 5706054 5697965 5711605 5713069 5689807 5699078 5735196 5735502 5717364 5745514
5155 5745514 5756166 5778629 5793246 5759251 5728659 5740621 5733597 5709588 5754515 5790635 5807323 5827539
5143 5827539 5870350 5906323 5900674 5895220 5945316 5977820 5962895 5932118 5924807 5929933 5918397 5904181
5131 5904181 5905828 5891987 5922006 5943809 5924064 5940185 5973674 5947791 5925405 5985192 6056796 6125387
5119 6125387 6153536 6197160 6297740 6407781 6471087 6573015 6726723 6863327 6986743 7106549
$$ packed form
5201I417145l60094k91918l21258k24821k11695k63143j75188j45050j45906j31852
5191G146220j23341j33187j26385r3045j01359n7597q8200q2004o7913o5416k7873
5180F179900j7281j7810k9562l1384p5393q0814l1098k5265n8919n1588L410l2905
5168E731291l9339p351J2871Q582q089J3640J464k3262R271L6118L06j8138K8150
5155E745514J0652K2463J4617l3995l0592J1962p024k4009M4927L6120J6688K0216
5143E827539M2811L5973n649n454N0096L2504j4925l0777p311N126j1536j4216
5131E904181J647j3841L0019K1803j9745J6121L3489k5883k2386N9787P1604O8591
5119F125387K8149M3624J00580J10041O3306J01928J53708J36604J23416J19806
$$ plain form
5109 7106549 7283380 7501365 7685753 7887478 8144787 8436756 8747356 9011913 9304296 9613475
5099 9613475 9960879 10373708 10799802 11256231 11823615 12484674 13175975 13911988 14770033 15800506
5089 15800506 16852141 18043139 19347420 20716624 22106713 23532815 24936130 26187466
5081 26187466 27236270 28044974 28587391 28901345 29036340 29020652 28883660 28661725 28443612
5072 28443612 28204706 27987016 27863040 27790705 27785600 27855960 28040416 28361128 28871081 29585736
5062 29585736 30481522 31479578 32606875 33952574 35387568 36975918 38623665 40182343
5054 40182343 41645174 42912110 43970906 44825241 45339893 45561434 45418876 44987508 44298806
5045 44298806 43365586 42220614 40869895 39297735 37517277 35810151 34212981 32783879
$$ packed form
5109G106549J76831K17985J84388K01725K57309K91969L10600K64557K92383L09179
5099I613475L47404M12829M26094M56429N67384O61059O91301P36013Q58045J030473
5089A5800506J051635J190998J304281J369204J390089J426102J403315J251336
5081B6187466J048804Q08704N42417L13954J34995j5688j36992k21935k18113
5072B8443612k38906k17690j23976p2335n105P0360J84456L20712N09953P14655
5062B9585736Q95786R98056J127297J345699J434994J588350J647747J558678
5054D0182343J462831J266936J058796Q54335N14652K21541j42558m31368o88702
5045D4298806r33220j144972j350719j572160j780458j707126j597170j429102
$$ plain form
5037 32783879 31481465 30321962 29333057 28505745 27866799 27456292 27191664 26980373 26818172
5028 26818172 26809275 26931319 27124101 27353322 27551679 27683594 27745102 27729027 27643547 27407753
5018 27407753 26957066 26288089 25404108 24355860 23229562 22054922 20826137 19652200 18559731
5009 18559731 17589473 16706510 15925313 15207960 14561677 13958600 13413907 12883636 12437697
5000 12437697 12071028 11785515 11529935 11412731 11261268 11142995 11006550 10885882 10717479
4991 10717479 10512432 10308508 10081258 9902988 9734771 9602173 9521764 9439074 9351888 9336584
4981 9336584 9349256 9355598 9338820 9367221 9377991 9389804 9405087 9383611 9369293 9352818 9309166 9258331
4969 9258331 9227037 9267209 9311355 9375734 9494357 9590045 9645965 9693197 9657311 9573562 9461755
$$ packed form
5037C2783879j302414j159503r88905q27312o38946m10507k64628k11291j62201
5028B6818172q897J22044J92782K29221J98357J31915O1508j6075q5480k35794
5018B7407753m50687o68977q83981j048248j126298j174640j228785j173937j092469
5009A8559731r70258q82963p81197p17353o46283o03077n44693n30271m45939
5000A2437697l66669k85513k55580j17204j51463j18273j36445j20668j68403
4991A0717479k05047k03924k27250j78270j68217j32598q0409q2690q7186j5304
4981I336584J2672O342j6778K8401J0770J1813J5283k1476j4318j6475m3652n0835
4969I258331l1294M0172M4146O4379J18623R5688N5920M7232l5886q3749j11807
$$ plain form
4958 9461755 9357759 9284868 9231045 9187058 9166213 9119203 9121551 9178926 9231616 9288172 9414634
4947 9414634 9538479 9737084 9901629 10074120 10187643 10238210 10304429 10322925 10343643 10451536
4937 10451536 10570141 10741570 10887524 11104508 11344675 11649763 11987122 12399644 12847748
4928 12847748 13223108 13546741 13782420 13892903 13931626 13904066 13762858 13618687 13473651 13328422
4918 13328422 13260043 13253321 13254945 13295270 13348895 13453463 13620228 13809501 13998989 14168481 14293261
4907 14293261 14365724 14372589 14372035 14353422 14378245 14453435 14608575 14797346 15082754 15444794 15770200
4896 15770200 16017644 16134224 16082513 16017218 15931396 15868431 15814457 15771153 15759460 15808846 15837909
4885 15837909 15904927 16015440 16177497 16384361 16665653 16991779 17357603 17673299 17902506 17998991
$$ packed form
4958I461755j03996p2891n3823m3987k0845m7010K348N7375N2690N6556J26462
4947I414634J23845J98605J64545J72491J13523N0567O6219J8496K0718J07893
4937A0451536J18605J71429J45954K16984K40167L05088L37359M12522M48104
4928A2847748L75360L23633K35679J10483L8723k7560j41208j44171j45036j45229
4918A3328422o8379o722J624M0325N3625J04568J66765J89273J89488J69492J24780
4907A4293261P2463O865n54j8613K4823P5190J55140J88771K85408L62040L25406
4896A5770200K47444J16580n1711o5295q5822o2965n3974m3304j1693M9386K9063
4885A5837909O7018J10513J62057K06864K81292L26126L65824L15696K29207R6485
$$ plain form
4875 17998991 18002653 17996811 17970700 17893137 17831173 17809380 17824406 17927723 18041225 18157726 18300794
4864 18300794 18506311 18819109 19182512 19568423 19968777 20344924 20791412 21218668 21585281
4855 21585281 21812729 21943514 21945374 21805360 21632543 21452660 21243184 21060107 20931973 20787724
4845 20787724 20684584 20628666 20609989 20608106 20623755 20665207 20758978 20901590 21136758 21509604 21974488
4834 21974488 22529649 23193249 23701162 23939068 24079829 24186877 24233298 24212934 24009679 23634471
4824 23634471 23226036 22820042 22496286 22265817 22099060 21997014 22036442 22212617 22479086 22902660
4814 22902660 23360440 23710848 24149030 24803675 25540535 26122451 26442256 26615474 26809917
4805 26809917 27108684 27342887 27306884 27057180 26666114 26212206 25785966 25499993 25321313 25315788
$$ packed form
4875A7998991L662n842k6111p7563o1964k1793J5026J03317J13502J16501J43068
4864A8300794K05517L12798L63403L85911M00354L76147M46488M27256L66613
4855B1585281K27448J30785J860j40014j72817j79883k09476j83077j28134j44249
4845B0787724j03140n5918j8677j883J5649M1452R3771J42612K35168L72846M64884
4834B1974488N55161O63600N07913K37906J40761J07048M6421k0364k03255l75208
4824B3634471m08435m05994l23756k30469j66757j02046L9428J76175K66469M23574
4814B2902660M57780L50408M38182O54645P36860N81916L19805J73218J94443
4805B6809917K98767K34203l6003k49704l91066m53908m26240k85973j78680n525
$$ plain form
4795 25315788 25499716 25919147 26552857 27230706 27892737 28425568 28890109 29459510 30109176
4786 30109176 30733366 31150128 31369909 31625480 31954602 32333171 32822450 33365741 33944897
4777 33944897 34549317 35117626 35618242 36157810 36690132 37267167 37894375 38541688 39259308
4768 39259308 40066619 40925896 41833919 42783098 43697903 44558337 45369221 46147850 46903236
4759 46903236 47640082 48388481 49181619 49989627 50859671 51818269 52856896 53895277 54984509
4750 54984509 56000214 56902658 57645800 58147285 58466948 58618361 58688754 58640872 58598931 58593772
4740 58593772 58682412 58902408 59254503 59687028 60176231 60688040 61203243 61703438 62147256 62498221
4730 62498221 62750590 62809853 62736732 62518856 62090700 61591448 60994193 60322222 59618308 58941051
$$ packed form
4795B5315788J83928M19431O33710O77849O62031N32831M64541N69401O49666
4786C0109176O24190M16762K19781K55571L29122L78569M89279N43291N79156
4777C3944897O04420N68309N00616N39568N32322N77035O27208O47313P17620
4768C9259308Q07311Q59277R08023R49179R14805Q60434Q10884P78629P55386
4759D6903236P36846P48399P93138Q08008Q70044R58598J038627J038381J089232
4750E4984509J015705R02444P43142N01485L19663J51413P0393m7882m1941n159
4740E8593772Q8640K19996L52095M32525M89203N11809N15203N00195M43818L50965
4730F2498221K52369N9263p3121k17876m28156m99252n97255o71971p03914o77257
$$ plain form
4720 58941051 58266248 57631310 57105807 56690112 56393512 56246210 56235952 56344030 56449995 56708159
4710 56708159 56978715 57227363 57507638 57769771 58031662 58282205 58560290 58784074 58980242
4701 58980242 59145776 59277848 59386992 59513366 59632927 59740551 59813135 59904277 59971995 60015249
4691 60015249 60091547 60101244 60149483 60143883 60108686 60078975 60049972 59959869 59826494 59687054 59498274
4680 59498274 59271712 59001907 58747438 58481696 58222669 57902979 57548686 57206550 56841850
4671 56841850 56457301 56085940 55639337 55112002 54555524 53944285 53280774 52581152 51898946
4662 51898946 51207346 50513600 49825545 49174605 48647707 48107372 47556487 47040068 46561890
4653 46561890 46093544 45604244 45110545 44635142 44224350 43799839 43418014 43119465 42899697
$$ packed form
4720E8941051o74803o34938n25503m15695k96600j47302j0258J08078J05965K58164
4710E6708159K70556K48648K80275K62133K61891K50543K78085K23784J96168
4701E8980242J65534J32072J09144J26374J19561J07624P2584R1142O7718M3254
4691F0015249P6298R697M8239n600l5197k9711k9003r0103j33375j39440j88780
4680E9498274k26562k69805k54469k65742k59027l19690l54293l42136l64700
4671E6841850l84549l71361m46603n27335n56478o11239o63511o99622o82206
4662E1898946o91600o93746o88055o50940n26898n40335n50885n16419m78178
4653D6561890m68346m89300m93699m75403m10792m24511l81825k98549k19768
$$ plain form
4644 42899697 42792745 42832907 43050299 43381989 43590523 43567742 43323121 43036890 42801636 42616996
4634 42616996 42515278 42607453 42837601 43251342 43873256 44728316 45656773 46475483 47011635 47262922
4624 47262922 47407033 47588164 47925333 48450206 49125860 50003438 51003295 51910741 52685144
4615 52685144 53305223 53820140 54172993 54335730 54419066 54583991 54884742 55283999 55802520 56278247
4605 56278247 56641709 56697480 56392122 55820275 55095086 54442627 53845782 53431754 53140006 52937222
4595 52937222 52813495 52742335 52714874 52739921 52746303 52618562 52391422 52276464 52233501 52293684 52441736
4584 52441736 52663410 52956031 53243428 53569832 53932698 54397090 54968705 55611982 56322335
4575 56322335 57162529 58134319 59235835 60591782 62131369 63959238 66116017 68594163
$$ packed form
4644D2899697j06952M0162K17392L31690K08534k2781k44621k86231k35254j84640
4634D2616996j01718R2175K30148M13741O21914Q55060R28457Q18710N36152K51287
4624D7262922J44111J81131L37169N24873O75654Q77578R99857R07446P74403
4615E2685144O20079N14917L52853J62737Q3336J64925L00751L99257N18521M75727
4605E6278247L63462N5771l05358n71847p25189o52459n96845m14028k91748k02784
4595E2937222j23727p1160k7461K5047O382j27741k27140j14958m2963O0183J48052
4584E2441736K21674K92621K87397L26404L62866M64392N71615O43277P10353
4575E6322335Q40194R71790J101516J355947J539587J827869K156779K478146
$$ plain form
4567 68594163 71483606 74924996 79024494 83823741 89440171 96131888 103989689 113161900
4559 113161900 123586772 134943856 146441956 156625721 163831149 166671522 164799058
4552 164799058 159318103 151548069 142597685 133310778 124329092 116073451 108596523 102005228
4544 102005228 96389842 91600597 87640760 84435010 81948759 80140581 78943403 78383233
4536 78383233 78386355 78935850 79989879 81507901 83420064 85668880 88250593 91221315 94674611
4527 94674611 98788390 103700791 109553277 116538362 124740601 133792806 142869426 150785897
4519 150785897 156557584 159821491 160515337 158877610 155450604 151024502 146740593 143405855
4511 143405855 141554462 141484601 143655718 148452478 156018024 166228915 178388482 190556612
$$ packed form
4567F8594163K889443L441390M099498M799247N616430O691717P857801R172211
4559A13161900J0424872J1357084J1498100J0183765P205428K840373j872464
4552A64799058n480955p770034q950384r286907q981686q255641p476928o591295
4544A02005228n615386m789245l959837l205750k486251j808178j197178n60170
4536G8383233L122N49495J054029J518022J912163K248816K581713K970722L453296
4527I4674611M113779M912401N852486O985085Q202239R052205R076620P916471
4519A50785897N771687L263907O93846j637727l427006m426102m283909l334738
4511A43405855j851393o9861K171117M796760P565546J0210891J2159567J2168130
$$ plain form
4503 190556612 200652917 207219087 209462356 206841298 199456780 188251149 174964619 161376001
4495 161376001 148579105 137081132 126963794 118415414 111185326 105195728 100302895 96309493
4487 96309493 93207029 90910150 89387324 88588360 88515832 89191974 90614275 92736393 95512706
4478 95512706 98883394 102664733 106610970 110318649 113239364 114839681 114778118 113142946
4470 113142946 110152926 106176595 101565329 96626871 91544007 86468072 81521998 76813951
4462 76813951 72367442 68200073 64364028 60868091 57702618 54797839 52201369 49866308
4454 49866308 47783580 45866771 44107430 42536389 41096385 39821230 38675010 37618425
4446 37618425 36717538 35907629 35245613 34807413 34546500 34240349 33690699 33105438 32646051
$$ packed form
4503A90556612J0096305O566170K243269k621058p384518j1205631j3286530j3588618
4495A61376001j2796896j1497973j0117338q548380p230088n989598m892833l993402
4487I6309493l102464k296879j522826p98964p2528O76142J422301K122118K776313
4478I5512706L370688L781339L946237L707679K920715J600317o1563j635172
4470A13142946k990020l976331m611266m938458n082864n075935m946074m708047
4462G6813951m446509m167369l836045l495937l165473k904779k596470k335061
4454D9866308k082728j916809j759341j571041j440004j275155j146220j056585
4446C7618425r00887q09909o62016m38200k60913l06151n49650n85261m59387
$$ plain form
4437 32646051 32217783 31794541 31324514 30853592 30438532 29998841 29601414 29213326 28820118
4428 28820118 28473213 28171669 27875415 27636900 27409952 27199920 26994367 26774058 26645542
4419 26645542 26631326 26759187 27030998 27563256 28384603 29569366 31070505 32707889 34036132
4410 34036132 34530271 34056200 32872797 31419859 29879962 28369743 27015200 25850665
4402 25850665 24890568 24031653 23256789 22603349 21990987 21478976 21008982 20573750 20224865
4393 20224865 19900906 19636555 19425556 19240970 19115692 18978070 18819782 18664809 18469411
4384 18469411 18262958 18076906 17889795 17690031 17468393 17370790 17280980 17189764 17143352 17135763
4374 17135763 17181885 17191134 17202059 17181722 17166272 17180347 17203632 17270835 17336735 17455105 17613993
$$ packed form
4437C2646051m28268m23242m70027m70922m15060m39691l97427l88088l93208
4428B8820118l46905l01544k96254k38515k26948k10032k05553k20309j28516
4419B6645542j4216J27861K71811N32258Q21347J184763J501139J637384J328243
4410C4036132M94139m74071j183403j452938j539897j510219j354543j164535
4402B5850665r60097q58915p74864o53440o12362n12011m69994m35232l48885
4393B0224865l23959k64351k10999j84586j25278j37622j58288j54973j95398
4384A8469411k06453j86052j87111j99764k21638r7603q9810r1216m6412p589
4374A7135763M6122R249J0925k0337j5450J4075K3285O7203O5900J18370J58888
$$ plain form
4363 17613993 17819030 18082356 18417213 18866140 19446501 20322358 21502192 23076966 24976590
4354 24976590 27007569 28586600 29562529 29946174 29842385 29272178 28273562 26946251 25512295
4345 25512295 24203639 23019885 21969853 21007529 20089802 19302972 18621336 17967410 17375074
4336 17375074 16827913 16378802 15959973 15562718 15220113 14962595 14749249 14564563 14419411
4327 14419411 14262476 14105111 13936761 13759823 13590744 13441917 13265952 13140786 12991958
4318 12991958 12877730 12841705 12757241 12673299 12593791 12564659 12492498 12395203 12324889 12291462 12242861
4307 12242861 12223827 12219552 12242031 12271910 12295188 12316825 12333845 12311080 12313102 12332136 12350740 12417497
4295 12417497 12497936 12592143 12712502 12868266 13001381 13105814 13187170 13261003 13369505 13482973
$$ packed form
4363A7613993K05037K63326L34857M48927N80361Q75857J179834J574774J899624
4354B4976590K030979J579031R75929L83645j03789n70207r98616j327311j433956
4345B5512295j308656j183754j050032r62324r17727p86830o81636o53926n92336
4336A7375074n47161m49111m18829l97255l42605k57518k13346j84686j45152
4327A4419411j56935j57365j68350j76938j69079j48827j75965j25166j48828
4318A2991958j14228l6025q4464q3942p9508k9132p2161r7295p0314l3427m8601
4307A2242861j9034m275K2479K9879K3278K1637J7020k2765K022J9034J8604O6757
4295A2417497Q0439R4207J20359J55764J33115J04433Q1356P3833J08502J13468
$$ plain form
4285 13482973 13584138 13699140 13819854 13940860 14099818 14279730 14444139 14650902 14883224
4276 14883224 15115946 15331438 15489228 15564876 15720512 15952799 16200745 16459930 16688489 17007892
4266 17007892 17344080 17702721 18025347 18300003 18542022 18673337 18824534 18978230 19138720
4257 19138720 19345863 19566393 19841292 20139337 20442099 20800567 21172832 21580982 22005856
4248 22005856 22380768 22799695 23236629 23636033 24061585 24536137 24983253 25430108 25887385
4239 25887385 26482654 27135784 27832393 28532013 29241873 30020301 30838435 31666121 32514585
4230 32514585 33232130 33908367 34548856 35079524 35615655 36185221 36759135 37234885 37727104
4221 37727104 38293924 38886686 39574886 40192402 40775290 41334630 41808010 42177706 42446954
$$ packed form
4285A3482973J01165J15002J20714J21006J58958J79912J64409K06763K32322
4276A4883224K32722K15492J57790P5648J55636K32287K47946K59185K28559L19403
4266A7007892L36188L58641L22626K74656K42019J31315J51197J53696J60490
4257A9138720K07143K20530K74899K98045L02762L58468L72265M08150M24874
4248B2005856L74912M18927M36934L99404M25552M74552M47116M46855M57277
4239B5887385N95269O53130O96609O99620P09860P78428Q18134Q27686Q48464
4230C2514585P17545O76237O40489N30668N36131N69566N73914M75750M92219
4221C7727104N66820N92762O88200O17516N82888N59340M73380L69696K69248
$$ plain form
4212 42446954 42614036 42745907 42775099 42810126 42908766 42981101 43049673 43084585 43086803 43093526 43135816
4201 43135816 43131311 43011523 42730189 42412791 42081780 41740582 41517739 41410283 41305511 41217741
4191 41217741 41072947 40826445 40497034 40057746 39658179 39383803 39144496 38898946 38664013
4182 38664013 38422327 38195547 37925937 37602638 37392823 37165175 36863293 36358779 35803429
4173 35803429 35281910 34958516 34755695 34675831 34891172 35492393 36176462 36995336 38100665
4164 38100665 39385817 40450495 41288512 41902154 42485343 43492856 45320659 48106514 52541214
4155 52541214 59567965 71044965 90437177 124617884 179280003 237174843 253438351
4148 253438351 222059201 182907582 152544966 126872462 104494376 86534514 72760111
$$ packed form
4212D2446954J67082J31871K9192L5027R8640P2335O8572L4912K218O723M2290
4201D3135816m505j19788k81334l17398l31011l41198k22843j07456j04772q7770
4191D1217741j44794k46502l29411m39288l99567k74376k39307k45550k34933
4182C8664013k41686k26780k69610l23299k09815k27648l01882n04514n55350
4173C5803429n21519l23394k02821p9864K15341O01221O84069Q18874J105329
4164C8100665J285152J064678Q38017O13642N83189J007513J827803K785855M434700
4155E2541214P026751J1477000J9392212L4180707N4662119N7894840J6263508
4148B53438351l1379150l9151619l0362616k5672504k2378086j7959862j3774403
$$ plain form
4141 72760111 61845587 53024347 45873298 39972731 35244934 31708250 29291397 27360546
4133 27360546 25550487 23795174 22389653 21394541 20527001 19630366 18861219 18234777 17578316
4124 17578316 16775090 16018936 15471764 15063002 14569637 13969813 13367844 12846327 12419083
4115 12419083 12064935 11789159 11594047 11429793 11228197 10995232 10878736 10811725 10705200 10538073
4105 10538073 10410062 10329303 10189059 9957969 9697246 9424190 9136793 8987630 8902878 8824200
4095 8824200 8692456 8439499 8187634 7961142 7766661 7624844 7475148 7341905 7211729 7057040
4085 7057040 6921168 6799324 6675779 6582856 6488226 6378584 6350882 6289842 6177586 6082332
4075 6082332 6022494 6026749 6017932 5988889 5916269 5781407 5670898 5595854 5552094 5510063 5402641
$$ packed form
4141G2760111j0914524q821240p151049n900567m727797l536684k416853j930851
4133B7360546j810059j755313j405521r95112q67540q96635p69147o26442o56461
4124A7578316q03226p56154n47172m08762m93365n99824o01969n21517m27244
4115A2419083l54148k75776j95112j64254k01596k32965j16496o7011j06525j67127
4105A0538073j28011q0759j40244k31090k60723k73056k87397j49163q4752p8678
4095H824200j31744k52957k51865k26492j94481j41817j49696j33243j30176j54689
4085G057040j35872j21844j23545r2923r4630j09642k7702o1040j12256r5254
4075F082332n9838M255q817k9043p2620j34862j10509p5044m3760m2031j07422
$$ plain form
4064 5402641 5296406 5213643 5131198 5054360 4988994 4915772 4809687 4664394 4612608 4518216 4456384
4053 4456384 4412582 4396636 4414569 4403089 4390652 4394138 4335277 4286275 4224754 4217054 4192507 4131375
4041 4131375 4101543 4042365 3959831 3888625 3795881 3736651 3690609 3734241 3801669 3804746 3776934 3768435
4029 3768435 3743391 3727409 3691513 3640193 3573630 3521927 3527699 3560267 3565429 3545797 3486842 3479849
4017 3479849 3501182 3482960 3448817 3420052 3378404 3345963 3312450 3278920 3227288 3201524 3198405 3186980
4005 3186980 3159318 3128681 3099779 3031925 2974262 2874735 2820293 2796697 2772404 2736894 2704068
3994 2704068 2659820 2639571 2617025 2580023 2539671 2527479 2509066 2441117 2415169 2426590 2441749
3983 2441749 2439938 2430980 2392239 2410671 2449782 2447455 2476686 2476067 2511324 2501214 2433177 2414508
$$ packed form
4064E402641j06235q2763q2445p6838o5366p3222j06085j45293n1786r4392o1832
4053D456384m3802j5946J7933j1480j2437L486n8861m9002o1521p700k4547o1132
4041D131375k9832n9178q2534p1206r2744n9230m6042M3632O7428L077k7812q499
4029C768435k5044j5982l5896n1320o6563n1703N772L2568N162j9632n8955o993
4017C479849K1333j8222l4143k8765m1648l2441l3513l3530n1632k5764l119j1425
4005C186980k7662l0637k8902o7854n7663r9527n4442k3596k4293l5510l2826
3994B704068m4248k0249k2546l7002m0352j2192j8413o7949k5948J1421J5159
3983B441749j811q958l8741J8432L9111k327K9231o19L5257j0110o8037j8669
$$ plain form
3971 2414508 2410894 2401025 2438009 2443950 2440288 2391414 2336897 2266944 2243757 2181674 2153681 2119920
3959 2119920 2076362 2036980 2034047 2031932 2057493 2085151 2120170 2138235 2162918 2149627 2079024 2049728
3947 2049728 2017364 1955091 1919705 1919975 1938271 1963471 1945683 1902134 1876853 1863752 1858574 1874253
3935 1874253 1917354 1927301 1956035 1943955 1955296 1948733 1931028 1903275 1915228 1944331 1953375 1959890
3923 1959890 1962456 1993662 2006608 2042506 2056337 2061316 2027756 1961955 1936606 1952029 1965975 1954181
3911 1954181 1942599 1962901 1963364 2020356 1999833 1988468 2007897 2029113 2064740 2085386 2095192 2123378
3899 2123378 2134212 2139974 2138765 2115647 2124137 2113988 2093998 2085253 2077651 2090018 2091328 2082202 2094663
3886 2094663 2133602 2133844 2136069 2139501 2167326 2183770 2216170 2254353 2224166 2189781 2186037 2185899 2177692
$$ packed form
3971B414508l614r869L6984N941l662m8874n4517o9953k3187o2083k7993l3761
3959B119920m3558l9382k933k115K5561K7658L5019J8065K4683j3291p0603k9296
3947B049728l2364o2273l5386K70J8296K5200j7788m3549k5281j3101n178J5679
3935A874253M3101R947K8734j2080J1341o563j7705k7753J1953K9103R044O515
3923A959890K566L1206J2946L5898J3831M979l3560o5801k5349J5423J3946j1794
3911A954181j1582K0302M63N6992k0523j1365J9429K1216L5627K0646R806K8186
3899B123378J0834N762j209k3118Q490j0149j9990q745p602J2367J310r126J2461
3886B094663L8939K42K225L432K7825J6444L2400L8183l0187l4385l744j38q207
$$ plain form
3873 2177692 2169186 2204410 2200076 2230379 2247820 2279546 2275459 2277764 2309664 2317056 2320504 2366762 2435450
3860 2435450 2523002 2609096 2734451 2923782 3237332 3530058 3548752 3390938 3209681 3111882
3850 3111882 2990960 2872330 2807197 2721046 2675662 2640419 2622434 2636344 2658910 2665707 2654094
3839 2654094 2683538 2685589 2699632 2727593 2765449 2810622 2795670 2832543 2874399 2896227 2966401 3024644
3827 3024644 3052912 3067469 3099550 3156906 3163506 3197497 3208260 3224778 3242284 3327227 3370404 3359816
3815 3359816 3410673 3425871 3426373 3468542 3510721 3589059 3666971 3706727 3782246 3849894 3918239 3981573
3803 3981573 4041722 4080899 4136631 4196030 4223739 4250219 4293432 4306815 4290146 4271999 4324020
3792 4324020 4339243 4339078 4353992 4347314 4307633 4280488 4270752 4291969 4262775 4276201 4290827 4297443
$$ packed form
3873B177692q506L5224m334L0303J7441L1726m087K305L1900P392L448M6258O8688
3860B435450Q7552Q6094J25355J89331L13550K92726J8694j57814j81257r7799
3850C111882j20922j18630o5133q6151m5384l5243j7985J3910K2566O797j1613
3839B654094K9444K051J4043K7961L7856M5173j4952L6873M1856K1828P0174N8243
3827C024644K8268J4557L2081N7356O600L3991J0763J6518J7506Q4943M3177j0588
3815C359816N0857J5198N02M2169M2179P8338P7912L9756P5519O7648O8345O3334
3803C981573O0149L9177N5732N9399K7709K6480M3213J3383j6669j8147N2021
3792D324020J5223j65J4914o678l9681k7145r736K1217k9194J3426J4626O616
$$ plain form
3780 4297443 4308879 4311787 4351425 4367446 4358188 4410550 4469910 4482240 4473975 4490248 4521078 4531502
3768 4531502 4541057 4577836 4595024 4650334 4719707 4808652 4920344 5022164 5067601 5039871 5042072
3757 5042072 5007323 4936115 4962035 4951814 4930238 4961324 4994266 5056844 5077294 5098584 5149242
3746 5149242 5163628 5193696 5251901 5284372 5306669 5369966 5396942 5448849 5454167 5472208 5541264 5576326
3734 5576326 5661120 5743481 5833878 5969602 6146839 6379462 6602613 6671515 6663560 6672636 6729669
3723 6729669 6809870 6888153 7000173 7138604 7392357 7612587 7839864 8109933 8369892 8642601
3713 8642601 8969304 9249780 9539682 9857232 10159084 10461721 10693778 10915021 11137707 11308829
3703 11308829 11482799 11676194 11797295 11908971 12031385 12129653 12255321 12369962 12362154 12289192
$$ packed form
3780D297443J1436K908L9638J6021r258N2362N9360J2330q265J6273L0830J0424
3768D531502R555L6779J7188N5310O9373Q8945J11692J01820M5437k7730K201
3757E042072l4749p1208K5920j0221k1576L1086L2942O2578K0450K1290N0658
3746E149242J4386L0068N8205L2471K2297O3297K6976N1907N318J8041O9056L5062
3734E576326Q4794Q2361R0397J35724J77237K32623K23151O8902p955R076N7033
3723F729669Q0201P8283J12020J38431K53753K20230K27277K70069K59959K72709
3713H642601L26703K80476K89902L17550L01852L02637K32057K21243K22686J71122
3703A1308829J73970J93395J21101J11676J22414R8268J25668J14641p808p2962
$$ plain form
3693 12289192 12216214 12147866 12068299 11993163 11938891 11858463 11719928 11574873 11435873 11225891
3683 11225891 11027786 10807992 10600070 10389693 10217932 10077501 9897346 9743813 9594782
3674 9594782 9506712 9473757 9463793 9443193 9441315 9451361 9503509 9591515 9695023 9751842 9823647 9871864
3662 9871864 9953368 10047488 10133645 10240632 10314911 10392275 10538549 10664590 10831858 10965328
3652 10965328 11112068 11219342 11305108 11401153 11502071 11627029 11776882 11923146 12055560 12190816
3642 12190816 12313070 12421029 12561456 12702832 12854493 12993899 13157594 13343798 13495457
3633 13495457 13611931 13729223 13901856 14103158 14307366 14489254 14668690 14873443 15051872
3624 15051872 15249558 15475425 15790999 16094836 16425733 16786915 17096373 17401524 17678482
$$ packed form
3693A2289192p2978o8348p9567p5136n4272q0428j38535j45055j39000k09982
3683A1225891j98105k19794k07922k10377j71761j40431j80155j53533j49031
3674I594782q8070l2955r964k0600j878J0046N2148Q8006J03508N6819P1805M8217
3662I871864Q1504R4120Q6157J06987P4279P7364J46274J26041J67268J33470
3652A0965328J46740J07274Q5766R6045J00918J24958J49853J46264J32414J35256
3642A2190816J22254J07959J40427J41376J51661J39406J63695J86204J51659
3633A3495457J16474J17292J72633K01302K04208J81888J79436K04753J78429
3624A5051872J97686K25867L15574L03837L30897L61182L09458L05151K76958
$$ plain form
3615 17678482 17925211 18206988 18451025 18667721 18882866 19113030 19294589 19483359 19661748
3606 19661748 19846899 19995185 20162283 20347738 20508280 20670470 20792531 20917562 21037507
3597 21037507 21138501 21253119 21380578 21516477 21639506 21733053 21848962 21944552 22021667 22118257
3587 22118257 22258860 22383810 22533578 22730771 22943575 23178875 23399223 23686652 24026962
3578 24026962 24420614 24810697 25192503 25600953 25984444 26413030 26868811 27363912 27834809
3569 27834809 28371029 28958134 29506167 30021075 30550601 31095917 31646994 32150446 32655333
3560 32655333 33167057 33740434 34296528 34889776 35425543 35921612 36389993 36899255 37349595
3551 37349595 37790661 38251056 38732590 39175090 39508027 39769103 39988096 40188239 40368998
$$ packed form
3615A7678482K46729K81777K44037K16696K15145K30164J81559J88770J78389
3606A9661748J85151J48286J67098J85455J60542J62190J22061J25031J19945
3597B1037507J00994J14618J27459J35899J23029R3547J15909R5590P7115R6590
3587B2118257J40603J24950J49768J97193K12804K35300K20348K87429L40310
3578B4026962L93652L90083L81806M08450L83491M28586M55781M95101M70897
3569B7834809N36220N87105N48033N14908N29526N45316N51077N03452N04887
3560C2655333N11724N73377N56094N93248N35767M96069M68381N09262M50340
3551C7349595M41066M60395M81534M42500L32937K61076K18993K00143J80759
$$ plain form
3542 40368998 40493227 40646065 40876275 41130247 41431221 41795199 42175457 42581708 43055840
3533 43055840 43567448 44160743 44880359 45644456 46513880 47448372 48551246 49805286 51259449
3524 51259449 52725290 54143726 55578598 57087849 58711978 60463333 62379662 64460755
3516 64460755 66596231 68731717 70758994 72791564 74824717 76813960 78662562 80460974
3508 80460974 82348410 84464381 86691915 89052353 91676715 94711212 98010785 101526538
3500 101526538 105289862 109341536 113618388 118004504 122344823 126699768 130980716 135138750
3492 135138750 139111698 142974335 146790120 150656569 154675701 158893818 163460065 168572961
3484 168572961 174533913 181537103 189562669 198938893 209583587 221536115 234957869 250990154
$$ packed form
3542D0368998J24229J52838K30210K53972L00974L63978L80258M06251M74132
3533D3055840N11608N93295P19616P64097Q69424R34492J102874J254040J454163
3524E1259449J465841J418436J434872J509251J624129J751355J916329K081093
3516F4460755K135476K135486K027277K032570K033153J989243J848602J798412
3508H0460974J887436K115971K227534K360438K624362L034497L299573L515753
3500A01526538L763324M051674M276852M386116M340319M354945M280948M158034
3492A35138750L972948L862637L815785L866449M019132M218117M566247N112896
3484A68572961N960952P003190Q025566R376224J0644694J1952528J3421754J6032285
$$ plain form
3476 250990154 270831653 293234061 307381131 305005137 296131474 287566547 278285970 268301786
3468 268301786 258762877 250464331 243368833 237633094 233003490 229105434 225946126 223572206
3460 223572206 221872389 220440487 219310868 218632090 218396906 218297944 218215564 218292726 218758195
3451 218758195 219900592 221703867 224435045 228591918 234831626 244124238 258081237 280123554
3443 280123554 313073427 344932321 349010922 334977728 323858733 315582792 308206398
3436 308206398 301498556 296099311 291436066 287152213 283016171 278984453 274732425 270610938
3428 270610938 266768624 263147749 259469147 255755510 251877906 247777815 243198075 237843068
3420 237843068 231605063 224787260 217501568 209826132 202030919 194649313 188313228 183753897
$$ packed form
3476B50990154J9841499K2402408J4147070k375994q873663q564927r280577r984184
3468B68301786r538909q298546p095498n735739m629604l898056l159308k373920
3460B23572206j699817j431902j129619o78778k35184r8962q2380P7162M65469
3451B18758195J142397J803275K731178M156873O239708R292612J3956999K2042317
3443B80123554L2949873L1858894M078601j4033194j1118995q275941p376394
3436C08206398o707842n399245m663245m283853m136042m031718m252028m121487
3428B70610938l842314l620875l678602l713637l877604m100091m579740n355007
3420B37843068o238005o817803p285692p675436p795213p381606o336085m559331
$$ plain form
3412 183753897 182333915 185821773 193029628 192951630 180206453 165458705 153289416 142602794
3404 142602794 133034616 124845794 118035513 112259413 107286590 103054580 99224129 95854007
3396 95854007 92860850 90302879 88010659 85914382 83989016 82326366 80973316 79759059
3388 79759059 78569218 77466676 76478416 75550022 74616782 73875004 73248257 72755159 72364819
3379 72364819 72039055 71744464 71612260 71588528 71645276 71754400 71910350 72098423 72314990 72514845
3369 72514845 72693854 72869231 73003590 73104926 73221012 73325023 73370194 73426962 73454976 73460888
3359 73460888 73451744 73453853 73455483 73372326 73183409 72885956 72518189 72116268 71660866 71223364 70724255
3348 70724255 70219782 69704123 69286973 68907331 68580279 68341017 68217070 68170728 68124561 68132042
$$ packed form
3412A83753897j419982L487858P207855p7998j2745177j4747748j2169289j0686622
3404A42602794r568178q188822o810281n776100m972823m232010l830451l370122
3396I5854007k993157k557971k292220k096277j925366j662650j353050j214257
3388G9759059j189841j102542r88260r28394r33240p41778o26747m93098l90340
3379G2364819l25764k94591j32204k3732N6748J09124J55950J88073K16567J99855
3369G2514845J79009J75377J34359J01336J16086J04011M5171N6768K8014N912
3359G3460888r144K109J630q3157j88917k97453l67767m01921m55402m37502m99109
3348G0724255n04473n15659m17150l79642l27052k39262j23947m6342m6167P481
$$ plain form
3338 68132042 68240302 68403841 68650224 68955316 69355688 69791695 70247322 70769195 71376536
3329 71376536 72146973 73117389 74257782 75644065 77221833 79022438 81067762 83349071
3321 83349071 85824741 88572770 91476939 94543923 97803538 101386158 105369752 109737503
3313 109737503 114438078 119492840 124929884 130643737 136461293 142265902 147936994 153357730
3305 153357730 158434376 163025097 167081584 170564775 173459254 175756227 177440280 178562674
3297 178562674 179068504 179100848 178578343 177575251 176096659 174178184 171842149 169276603 166478386
3288 166478386 163539393 160594140 157731515 154965284 152403178 150045653 147926055 146076081
3280 146076081 144474841 143080288 141864736 140739264 139689785 138646020 137600032 136575259
$$ packed form
3338F8132042J08260J63539K46383L05092M00372M36007M55627N21873O07341
3329G1376536P70437R70416J140393J386283J577768J800605K045324K281309
3321H3349071K475670K748029K904169L066984L259615L582620L983594M367751
3313A09737503M700575N054762N437044N713853N817556N804609N671092N420736
3305A53357730N076646M590721M056487L483191K894479K296973J684053J122394
3297A78562674N05830L2344n22505j003092j478592j918475k336035k565546k798217
3288A66478386k938993k945253k862625k766231k562106k357525k119598j849974
3280A46076081j601240j394553j215552j125472j049479j043765j045988j024773
$$ plain form
3272 136575259 135520096 134434786 133314773 132294061 131452087 130808607 130352855 130098164 129990693
3263 129990693 130072415 130310859 130789092 131339803 131946661 132563074 133088735 133401748 133428868 133142763
3253 133142763 132474535 131378441 129827571 127883738 125579109 122969428 120068272 116974247
3245 116974247 113800818 110466563 107059675 103631785 100205359 96795798 93401641 90064305
3237 90064305 86748613 83495388 80328980 77248006 74268283 71430841 68703385 66140242
3229 66140242 63735619 61507786 59422217 57518697 55717995 54052095 52572439 51216424
3221 51216424 49956094 48779739 47651046 46665595 45816683 45047764 44345021 43648507 43069513
3212 43069513 42554770 42132403 41715778 41369672 41162960 41028090 40962392 40989786 41135000 41298726
$$ packed form
3272A36575259j055163j085310j120013j020712q41974o43480m55752k54691j07471
3263A29990693Q1722K38444M78233N50711O06858O16413N25661L13013K7120k86105
3253A33142763o68228j096094j550870j943833k304629k609681k901156l094025
3245A16974247l173429l334255l406888l427890l426426l409561l394157l337336
3237I0064305l315692l253225l166408l080974k979723k837442k727456k563143
3229F6140242k404623k227833k085569j903520j800702j665900j479656j356015
3221E1216424j260330j176355j128693r85451q48912p68919p02743o96514n78994
3212D3069513n14743m22367m16625l46106k06712j34870o5698K7394J45214J63726
$$ plain form
3202 41298726 41582352 41919325 42172717 42418602 42548384 42618291 42585997 42427637 42112030 41750970
3192 41750970 41265578 40753488 40201891 39592589 39057617 38456949 37836688 37221432 36535026
3183 36535026 35879439 35205940 34665620 34193562 33772952 33434687 33186062 33008851 32902676
3174 32902676 32826640 32797700 32887053 33063259 33381806 33810046 34324213 34923294 35595318 36415494
3164 36415494 37474720 38827442 40446179 42318094 44377264 46583596 49000934 51582992
3156 51582992 54079182 56231855 57748135 58456106 58537014 58313323 58097056 57948163 57838109
3147 57838109 57817789 57919682 58065246 58223259 58323243 58403510 58600257 58925902 59343436 59863381
3137 59863381 60422978 61070316 61880963 62989927 64668973 67234591 71021195 76453823 84389452
$$ packed form
3202D1298726K83626L36973K53392K45885J29782O9907l2294j58360l15607l61060
3192D1750970m85392n12090n51597o09302n34972o00668o20261o15256o86406
3183C6535026o55587o73499n40320m72058m20610l38265k48625j77211j06175
3174C2902676p6036k8940Q9353J76206L18547M28240N14167N99081O72024Q20176
3164C6415494J059226J352722J618737J871915K059170K206332K417338K582058
3156E1582992K496190K152673J516280P07971Q0908k23691k16267j48893j10054
3147E7838109k0320J01893J45564J58013R9984Q0267J96747L25645M17534N19945
3137E9863381N59597O47338Q10647J108964J679046K565618L786604N432628P935629
$$ plain form
3128 84389452 95884918 110367158 121183747 121596456 115378966 108081535 100825521 93814973
3120 93814973 87396175 81841970 77207235 73490625 70534864 68145113 66170598 64574892
3112 64574892 63297692 62331431 61749463 61531361 61641077 62133073 62964149 64071192 65438553
3103 65438553 67091012 69085260 71603527 74608779 78099822 82042107 86224556 90308590
3095 90308590 93855589 96729822 99382225 102320037 106124517 111282864 117757217 124706608
3087 124706608 130557983 133936382 134859291 134341115 133670138 133433936 133820747 134948697 136838326
3078 136838326 139501227 143082790 147618961 153159816 159969413 167958205 177199445 187637348
3070 187637348 199276628 212454259 227763533 245800117 266972713 291583720 319245498
$$ packed form
3128H4389452J1495466J4482240J0816589M12709o217490p297431p256014p010548
3120I3814973o418798n554205m634735l716610k955761k389751j974515j595706
3112F4574892j277200r66261n81968k18102J09716M91996Q31076J107043J367361
3103F5438553J652459J994248K518267L005252L491043L942285M182449M084034
3095I0308590L546999K874233K652403K937812L804480N158347O474353O949391
3087A24706608N851375L378399R22909n18176o70977k36202L86811J127950J889629
3078A36838326K662901L581563M536171N540855O809597P988792R241240J0437903
3070A87637348J1639280J3177631J5309274J8036584K1172596K4611007K7661778
$$ plain form
3063 319245498 348227531 375609320 397404247 410279148 413369246 408353351 398027455
3056 398027455 384841167 370515822 356208354 342856679 331438074 322934018 318343101
3049 318343101 318521203 323947904 333417078 342829169 346706166 342909904 333196410 319500101
3041 319500101 302837010 284211386 264726936 245394540 226845934 209453411 193363284
3034 193363284 178595721 165220771 153208294 142488925 132955059 124473536 116933422
3027 116933422 110263564 104271166 98924375 94043667 89639335 85648516 81963226 78560685
3019 78560685 75409768 72472529 69750100 67189684 64718950 62382635 60167215 58138031
3011 58138031 56223056 54403967 52681464 51124334 49603997 48172327 46864891 45617785
$$ packed form
3063C19245498K8982033K7381789K1794927J2874901L090098n015895j0325896
3056C98027455j3186288j4325345j4307468j3351675j1418605q504056m590917
3049C18343101J78102N426701R469174R412091L876997l796262r713494j3696309
3041C19500101j6663091j8625624j9484450j9332396j8548606j7392523j6090127
3034A93363284j4767563j3374950j2012477j0719369r533866q481523p540114
3027A16933422o669858n992398n346791m880708m404332l990819l685290l402541
3019G8560685l150917k937239k722429k560416k470734k336315k215420k029184
3011E8138031j914975j819089j722503j557130j520337j431670j307436j247106
$$ plain form
3003 45617785 44448540 43352885 42328102 41381019 40465928 39545999 38666766 37841393 37063616
2994 37063616 36312897 35581778 34867952 34127719 33394886 32641311 31859492 31102065 30305698
2985 30305698 29494363 28706214 27898684 27095739 26290285 25484478 24718872 23940230 23263850
2976 23263850 22611529 21994983 21372508 20815909 20282251 19759548 19249256 18787964 18314310
2967 18314310 17795614 17354438 16930310 16479835 16114815 15723709 15347237 15008301 14709953
2958 14709953 14409060 14129552 13894112 13620812 13343062 13062229 12814913 12561413 12283682
2949 12283682 12009445 11756635 11515657 11303284 11098290 10925727 10733631 10530761 10352667
2940 10352667 10159351 9941476 9771437 9622604 9463340 9285579 9146498 9000822 8858704
$$ packed form
3003D5617785j169245j095655j024783r47083r15091r19929q79233q25373p77777
2994C7063616p50719p31119p13826p40233p32833p53575p81819p57427p96367
2985C0305698q11335p88149q07530q02945q05454q05807p65606p78642o76380
2976B3263850o52321o16546o22475n56599n33658n22703n10292m61292m73654
2967A8314310n18696m41176m24128m50475l65020l91106l76472l38936k98348
2958A4709953l00893k79508k35440k73300k77750k80833k47316k53500k77731
2949A2283682k74237k52810k40978k12373k04994j72563j92096k02870j78094
2940A0352667j93316k17875j70039j48833j59264j77761j39081j45676j42118
$$ plain form
2931 8858704 8670954 8495820 8371451 8257311 8116323 7978964 7847544 7733579 7608581 7481870
2921 7481870 7367453 7287308 7221994 7138706 7032260 6950953 6887127 6807709 6716150 6603490 6470738
2910 6470738 6378794 6260471 6156379 6046398 5956199 5861081 5778777 5712366 5624218 5569487 5506145
2899 5506145 5411680 5322952 5275395 5163588 5033548 4917724 4835149 4720343 4631927 4588362 4551090
2888 4551090 4502871 4446236 4362143 4309086 4243081 4200139 4175876 4102252 4060910 4004635 3952575
2877 3952575 3939087 3899431 3867239 3816858 3807043 3772640 3754096 3722557 3670211 3630439 3616994 3599153
2865 3599153 3577426 3549996 3538423 3532003 3519989 3489317 3451779 3360792 3335456 3311523 3251350 3232445
2853 3232445 3200740 3147574 3102353 3081191 3067390 3065227 3046186 3033952 3079159 3123802 3158746 3176306
$$ packed form
2931H858704j87750j75134j24369j14140j40988j37359j31420j13965j24998j26711
2921G481870j14417q0145o5314q3288j06446q1307o3826p9418r1559j12660j32752
2910F470738r1944j18323j04092j09981r0199r5118q2304o6411q8148n4731o3342
2899E506145r4465q8728m7557j11807j30040j15824q2575j14806q8416m3565l7272
2888D551090m8219n6635q4093n3057o6005m2942k4263p3624m1342n6275n2060
2877C952575j3488l9656l2192n0381r815l4403j8544l1539n2346l9772j3445j7841
2865C599153k1727k7430j1573o420j2014l0672l7538r0987k5336k3933o0173j8905
2853C232445l1705n3166m5221k1162j3801k163j9041j2234M5207M4643L4944J7560
$$ plain form
2841 3176306 3108560 3007895 2961532 2915222 2821925 2734991 2673854 2571791 2509432 2509627 2476333
2830 2476333 2449117 2436229 2441550 2378410 2367807 2318682 2290661 2327157 2341887 2307786 2312118 2288362
2818 2288362 2317974 2332948 2349197 2349877 2350691 2354464 2354083 2351427 2344540 2375946 2384066 2367489 2346870
2805 2346870 2350155 2353316 2329178 2304121 2290519 2262212 2266488 2285603 2287409 2312029 2319344 2344004
2793 2344004 2383365 2381670 2388032 2415307 2428685 2475935 2515674 2521979 2578758 2646442 2723939 2810825
2781 2810825 2914619 3001385 3153747 3212862 3269962 3293174 3285287 3240920 3182345 3123433 3051613
2770 3051613 2989013 2917062 2908486 2847924 2802416 2833785 2811078 2812254 2814752 2757840 2678500 2591158
2758 2591158 2522306 2422396 2248338 2177036 2089107 1982468 1896365 1787750 1704371 1619292 1543655
$$ packed form
2841C176306o7746j00665m6363m6310r3297q6934o1137j02063o2359J95l3294
2830B476333k7216j2888N321o3140j0603m9125k8021L6496J4730l4101M332k3756
2818B288362K9612J4974J6249O80Q14L773l81k656o887L1406Q120j6577k0619
2805B346870L285L161k4138k5057j3602k8307M276J9115J806K4620P315K4660
2793B344004L9361j695O362K7275J3378M7250L9739O305N6779O7684P7497Q6886
2781B810825J03794Q6766J52362N9115N7100K3212p887m4367n8575n8912p1820
2770C051613o2600p1951q576o0562m5508L1369k2707J176K498n6912p9340q7342
2758B591158o8852r9910j74058p1302q7929j06639q6103j08615q3379q5079p5637
$$ plain form
2747 1543655 1446369 1413636 1361404 1321628 1298773 1283904 1257934 1252719 1209883 1187571 1104853 1000827
2735 1000827 944910 906964 850344 835643 817000 826292 843806 801678 774263 754222 705476 703185
2723 703185 681982 651314 648018 627474 606291 626346 618567 627092 598879 589552 570616 558630
2711 558630 557933 533509 549080 539212 524631 504616 516606 530634 502639 519795 533437 529083
2699 529083 539509 539800 545701 545558 504450 454774 503675 518107 558714 549876 593648 601693 618053
2686 618053 637124 629039 607364 587414 558202 569973 555887 536570 519818 543693 549511 565884
2674 565884 598305 610523 598453 548197 526761 481722 489932 514714 516156 482284 497504 492991
2662 492991 526401 504500 502929 522356 465571 472637 463171 444097 473991 438643 427226 425565
$$ packed form
2747A543655r7286l2733n2232l9776k2855j4869k5970n215m2836k2312q2718j04026
2735A000827n5917l7946n6620j4701j8643R292J7514m2128k7415k0041m8746k291
2723G03185k1203l0668l296k0544k1183K0055p779Q525k8213r327j8936j1986
2711E58630o97k4424J5571r868j4581k0015J1990J4028k7995J7156J3642m354
2699E29083J0426K91N901j43m1108m9676M8901J4432M0607q838M3772Q045J6360
2686F18053J9071q085k1675j9950k9212J1771j4086j9317j6752K3875N818J6373
2674E65884L2421J2218j2070n0256k1436m5039Q210K4782J442l3872J5220m513
2662D92991L3410k1901j571J9427n6785P066r466j9074K9894l5348j1417j661
$$ plain form
2650 425565 459011 453944 471008 464782 444047 472678 470876 458687 455109 463847 410137 396329 357440
2637 357440 395729 412690 450201 465733 449202 421747 441573 426493 434044 449715 493119 494243
2625 494243 432494 399735 419692 429889 426658 376379 375706 413689 354405 325064 373777 423438
2613 423438 408741 392044 419743 410170 399829 393165 422596 456281 415805 379908 338748 356182
2601 356182 347182 318637 304224 304419 331089 388803 397550 357042 329732 326602 334860 332851 308822
2588 308822 302830 325591 340593 313566 320121 295462 280547 265283 257658 222897 237615 261795
2576 261795 293162 286106 267672 235559 216839 241838 257362 240315 270388 267513 266914 235321
2564 235321 253289 281610 271665 263595 258189 269862 257566 243083 238757 226209 213829 227177
$$ packed form
2650D25565L3446n067J7064o226k0735K8631j802j2189l578Q738n3710j3808l8889
2637C57440L8289J6961L7511J5532j6531k7455J9826j5080P551J5671M3404J124
2625D94243o1749l2759J9957J0197l231n0279o73L7983n9284k9341M8713M9661
2613D23438j4697j6697K7699r573j0341o664K9431L3685m0476l5897m1160J7434
2601C56182r000k8545j4413J95K6670N7714Q747m0508k7310l130Q258k009k4029
2588C08822n992K2761J5002k7027O555k4659j4915j5264p625l4761J4718K4180
2576B61795L1367p056j8434l2113j8720K4999J5524j7047L0073k875n99l1593
2564B35321J7968K8321r945q070n406J1673j2296j4483m326j2548j2380J3348
$$ plain form
2552 227177 265272 264447 222265 233094 223214 222421 254490 257693 242412 223801 210526 218301 239811
2539 239811 246293 210775 185354 180783 197949 162197 149892 155143 108486 66556 85826 97556
2527 97556 57774 71360 76820 76911 61951 42847 60300 62252 86002 105633 76959 68560 68466 39544
2513 39544 55663 44695 22801 17633 -6600 13344 13457 15255 36959 68019 59591 20621 15128
2500 15128 1541 34265 80313 49755 37551 61241 51206 46715 36134 49689 20355 13610
2488 13610 37139 67332 62449 27557 -3377 16061 23208 22897 47795 45073 40738 44941 32302
2475 32302 10114 20818 4677 4703 36372 38512 51577 50739 44949 26491 33264 33721 57965 43540
2461 43540 35144 14571 27114 46443 48886 56340 41172 24912 21066 20680 20351 61545 64646 69380
$$ packed form
2552B27177L8095q25m2182J0829r880p93L2069L203j5281j8611j3275P775K1510
2539B39811O482l5518k5421m571J7166l5752j2305N251m6657m1930J9270J1730
2527I7556l9782J3586N460R1j4960j9104J7453J952K3750J9631k8674q399r4k8922
2513C9544J6119j0968k1894n168k4233J9944J13J798K1704L1060q428l8970n493
2500A5128j3587L2724M6048l0558j2204K3690j0035m491j0581J3555k9334o745
2488A3610K3529L0193m883l4892l0934J9438P147l11K4898k722m335M203j2639
2475C2302k2188J0704j6141K6L1669K140J3065q38n790j8458O773M57K4244j4425
2461D3540q396k0573J2543J9329K443P454j5168j6260l846l86l29M1194L101M734
$$ plain form
2447 69380 58262 29858 35641 82587 80797 68567 52167 49731 32135 63592 108665 84949
2435 84949 66280 30066 -222 15079 9612 25029 14142 45180 45950 52722 69635 60131 94762
2422 94762 80161 112170 113337 93522 64257 62698 125504 141878 101651 115439 104550 98939
2410 98939 105271 115108 138349 154244 136221 132165 134328 125137 156434 169963 152541 132370 121950
2397 121950 129134 157377 113435 135386 144142 141354 148552 182936 237603 217494 198173 186654
2385 186654 189250 167717 169510 144675 134066 137930 176216 173709 212568 202829 207483 206569 188506
2372 188506 213272 189936 197112 224647 245981 236297 216285 227400 251447 287703 280576 276220
2360 276220 340011 355327 348334 381769 387786 372698 380808 390230 365660 395201 446840 514045
$$ packed form
2447F9380j1118k8404N783M6946j790j2230j6400k436j7596L1457M5073k3716
2435H4949j8669l6214l0288J5301n467J5417j0887L1038P70O772J6913r504L4631
2422I4762j4601L2009J167j9815k9265j559O2806J6374m0227J3788j0889n611
2410I8939O332R837K3241J5895j8023m056K163r191L1297J3529j7422k0171j0420
2397A21950P184K8243m3942K1951Q756k788P198L4384N4667k0109j9321j1519
2385A86654K596k1533J793k4835j0609L864L8286k507L8859r739M654r14j8063
2372A88506K4766k3336P176K7535K1334r684k0012J1115K4047L6256p127m356
2360B76220O3791J5316o993L3435O017j5088Q110R422k4570K9541N1639O7205
$$ plain form
2348 514045 564816 661492 790652 925776 1117180 1296592 1410145 1449855 1461646 1485434 1515354
2337 1515354 1592575 1746676 2049357 2499403 3137459 4109873 5711062 8681241 13672078
2328 13672078 17804419 16284116 12760362 10483679 8667257 7059783 5650220 4582357
2320 4582357 3751107 3107989 2595088 2189727 1888007 1661042 1582807 1540239 1359558 1168638
2310 1168638 1011339 965373 893991 834465 769939 737899 692656 658589 584957 548085 546719
2299 546719 548585 465101 440338 380722 343489 340478 298539 260133 271817 315827 294121 292800
2287 292800 301357 280363 290172 283030 284744 317241 305244 278810 227402 184126 194189 169336
2275 169336 176922 185018 194781 218555 162265 136387 116636 127307 155921 126892 123917 111386
$$ packed form
2348E14045N0771R6676J29160J35124J91404J79412J13553L9710J1791K3788K9920
2337A515354P7221J54101L02681M50046O38056R72414J601189K970179M990837
2328A3672078M132341j520303l523754k276683j816422j607474j409563j067863
2320D582357q31250o43118n12901m05361l01720k26965p8235m2568j80681j90920
2310A168638j57299m5966p1382n9526o4526l2040m5243l4067p3632l6872j366
2299E46719J866q3484k4763n9616l7233l011m1939l8406J1684M4010k1706j321
2287B92800Q557k0994R809p142J714L2497j1997k6434n1408m3276J0063k4853
2275A69336P586Q096R763K3774n6290k5878j9751J0671K8614k9029k975j2531
$$ plain form
2263 111386 132960 109479 118659 142947 127578 93489 85669 79233 64075 56074 60661 55424 32802
2250 32802 22961 72394 81300 38099 4318 -5526 13767 15881 15941 27768 18716 16195 11640 23086
2236 23086 31491 24761 -14764 -34554 4659 2186 -15415 20993 -660 -3764 11527 6417 7380
2223 7380 -210 -24454 15327 -23701 -34192 -34555 -39984 -49307 -39754 -60315 -79784 -60427 -71077
2210 -71077 -65490 -73921 -53150 -50680 -41492 -43746 -47778 -69906 -47100 -36022 -80870 -84074 -45355
2197 -45355 -18690 -68359 -102100 -53205 -49725 -55652 -83654 -94013 -88978 -76890 -81471 -89047 -96362
2184 -96362 -56314 -60365 -47621 -75019 -58465 -87657 -87918 -86500 -132448 -131098 -105612 -87064 -109040
2171 -109040 -113220 -73179 -81753 -80626 -87023 -84607 -75557 -46127 -92057 -105959 -86721 -111318 -109380
$$ packed form
2263A11386K1574k3481R180K4288j5369l4089p820o436j5158q001M587n237k2622
2250C2802r841M9433Q906m3201l3781r844J9293K114O0J1827r052k521m555J1446
2236B3086Q405o730l9525j9790L9213k473j7601L6408k1653l104J5291n110R63
2223G380p590k4244L9781l9028j0491l63n429r323R553k0561j9469J9357j0650
2210g1077N587q431K0771K470R188k254m032k2128K2806J1078m4848l204L8719
2197d5355K6665m9669l3741M8895L480n927k8002j0359N035J2088m581p576p315
2184i6362M0048m051J2744k7398J6554k9192k61J418m5948J350K5486J8548k1976
2171a09040m180M0041q574J127o397K416R050K9430m5930j3902J9238k4597J938
$$ plain form
2158 -109380 -103803 -101109 -110731 -107643 -89077 -80696 -76717 -67478 -76984 -81339 -71142 -62098 -95684 -85279
2144 -85279 -104055 -79486 -97279 -92314 -73649 -110042 -129282 -116051 -91512 -80245 -95969 -90792
2132 -90792 -67386 -74686 -61689 -60348 -80172 -102960 -124852 -90556 -87509 -108648 -103719 -62782 -57581
2119 -57581 -57754 -91473 -112955 -57585 -42876 -36116 -64581 -93977 -97811 -77250 -84023 -72152 -68645
2106 -68645 -112928 -124527 -140217 -148852 -124856 -97204 -111312 -108479 -139622 -83834 -29594 -35259
2094 -35259 -54520 -79264 -84069 -91633 -78137 -108897 -97554 -103150 -119601 -139400 -112440 -88702
2082 -88702 -96110 -88476 -85685 -102684 -102223 -94249 -143925 -126717 -135048 -115723 -116059 -98556 -80272 -84248
2068 -84248 -89321 -103295 -90150 -87191 -64977 -89905 -73227 -45795 -39377 -24990 -21799 -25109 9
$$ packed form
2158a09380N577K694r622L088J8566Q381L979R239r506m355J0197R044l3586J0405
2144h5279j8776K4569j7793M965J8665l6393j9240J3231K4539J1267j5724N177
2132i0792K3406p300J2997J341j9824k2788k1892L4296L047k1139M929M0937N201
2119e7581j73l3719k1482N5370J4709O760k8465k9396l834K0561o773J1871L507
2106f8645m4283j1599j5690q635K3996K7652j4108K833l1143N5788N4240n665
2094c5259j9261k4744m805p564J3496l0760J1343n596j6451j9799K6960K3738
2082h8702p408P634K791j6999M61P974m9676J7208q331J9325l36J7503J8284l976
2068h4248n073j3974J3145K959K2214k4928J6678K7432O418J4387L191l310K5118
$$ plain form
2055 9 -25453 -56380 -64263 -70376 -52321 -87968 -133791 -138105 -108678 -80849 -94706 -119605 -88555
2042 -88555 -48386 -70022 -88751 -74770 -71832 -113283 -141011 -127593 -90064 -77653 -77220 -85323 -75769
2029 -75769 -89975 -71112 -83012 -89479 -80161 -78915 -99921 -111219 -79111 -102211 -102743 -117996 -105048
2016 -105048 -96810 -90663 -96247 -102681 -124481 -164736 -154097 -115911 -136132 -127048 -133075 -115047 -103935
2003 -103935 -112010 -72166 -90087 -109355 -132244 -150118 -140019 -142190 -139585 -140939 -122123 -102300
1991 -102300 -120826 -124997 -142979 -123521 -101026 -90988 -67985 -80208 -105583 -133286 -119413 -116606
1979 -116606 -139220 -113638 -97184 -65045 -36338 -48756 -70306 -73370 -107606 -102780 -90665 -81901
1967 -81901 -79240 -71066 -77088 -94958 -60997 -51581 -87484 -139085 -96490 -83969 -126847 -157448 -179582
$$ packed form
2055Ik5462l0927p883o113J8055l5647m5823m314K9427K7829j3857k4899L1050
2042h8555M0169k1636j8729J3981K938m1451k7728J3418L7529J2411M33q103R554
2029g5769j4206J8863j1900o467R318J246k1006j1298L2108k3100n32j5253J2948
2016a05048Q238O147n584o434k1800m0255J0639L8186k0221R084o027J8028J1112
2003a03935q075L9844j7921j9268k2889j7874J0099k171K605j354J8816J9823
1991a02300j8526m171j7982J9458K2495J0038K3003j2223k5375k7703J3873K807
1979a16606k2614K5582J6454L2139K8707j2418k1550l064l4236M826J2115Q764
1967h1901K661Q174o022j7870L3961R416l5903n1601M2595J2521m2878l0601k2134
$$ plain form
1954 -179582 -146872 -124452 -116757 -136986 -132204 -61699 -48479 -83713 -93748 -92836 -91101 -100685 -111550
1941 -111550 -124265 -145354 -101703 -122840 -106186 -101998 -65806 -64432 -89030 -114394 -158436 -187860
1929 -187860 -164236 -154772 -143706 -121193 -107497 -100650 -126077 -122797 -115428 -101273 -116594 -87442
1917 -87442 -97320 -111585 -85930 -94290 -112366 -119206 -144814 -135058 -122959 -119987 -122607 -122845 -144195
1904 -144195 -119003 -119803 -115654 -127415 -139437 -156466 -160740 -121198 -88790 -108349 -130533 -108317
1892 -108317 -135173 -97078 -69858 -106777 -128134 -112657 -116683 -128249 -145008 -141331 -165265 -170756
1880 -170756 -128586 -88446 -109534 -113932 -103531 -130302 -144942 -178196 -142434 -141526 -132604 -141971 -124420
1867 -124420 -131909 -135697 -142675 -123927 -110307 -128612 -111689 -124312 -146089 -95408 -94978 -145324 -137743
$$ packed form
1954a79582L2710K2420P695k0229M782P0505J3220l5234j0035R12J735r584j0865
1941a11550j2715k1089M3651k1137J6654M188L6192J374k4598k5364m4042k9424
1929a87860K3624R464J1066K2513J3696O847k5427L280P369J4155j5321K9152
1917h7442r878j4265K5655q360j8076o840k5608R756J2099K972k620k38k1350
1904a44195K5192q00M149j1761j2022j7029m274L9542L2408j9559k2184K2216
1892a08317k6856L8095K7220l6919k1357J5477m026j1566j6759L677k3934n491
1880a70756M2170M0140k1088m398J0401k6771j4640l3254L5762R08Q922r367J7551
1867a24420p489l788o978J8748J3620j8305J6923j2623k1777N0681M30n0346P581
$$ plain form
1854 -137743 -136464 -127180 -129725 -134594 -118078 -102929 -114924 -105985 -99093 -113316 -117967 -98144 -87428
1841 -87428 -78055 -80050 -123095 -120533 -84445 -104662 -93833 -104677 -115910 -74166 -82877 -102420 -121270
1828 -121270 -108125 -75294 -55283 -76419 -73952 -102240 -121535 -91088 -161309 -172874 -143311 -104490
1816 -104490 -131553 -130304 -131322 -136882 -117899 -125333 -99509 -109359 -96532 -99249 -92938 -100753 -124938
1803 -124938 -77091 -74705 -66449 -57253 -62805 -68701 -62397 -29653 -47449 -73814 -101126 -111195 -124019
1790 -124019 -123844 -94295 -88890 -106375 -128860 -102245 -89911 -96211 -119079 -147717 -122112 -114409 -146566
1777 -146566 -122135 -104626 -92852 -79198 -97608 -117595 -120302 -124552 -135252 -127515 -121161 -98024
1765 -98024 -131565 -126287 -144485 -111891 -107112 -154665 -144368 -108287 -104208 -128594 -161244 -137366
$$ packed form
1854a37743J279R284k545m869J6516J5149j1995Q939O892j4223m651J9823J0716
1841h7428R373j995m3045K562L6088k0217J0829j0844j1233M1744q711j9543j8850
1828a21270J3145L2831K0011k1136K467k8288j9295L0447p0221j1565K9563L8821
1816a04490k7063J249j018n560J8983p434K5824r850J2827k717O311p815k4185
1803a24938M7847K386Q256R196n552n896O304L2744j7796k6365k7312j0069j2824
1790a24019J75K9549N405j7485k2485K6615J2334o300k2868k8638K5605P703l2157
1777a46566K4431J7509J1774J3654j8410j9987k707m250j0700P737O354K3137
1765i8024l3541N278j8198L2594M779m7553J0297L6081M079k4386l2650K3878
$$ plain form
1753 -137366 -97674 -102231 -118209 -120183 -102226 -80372 -70854 -61070 -59624 -83062 -79191 -98675 -101515
1740 -101515 -111313 -110733 -83104 -90439 -81558 -90897 -85249 -84350 -118339 -121914 -108732 -99412 -123259 -138590
1726 -138590 -126554 -87109 -115823 -131382 -110878 -73333 -79679 -72921 -82907 -62602 -60439 -85623
1714 -85623 -74583 -91722 -95585 -76243 -121814 -89942 -81560 -102683 -115899 -102509 -87691 -91797
1702 -91797 -97698 -109000 -90230 -81165 -131428 -140398 -131370 -98038 -68973 -72213 -86072 -74166 -61992
1689 -61992 -38187 -43970 -63221 -57424 -73195 -86931 -110957 -125046 -145117 -117663 -96295 -110380
1677 -110380 -121036 -100560 -99519 -94085 -107506 -103067 -110811 -90435 -103638 -117325 -118911 -98826 -76659
1664 -76659 -75944 -72050 -86777 -112726 -102261 -93005 -96394 -135092 -124105 -130878 -128216 -131902 -123552 -117411
$$ packed form
1753a37366L9692m557j5978j974J7957K1854R518R784J446k3438L871j9484k840
1740a01515r798N80K7629p335Q881r339N648Q99l3989l575J3182R320k3847j5331
1726a38590J2036L9445k8714j5559K0504L7545o346O758r986K0305K163k5184
1714h5623J1040j7139l863J9342m5571L1872Q382k1123j3216J3390J4818m106
1702i1797n901j1302J8770R065n0263q970R028L3332K9065l240j3859J1906J2174
1689f1992K3805n783j9251N797j5771j3736k4026j4089k0071K7454K1368j4085
1677a10380j0656K0476J041N434j3421M439p744K0376j3203j3687j586K0085K2167
1664g6659P15L894j4727k5949J0465R256l389l8698J0987o773K662l686Q350O141
$$ plain form
1650 -117411 -121614 -143061 -109054 -99424 -72033 -81649 -88997 -44951 -52797 -77991 -88975 -89690 -93806
1637 -93806 -56363 -57566 -59859 -73290 -80473 -68285 -46081 -33504 -52980 -24881 1320 -7801 -29021
1624 -29021 -61217 -88043 -79430 -104191 -94734 -97148 -97340 -68360 -117951 -133059 -98491 -135380 -157042
1611 -157042 -125434 -96121 -82211 -75711 -57254 -36867 -51997 -76371 -67061 -73875 -90599 -116184
1599 -116184 -110341 -55596 -45835 -101551 -78113 -87604 -110004 -106104 -130634 -110645 -87861 -116385
1587 -116385 -80282 -77230 -65961 -60296 -67902 -109811 -145011 -158165 -172808 -173770 -149100 -145626 -125552
1574 -125552 -107470 -76241 -64410 -75081 -93125 -120913 -109459 -113963 -82792 -29607 -40669 -61151
1562 -61151 -71837 -76717 -51728 -58830 -79607 -64841 -61912 -74194 -73306 -77122 -89110 -62001 -41494
$$ packed form
1650a17411m203k1447L4007R630K7391r616p348M4046p846k5194j0984p15m116
1637i3806L7443j203k293j3431p183J2188K2204J2577j9476K8099K6201r121k1220
1624b9021l2196k6826Q613k4761R457k414j92K8980m9591j5108L4568l6889k1662
1611a57042L1608K9313J3910O500J8457K0387j5130k4374R310o814j6724k5585
1599a16184N843N4745R761n5716K3438r491k2400L900k4530J9989K2784k8524
1587a16385L6103L052J1269N665p606m1909l5200j3154j4643r62K4670L474K0074
1574a25552J8082L1229J1831j0671j8044k7788J1454m504L1171N3185j1062k0482
1562f1151j0686m880K4989p102k0777J4766K929j2282Q88l816j1988K7109K0507
$$ plain form
1549 -41494 -62487 -99417 -114633 -129256 -120515 -118964 -99516 -63071 -22799 2952 -30132 -61593
1537 -61593 -60893 -53593 -58211 -57901 -42091 -70271 -100157 -90249 -95265 -69654 -80052 -97856 -92969 -123021
1523 -123021 -113066 -68911 -89403 -64028 -63585 -35649 -59439 -89571 -92748 -100666 -110120 -68623 -82694
1510 -82694 -72291 -53188 -63056 -38313 -36620 -41915 -49206 -28698 -60669 -87816 -57764 -54717 -30751
1497 -30751 -18718 -47610 -63251 -81892 -97087 -134476 -103850 -107379 -71762 -60563 -58773 -81218
1485 -81218 -59179 -74702 -78491 -60807 -56351 -53733 -73140 -58907 -43160 -112334 -103610 -94275 -63576
1472 -63576 -38537 -74321 -82811 -74774 -55900 -68582 -76066 -75223 -54340 -37999 -57071 -63944 -55450
1459 -55450 -73110 -73304 -74080 -66818 -70264 -41074 -65361 -64205 -32482 -46462 -90750 -72825 -98510
$$ packed form
1549d1494k0993l6930j5216j4623Q741J551J9448L6445M0272K5751l3084l1461
1537f1593P00P300m618L10J5810k8180k9886R908n016K5611j0398j7804M887l0052
1523a23021R955M4155k0492K5375M43K7936k3790l0132l177p918r454M1497j4071
1510h2694J0403J9103r868K4743J693n295p291K0508l1971k7147L0052L047K3966
1497c0751J2033k8892j5641j8641j5195l7389L0626l529L5617J1199J790k2445
1485h1218K2039j5523l789J7684M456K618j9407J4233J5747o9174Q724R335L0699
1472f3576K5039l5784q490Q037J8874j2682p484Q43K0883J6341j9072o873Q494
1459e5450j7660j94p76P262l446K9190k4287J156L1723j3980m4288J7925k5685
$$ plain form
1446 -98510 -83488 -88994 -75004 -48887 -25005 -37192 -66604 -70970 -55689 -70529 -53465 -30525
1434 -30525 -18214 -49083 -74887 -67200 -48403 -59027 -66596 -40447 -43717 5242 4718 -49180 -74835
1421 -74835 -38722 -19121 -38694 -47645 -33859 -42452 -61983 -73146 -82790 -114677 -116945 -116531 -104376
1408 -104376 -63447 -68433 -86622 -74773 -73333 -85666 -57352 -58205 -47040 -60251 -28575 9786
1396 9786 1808 -34772 -76408 -55903 -71402 -54017 -57853 -69215 -40834 -27213 -49974 -60584
1384 -60584 -58668 -26078 -58140 -58132 -32906 -50150 -70603 -84406 -72560 -39815 -37609 -49151 -35558
1371 -35558 -29406 2644 6669 22401 37227 6718 -23007 -33596 -38328 -14489 -23906 -26043 -15850
1358 -15850 -24862 -22799 -33925 -12008 -48259 -50742 -66817 -70007 -67064 -60812 -56795 -59485 -52030 -50174
$$ packed form
1446i8510J5022n506J3990K6117K3882j2187k9412m366J5281j4840J7064K2940
1434c0525J2311l0869k5804P687J8797j0624p569K6149l270M8959n24n3898k5655
1421g4835L6113J9601j9573q951J3786q593j9531j1163r644l1887k268M14J2155
1408a04376M0929m986j8189J1849J440j2333K8314q53J1165j3211L1676L8361
1396I786p978l6580m1636K0505j5499J7385l836j1362K8381J3621k2761j0610
1384f0584J916L2590l2062QK5226j7244k0453j3803J1846L2745K206j1542J3593
1371c5558O152L2050M025J5732J4826l0509k9725j0589m732K3839r417k137J0193
1358a5850r012K063j1126K1917l6251k483j6075l190K943O252M017k690P455J856
$$ plain form
1344 -50174 -871 -7239 -31415 -29046 -5182 21542 -4168 -11087 -33672 -52986 -80724 -74770 -68305
1331 -68305 -49068 -40136 -29106 -30932 -32653 -24364 -50207 -20074 -11693 -5959 -14967 -10718 -34194
1318 -34194 -40959 -52859 -44263 -33087 -42819 -60388 -59965 -55127 -27786 -8369 -43287 -67790 -69727
1305 -69727 -65695 -26846 -35392 -41590 -27732 -34998 -10805 -25291 -42810 -31917 -32261 -26063 -12370
1292 -12370 -23316 -34410 -32923 5029 -21571 -39194 -18420 -49069 -45994 -51198 -48249 -31098 -59480
1279 -59480 -18609 11514 -15586 3448 9539 -15012 -5484 16153 10604 306 -14793 1791
1267 1791 -21293 -4126 12512 -4459 -11803 -39627 -23280 -28174 -12547 12530 -26403 -23635 -553
1254 -553 -18418 -35982 -29955 -6624 -13210 4912 -10319 -4994 -2536 -23661 -5001 -2352 -28433
$$ packed form
1344e0174M9303o368k4176K369K3864K6724k5710o919k2585j9314k7738N954O465
1331f8305J9237Q932J1030j826j721Q289k5843L0133Q381N734r008M249k3476
1318c4194o765j1900Q596J1176r732j7569M23M838K7341J9417l4918k4503j937
1305f9727M032L8849q546o198J3858p266K4193j4486j7519J0893l44O198J3693
1292a2370j0946j1094J487L7952k6600j7623K0774l0649L075n204K949J7151k8382
1279e9480M0871L0123k7100J9034O091k4551R528K1637n549j0298j5099J6584
1267A791k3084J7167J6638j6971p344k7824J6347m894J5627K5077l8933K768K3082
1254e53j7865j7564O027K3331o586J8122j5231N325K458k1125J8660K649k6081
$$ plain form
1241 -28433 -41248 -60131 -65819 -53171 -26668 -5125 -2736 -27539 -11869 1261 9091 18757 -33121
1228 -33121 -44001 -35319 -68732 -35094 7419 21127 59157 23427 -9621 21657 -5220 -22998
1216 -22998 8666 10550 -30360 -24305 -40061 -63544 -28956 -40164 -29737 260 3654 11762 -12972
1203 -12972 -14499 15835 -982 -6631 116 29602 13179 -24903 -27368 2342 -17081 -29707 -19631
1190 -19631 1517 -14778 -23681 -24275 -7193 -26515 -44242 -5489 -14402 -17822 -24765 -25082 -21188 -12933
1176 -12933 -5529 4383 -2977 -10041 -4843 -5064 -15930 -34159 -10422 5591 37531 21870 5671
1163 5671 6339 28800 30335 28183 -1210 16194 35293 6794 -27794 -47418 -59029 -66197 -47809
1150 -47809 -49204 -55222 -49314 -1472 3503 -2727 44097 51117 22000 19898 4694 23296 15113
$$ packed form
1241b8433j2815j8883n688J2648K6503K1543K389k4803J5670J3130P830R666n1878
1228c3121j0880Q682l3413L3638M2513J3708L8030l5730l3048L1278k6877j7778
1216b2998L1664J884m0910O055j5756k3483L4588j1208J0427K9997L394Q108k4734
1203a2972j527L0334j6817n649O747K9486j6423l8082k465K9710j9423j2626J0076
1190a9631K1148j6295q903n94J7082j9322j7727L8753q913l420o943l17L894Q255
1176a2933P404R912p360p064N198k21j0866j8229K3737J6013L1940j5661j6199
1163E671O68K2461J535k152k9393J7404J9099k8499l4588j9624j1611p168J8388
1150d7809j395o018N908M7842M975o230M6824P020k9117k102j5204J8602q183
$$ plain form
1137 15113 -26114 3942 24705 13583 7778 -21507 -39028 -13975 7506 9614 -9619 -14153
1125 -14153 -22811 -26018 29915 8750 -26898 -41219 10344 17408 18390 12856 -9302 -15085 -15451 1847
1111 1847 -8274 -6550 1302 57474 46248 20035 43805 16574 13052 24349 23145 -4184 20395
1098 20395 39789 12394 -3080 21560 4245 -11324 -3833 12134 39143 27691 28749 53845
1086 53845 74909 41765 -5230 11765 22310 10385 75 -13515 -10567 14417 -33913 -41417
1074 -41417 -43311 -39827 -41851 -44395 -21119 -5010 37104 41226 30292 22159 9505 9752 12762 6597
1060 6597 30355 37723 13262 7791 16082 48571 25760 -4168 -7809 2771 519 37723 57659
1047 57659 44119 59570 25640 8975 10254 18088 24540 19896 17399 28793 4139 -11812 -161
$$ packed form
1137A5113m1227L0056K0763j1122n805k9285j7521K5053K1481K108j9233m534
1125a4153q658l207N5933k1165l5648j4321N1563P064R82n534k2158n783l66J7298
1111A847j0121J724P852N6172j1226k6213K3770k7231l522J1297j204k7329K4579
1098B0395J9394k7395j5474K4640j7315j5569P491J5967K7009j1452J058K5096
1086E3845K1064l3144m6995J6995J0545j1925j0310j3590K948K4984m8330p504
1074d1417j894L484k024k544K3276J6109M2114M122j0934q133j2654K47L010o165
1060F597K3758P368k4461n471Q291L2489k2811k9928l641J0580k252L7204J9936
1047E7659j3540J5451l3930j6665J279P834O452m644k497J1394k4654j5951J1651
$$ plain form
1034 -161 18563 10257 36930 10872 -10455 15055 39224 32564 36711 44188 29487 6973 13275
1021 13275 19031 16952 15365 24668 29533 16623 -13191 -14344 -6896 -793 -6555 -26701 -10519 12433
1007 12433 26167 21353 -8833 35001 52335 46396 2600 6317 32887 50605 44893 -4531 4068
994 4068 15955 -6100 16345 5463 31607 33810 -30726 -6843 3277 27136 39218 44697 64259
981 64259 72562 70682 66743 24807 47405 70448 89809 43360 45713 45363 58908 82465 75072
968 75072 90977 50777 32028 14275 39391 51077 34609 35705 28723 27134 40757 36541 42567
955 42567 19932 24693 30738 5550 26281 61515 49492 55550 44127 53442 70115 28150 55722
942 55722 51248 22468 34417 36268 34657 72952 50916 68200 44808 45158 57499 79346 97124
$$ packed form
1034a61J8724q306K6673k6058k1327K5510K4169o660M147P477j4701k2514O302
1021A3275N756k079j587R303M865j2910k9814j153P448O103n762k0146J6182K2952
1007A2433J3734m814l0186M3834J7334n939m3796L717K6570J7718n712m9424Q599
994D068J1887k2055K2445j0882K6144K203o4536K3883J0120K3859J2082N479J9562
981F4259Q303j880l939m1936K2598K3043J9361m6449K353l50J3545K3557p393
968G5072J5905m0200j8749j7753K5116J1686j6468J096o982j589J3623m216O026
955D2567k2635M761O045k5188K0731L5234j2023O058j1423R315J6673m1965K7572
942E5722m474k8780J1949J851j611L8295k2036J7284k3392L50J2341K1847J7778
$$ plain form
929 97124 83237 33543 47875 63050 52549 43776 69410 34419 16207 39759 -83 4421
917 4421 -442 -171 22953 30523 41013 25666 52934 80298 58945 16254 37766 48709 36059
904 36059 26849 -6826 16942 -10235 -21396 -12596 19144 34247 46134 26978 43885 31708
892 31708 23206 35617 58687 51741 38942 1156 23580 17087 4784 15749 32683 23257 18221
879 18221 16166 31215 7756 28427 -5246 -17059 15565 30736 4083 -11895 -743 26675
867 26675 53520 71307 89952 40244 8865 -7603 12992 25819 51384 19259 22270 38192
855 38192 22274 34945 46736 14811 31943 51730 45412 57823 61888 59070 71331 33976 47977
842 47977 30137 24500 18977 7224 19163 43120 77661 73125 73177 74620 65406 50868 19205 15613
$$ packed form
929I7124j3887m9694J4332J5175j0501q773K5634l4991j8212K3552l9842M504
917D421m863K71K3124P570J0490j5347K7268K7364k1353m2691K1512J0943j2650
904C6059r210l3675K3768k7177j1161Q800L1740J5103J1887j9156J6907j2177
892C1708q502J2411K3070o946j2799l7786K2424o493j2303J0965J6934r426n036
879A8221k055J5049k3459K0671l3673j1813L2624J5171k6653j5978J1152K7418
867B6675K6845J7787J8645m9708l1379j6468K0595J2827K5565l2125L011J5922
855C8192j5918J2671J1791l1925J7132J9787o318J2411M065k818J2261l7355J4001
842D7977j7840n637n523j1753J1939K3957L4541m536N2J443r214j4538l1663l592
$$ plain form
828 15613 15158 52357 42681 22334 28889 49993 82696 90857 74803 34489 13240 56783 46424
815 46424 25005 27255 13898 -3909 -21425 -12954 42125 80263 92809 70810 54760 64410 61884
802 61884 69403 54059 63575 21353 30440 41399 58487 37240 27337 25756 49164 58185 58682 65858
788 65858 60453 56753 82693 79238 63673 41991 74082 88389 77298 72598 37521 63230 36439
775 36439 20486 43066 73608 51901 71719 47207 79292 73873 46247 41798 344 15747
763 15747 43644 48618 22993 18186 66365 64309 65322 76946 68924 37660 40975 39457 53813
750 53813 44311 42127 58840 25186 60276 78287 68053 35821 40812 27021 40877 42530 60538
737 60538 47768 14371 28747 39110 54391 32414 58149 82688 97767 76660 46538 59155
$$ packed form
828A5613m55L7199r676k0347O555K1104L2703Q161j6054m0314k1249M3543j0359
815D6424k1419K250j3357j7807j7516Q471N5079L8138J2546k1999j6050R650k526
802F1884P519j5344R516m2222R087J0959J7088k1247r903j581K3408R021M97P176
788F5858n405l700K5940l455j5565k1682L2091J4307j1091m700l5077K5709k6791
775C6439j5953K2580L0542k1707J9818k4512L2085n419k7626m449m1454J5403
763A5747K7897M974k5625m807M8179k056J013J1624q022l1264L315j518J4356
750E3813r502k184J6713l3654L5090J8011j0234l2232M991j3791J3856J653J8008
737F0538j2770l3397J4376J0363J5281k1977K5735K4539J5079k1107l0122J2617
$$ plain form
725 59155 71933 90465 90043 63042 67852 81156 62996 62246 34653 9770 16545 23118 46910
712 46910 64440 55101 79474 70001 51556 38826 36052 37915 54777 61414 81731 71781 73431
699 73431 70823 58804 51382 3483 18087 37441 46615 49704 28184 25131 43585 45705 50102
686 50102 52245 47060 45985 60486 78132 75426 78805 34394 39629 43986 56012 26705 24940 41359
672 41359 54476 52707 57644 67307 69038 84340 67471 55689 47945 53916 42505 56680 107998
659 107998 49349 37187 35623 54290 49304 30728 41251 39914 111862 80635 35867 65625
647 65625 105418 102861 113748 111956 94750 118093 116769 52033 42448 68447 70814 58954 79000
634 79000 87869 123946 114017 99710 105972 99264 105777 104884 100009 110699 98489 100584 68057 98528
$$ packed form
725E9155J2778J8532m22k7001M810J3304j8160p50k7593k4883O775O573K3792
712D6910J7530r339K4373r473j8445j2730k774J863J6862O637K0317r950J650
699G3431k608j2019p422m7899J4604J9354R174L089k1520l053J8454K120M397
686E0102K143n185j075J4501J7646k706L379m4411N235M357J2026k9307j765J6419
672D1359J3117j769M937R663J731J5302j6869j1782p744N971j1411J4175N1318
659A07998n8649j2162j564J8667m986j8576J0523j337P1948l1227m4768K9758
647F5625L9793k557J0887j792j7206K3343j324o4736r585K5999K367j1860K0046
634G9000Q869L6077r929j4307O262o708O513q93m875J0690j2210K095l2527L0471
$$ plain form
620 98528 101103 86230 86123 100215 76423 62729 87381 96389 72062 69286 84803 62721 41358
607 41358 27965 36216 61657 58255 68358 47168 29053 36647 20700 1880 30784 60174 65031
594 65031 69666 91216 62467 57290 85836 93610 81598 70682 78065 84121 116096 114209 91189
581 91189 100198 113971 93642 55531 49898 32367 35996 106132 101687 84409 68842 74401 78664
568 78664 72396 48870 101332 103617 90117 92833 99221 106726 98072 67293 59050 62918 90221 91231
554 91231 76268 73199 100306 80077 57158 37250 33392 82649 96233 66795 71310 87933 88678
541 88678 111196 110721 83263 115965 122688 91886 91527 97156 91489 102339 84454 66626 64247 72534
527 72534 85958 64151 66886 93375 82466 81440 70914 75550 92930 84882 73089 42442 75915
$$ packed form
620I8528K575j4873j07J4092k3792j3694K4652R008k4327k776J5517k2082k1363
607D1358j3393Q251K5441l402J0103k1190j8115P594j5947j8820K8904K9390M857
594F5031M635K1550k8749n177K8546P774j2012j0916P383O056L1975j887k3020
581I1189R009J3773k0329l8111n633j7531L629P0136m445j7278j5567N559M263
568G8664o268k3526N2462K285j3500K716O388P505q654l0779q243L868K7303J010
554I1231j4963l069K7107k0229k2919j9908l858M9257J3584k9438M515J6623P45
541H8678K2518m75k7458L2702O723l0802l59N629n667J0850j7885j7828k379Q287
527G2534J3424k1807K735K6489j0909j026j0526M636J7380q048j1793l0647L3473
$$ plain form
514 75915 57226 63292 93152 112878 78701 70033 63296 69034 69556 70670 81212 77327 68375 73819
500 73819 77577 60954 62575 71585 74046 92599 73589 56295 64282 73347 83379 54928 71923
487 71923 56078 98787 120869 89629 94654 107888 93990 105791 112198 88590 86227 122929 91767
474 91767 101951 132333 117933 85513 68017 93324 89663 94342 105462 85254 115655 107135 75847
461 75847 64162 79032 89038 88811 141027 112505 87282 77899 82860 57863 42990 86745 96998
448 96998 106671 146801 107941 116028 90832 87112 93551 74578 95085 78773 83861 104910 100967
435 100967 80396 109587 116892 110307 110562 95195 83058 93103 89899 74197 89874 88956 87430
422 87430 63995 88862 110850 112131 55238 79618 114391 101221 116432 85479 71106 89028
$$ packed form
514G5915j8689O066K9860J9726l4177q668o737N738N22J114J0542l885q952N444
500G3819L758j6623J621R010K461J8553j9010j7294P987R065J0032k8451J6995
487G1923j5845M2709K2082l1240N025J3234j3898J1801O407k3608k363L6702l1162
474I1767J0184L0382j4400l2420j7496K5307l661M679J1120k0208L0401q520l1288
461G5847j1685J4870J0006k27N2216k8522k5223r383M961k4997j4873M3755J0253
448I6998R673M0130l8860Q087k5196l720O439j8973K0507j6312N088K1049l943
435A00967k0571K9191P305o585K55j5367j2137J0045l204j5702J5677r18j526
422H7430k3435K4867K1988J281n6893K4380L4773j3170J5211l0953j4373J7922
$$ plain form
410 89028 69488 56378 85091 76813 70535 40074 60557 87718 60953 110030 107367 99422 70127
397 70127 57826 78657 105698 72784 56907 81134 103936 87727 66095 102394 104376 79463
385 79463 65160 75811 84231 80253 56115 32040 19893 77245 100660 81334 84341 99503 66432
372 66432 67502 78204 70220 83116 49016 39754 45951 61017 88375 67315 93259 101171 126844
359 126844 108283 76217 72616 55752 95833 146491 124314 86796 87974 98176 101319 117053
347 117053 79933 69587 84275 113509 87818 69723 77724 73700 102724 116977 124173 121790 100395
334 100395 124332 108229 73891 83902 90177 77037 71084 58683 87834 93647 86378 106930 131054
321 131054 116311 97015 109653 108101 104259 92013 74406 59529 60660 89724 87622 71782 76433
$$ packed form
410H9028j9540j3110K8713q278o278l0461K0483K7161k6765M9077k663p945k9295
397G0127j2301K0831K7041l2914j5877K4227K2802j6209k1632L6299J982k4913
385G9463j4303J0651Q420l978k4138k4075j2147N7352K3415j9326L007J5162l3071
372F6432J070J0702p984J2896l4100r262O197J5066K7358k1060K5944P912K5673
359A26844j8561l2066l601j6864M0081N0658k2177l7518J178J0202L143J5734
347A17053l7120j0346J4688K9234k5691j8095Q001m024K9024J4253P196k383k1395
334A00395K3937j6103l4338J0011O275j3140n953j2401K9151N813p269K0552K4124
321A31054j4743j9296J2638j552l842j2246j7607j4877J131K9064k102j5840M651
$$ plain form
308 76433 57173 66616 76391 68338 66577 87536 82655 54704 34378 46290 69425 87699 85226
295 85226 88384 137578 146550 113804 115379 93955 87689 89268 89878 91819 97962 53566 49994 76561
281 76561 110237 111276 102878 123788 105574 109091 119346 91412 61624 61859 77542 77646 93289
268 93289 95629 124523 118406 120929 116784 89804 74519 89703 105300 124913 136592 123103 102019
255 102019 103468 74393 92276 89671 114192 113086 110051 106051 54632 71713 97712 82777 69866
242 69866 93585 104701 79994 73195 107167 96491 79013 91257 90116 61727 68051 73772 63561
229 63561 71930 96118 69823 103048 95164 105300 119632 126226 132537 108455 92771 78269 61367
216 61367 96990 91037 99719 105300 114235 118371 109739 104629 87228 115925 136609 127567 131306 117232
$$ packed form
308G6433j9260R443R775q053j761K0959m881k7951k0326J1912K3135J8274k473
295H5226L158M9194Q972l2746J575k1424o266J579O10J941O143m4396l572K6567
281G6561L3676J039q398K0910j8214L517J0255k7934k9788K35J5683J04J5643
268I3289K340K8894o117K523m145k6980j5285J5184J5597J9613J1679j3489k1084
255A02019J449k9075J7883k605K4521j106l035m000n1419J7081K5999j4935j2911
242F9866K3719J1116k4707o799L3972j0676j7478J2244j141k8389O324N721j0211
229F3561Q369K4188k6295L3225p884J0136J4332O594O311k4082j5684j4502j6902
216F1367L5623n953Q682N581Q935M136q632n110j7401K8697K0684r042L739j4074
$$ plain form
202 117232 102712 129460 134851 107856 150051 162414 104733 98727 126891 119553 98606 89066 108717
189 108717 91591 94610 105897 87252 71052 84778 117960 125236 127573 117512 88036 68108
177 68108 91431 103711 103704 92694 80972 94439 85937 102912 113178 133785 159012 141559 133106
164 133106 114146 117122 78070 69440 114127 124338 85227 102837 105418 111541 121191 122548 114869
151 114869 128930 147283 134112 123523 110807 145639 160999 122453 103534 90772 70947 81793
139 81793 108602 109081 114368 117344 116334 129868 133048 98632 102286 141734 158215 128002 128851 117403
125 117403 116290 102991 108669 121088 120943 109348 92897 100970 105193 112791 118498 142851 139694 147776
111 147776 144949 129672 112154 102035 111389 122082 127983 101505 91697 104706 108043 130124 117542
$$ packed form
202A17232j4520K6748N391k6995M2195J2363n7681o006K8164p338k0947r540J9651
189A08717j7126L019J1287j8645j6200J3726L3182P276K337j0061k9476j9928
177F8108K3323J2280pj1010j1722J3467q502J6975J0266K0607K5227j7453q453
164A33106j8960K976l9052q630M4687J0211l9111J7610K581O123R650J357p679
151A14869J4061J8353j3171j0589j2716L4832J5360l8546j8919j2762j9825J0846
139H1793K6809M79N287K976j010J3534L180l4416L654L9448J6481l0213Q49j1448
125A17403j113j3299N678J2419j45j1595j6451Q073M223P598N707K4353l157Q082
111A47776k827j5277j7518j0119R354J0693N901k6478r808J3009L337K2081j2582
$$ plain form
98 117542 109728 109500 137037 137743 152391 171040 150022 121911 86311 91895 113321 106543 105483 132896
84 132896 124816 106243 110773 86613 89384 107091 132600 125549 124170 134047 134916 119723 84608 87720
70 87720 78596 81707 84307 98345 107190 116991 114353 119197 134021 126581 126421 123737 132815 100519 86471
55 86471 111522 118966 116347 121815 149108 146397 148432 161188 151715 157141 143448 134002 127541 112083
41 112083 125908 136123 136108 145559 130349 117844 111719 133725 136763 134844 130589 116140 145008 137005
27 137005 145579 136369 122532 108305 90874 102993 120240 107107 110255 109021 111906 122192 105738
14 105738 117810 127678 134779 159809 148354 148260 155250 161824 161735 146902 117472 117680 125873 118068
0 118068
$$ packed form
98A17542p814k28K7537P06J4648J8649k1018k8111l5600N584K1426o778j060K7413
84A32896q080j8573M530k4160K771J7707K5509p051j379R877Q69j5193l5115L112
70H7720r124L111K600J4038Q845R801k638M844J4824p440j60k684R078l2296j4048
55H6471K5051P444k619N468K7293k711K035J2756r473N426j3693r446o461j5458
41A12083J3825J0215j5R451j5210j2505o125K2006L038j919m255j4449K8868q003
27A37005Q574r210j3837j4227j7431J2119J7247j3133L148j234K885J0286j6454
14A05738J2072R868P101K5030j1455r4O990O574q9j4833k9430K08Q193p805
0A18068
$$ Imaginary data points
##PAGE= N=2
##DATA TABLE= (X++(I..I)), XYDATA
$$ plain form
16383 -3758793 -3718376 -3672389 -3589971 -3529909 -3499711 -3427021 -3367547 -3331737 -3272525 -3224201 -3183673
16372 -3183673 -3139356 -3111044 -3059558 -3014189 -2972264 -2920122 -2878954 -2813371 -2748440 -2717453 -2656545
16361 -2656545 -2604992 -2541666 -2496185 -2456121 -2405084 -2364479 -2322659 -2259787 -2214923 -2167733 -2121639
16350 -2121639 -2088375 -2034342 -1984567 -1919736 -1869151 -1829977 -1766482 -1758413 -1720009 -1633312 -1584225
16339 -1584225 -1538771 -1508563 -1452016 -1414310 -1359471 -1317172 -1296367 -1242455 -1192847 -1120764 -1081823
16328 -1081823 -1062945 -991981 -934692 -904207 -869308 -840351 -798420 -733860 -676125 -608110 -569511
16317 -569511 -537479 -500275 -478458 -427851 -394066 -355588 -313623 -268103 -218877 -165755 -136463
16306 -136463 -101985 -74379 -42818 12692 56292 140653 186374 223325 267496 283922 327656
$$ packed form
16383c758793M0417M5987Q2418O0062L0198P2690N9474L5810N9212M8324M0528
16372c183673M4317K8312N1486M5369M1925N2142M1168O5583O4931L0987O0908
16361b656545N1553O3326M5481M0064N1037M0605M1820O2872M4864M7190M6094
16350b121639L3264N4033M9775O4831N0585L9174O3495Q069L8404Q6697M9087
16339a584225M5454L0208N6547L7706N4839M2299K0805N3912M9608P2083L8941
16328a081823J8878P0964N7289L0485L4899K8957M1931O4560N7735O8015L8599
16317e69511L2032L7204K1817N0607L3785L8478M1965M5520M9226N3122K9292
16306a36463L4478K7606L1561N5510M3600Q4361M5721L6951M4171J6426M3734
$$ plain form
16295 327656 374815 401104 445599 493324 523198 535425 591415 625672 686048 731427 721589 795644
16283 795644 837214 856901 881281 918077 953319 991895 1020103 1044243 1087559 1151821 1186627
16272 1186627 1238309 1272345 1283091 1336849 1356295 1399241 1433587 1445048 1467912 1495672 1547808
16261 1547808 1573514 1626515 1644966 1643275 1701873 1762093 1766043 1786660 1817545 1826055 1839401 1898534
16249 1898534 1976525 1982302 1982357 2020617 2051977 2079722 2081555 2103122 2137841 2151513 2177995 2226255
16237 2226255 2243102 2270626 2315996 2326579 2343793 2378987 2415536 2410201 2449358 2480989 2536345
16226 2536345 2562188 2538478 2542438 2566764 2619782 2666351 2695619 2705150 2731206 2772141 2781977 2787680
16214 2787680 2803779 2847050 2869622 2870758 2883449 2884820 2918535 2922586 2924319 2940106 2961708 2992208
$$ packed form
16295C27656M7159K6289M4495M7725K9874J2227N5990L4257O0376M5379r838P4055
16283G95644M1570J9687K4380L6796L5242L8576K8208K4140M3316O4262L4806
16272A186627N1682L4036J0746N3758J9446M2946L4346J1461K2864K7760N2136
16261A547808K5706N3001J8451j691N8598O0220L950K0617L0885Q510J3346N9133
16249A898534P7991N777N5L8260L1360K7745J833K1567L4719J3672K6482M8260
16237B226255J6847K7524M5370J0583J7214L5194L6549n335L9157L1631N5356
16226B536345K5843k3710L960K4326N3018M6569K9268R531K6056M0935R836N703
16214B787680J6099M3271K2572J136J2691J371L3715M051J733J5787K1602L0500
$$ plain form
16202 2992208 3024694 3076721 3052290 3055314 3089358 3108271 3142471 3125126 3194283 3182449 3187105 3225649
16190 3225649 3185744 3236758 3279343 3312254 3331390 3344807 3340159 3362097 3361050 3376519 3377594 3396217
16178 3396217 3417990 3420128 3418339 3454727 3464585 3469959 3485897 3497639 3477896 3491932 3530508 3521432
16166 3521432 3526916 3559188 3558629 3564828 3583255 3589720 3601585 3599211 3598883 3598478 3660019 3709547 3684077
16153 3684077 3680748 3701679 3685964 3689006 3742041 3764483 3761374 3765694 3776762 3769736 3765106 3793596
16141 3793596 3817508 3787910 3781438 3807397 3809381 3849017 3853561 3854726 3870492 3890792 3881797 3860409
16129 3860409 3878506 3901474 3882673 3872574 3883790 3879039 3881990 3898184 3940389 3978940 3965957 3951037
16117 3951037 3942877 3968284 3969679 3954554 3951467 3949258 3946836 3963805 3947086 3976659 4010930 4028567
$$ packed form
16202B992208L2486N2027k4431L024L4044J8913L4200j7345O9157j1834M656L8544
16190C225649l9905N1014M2585L2911J9136J3417m648K1938j047J5469J075J8623
16178C396217K1773K138j789L6388R858N374J5938J1742j9743J4036L8576r076
16166C521432N484L2272n59O199J8427O465J1865k374l28m05O1541M9528k5470
16153C684077l329K0931j5715L042N3035K2442l109M320J1068p026m630K8490
16141C793596K3912k9598o472K5959J984L9636M544J165J5766K0300q995k1388
16129C860409J8097K2968j8801j0099J1216m751K951J6194M2205L8551j2983j4920
16117C951037q160K5407J395j5125l087k209k422J6969j6719K9573L4271J7637
$$ plain form
16105 4028567 4021339 4018460 4031678 4023856 3997309 4015250 4020639 4000225 4015705 4064731 4078429 4063218
16093 4063218 4032375 4058376 4074163 4043715 4030976 4029418 4067220 4096873 4114978 4109195 4065574 4039574
16081 4039574 4086138 4122469 4083452 4081830 4103312 4109750 4104623 4085232 4074107 4124671 4111667 4092793
16069 4092793 4085843 4081813 4119301 4163361 4183922 4169663 4139887 4129762 4146566 4119397 4136242 4157921
16057 4157921 4169134 4142006 4131136 4129048 4162164 4154944 4164388 4133053 4118803 4135964 4158129 4142740
16045 4142740 4162097 4161110 4164730 4178112 4177137 4149263 4150478 4124122 4101944 4148932 4166157 4178800
16033 4178800 4137463 4130645 4123416 4155833 4176285 4177133 4189377 4186367 4129035 4123662 4147616 4148469 4155599
16020 4155599 4153099 4121780 4160026 4179105 4164771 4173374 4160297 4165143 4172013 4165995 4190018 4204689
$$ packed form
16105D028567p228k879J3218p822k6547J7941N389k0414J5480M9026J3698j5211
16093D063218l0843K6001J5787l0448j2739j558L7802K9653J8105n783m3621k6000
16081D039574M6564L6331l9017j622K1482O438n127j9391j1125N0564j3004j8874
16069D092793o950m030L7488M4060K0561j4259k9776j0125J6804k7169J6845K1679
16057D157921J1213k7128j0870k088L3116p220R444l1335j4250J7161K2165j5389
16045D142740J9357r87L620J3382r75k7874J215k6356k2178M6988J7225J2643
16033D178800m1337o818p229L2417K0452Q48J2244l010n7332n373K3954Q53P130
16020D155599k500l1319L8246J9079j4334Q603j3077M846O870o018K4023J4671
$$ plain form
16008 4204689 4182523 4166026 4175341 4208460 4221689 4199047 4194588 4189677 4178586 4216669 4217475 4209149
$$ packed form
16008D204689k2166j6497R315L3119J3229k2642m459m911j1091L8083Q06q326
$$ [...]
##END NTUPLES=NMR SPECTRUM
##END=
