##TITLE=1H_CA-9398-1
 200.13MHz,DMSO-d6,
 8 sc
 
 25.11.2025
##JCAMPDX= 6.0         $$ Bruker NMR JCAMP-DX V2.0
##DATA TYPE= NMR SPECTRUM
##DATA CLASS= NTUPLES
##ORIGIN= UXNMR, Bruker Analytische Messtechnik GmbH
##OWNER= pz
$$ XWIN-NMR		Version 3.5
$$ Tue Nov 25 15:26:01 2025 Russian Standard Time (UT+4h)  she@DPX200
##.OBSERVE FREQUENCY= 200.1313
##.OBSERVE NUCLEUS= ^1H
##.ACQUISITION MODE= SIMULTANEOUS
##.ACQUISITION SCHEME= undefined
##.AVERAGES= 8
##.DIGITISER RES= 18
##SPECTROMETER/DATA SYSTEM= spect
##.PULSE SEQUENCE= zg30
##.SOLVENT NAME= DMSO
##.SHIFT REFERENCE= (INTERNAL, DMSO, 0, 15.5078)
##AUDIT TRAIL= $$ (NUMBER, WHEN, WHO, WHERE, WHAT)
$$ ##TITLE= Audit trail, XWIN-NMR		Version 3.5
$$ ##JCAMPDX= 5.01
$$ ##ORIGIN= Bruker BioSpin GmbH
$$ ##OWNER= she
$$ F:/spectra/data/she/nmr/H-C/1/pdata/1/auditp.txt
$$ ##AUDIT TRAIL=  $$ (NUMBER, WHEN, WHO, WHERE, WHAT)
(   1,<2025-11-25 15:24:48.62 +0400>,<she>,<DPX200>,
      <created by zg, POWCHK disabled, PULCHK disabled
       configuration hash MD5:
       00 E9 B6 7A A2 85 ED C7 34 08 36 98 17 FE 4E 26
       data hash MD5: 16K
       7B E0 C8 20 12 AA D5 90 BF C3 C2 CE DD B7 91 2C>)
(   2,<2025-11-25 15:24:53.65 +0400>,<she>,<DPX200>,
      <Start of raw data processing
       efp BC_mod = 2 LB = 0.25 FT_mod = 6 PKNL = 1 PHC0 = -2987.837 PHC1 = 16.39234 SI = 16K 
       data hash MD5: 16K
       16 02 9B AF 97 F4 8D 54 BF 3F E3 6B A5 AD A6 2F>)
(   3,<2025-11-25 15:25:23.46 +0400>,<she>,<DPX200>,
      <pk PHC0 = -18.1513 PHC1 = 20.8 
       data hash MD5: 16K
       85 A5 09 3D E2 CC FF C8 E7 2A A5 03 A9 26 63 E4>)
(   4,<2025-11-25 15:25:27.34 +0400>,<she>,<DPX200>,
      <abs ABSG = 5 
       data hash MD5: 16K
       81 E3 5A BA 95 DD 75 CE 45 4E 85 EC CF 6C D9 8B>)
$$ ##END=
$$ 
$$ hash MD5
$$ 2A FE EF 9D 73 F9 C5 2C 7F F2 D3 1E E2 FC 5F A8
##$RELAX= 
##$RELAX= 
##$RELAX= 
##$RELAX= 
##$RELAX= 
##$RELAX= 
$$ Bruker specific parameters
$$ --------------------------
##$DU= <F:/spectra>
##$EXPNO= 1
##$NAME= <H-C>
##$PROCNO= 1
##$TYPE= <nmr>
##$USER= <she>
##$AMP= (0..31)
100 100 100 100 100 100 100 100 100 100 100 100 100 100 100 100 100 100 
100 100 100 100 100 100 100 100 100 100 100 100 100 100 
##$AQSEQ= 0
##$AQ_mod= 1
##$AUNM= <au_zg>
##$AUTOPOS= <>
##$BF1= 200.13
##$BF2= 200.13
##$BF3= 200.13
##$BF4= 200.13
##$BF5= 200.13
##$BF6= 200.13
##$BF7= 200.13
##$BF8= 200.13
##$BYTORDA= 1
##$CFDGTYP= 0
##$CFRGTYP= 5
##$CHEMSTR= <none>
##$CNST= (0..31)
1 1 145 1 1 1 1 1 1 1 1 1 1 1 1 1 1 1 1 1 1 1 1 1 1 1 1 1 1 1 1 1 
##$CPDPRG= <>
##$CPDPRG1= <>
##$CPDPRG2= <>
##$CPDPRG3= <>
##$CPDPRG4= <mlev>
##$CPDPRG5= <mlev>
##$CPDPRG6= <mlev>
##$CPDPRG7= <mlev>
##$CPDPRG8= <mlev>
##$CPDPRGB= <>
##$CPDPRGT= <>
##$D= (0..31)
0 0.7 0 0 0 0 0 0 0 0 0 0.03 0 0 0 0 0 0 0 0 0 0 0 0 0 0 0 0 0 0 0 0 
##$DATE= 1764069888
##$DBL= (0..7)
120 120 120 120 120 120 120 120 
##$DBP= (0..7)
150 150 150 150 150 150 150 150 
##$DBP07= 0
##$DBPNAM0= <>
##$DBPNAM1= <>
##$DBPNAM2= <>
##$DBPNAM3= <>
##$DBPNAM4= <>
$$ [...]
##$SUBNAM3= <"">
##$SUBNAM4= <"">
##$SUBNAM5= <"">
##$SUBNAM6= <"">
##$SUBNAM7= <"">
##$SUBNAM8= <"">
##$SUBNAM9= <"">
##$SW= 18.0517328524113
##$SWIBOX= (0..15)
0 0 2 0 0 0 0 0 0 0 0 0 0 0 0 0 
##$SW_h= 3612.71676300578
##$TD= 16384
##$TD0= 1
##$TE= 0
##$TE2= 300
##$TE3= 300
##$TEG= 300
##$TL= (0..7)
0 120 120 120 120 120 120 120 
##$TP= (0..7)
150 150 150 150 150 150 150 150 
##$TP07= 0
##$TPNAME0= <>
##$TPNAME1= <>
##$TPNAME2= <>
##$TPNAME3= <>
##$TPNAME4= <>
##$TPNAME5= <>
##$TPNAME6= <>
##$TPNAME7= <>
##$TPOAL= (0..7)
0.5 0.5 0.5 0.5 0.5 0.5 0.5 0.5 
##$TPOFFS= (0..7)
0 0 0 0 0 0 0 0 
##$TUNHIN= 0
##$TUNHOUT= 0
##$TUNXOUT= 0
##$USERA1= <user>
##$USERA2= <user>
##$USERA3= <user>
##$USERA4= <user>
##$USERA5= <user>
##$V9= 5
##$VALIST= <valist>
##$VCLIST= <CCCCCCCCCCCCCCC>
##$VD= 0
##$VDLIST= <DDDDDDDDDDDDDDD>
##$VPLIST= <PPPPPPPPPPPPPPP>
##$VTLIST= <TTTTTTTTTTTTTTT>
##$WBST= 1024
##$WBSW= 4
##$XGAIN= (0..3)
0 0 0 0 
##$XL= 0
##$YL= 0
##$YMAX_a= 241540
##$YMIN_a= -319093
##$ZGOPTNS= <>
##$ZL1= 120
##$ZL2= 120
##$ZL3= 120
##$ZL4= 120
##$ABSF1= 15.5078
##$ABSF2= -2.544049
##$ABSG= 5
##$ABSL= 3
##$ALPHA= 0
##$AQORDER= 0
##$ASSFAC= 0
##$ASSFACI= 0
##$ASSFACX= 0
##$ASSWID= 0
##$AUNMP= <proc_1d>
##$AZFE= 0.1
##$AZFW= 0.1
##$BCFW= 0
##$BC_mod= 2
##$BYTORDP= 0
##$COROFFS= 0
##$CY= -3
##$DATMOD= 1
##$DC= 0
##$DFILT= <>
##$DTYPP= 0
##$F1P= 0
##$F2P= 0
##$FCOR= 1
##$FTSIZE= 16384
##$FT_mod= 6
##$GAMMA= 0
##$GB= 0
##$INTBC= 1
##$INTSCL= 3.241238e-09
##$ISEN= 128
##$LB= 0.25
##$LEV0= 0
##$LPBIN= 0
##$MAXI= 10000
##$MC2= 0
##$MEAN= 0
##$ME_mod= 0
##$MI= 1.114404
##$NCOEF= 0
##$NC_proc= -9
##$NLEV= 6
##$NOISF1= 3.799351
##$NOISF2= 2.8
##$NSP= 0
##$NTH_PI= 0
##$NZP= 0
##$OFFSET= 15.5078
##$PC= 1
##$PHC0= -3005.988
##$PHC1= 37.19234
##$PH_mod= 1
##$PKNL= yes
##$PPARMOD= 0
##$PSCAL= 0
##$PSIGN= 0
##$REVERSE= no
##$SF= 200.130002782375
##$SI= 16384
##$SIGF1= 3
##$SIGF2= 2
##$SINO= 0.751879
##$SIOLD= 32768
##$SREGLST= <19F.Aceton>
##$SSB= 0
##$STSI= 16384
##$STSR= 0
##$SW_p= 3612.71676300578
##$SYMM= 0
##$S_DEV= 0
##$TDeff= 16384
##$TDoff= 0
##$TI= <>
##$TILT= no
##$TM1= 0
##$TM2= 0
##$TOPLEV= 0
##$USERP1= <user>
##$USERP2= <user>
##$USERP3= <user>
##$USERP4= <user>
##$USERP5= <user>
##$WDW= 1
##$XDIM= 16384
##$YMAX_p= 415224327
##$YMIN_p= -4700846
$$ End of Bruker specific parameters
$$ ---------------------------------
##NTUPLES= NMR SPECTRUM
##VAR_NAME=  FREQUENCY,     SPECTRUM/REAL,   SPECTRUM/IMAG
##SYMBOL=    X,             R,               I
##VAR_TYPE=  INDEPENDENT,   DEPENDENT,       DEPENDENT
##VAR_FORM=  AFFN,          ASDF,            ASDF
##VAR_DIM=   16384,         16384,           16384
##UNITS=     HZ,            ARBITRARY UNITS, ARBITRARY UNITS
##FACTOR=    0.220516191357247, 1,           1
##FIRST=     3103.57607760858, 0,            0
##LAST=      -509.140685397198, 0,           0
##MIN=       -509.140685397198, -4700846,    0
##MAX=       3103.57607760858, 415224327,    0
$$ Real data points
##PAGE= N=1
##DATA TABLE= (X++(R..R)), XYDATA
$$ [...]
10122 5533226 5585017 2937472 3276008 5240914 3793177 1748122 3185980 4731724 5712048
10113 5712048 4434590 2725315 3669048 4268790 4084846 4926264 5069421 4212772 4529771
10104 4529771 5604728 4736558 3464814 4755182 6781154 7425784 7437919 6669372 6153176
10095 6153176 4567603 2653468 2497772 3580084 3500235 3127165 5906892 3969117 3416982
10086 3416982 3944220 3458600 5501625 6327998 5431120 5356802 4891384 5585703 5012262
10077 5012262 4983806 6350049 7055199 5603233 4938609 5953693 4413873 4886652 3467942
10068 3467942 2992907 4541261 6395889 6740895 5122028 4792780 5015255 5295028 7560309
10059 7560309 5535044 5194406 5967329 5286700 5161763 5048999 5424915 5667007 6931315
10050 6931315 5822195 5287432 6567333 6329878 5373138 6093989 6502067 5376832 7212921
10041 7212921 7670814 7097824 7474664 7930120 7667165 6185014 5979475 5447723 5519660
10032 5519660 4949438 4070837 3654576 4477021 5615995 5768447 4065109 4908672 6438229
10023 6438229 6790811 6306254 5160652 6276352 6151632 5738749 5231219 5283079 6559903
10014 6559903 6501661 6003567 5579573 4043458 3661624 4840760 5029929 4930262 5474403
10005 5474403 5367800 6307723 6264252 5778372 7743765 8437150 8394721 7233807 6770803
9996 6770803 6736210 6081543 6476510 5494287 4205244 4623969 5319367 6015418 6075068 6103436
9986 6103436 5554902 6606358 7384196 6225205 6112295 6355856 5907825 6053654 5641683
9977 5641683 6316631 6552358 5518884 5496112 5718464 5318964 6184484 5339394 4620237 4252089
9967 4252089 4650370 4923747 5470414 5480462 4902986 5753438 6292288 5693518 6785155 6627039
9957 6627039 7184808 7376031 6654151 6112926 6387343 6981759 6906029 7807252 7660591 7970835
9947 7970835 8339365 8317989 7159250 7173064 6636249 5563922 4122748 3489260 4035266
9938 4035266 4702828 4724374 4991500 5849022 6547646 6062293 7059844 7277680 5697500 6073740
9928 6073740 6997911 6174055 8040954 9945621 9101281 7944826 8047760 7010908 7481297
9919 7481297 7745279 7842965 8417985 7155197 6227269 6626148 7229268 6752362 6035831 6237277
9909 6237277 6562838 8186581 8938252 7961398 7777265 7256207 7711719 7992792 8265211
9900 8265211 9481461 9607238 7579750 6641076 7063938 6572174 6369244 8383223 8127969
9891 8127969 7046584 6972312 6593601 6099431 5468930 6124156 7025278 8574506 8440155
9882 8440155 8788175 8089207 6457692 7615873 9737557 10059665 7996853 8583939 10218553
9873 10218553 9747247 8607872 7402404 7678160 9339400 9098361 8205434 7946230 7523460
9864 7523460 7675822 8196218 7759392 7811960 7699276 8504913 9531694 8613249 7912779 7564803
9854 7564803 8066611 7824318 6673646 7260028 8266260 7980018 8378133 10178860 9830410
9845 9830410 8915099 10496916 10522863 10111010 10397346 11304560 11105175 10126282 10398673 11342640
9835 11342640 10192837 8820293 9256502 9622104 9547721 9248468 9727143 9527498 9256597
9826 9256597 10020536 10985860 10395696 10614846 11345517 10961030 12578670 12789384 11505762
9817 11505762 10820120 10697029 10425227 11312631 12327895 12120848 9985151 8382074 10142817
9808 10142817 10671233 9991703 9312516 9931732 11383781 11379601 11390030 11761126 11857316 11805010
9798 11805010 13025907 13155914 12301555 12815595 11999871 10770588 10879497 11278288 12531641
9789 12531641 13520037 13049403 11420809 11033424 11563206 12113965 12821423 13624647 13481702
9780 13481702 13271192 13591612 13224516 12861359 12255356 12225350 11756646 12306539 14176569
9771 14176569 13802221 12712606 15387703 15968164 14929460 13709177 13480968 13261145 13533976
9762 13533976 14585046 13645866 11313561 10924607 12721417 12867748 11534844 10884687 10973088
9753 10973088 11620186 12707187 11963325 11669695 14976605 16050023 15099687 14251009 14515610
9744 14515610 14412085 14468417 13991794 15429264 15714013 14397623 14536329 14617039 13979486
9735 13979486 13290975 13529158 14819021 15764132 14658276 13737693 14118530 15127627 15700171
9726 15700171 15636754 15728836 15749881 16443792 17182904 16437638 15013529 14731429 16281647 14394167
9716 14394167 13920711 15567775 15941938 15798305 15793597 14712317 13809991 14612514 14295036
9707 14295036 14602985 14586034 14180448 13358376 13671400 14846530 14652109 15266498 15544668
9698 15544668 14827855 13729810 14503746 14186801 14433024 14971786 14540182 14582096 14170496
9689 14170496 14441343 14376480 15581065 15345225 13857245 12944565 12691579 13154462 14029183
9680 14029183 13251910 13180846 14143681 14415045 13905801 13625914 13356256 13825130 14845598
9671 14845598 14095540 13314211 11862571 14558184 16255375 14672112 12916198 13457783 14427696
9662 14427696 14842674 12396903 10744666 11627368 12159979 12273703 11846409 12049373 12612076
9653 12612076 11869866 11608509 11315891 11088806 10860384 12031604 12446508 13391077 12764604
9644 12764604 13341448 13778988 13884404 13767992 13554196 13727658 13033638 12043948 10986545
9635 10986545 10213857 10579541 11166634 12258956 12342979 9941957 9469670 8826666 9462298
9626 9462298 9824212 9766700 9183751 10279085 12362719 12330560 11921911 12089002 12264189 12994328
9616 12994328 12824708 12350164 11542823 11484871 12212457 12344014 10680242 10833468 11528455
9607 11528455 12551142 12870780 12127081 11258380 10841705 11645572 11589344 10443177 10738366
9598 10738366 11312010 9962571 9607621 12916399 14824064 11847827 12107959 13161576 12077916
9589 12077916 12119783 10230847 9568381 11261104 12818958 11682607 9949698 9366000 9488315
9580 9488315 10346649 10148289 9408796 10170285 10169759 10399193 10644210 9985083 8805369 9224782
9570 9224782 11061081 11651528 11656140 11315631 10942447 10896407 9447387 9248958 11223523 12320197
9560 12320197 10971265 9796617 11179313 10806084 10268981 10434213 10514937 10251745 11322029
9551 11322029 12584265 10958083 9755419 10503200 10526101 10612685 11024076 11043531 9733890
9542 9733890 8654435 8838153 7874612 8448549 10896734 10573867 9086529 10105818 9994930
9533 9994930 8985541 10010498 10559014 10763369 11441565 11674089 10109319 10079535 10145363
9524 10145363 9673046 11566691 10766450 9147573 9230389 9189333 9051169 9254792 9005952
9515 9005952 7756824 8226163 9253207 10015736 9912061 8239610 8962388 10346526 10873999
9506 10873999 9340016 9413465 9460399 8294543 7146641 6732374 8223821 9137032 8239204
9497 8239204 8738459 8975517 7661044 7508516 7774728 8496313 7785059 7947566 9590324
9488 9590324 10546777 10430017 9426497 8769919 8603323 8171645 8712884 9999335 8606205
9479 8606205 7478462 8149354 8532684 8888501 9242974 8735109 8546743 7977601 7933819 8423292
9469 8423292 8261882 8401876 7822107 7639848 7332620 7517653 8083392 7493440 7300161 7978141
9459 7978141 8169562 6867141 7420508 7794498 7029414 7687343 8774674 9418259 7497694
9450 7497694 7624398 8700526 8618016 9142470 8587597 8488234 9603993 9114342 7724184
9441 7724184 6404770 6925217 7133079 8905378 9414592 9884283 9548233 8046965 7077222
9432 7077222 7833925 8725405 8587974 9095214 9287532 9610563 9311692 8294853 9745837
9423 9745837 8902619 7066243 7977591 9152044 7508020 6201879 7431857 7450061 7037185
9414 7037185 7327828 8604730 10801720 10209010 8668499 7736728 8548102 8132956 7946967
9405 7946967 8427532 8342367 8144366 8685450 8620418 8155717 8159629 9296991 10677279 8376521
9395 8376521 6507362 6411997 8136733 8449198 7631883 6993536 6598119 8278019 10537289
9386 10537289 8718786 6636915 7685656 9633213 9825366 9250136 8417973 8337586 8685380
9377 8685380 10194458 11669603 11922414 9640218 7953244 9142869 10042217 9562327 8763232
9368 8763232 7635913 10189343 10664820 9925564 9206028 8851691 9286396 10521056 10418042
9359 10418042 9107980 8514026 8405922 7359995 8639615 10912225 9713593 10363776 10147563
9350 10147563 8636245 9022626 9355876 8057239 8163429 8605058 7636234 9346217 10021337
9341 10021337 8651855 8627551 8845875 8725898 11658364 12524176 11138485 10441993 11209658
9332 11209658 12198334 12109302 11653762 11842435 12445090 10749207 9192756 8698397 9715778
9323 9715778 8975297 8417590 9288123 9699180 11399554 11752252 10687010 10970711 11140232
9314 11140232 13224540 12653320 10752452 9532236 11523580 12718700 12323313 10684228
9306 10684228 9752596 10565358 11981583 10864563 9542072 11407990 11110511 11121193 11173000
9297 11173000 11370162 10158496 11519140 12008629 11312606 11763691 13668958 13820750 13065378
9288 13065378 11754965 11165654 11003169 10961975 11854546 11839941 11294052 12234336 12526522 10974553
9278 10974553 11179016 11027404 12058873 12016245 13190220 14230640 13430764 13439678 13860719
9269 13860719 12734116 13572855 14627427 14617376 13081876 12461840 13794534 13444944 12266864
9260 12266864 13210263 13141971 12920038 13732787 15374912 15458615 13914838 13524463 13349749
9251 13349749 13549880 14766301 14933668 14632771 15345295 14195782 13725782 14394014 13191457
9242 13191457 13614377 14598594 14365779 15706543 15913494 14153060 14165264 15674955 16717538
9233 16717538 17268783 15744865 14828525 15419444 16386765 15101582 14873526 16423103 16651641
9224 16651641 16821344 18593692 17068377 14635150 15201841 15821586 16148612 15672465 16286274
9215 16286274 17032992 17133208 16497597 16869378 18324045 16863315 16660372 17708034 18243326
9206 18243326 19220074 18616858 18064887 18073882 17798114 18426156 19093189 19330477 18190851 19302925
9196 19302925 19385463 17376093 17482429 17004515 17340118 18891042 19416907 18259166 19442346
9187 19442346 19358874 17875894 17744816 18235553 19445082 20121116 18559733 18003025 18841600
9178 18841600 19835397 20627034 19680317 19573670 19763781 21239397 20928036 18106833 17821567
9169 17821567 18430986 19405997 21036567 20957082 19459678 19234909 19637385 19414263 20151056
9160 20151056 18966729 16557240 16614318 18418583 19435521 20075886 19307947 19711283 21831186
9151 21831186 21135069 20561684 20456741 19846300 19214815 20539978 21304211 21369876 20826359
9142 20826359 21317532 20150545 21453950 21826349 21234783 21424726 20179522 20156539 21183042
9133 21183042 21939984 21362130 22785681 22126316 20530679 20713147 22161531 21297897 19704558
9124 19704558 19156276 19829285 20836625 20773728 21322814 21747634 22010614 21823912 22563262
9115 22563262 22324717 21434810 20927845 21055675 21498840 20986081 20925947 19872852 20312295
9106 20312295 19904041 19411401 19813059 18843065 18459205 20593658 21386865 20164409 19185308
9097 19185308 19469875 20761459 21793617 22189774 22772510 22213241 22336592 22544750 20676551
9088 20676551 20526358 21840456 21468900 20655084 20868231 21660285 21787315 22085760 22059086
9079 22059086 20808685 20345135 21534599 21248978 21020780 21586788 20722409 19095650 19966075
9070 19966075 20444295 20651539 19572357 19098479 20270860 20576671 20202722 19281165 19355973
9061 19355973 19823125 20727571 21211626 20413827 20464086 21287878 21811974 21744131 21345830 20729221
9051 20729221 20964111 21838878 21084350 19813114 20519903 21306208 20904114 20048519 20722912
9042 20722912 21590923 22134903 20514795 20468519 21759814 22073505 23185953 21438455 20535713
9033 20535713 20097309 20485933 20784728 21370122 21448792 21561045 22915694 23073332 22508154
9024 22508154 22081574 22479006 22360873 22116416 23101740 23209238 22458318 22093542 21834228
9015 21834228 21669580 22603295 23424221 23235050 22659222 22708694 21367539 21541868 22009779
9006 22009779 21722910 21930773 22433778 23706359 24147069 23450878 23373667 23069616 22847203
8997 22847203 22639170 23596709 24519105 25230983 24395116 23950890 23195568 23943341 25195030
8988 25195030 25317183 24764228 25012994 24138451 23920231 25491599 25825455 24918096 26478433
8979 26478433 28252573 27210599 25969617 26113513 25257875 27151146 27557758 26818853 26254212
8970 26254212 26052876 26577066 27387317 27223561 26082151 26074902 26445901 27786464 26441979
8961 26441979 26342582 25912620 26637802 28178451 27441250 26349377 27567759 29514618 28551195
8952 28551195 27466838 28531528 28880112 29115828 29292675 31231109 31596044 29872086 28318754
8943 28318754 30275021 31514010 31754759 31741060 30800216 30122408 29849124 29872281 31054448
8934 31054448 32149926 33163133 32498968 31199682 30813388 30191400 30140507 31946107 31423429
8925 31423429 31653022 32682819 32332480 31586304 31555571 33666177 33176495 33720448 34797256
8916 34797256 34053888 32280346 32078991 33173879 32854657 33938847 35020061 34550128 34377389
8907 34377389 33828787 34478182 35476065 33669967 33851670 35815697 35874757 34269832 35406039
8898 35406039 35684978 34735789 33878907 35018641 36641570 36956110 35030238 33877481 34210637
8889 34210637 33807477 33376861 33055644 34340160 35796999 34831862 33806002 33555899 33726275
8880 33726275 33424323 35286502 36346615 35427468 34793808 35265817 35323990 34554196 35973911
8871 35973911 35905337 34726871 33431128 33404597 35146161 35834343 34438967 33892719 35787931
8862 35787931 36662846 35470226 36830630 36436293 36428643 37070636 37712872 38332207 38634397
8853 38634397 37688092 36040227 34736336 35149956 36289944 37126706 36151791 36055821 36095538
8844 36095538 35985786 36476310 35632671 35303090 36763196 38406914 38845690 36251997 34803724
8835 34803724 35610273 36904883 37609957 38900147 39095313 38257193 38428589 38056052 37109557
8826 37109557 37267837 38223301 39055530 39022015 39444479 40149284 39531649 39083799 39288661 38803803
8816 38803803 39542463 39935475 39091952 37479275 38027361 38569751 39205945 40401889 38497745
8807 38497745 38889462 40014975 40516024 40867735 41155731 40861546 41158125 40984572 41553549
8798 41553549 41037377 40197927 39936257 40189683 40496974 39816890 40296736 40899293 40458507
8789 40458507 40972993 41529752 41398735 40357253 39810183 39383054 40788716 39772047 38935017
8780 38935017 40725024 42942018 41873108 41764361 43065701 41047799 41798018 42330502 42642281
8771 42642281 42135496 41812823 41037098 40805968 40951122 41035978 41957924 43085939 42461731
8762 42461731 41758167 41046506 41725957 42381434 41652130 40446622 40368361 41265518 41915456
8753 41915456 41994789 39877751 38045209 40303913 42085223 40855033 41249376 40679777 41342762
8744 41342762 41533918 41150438 39226348 40586848 42368248 43012987 42323662 41653779 40976861
8735 40976861 40426507 40660939 38671431 39700747 40788243 41151072 40414347 39885750 40631121
8726 40631121 41395500 41399983 40976904 41531031 42214937 42509466 42100112 41816817 40572824 40839722
8716 40839722 41504507 42359362 42579304 41824895 41619683 40934025 40931734 41064391 42924278 42804732
8706 42804732 42589516 41469311 41193659 41867204 44127361 44156731 42853590 42842293 43571494
8697 43571494 44405282 43766957 43669641 43527806 43902000 44501789 45242825 44403406 43436564 42714203
8687 42714203 43780269 42935309 43456606 44631240 44780328 44810955 45372214 44107629 43802282
8678 43802282 45535803 43209917 44674634 46808947 45507518 44381029 44881062 45297263
8670 45297263 43896253 44736899 45716159 44204587 45169365 45129774 45057173 45901013 45905213 45939946
8660 45939946 46702336 48012434 48743810 48360245 48747320 48225984 48175847 48927332 48712786
8651 48712786 48205823 46201937 48466771 49398744 47725306 48137098 49459875 50012002 49706903
8642 49706903 49839572 48959522 49462526 51103861 52689603 50846586 49600008 51735389 52622706
8633 52622706 53086624 53200387 53165019 51831334 51391714 51784658 51016102 50664973 51371819
8624 51371819 51706779 52800597 54444326 55624039 56280346 56507912 54921500 55050179 55271762
8615 55271762 56165750 56038715 56401180 57077650 57055769 56926425 55477219 55973061 57161465
8606 57161465 58319121 56463114 55237698 54733665 54351071 54069357 53871774 55531110 57368427
8597 57368427 58941049 59267915 60527595 60234221 60267679 60252843 58475499 58612338 60253516
8588 60253516 60032697 59015177 58897218 58261964 59383901 60781553 60320903 58918812 58314192
8579 58314192 57960075 58916000 58974845 59498854 60967789 61565986 62289197 61658692 62083724
8570 62083724 61665369 60981874 60964611 59600385 59323800 59943647 58772567 57429036 58464109
8561 58464109 58163350 59057245 60007059 59917953 59631789 58720065 57642378 58394224 60331173
8552 60331173 62250767 62485319 61813425 61292732 61962235 61509099 59207336 58122111 59897220
8543 59897220 59538348 59069618 60145506 59518486 59878280 59656789 61051355 61217743 62197208
8534 62197208 62218970 61771240 61909536 61621137 61824062 59720443 59880856 61761520 61799876
8525 61799876 60937898 59495900 58418722 59347013 60666962 62166384 62952769 62560434 61554818
8516 61554818 62234798 62506162 62770551 62379927 62226463 62390633 61871346 62210105 62240219 61607830
8506 61607830 62084665 63983026 65575898 65841891 65058948 65843056 64884122 62933866 62934631
8497 62934631 64432265 64111600 63930936 64317845 63700121 64040525 65260971 65264405 66083956
8488 66083956 66946815 65289905 65937055 67346535 66144249 64721997 65997684 66919440 68645819
8479 68645819 71244667 70206729 68188881 67671163 68236041 68068897 67893218 66822976 67770230
8470 67770230 69880341 71532857 70631255 69351590 69674893 72055731 73191668 72872995 72188987
8461 72188987 71396779 71446872 71685232 72806905 73351980 73287473 72101753 72727068 75088620
8452 75088620 75114340 74652562 74600762 74968418 75800668 74913965 74544113 75558411 78021500
8443 78021500 79181837 78849434 79442321 77635395 77338009 79623936 78514626 77407001 78454045
8434 78454045 79538194 79478805 80125233 80001057 80621309 81722071 81481012 82080315 82931628
8425 82931628 84383498 84507802 83557884 84728555 83707205 84589911 86678108 87746809 88384371
8416 88384371 86519933 85762286 86437802 87180945 87691391 89570624 89879896 89346410 89778602
8407 89778602 89910207 89781396 91237647 91701226 92510860 95237875 96143666 94431524 92162067
8398 92162067 92659469 94236899 94755360 94472418 93918633 94963302 95338788 94903048 96130208
8389 96130208 97258359 96295302 96184585 98529964 99292231 99986849 99360379 98776756 99790307
8380 99790307 100272830 100019575 100942515 102440164 102512552 102744093 102027860 101196402 102376748
8371 102376748 102603352 102635032 102956791 103201480 104352944 104159085 104216294 104182442 104754904 106309758
8361 106309758 105965075 105735331 105482918 105880338 106828200 106708983 106379803 106877553 107321623
8352 107321623 107736315 107497431 107962781 108440021 107698521 106819069 106812870 107420372 108898849
8343 108898849 108920643 108954131 110137488 109552851 110176569 111118789 111169628 110406126 111770659
8334 111770659 112642298 113915883 113420151 112063976 111990574 113534650 113725899 113167211 113367422
8325 113367422 113404657 114591672 116035066 115913768 114924973 113832026 114317715 116233374 117567242
8316 117567242 117247340 117231961 116315560 116325590 119374859 119799453 119880150 120126947 120298295 119780453
8306 119780453 119583157 119874998 120572757 120670524 123173970 123722049 122258456 119777121 120324806
8297 120324806 122524030 123521439 123244117 123315459 123831060 123978229 123944287 123936224 123017672 123360148
8287 123360148 125397524 125242693 124262000 121888018 123303696 126209565 125958640 123506769
8279 123506769 123942900 125566338 125788776 125103860 124750935 123276889 123250336 123860130 125224749
8270 125224749 125645661 123603761 122556545 124170752 123792032 123110744 123992074 122918316 121867814
8261 121867814 120377236 121152476 120989247 119823313 118173118 118078226 119322505 119315517 117395750
8252 117395750 116602066 116492399 116843518 117156112 116716340 114829104 112713783 113634989 113478550
8243 113478550 112421959 112818277 112830071 111505404 112386006 113371814 111994508 110152826 109335293
8234 109335293 109241849 107916803 108258505 110060999 109432599 109262030 108626664 107764290 107407544
8225 107407544 106733261 105830796 104797899 104429260 102852465 100546373 101435592 102143747 100410740
8216 100410740 100037376 100226855 99508033 98738257 98320059 98172539 99566079 99534691 97702260
8207 97702260 98071462 97390199 95691245 96067991 95898498 95230199 94420776 94102546 92339879
8198 92339879 92267987 91684712 92345550 93009759 92215459 87504695 85140257 92787836 93984804
8189 93984804 93216903 91893123 91194304 91576076 89967279 87529884 87180703 87413211 87060808
8180 87060808 84928882 83714921 84125420 84327683 85222474 83810638 82492679 81510250 81332465
8171 81332465 82214895 82934083 82917350 82103202 81273507 80888781 80343656 80250638 79665941 80370062
8161 80370062 79829701 78159690 75999737 74818401 76362881 77184943 77015493 76152100 76596266
8152 76596266 76362776 76269065 76192732 74557244 72904338 72546245 72817755 72098073 72736510
8143 72736510 72592508 71440382 71262792 72244297 71507004 71165033 70751855 69813369 69829150
8134 69829150 68094125 68410254 70054720 70530075 68852709 68282564 67462234 66824378 66690960
8125 66690960 66331754 66067774 66327172 66931916 66103087 66055056 65598699 66179568 66377066 65173627
8115 65173627 63054615 62620396 64422450 63321871 61579207 62076658 62607844 62691049 62231851
8106 62231851 62026431 61612605 63035376 64517177 62840232 62189946 61225497 60213999 60683737
8097 60683737 60129945 59883554 58497176 58479516 58649356 58348490 58773226 59322745 60059040
8088 60059040 59873722 59490268 58047552 58359369 60513868 60418662 59258658 59271775 57986449
8079 57986449 57349960 57616783 58586897 57682831 56241167 56081805 55491241 56454596 55226518
8070 55226518 53200098 53098485 54259863 54828769 53326824 52385137 54119438 53987352 53319115
8061 53319115 53814020 51759691 51030980 50892315 50985495 51872172 51940072 50898846 49026228
8052 49026228 48826676 49575452 49504446 48968192 47488297 46164781 45703846 45309931 45504536
8043 45504536 45342640 46523764 46905980 45966159 45297958 45400762 46060354 45842777 44992068
8034 44992068 43656883 43035535 43200514 43957945 43643711 42426309 42175000 41808334 40471729
8025 40471729 39159578 38876506 37557055 39673991 40238532 39498819 38947148 40522063 41165879
8016 41165879 40430682 39231664 37944530 37340944 38384024 38876450 36311811 36469456 36039387
8007 36039387 35414796 35282033 35740553 35413248 35893596 35986075 34928926 34799076 35722269
7998 35722269 35853568 34870573 33020229 31266288 30288017 31526653 30934322 30944298 30612923
7989 30612923 30621084 29971409 29908137 29641606 29104465 30083827 30612140 31055871 30502762 30359081
7979 30359081 30550446 28143489 28016901 29396616 29548559 28010373 27901943 28671634 28288580
7970 28288580 27729036 26482771 26305388 25636751 25487867 24967864 25654626 26349888 26009216
7961 26009216 26936693 28041167 28104343 27654647 27359277 26781650 25722043 25406753 23564043
7952 23564043 23332842 25984173 26400457 24306999 23632981 24297180 23586974 23139956 23675201
7943 23675201 23951745 22742053 22646597 22926711 21373910 20785265 21995699 23143397 22075229
7934 22075229 20879461 20284519 20020518 19379396 18997092 19692421 20313826 19721049 19107430
7925 19107430 21008077 20378615 20146269 22888550 23273374 23321700 21765414 20366464 19385474
7916 19385474 19676080 19461365 19503009 19189987 19186934 20011854 21016471 19965499 18874424
7907 18874424 19010988 18745445 17656822 18468640 19897101 19018006 18844185 18568735 17746091
7898 17746091 18637146 19325374 17053310 17120114 15810964 14324444 16134588 16580505 14484319
7889 14484319 14798591 16418457 16531484 16275329 16336265 16463655 17413296 17104516 17693538
7880 17693538 17675060 17194951 16097686 15928480 17149698 16022031 15836585 16779060 16189617
7871 16189617 15140082 13880095 13661150 14890804 14673043 14464797 14735483 15282171 14606927
7862 14606927 13395571 14012219 15417983 14889458 15137117 14622958 14116622 12555351 11650522
7853 11650522 12125257 13747108 14822556 15297847 15103615 14334520 15343117 15067521 14474195
7844 14474195 14274093 14266740 13328831 13156207 11588074 10382487 10304061 11456532 12110152
7835 12110152 12341971 12235990 11285759 11879116 13532248 12785231 11720612 12331224 13195505
7826 13195505 13357179 12101049 12460496 13203584 12873598 11571189 11288581 10529267 9759803
7817 9759803 9377363 9313973 9685295 10351458 9766766 9650052 8806407 8783186 9788423 8781497
7807 8781497 10782521 10247984 10336758 10550955 10862856 11771290 11027657 10145691 8648527
7798 8648527 9112006 11864649 12191097 9810107 9098893 9459578 9641751 8929439 10243489
7789 10243489 10460270 10503612 8706420 7637958 8172884 9290001 9391981 9977513 10066160
7780 10066160 9391413 8063857 6564525 7935927 9373344 8749472 7529574 7361998 6177031
7771 6177031 7116895 7239257 6548442 6521133 6638444 7527684 8141590 7602534 6810099 7170555
7761 7170555 6534543 5377484 4903604 5035977 7044051 7635757 5523830 4320312 5611311
7752 5611311 4762314 4838444 6605909 7599056 6175277 5944022 5573371 4826144 6187193
7743 6187193 6737274 5031458 4879584 6043997 6180370 6118871 6936406 8217869 7249577
7734 7249577 6417630 5544408 4711472 4985988 6510622 7232508 6089603 4917621 6169273
7725 6169273 6204807 5405222 5157846 4898617 5295590 5840316 5519020 3697592 3878158 4218627
7715 4218627 4373811 5187689 5984262 4261567 3274796 3623526 3115451 3093313 3761325 5023386
7705 5023386 5409849 3663352 2643245 3515750 4245140 3091038 3277051 4357553 4512615
7696 4512615 5169689 4964516 4356273 2008687 905901 2827993 4930999 5778140 4257649
7687 4257649 3562107 3606352 2635338 3148347 3578997 3693213 3092418 3269699 4124872 3069331
7677 3069331 2570006 3567354 3507916 2079836 2780638 3346756 1565473 2004909 4073360
7668 4073360 3943413 3481257 3899739 2291230 3005907 3074577 2827895 2563385 1033621
7659 1033621 -328946 687648 2003943 3113819 3034974 2585143 2303883 1952533 2586394
7650 2586394 2700535 2973994 3312789 1778331 1972830 2496245 880699 1008184 2131480
7641 2131480 3344122 2653028 806916 -447538 1518201 2759855 2696739 2043401 1759382
7632 1759382 204619 -69846 1722087 1727054 1562926 2571722 3242875 1271683 -829794
7623 -829794 -762486 1546571 2216962 2066367 2257695 2501595 2823071 4465882 4267577 1963286
7613 1963286 1518547 3357931 2427538 1308931 1039753 792977 879375 1218858 706136
7604 706136 470962 890223 2049750 1571806 867774 133905 306027 2323500 2143179
7595 2143179 2171964 1663084 2064793 1888334 1755229 1514607 1682446 2206956 2470722 1281645
7585 1281645 -81393 -867855 796503 1868266 1082753 -403922 147139 1491014 1594476
7576 1594476 1044167 2794817 4400641 3090106 930660 -715294 505388 2502125
7568 2502125 3149323 2184747 714484 1849875 3686442 4099668 2524678 2286568 3311843
7559 3311843 4441930 2537866 600912 2579679 2812010 433358 -1144897 -342616 1189813
7550 1189813 1650878 139884 -1035339 -339001 850702 1509812 2279208 3249092 4773438
7541 4773438 5347590 3682018 1873892 1519099 2189598 2333920 1597388 1399104 1743086
7532 1743086 1813597 2004386 980270 645044 1592317 2807640 977272 734487 1315211
7523 1315211 2530209 2161822 1258017 2358733 2086613 1076167 397072 1375942 1265149
7514 1265149 1481591 88336 -459776 132810 1296365 1744578 1331070 566497 230724
7505 230724 1251266 2247233 190372 -1566720 -1534201 59112 1254905 394731 -1664497
7496 -1664497 -783596 891806 420573 139189 275221 -579471 -546546 -704236 -486799 104695
7486 104695 -1064549 -1040934 -187695 1179913 2380154 1503649 -572676 -590166 -114061
7477 -114061 145185 -581633 -494693 896662 708965 -1326738 -1043155 -305913 -977915 -1555831
7467 -1555831 -1696364 -513820 418327 400875 -1149228 -1031411 -220153 1653714 1103799
7458 1103799 -73313 -1474346 -2394519 -624797 1006088 732816 -394996 -1835669 -845435
7449 -845435 679441 597594 -667046 -1018939 -884179 -1507336 338643 928258 -772386
7440 -772386 -1980482 -340561 1130476 -229284 -346782 -404951 -843331 -1366944 -1135892
7431 -1135892 -912915 -1139349 -1724051 -1851396 -105662 506870 -1010008 315168 1014907
7422 1014907 -87708 -1005937 -185586 621184 570903 -708584 -177601 1568431 86509
7413 86509 -2286750 -2522840 -28257 -121946 379427 -903597 -1374085 -947877 -605858 -1072394
7403 -1072394 -1108920 -1741835 -883309 124616 -152162 -458768 1173613 635358 -854570
7394 -854570 -870564 -337737 496174 197695 -983988 -1267189 -731182 266824 -364314 -1038871
7384 -1038871 -642962 -1061988 -1047001 -51947 -1361244 -679525 -532023 -331766 499863 880419
7374 880419 -380419 -3579947 -3477916 -1508990 -316559 -63347 527028 202714 619087
7365 619087 193817 -1267989 -1158319 -1518037 82731 1524013 734021 -1711186 -2766770
7356 -2766770 -233167 157619 -660037 -801848 -329577 431463 248767 196677 -15417 -942191
7346 -942191 -764385 -284512 -177939 -1348235 -2780583 -1248916 -201379 -1561285 -1469344
7337 -1469344 -7753 1474468 1189695 -1800345 -3558843 -1670269 -579183 70331 342590
7328 342590 1047904 25085 -426641 7173 -1100922 -2025401 -1738546 -1244496 -1133282
7319 -1133282 -2463334 -2530520 -2428932 -1789479 -2115186 -2447768 -975947 695170 12020
7310 12020 -843921 -423830 2039581 2747468 1405497 -95467 903649 755920 -40420
7301 -40420 -495553 -1675142 -1965905 -813423 -683801 -339077 -1152498 -2572778 -1522897
7292 -1522897 -587772 -1390940 -427200 1381297 1512301 209883 -812308 174402 40807
7283 40807 -1077166 -1973302 -1844279 -1618033 -1269145 -1777220 -2780772 -917059 1399232
7274 1399232 88858 -436416 -959242 -217515 -1196517 -484719 1408690 1140584 64153
7265 64153 325400 253369 488583 -525885 -937654 -1414490 -1121689 -417101 361671 552923
7255 552923 223658 -1024921 -1166927 -87748 639113 872612 633260 786730 -322911
7246 -322911 143643 967817 746394 -613913 -1679915 -2058303 -158295 -103034 -1052786
7237 -1052786 -933634 -304657 137533 665835 957443 636212 -408595 791002 1591324
7228 1591324 2303857 1020652 160867 1057066 884148 455842 576974 430043 151655
7219 151655 2086846 1776065 411751 -496631 -930686 -730631 73034 379568 496177
7210 496177 6544 699796 658840 200925 -626957 201466 992960 -655535 -2071882 -119886
7200 -119886 878443 300506 276451 1030188 1017458 2216765 2446574 785943 443823 888855
7190 888855 393423 697566 293066 -890770 -277052 376377 194372 381061 585852 1166632
7180 1166632 908048 1381434 880439 111959 505508 -1520988 -356995 1297672 1027550
7171 1027550 287234 756821 1894100 3497207 3493311 966190 -452700 -5771 -47904
7162 -47904 716726 1097887 -441932 -526161 689310 667621 338069 -635342 -67020 -283652
7152 -283652 -1259995 -563115 6494 187989 1033801 854000 820381 1040675 1670367 560993
7142 560993 197376 414433 -891617 -969316 460254 -286290 -841169 575581 2535483
7133 2535483 1460468 280735 682288 1572216 1355774 -406302 204652 1056602 2338454
7124 2338454 2475907 2267016 1028524 1344165 768104 -543746 517852 1913788 1653982
7115 1653982 -363118 -80795 246010 -235372 328516 1078406 681500 -338885 592564
7106 592564 1128416 419484 -597464 -1140862 -92777 28940 -151747 48733 -113698
7097 -113698 1124979 1871756 1227138 283188 945311 2396000 1630958 945365 683052
7088 683052 -1166964 -957684 -711532 -120257 -344718 -628920 -706315 -285967 -297234 765222
7078 765222 1181469 1023359 1719793 1640687 2422811 744988 43830 12979 1204798 1958461
7068 1958461 1147172 672019 860532 237437 -139472 427930 556033 1685400 2025613
7059 2025613 1449981 1784658 1374390 1283016 816523 1183373 1771567 687611 937840 1216640
7049 1216640 7022 211180 1115596 946437 234721 1374424 2097146 1514942 1834145
7040 1834145 1244423 414562 921729 52363 222199 1991580 2366919 -16146 -351261
7031 -351261 89460 951399 1441439 759134 421541 1090299 2381667 1219466 1256612 1413852
7021 1413852 789551 690445 1484217 1866546 2043934 2064466 1876378 773767 -225916 296937
7011 296937 1552685 3066458 1788909 1096020 1352681 1024033 88059 940094 2802314
7002 2802314 2225603 1177739 357227 869801 414304 396788 812833 672054 872874 1172298
6992 1172298 660588 745362 919512 1858332 2352767 1932427 1452525 2598921 2447405 1017492
6982 1017492 558291 1541312 2517193 3209003 2700114 1268939 -463294 883035 2095222
6973 2095222 -179492 -1002232 2291423 3780384 2124768 361088 14735 788624 1039356
6964 1039356 677195 954702 -156904 -591667 1404385 1139690 233554 981137 2105130
6955 2105130 2076390 2384080 1988750 1044298 1693918 3017076 1797923 1499864 1721251
6946 1721251 1862451 2740581 1818550 1393867 576299 793528 2087412 2704120 1639218
6937 1639218 -84837 -364320 1339857 3087856 3880926 3391739 2805513 2438755 1406566
6928 1406566 1100936 639766 331454 915196 2248165 1215557 264032 212702 680355
6919 680355 162014 1525104 2879762 4123273 4588369 3322590 1699009 1227037 1332591
6910 1332591 1297954 2737962 3809164 3968713 3524406 1863199 499460 633749 1567850
6901 1567850 1687039 989606 2539705 1993793 974810 1325501 1233805 1997142 3677484
6892 3677484 3428829 724228 2244490 3552719 3619705 2880101 3426777 2697200 3046565
6883 3046565 4393334 3221482 1678485 198799 -136712 868282 1149944 1305281 2937060
6874 2937060 2403589 1032293 1704721 2752593 2940135 2895384 3537980 3515513 3486877 2770375
6864 2770375 1834366 747614 1584100 3029855 2704723 854444 -661449 -181339 576074
6855 576074 2509621 2096830 276283 1512918 3498248 2188872 384431 511524 1154946
6846 1154946 1811367 1554795 923463 2809062 3293634 1630237 7341 507294 704557
6837 704557 2262489 4340340 3323393 3064672 1460214 1175393 2534398 1457516 214476
6828 214476 901962 2021670 1906579 2487887 2427863 953849 879736 1752355 1513890 1544931
6818 1544931 881204 381342 -618070 -128254 688162 1713724 949020 314857 -96265
6809 -96265 1207601 1418817 3016816 2818986 1325001 1587348 302520 644676 653016 -1594131
6799 -1594131 -2090198 1255790 2165430 -196201 67442 653087 -159211 773014 1959819
6790 1959819 944099 -98853 915491 2840128 4089462 3345007 806088 -245449
6782 -245449 1275189 1945027 3058698 1296009 251074 -164942 260249 -696506 -1067282
6773 -1067282 -48764 -290085 -425226 165124 -1278987 -2350479 -518022 786055 49071
6764 49071 544794 1382610 -360567 -1760405 321448 1486634 1445867 2756117 2452763
6755 2452763 1721995 1313916 1631475 742847 -17842 468825 2826146 3584687 1159380
6746 1159380 -558213 -104838 186877 991364 1943677 1744775 1280874 1143339 987511
6737 987511 868441 1149320 967616 945287 2033314 2266716 958628 1203665 1243298 -375606
6727 -375606 -27316 1843048 2268370 2374580 592029 -960555 -676006 -478618 -276217
6718 -276217 153472 1074690 1910624 863182 723717 413100 -750007 -265364 1116188
6709 1116188 2880840 2093264 -156878 717337 1618089 1449052 1442659 1046210 1425107 2539938
6699 2539938 4028526 4091407 2185039 1678291 1711599 1759066 2147206 2010815 904649 -444100
6689 -444100 248323 -120750 -1601557 967674 3663726 4038378 2437091 465907 707375
6680 707375 1285186 1971942 896296 816228 1700946 2630411 1661829 175601 1427365
6671 1427365 2806014 2967528 3238306 3329247 2250021 1735326 3546269 3202317 2477481
6662 2477481 2420859 2837172 3179063 2371787 48457 -235410 1280175 910231 1042723
6653 1042723 2611288 3607575 3066909 3604477 3159439 2797493 3628841 3627386 2585543 2587698
6643 2587698 1564630 755203 2068916 3442888 2657823 2824676 2952904 1553306 3110555
6634 3110555 3042258 1200043 3366570 3596190 1351961 2371723 4290053 4645337 3968926
6625 3968926 4759872 5413937 5632692 5263876 2468822 1531914 1671572 3871169 6852019
6616 6852019 6836637 4732792 4257019 4679872 3755797 4128562 5082861 3973183 2640419
6607 2640419 2619490 4066302 5043691 6022053 7005495 5583633 5636054 5904611 5292149 3948456
6597 3948456 2579077 2408186 2423897 4047533 4817325 4547917 6404178 5799986 3816428
6588 3816428 3914784 5627205 4720817 4490466 5790816 5382250 5755471 6355912 7800467
6579 7800467 8696719 9102798 8380383 6865118 6326711 5299231 5909092 7501035 6291486
6570 6291486 6060149 6816094 5479425 5410872 7524264 6395782 5318861 5389335 5154031
6561 5154031 5836412 6991587 6310915 7412308 9788652 10803543 10316475 9324176 8421526
6552 8421526 6676694 7145086 6698460 6257394 5976218 6799173 6855708 6573533 4791593
6543 4791593 5619245 7856645 8128788 7023847 6173885 6566785 5355360 6907192 7669292
6534 7669292 7533219 9191074 9513550 8077030 6817682 5399991 5011129 7108290 7823177
6525 7823177 8375574 9004097 8287847 9086938 8384998 7593440 8803880 10085072 10474175
6516 10474175 10551008 10216812 7890569 6260214 5370792 6155766 6924216 8979958 9052124
6507 9052124 7973855 7777569 6457295 6329735 7735065 10371065 10169739 9884931 7838493
6498 7838493 7362170 9669064 10071373 9144882 7569697 7596353 9006669 8183800 6862895
6489 6862895 7156297 6285389 7500456 8088072 7895389 8229982 8228789 8230722 8938233 7425391
6479 7425391 5888163 7961663 9240590 8456265 7589696 8754566 9192354 9314208 9380552
6470 9380552 8807674 8104985 7831698 5429112 5360280 7183037 6581850 5341317 6407405
6461 6407405 7431804 6631028 6704910 6466681 6533108 9258015 9046867 8001064 7443471
6452 7443471 6361121 7965876 8291571 7758415 6218979 5909458 6714831 7669796 6631063
6443 6631063 5151963 5692481 5998519 6269962 6668088 6718635 6731647 6055232 5830289 6688002
6433 6688002 6908932 6760282 7075577 7243815 5720170 4905376 6559228 6024849 3740313
6424 3740313 2903300 3614033 4624633 4402070 4280830 3715902 4168017 4903061 4274182
6415 4274182 3960389 4681726 5819122 6452173 5297502 4483154 5768650 7154556 6570840
6406 6570840 4975526 4342339 3426642 4294540 4664212 4942383 4549664 4458893 5110180 5992922
6396 5992922 5434271 5625542 7669481 8919171 6749037 6339222 6006609 5642081 5694900
6387 5694900 4716622 5087328 3816569 4196642 2736241 3010003 4070363 6774586 6398284
6378 6398284 4107880 3648309 3887268 4639204 4927072 5207955 5512343 4673266 6637605
6369 6637605 7078970 5773264 5655735 6080123 5821759 5692039 5624324 6152880 4769974
6360 4769974 2704145 3532175 3389552 3345810 4220117 5705474 5117298 4575621 5462382
6351 5462382 5760687 4502297 4441942 4947894 5749811 7152589 7526034 7440834 5840541
6342 5840541 5004400 5951018 6143103 5836822 5991632 5588341 4072412 3799229 4270163
6333 4270163 5087781 5821414 5844944 5213418 5953716 7065057 6481319 6572725 7226733 6044015
6323 6044015 6105156 7295694 6089353 5077269 5208612 5397725 6873277 6410976 4735150
6314 4735150 4614639 4554242 4606232 4891322 4564885 5030885 5483169 5679899 6691290 7009699
6304 7009699 5371451 4669090 5169714 5251243 3918653 5588690 7635498 5933942 4999497
6295 4999497 6069326 6139009 6769191 6738690 6247721 6465281 6778122 6301373 6485114 6778332
6285 6778332 6979544 7325068 5767937 6207130 7877827 6228530 5142395 6310268 7239873
6276 7239873 6881011 7786653 7494457 5655792 6663777 8262597 8092610 8392378 7977737
6267 7977737 7535898 7499769 6814801 5927345 7198325 7638237 6425704 6455843 6248010 6028047
6257 6028047 6871252 6415976 5118434 6696829 7782177 7241974 7409161 6649258 5860779
6248 5860779 7899128 7878628 7807779 7780031 6863546 6996020 7741938 6114491 6698988 7427119
6238 7427119 6206573 7863071 10022039 10190739 9039342 8248497 7941263 8967254 9050909
6229 9050909 8388517 8930111 9188624 8966270 8437233 9424501 8878908 9525556 9766704 9011901
6219 9011901 9320699 9522879 8955609 7876599 9263736 9696708 10994529 10721645 8587746
6210 8587746 8383595 8622513 8279325 9681137 9281060 7619524 7563256 8867495 9974100
6201 9974100 10786027 10719605 9905390 10283222 10790107 11123670 11404918 10943968 8406213 10473967
6191 10473967 12456718 11963813 11062295 11031151 10326056 11090235 9983547 9161536 10050249
6182 10050249 10804049 9996046 10104445 9873657 8989150 9580464 10522273 10537091 12203373
6173 12203373 12898092 12868359 12208893 11272497 11506153 13411024 13072388 12859461 12877002 12637646
6163 12637646 11442141 11367187 12728327 10664360 10660248 10000688 9106910 10668323 12437648
6154 12437648 11143957 10713114 11251790 12220755 12751522 12992562 12969493 13462245 13040630
6145 13040630 12931473 12051426 11207376 11919018 14674365 13347984 12374104 12013498 11968449
6136 11968449 11957529 13885499 12828488 11400353 12595664 13907511 13693931 13641091 13766426
6127 13766426 14032060 15190315 14779145 13595319 13609427 13336485 13805189 13421927 12311101
6118 12311101 12512915 12327719 12777575 14386631 16454957 16054056 14929173 14087677 14178444
6109 14178444 14330552 15472866 16299626 16633241 15800503 15462100 15516585 14720003 15138867
6100 15138867 15375457 13672988 13316821 14054038 14637991 14330755 13452467 13508834 14790368
6091 14790368 15654589 15271438 14431005 15742855 17671583 15302357 15028468 17675084 17815618
6082 17815618 17399143 16282791 15441284 15976799 16505578 15827199 15099062 15739801 16615517
6073 16615517 16596669 16106901 14984224 15573812 16881024 17023188 16828465 16875185 17363531
6064 17363531 17355357 17815246 18128294 19142479 20712581 20314589 18296501 19004652 19020721
6055 19020721 17856754 18286746 19012392 19033606 18795046 19082611 18502142 17837066 18095543
6046 18095543 19116494 19555245 20329762 19202639 18625088 18305251 19448369 20461247 19689532
6037 19689532 19246312 18858859 18883329 20263814 20870379 19482635 18361652 17505382 18462223
6028 18462223 20692157 21124489 21204183 20596606 21386222 20768312 20619386 21257635 20949061
6019 20949061 20772819 20065798 19925343 20807157 21666674 21588199 22069510 21492686 20982917 20416517
6009 20416517 20715576 21497648 22286852 22026075 22431186 22283420 23041471 23617379 23432230
6000 23432230 24385489 24864334 23973986 23470217 21957033 22867917 25073413 25971898 23853764
5991 23853764 22136773 22430385 22236946 22931881 23154289 22863667 21990016 23199739 22792610
5982 22792610 24041481 24737869 25066962 25237032 24200769 25490157 25774589 25701732 24452417
5973 24452417 23938807 24839328 25386413 25426917 25317724 25894832 26127872 27291850 26831475
5964 26831475 26605206 26188730 26620486 27600671 27216052 26444464 25449444 26740655 28140605
5955 28140605 28993537 28337882 28680324 29224079 27617384 27516392 28717611 29478883 29235608
5946 29235608 29155677 29466086 28273664 29416812 30478548 29686898 29874079 29451620 29249902
5937 29249902 29870773 29488468 29011481 30079139 31552871 31932193 31947590 31724292 29839613
5928 29839613 30043129 32034229 30291050 30196126 31997676 30438218 29865535 30765649 32187629
5919 32187629 31234092 30847802 31070758 33405456 32420866 31614628 31757926 32809873 33712434
5910 33712434 33056039 33889039 34167095 33180924 32646828 32082472 30919720 31509912 32516074
5901 32516074 33085887 32191796 31493469 32739942 34726361 33750034 33099291 33414011 34688127
5892 34688127 35883692 36765054 34970111 33567869 34198424 34132233 36465076 37241519 34733139
5883 34733139 34033326 33507754 34995068 35364950 32914671 32437505 34367942 35268357 34693768
5874 34693768 34346729 35869964 36316331 37409021 37828786 38200499 38508849 37390748 36362321
5865 36362321 36776747 35999597 36097017 35905777 36130967 36850963 36439072 35236837 35264158 36342152
5855 36342152 37590421 37427557 36538411 37166867 38855054 40208622 40150166 39780572 39752735
5846 39752735 40858996 39662613 38948948 38553618 39183431 38591216 37364636 38785374 38812373
5837 38812373 38238275 40034633 39936684 39425770 39455829 40493385 39723115 39749824 40761065
5828 40761065 41523725 41563471 42461217 44001420 44238082 44966737 43619965 42726712 42607515
5819 42607515 42567002 42092273 42535742 43582508 44693221 44634809 42981018 43156576 44241360
5810 44241360 45823199 46739915 46442718 46128207 46910637 47551582 46672126 46080156 47485720
5801 47485720 47905996 47985930 47601494 48124632 48688456 47395806 46824653 48030506 49734477
5792 49734477 50766181 51401716 50301076 50155748 50753030 51251496 52086202 52633221 52002868
5783 52002868 51553037 52297900 52924085 52242966 53032142 51997496 51982082 53303095 53878250
5774 53878250 54363945 55308160 54516597 53837306 54865207 55749049 56498457 57034912 57385434
5765 57385434 56263432 55982907 55926721 55826692 56545855 57995559 57790011 59192353 58834357
5756 58834357 58618766 59794481 61167656 61428495 61812097 62078997 62279100 61716099 62795934
5747 62795934 63061897 64283978 63873252 63127024 64075365 65165682 66802794 67532839 65631880
5738 65631880 64374556 66714460 66681904 68198842 70096488 69152489 68189770 68775271 69733787
5729 69733787 70101706 70708453 71317045 72845644 73136138 72597604 73061387 74860012 74341847
5720 74341847 74582141 75444791 75223315 77525871 76905559 76193354 76253733 77474913 76852252
5711 76852252 76733978 78641018 79851147 79572984 80518420 79988660 79923991 80520533 80553574
5702 80553574 80854728 81873909 82879826 82516701 83482350 85238526 85637504 85617630 86603658
5693 86603658 88117091 88009920 88043406 89583733 89551580 88806168 90673672 92234744 92069894
5684 92069894 92853065 94044950 94818709 95784578 95857648 95571794 97066687 98267586 96906971
5675 96906971 97539977 98323650 99444525 102077975 104914391 104897583 103758407 103355523 105011102
5666 105011102 108244231 106773232 104544910 105120764 107907988 108665933 108476928 109807449
5658 109807449 110641202 111293263 112384636 112024849 113221569 114860767 115105014 115743073 115979811
5649 115979811 116112014 117803779 120353246 120512845 120524830 121157205 122312947 122743466 123722950
5640 123722950 125023192 126268301 126596360 126689167 128589378 129082111 129279800 131570178 132344188
5631 132344188 133298720 133884529 134026688 134803865 136561076 139648842 140439261 140202989 140477340
5622 140477340 142097185 142916961 143855151 144108467 145171005 145851279 146605009 149636740 151656432
5613 151656432 152382723 153254069 154678733 155462582 156843005 158383836 158763085 160651297 161257883
5604 161257883 161497576 162866590 164673044 167011135 168605949 167179862 167273377 168096398 170504595
5595 170504595 172230847 172913774 173198093 174765845 176112948 178057919 179222121 180941131
5587 180941131 182224530 184730899 186918108 188422983 189724721 190352947 193205913 195348412
5579 195348412 196910381 198502724 201216605 203772061 203555913 202833357 204638308 206251402
5571 206251402 208828224 209379155 210260122 211051197 213886941 215890231 217758893 218481734 220261361
5562 220261361 223656153 226655441 227685371 227339154 228524659 231803389 234274865 236962920
5554 236962920 239261037 240630989 241992951 244067963 245961730 246518096 247601052 248463316
5546 248463316 250726636 253871290 257159511 258348700 258593061 261614592 265140902 266160417
5538 266160417 269499504 271972305 273628128 274261940 276303250 279066277 281060381 282686892
5530 282686892 285268466 288964885 290837706 293199203 294949739 295746639 297141234 300087552
5522 300087552 302017135 303124328 305273868 307443948 310035098 313504471 315609996 316943575
5514 316943575 319151448 322195926 323933828 326373384 328107253 330346374 332911222 335983401
5506 335983401 338475078 339340932 341708541 344670691 346247428 349480125 350734049 352784546
5498 352784546 353579530 355083604 357063305 360440275 362776811 364746971 367041809 368341893
5490 368341893 369268159 370473797 372918908 373847829 375684230 377061378 378591926 380909668
5482 380909668 383726095 384646954 386001518 387776169 389025691 389953590 391084367 391857249
5474 391857249 394333097 395925431 396621507 398272876 400729815 403103389 404268527 404609578
5466 404609578 405372565 405408633 406755844 407592110 408003912 408312289 410337723 412140014 411546001
5457 411546001 410866653 412555407 412814616 412823619 413434933 413818832 414381840 414583468 414903592
5448 414903592 415224327 414937562 414795878 413907908 414045275 413922464 414798085 414497453 412467964
5439 412467964 411735192 411073696 410109725 409078234 408736437 407804634 407677490 408815532 408004821
5430 408004821 406331372 404070016 403195699 400969404 400276687 399678239 397229810 395308528
5422 395308528 395605416 392877292 390983879 389820754 386941526 386404022 385803310 384651448
5414 384651448 381524908 379197717 378738125 378342611 377004277 375766275 373633034 372590628
5406 372590628 370492481 367836055 365870775 364743077 362548286 359501270 358538484 357548808
5398 357548808 354904020 353053837 349255378 347155844 345924439 343620316 341588056 340424234
5390 340424234 338712873 335942559 332635619 331883560 330697364 328117998 325773751 324668386
5382 324668386 321469771 317854472 315193084 312489471 310831605 309166095 307057849 305421614
5374 305421614 303039599 301443464 298685796 296245580 293637289 292322712 291866354 289253833
5366 289253833 286937922 284835015 281414181 278855919 278040862 276708848 274721399 272200185
5358 272200185 269045667 268633107 266337784 263601778 262043220 260707373 259287787 258531828
5350 258531828 256591705 254127299 253115922 252905579 250358036 248227455 246330298 243067759
5342 243067759 242778672 242211426 239967775 236991135 234289570 232172526 231904879 230865591
5334 230865591 228274768 225886711 224431001 222666348 221108703 219389963 217963531 217322178
5326 217322178 215890407 214360270 213420737 211295069 210233807 209580279 208778750 206355348
5318 206355348 205206790 203785612 202785664 201572574 199721488 197852362 196985951 197583775
5310 197583775 196478857 195090806 192725156 191651185 190112336 189018324 188193572 186100413
5302 186100413 184815475 184044372 185897353 184663568 182469417 179641356 179039499 179134178 178716616
5293 178716616 177005639 176120862 176167689 175747898 175071044 172941716 170874471 170678412 171703516
5284 171703516 171263441 168338717 166337111 165382176 165509561 164997346 163323003 162866884 163216027
5275 163216027 162945201 163112854 162807412 161363902 158674428 157256437 156592198 157150381 158015395
5266 158015395 157180719 156014604 154515952 153234679 153540791 152904691 150881404 149465534
5258 149465534 149903132 150133515 149040117 148486710 148040506 147218898 147871364 146627415 144612851
5249 144612851 144219752 141689682 139755076 140708075 141320441 138956407 137744800 137655248 138724938
5240 138724938 138656136 138583756 136614528 135821408 135714433 136113169 136821794 136662699 135859513
5231 135859513 134332632 134503667 135386892 134100544 133312877 132830011 132840113 133518604 133382519
5222 133382519 132599088 130976192 130926052 131799528 131722386 130491783 129763681 129924423 129213009
5213 129213009 128266211 126912900 126863627 126195412 125126469 125093829 124840032 124228001 125759604
5204 125759604 127397413 124963751 123944484 126174266 125657551 125314418 126340784 125535950
5196 125535950 124393755 124512397 123558166 124696284 125108741 124566515 123814407 122597953 121050991
5187 121050991 121407699 122262994 121824035 122035944 124124204 123713760 123819554 123485759 122627681
5178 122627681 123691620 124019443 123972052 123105032 122810123 123519319 125702030 124350069 122477073
5169 122477073 122142213 122688842 122392765 122903861 122284244 122552522 122763184 121647577 120688101
5160 120688101 121289965 122549425 122785660 122816250 121317057 119506300 119701565 119899401 118896327
5151 118896327 119117585 120095615 120449612 121395835 120963826 119296876 118489158 120082685 120825727
5142 120825727 120699385 120257164 119624541 120351808 120460246 119422416 119483835 119814178 120427005
5133 120427005 119690425 119541515 119420311 117154711 116620578 116848094 117185795 117941523 117488980
5124 117488980 116836796 118253385 116379886 115725138 116643091 117471962 117217772 117655508 118770633
5115 118770633 118496610 119118561 119892891 118361542 117839603 119746835 120438487 118616028 116699256
5106 116699256 116082891 117196499 117548440 117511583 118461534 118621375 118496649 117923403 118521064
5097 118521064 119018511 118953245 119981623 121820135 121156907 120461135 119737163 118079584 117753389
5088 117753389 118676388 118923030 119297326 120118676 119613554 118506226 119976424 118939474 119356813
5079 119356813 121615429 123450778 121879175 121322485 122290142 122504094 122501243 121659417 123115331
5070 123115331 122988378 122298618 122214735 121221217 121988377 124881791 125677658 125171566 123148462
5061 123148462 124118665 126071314 125490176 126280185 126910095 128328840 130273146 130656748 130931598
5052 130931598 130834694 130029352 130673012 131662997 131290576 131337398 131788574 131330492 131505620 132073912
5042 132073912 132750686 134021959 134666308 135071967 135014950 136202758 136567654 136955252 137971081
5033 137971081 139236239 140100568 141034734 141299787 141555829 142449157 141836304 140994023 143155212
5024 143155212 144762346 144285865 144268392 145154115 146288280 147841003 148591911 148480050 148348355
5015 148348355 149167434 150693051 151010223 151861192 153207661 155133694 156624908 157089398 157000792
5006 157000792 157570913 158741204 159820526 161305356 162653796 164607037 166548450 166199436
4998 166199436 166820488 169452458 171423467 172585351 173899045 176698542 176302896 176100840
4990 176100840 177777054 179001153 178433783 180128638 184948076 186234871 187478813 187958625
4982 187958625 187247993 187098751 190022476 190915706 192484582 194942642 196548741 197829749
4974 197829749 199606681 200435710 201545991 203818690 205259168 206714001 209104942 209532776
4966 209532776 210347433 214119634 215531278 216730547 219100066 221226672 222336677 224783811
4958 224783811 226191852 227885527 229705331 229620767 230832853 233830497 235460095 235551000 238029572
4949 238029572 240536623 240583400 241753049 244084548 247941307 249683030 250871537 251982891
4941 251982891 254109401 255465585 257101731 258946505 259324326 260272565 262726103 264611403
4933 264611403 265200851 265903954 265530299 266806899 268031030 268217756 269227293 271195869 272985978
4924 272985978 274593647 274376649 272930315 275378027 278698768 279402409 281586464 281741210
4916 281741210 282117770 283954831 286069512 286537239 286592887 287235463 288171463 288794864 290962930
4907 290962930 291317980 292066236 292638905 292603333 294917191 297701201 299239401 298558871 299622069
4898 299622069 300244454 302193991 303373243 305238123 307264322 308987534 309790400 311979919
4890 311979919 312366699 313493625 317277850 319607211 320594132 321473043 323059372 324622524
4882 324622524 326380013 327381924 329095569 331048086 334239256 335989326 336429853 338662246
4874 338662246 340079981 341732329 344018561 345522436 346772977 347116015 349087362 352046728
4866 352046728 354112111 356131363 358851455 360548266 360940939 363624785 367418943 368831491
4858 368831491 370300112 372869205 374338780 377125825 379121848 379274131 379530254 382339054
4850 382339054 384883899 385730617 387343290 387850844 388137829 390363424 389268665 390429958
4842 390429958 391785964 392900386 394518121 396320081 396389523 396034208 395526386 394697764 393889425
4833 393889425 394871908 396387756 396724683 397125660 395751203 393973938 395466909 397156122
4825 397156122 396630612 395466126 392432988 393358550 393016852 392078097 388664161 386677517 385271774
4816 385271774 384515572 384734459 382963507 380214262 378081428 376280677 376150142 374560751
4808 374560751 374041180 372941146 370544704 367490398 367407512 365890463 361384292 358415301
4800 358415301 357600693 355430139 351371407 348571300 345861041 343405423 341386921 339777459
4792 339777459 337893520 335068727 332915093 331279286 329198960 326807230 324319327 320914283
4784 320914283 317054255 314709591 313460318 309894842 305338816 303519476 301176862 297919878
4776 297919878 295577516 294307622 290929356 287420357 285577915 282197582 279250681 277835817
4768 277835817 276951369 274040985 272739214 271365160 268266624 265261010 262828838 259445372
4760 259445372 256035086 252718447 248021567 246444678 245251354 242787470 239607174 238043030
4752 238043030 236421658 233577377 231496568 229682098 228172865 227608121 225501676 223715659
4744 223715659 222582327 220472990 218052602 216899548 214341362 212686538 210375876 206935982
4736 206935982 203890606 202897088 202602208 202259527 201688503 199662694 198959347 198668561 196978350
4727 196978350 196662170 195288313 193361833 191774864 190659199 187939252 186058172 186087599
4719 186087599 186653384 185856169 183496123 181511518 181238388 182283134 181494593 180056467 178635801
4710 178635801 177854689 176440390 176445833 175679210 175148625 175564156 173234912 171004213 170202027
4701 170202027 170885681 171292233 169775026 168729918 169063237 169741457 170717073 169746576 167866965
4692 167866965 166511543 165833044 166020508 165945131 166455303 167552897 166550581 166204269 166864080
4683 166864080 166123655 166058600 166630888 166770703 166005460 164557032 165533051 166943280 166196597
4674 166196597 167765651 169328058 168221328 168583059 168219145 168914280 170345991 170869470 170122896
4665 170122896 169986208 171976332 173453725 173242632 174199706 174246443 174086668 175410986 177342932
4656 177342932 177522960 177746727 179070776 180468796 181869895 183471018 184706226 186003037
4648 186003037 187534594 188932041 189869276 190577804 190964769 193224605 195513217 195950367 198702297
4639 198702297 201863755 202942198 203743497 205069027 206979889 210893220 213559403 214823531
4631 214823531 215851683 218030423 220285611 221579661 223033590 225845831 227694175 229524461
4623 229524461 230713994 232154072 232630480 235030078 237075374 238400959 239324956 240903127
4615 240903127 243234189 244846309 247194138 250489810 251780450 253280336 253616634 255495422
4607 255495422 257614707 258457449 258539352 259759132 260601204 262627324 263805431 263823874 265259937
4598 265259937 264796024 264448952 265512348 266309947 268357344 269159342 269408656 266238431 265861131
4589 265861131 266748758 266266008 266063773 265369843 263905728 260298142 257771642 256919963 255070031
4580 255070031 252809310 250842914 248137348 246867031 244071196 241639010 239105736 236766320
4572 236766320 235006570 232921944 227383722 223736312 222806338 220154597 216682075 213598182
4564 213598182 209675335 206581335 204953324 201163520 197530683 194469535 190492018 186594606
4556 186594606 184796948 181984995 179110234 177543689 174239554 171293232 168259991 164723227
4548 164723227 161882412 160064570 156961070 155585062 152538087 148849289 146735966 143682359
4540 143682359 140098139 137822887 135882700 133714957 131205759 129582052 127308963 126977738
4532 126977738 125595680 123118897 120310562 119025061 116673009 115282675 114170861 113236147
4524 113236147 111285951 109159766 106459296 103440657 103238457 101715034 100249966 100586482
4516 100586482 98490265 96266280 95055251 93296576 93412594 93442115 91252121 88784514
4508 88784514 88196882 88645861 88068756 86937500 85091934 83623959 82285649 80329624 80647074
4499 80647074 80550978 80255317 78721219 76925081 75465211 75209961 74418607 72976337 72979520
4490 72979520 72443075 70323884 69635512 70575752 69330309 67706529 68193260 65894504 64358264
4481 64358264 64808473 64583269 64133527 62400160 61774832 62523103 61119445 58795424 59157782
4472 59157782 59899657 57932426 56037429 56787650 57838838 57330893 57354302 55641700 55827060
4463 55827060 55361658 54770651 54867313 54613898 54934025 53864684 53727660 52658728 51131610
4454 51131610 49840153 50229416 52379612 50596823 49313459 49964739 49317707 48319808 47461611
4445 47461611 47902901 47635566 47579704 47081229 45967460 46059303 46779940 45616992 45248752
4436 45248752 45347832 43488059 41198152 42097264 42368015 43660875 44817719 43305421 42019577
4427 42019577 42306438 40918351 40993948 39800544 39063267 41055247 40292255 38922134 38677932
4418 38677932 39730119 38593780 37813899 38430746 38600420 39073446 39112388 38403524 38567921
4409 38567921 38092980 37711077 37606553 38493484 38415140 37793908 37490338 36576470 34914632
4400 34914632 33386447 32660093 33751312 32682079 32945366 33048885 32746273 32631382 33046305
4391 33046305 32840799 32243656 33200208 33063208 31721626 32280981 31936588 31441476 31774108
4382 31774108 32125210 32494832 31440558 31765901 31411371 31476021 30334965 30486818 32581924
4373 32581924 32680843 31798897 31908991 31264904 30586477 30677218 31542039 29511560 28299038
4364 28299038 29262176 29124673 30366844 28103225 26230533 27564656 29268569 28977618 28575890
4355 28575890 26542560 25688581 26642454 28138780 27550533 26716678 25714462 26356539 27132921
4346 27132921 26572905 27470054 26227004 25375675 24933113 26966523 27320534 26662346 26495077
4337 26495077 26785253 27294741 27404594 26221985 25397323 26018725 25837412 26449817 26017801
4328 26017801 25566619 27471175 27442813 26592706 26314841 27460086 27170262 27034040 27078361
4319 27078361 25196046 23311001 24598399 24648504 23875807 24234945 23271778 22316859 22950004
4310 22950004 23855049 23407735 22217625 22312336 23210817 23536536 22934282 22130105 22987118
4301 22987118 25377346 26622657 25788492 24317335 23673535 23795971 22958143 23032182 23356134
4292 23356134 24559887 23136920 23355436 23252974 21725566 22055656 22383412 21872856 22574782
4283 22574782 22995869 23079269 22014002 21557253 21526791 21931517 23025470 24103508 24088313
4274 24088313 22751371 22693417 22566392 20839255 21309070 22343131 22289597 22855849 24309905
4265 24309905 22706717 21502752 21681426 21957692 22321120 22732902 21953840 21988269 22479306
4256 22479306 20351611 21066786 22142240 23709318 23744526 22409087 21100788 21816234 21003024
4247 21003024 20077182 19050204 19121898 19137471 19968928 20470482 18369402 17310788 19443632
4238 19443632 19697529 20223413 19385485 18688335 18388184 20014223 20512539 21090140 19727188
4229 19727188 18498902 18449133 18381922 17554348 18839862 18386639 17758098 18097669 18481349
4220 18481349 17840181 17809730 18242972 16696442 17886852 18873954 17564566 15995982 16382749
4211 16382749 17990303 18814123 18433158 18749908 19001270 17746711 16449560 16950336 16255786
4202 16255786 15866845 17534534 19615040 19513090 18149569 15867969 16009891 16190400 17027189
4193 17027189 16106163 15130434 14123545 13673701 14598837 15912633 15563586 15685655 15524908
4184 15524908 17019594 16575463 15224937 13512429 14003267 14180529 14033690 12776951 12811873
4175 12811873 14419295 14313308 13797206 13682569 13389263 13272483 13901973 15449591 15209873
4166 15209873 13978709 13278625 14593376 14606037 14321535 15519000 16028176 14615838 13652817
4157 13652817 13288003 12741479 13781729 13526869 12960635 12585023 13651942 13220540 12856367
4148 12856367 13818592 13883736 11377334 10894874 11243982 11814150 11685783 11611855 11880764 11888355
4138 11888355 12049146 12123317 11798747 10794656 11730075 13143728 13023103 10854741 11580435
4129 11580435 11323463 11152258 11578719 13492385 14163102 13147194 12290265 11876702 11591110
4120 11591110 11518105 12230765 11770154 12380752 12453039 11960241 12515555 12803813 11701733 10209639
4110 10209639 10832932 10811719 9581695 9648608 9973485 9770869 9245047 9872425 9810587 11193802
4100 11193802 11883391 10838328 9870246 9831557 8358409 9759433 10140580 10480593 10509957
4091 10509957 11427942 11044761 9822864 9036523 9896469 11542527 11533864 10088693 9446672
4082 9446672 9799175 9131752 10360989 10724279 9978180 10121362 11249983 11722635 10174774
4073 10174774 7956205 7936761 7897670 7953595 9321339 10155497 11627841 11199514 10453323
4064 10453323 9709403 9477930 10619908 11808615 11470708 10708787 9758159 8414220 8843560
4055 8843560 8782665 10189230 10903466 10483657 8745359 8578376 8902007 9205577 11400290
4046 11400290 11282062 11177588 11685933 12483394 12396439 10765780 9344380 11294580 11167879
4037 11167879 11300292 12356892 10782019 9722294 8836267 9145860 9881871 10984762 10630123
4028 10630123 11041812 10716202 10888298 9912339 9566801 10164669 10910423 12777757 12664514
4019 12664514 11217246 9694191 9595076 10669518 11413283 11453856 12041876 13128252 12046787
4010 12046787 10695406 10971404 11464518 11877269 12063839 11884899 11674958 12150509 12382204
4001 12382204 11085122 10467797 11322259 11219672 11944965 11509288 11456811 11843694 12044919
3992 12044919 11549024 12433840 12076558 11370669 11893873 12550657 12097727 13867141 14063715
3983 14063715 12584259 12679402 11980779 11923659 12049684 12411272 12651134 13774276 14502338
3974 14502338 14749366 13747387 11843887 10799257 10772982 13528064 13705762 12739123 12950012
3965 12950012 13075013 12452856 11216589 11195595 12240304 12261434 13090036 14412787 13078507
3956 13078507 12669481 13953354 15807170 14185584 12913338 13101060 14672170 15090682 13732989
3947 13732989 12607908 13694587 14351981 14621300 13820182 13693916 14122107 14661122 13920104
3938 13920104 12013286 11770252 11353682 11274296 11764114 11807497 11862187 13031105 14937717
3929 14937717 15368972 14433810 13242662 13770602 12914761 11995044 11215026 11214774 10801976 10491783
3919 10491783 10945708 10508346 9990059 10774265 9980332 9644900 8492235 8888485 9436772
3910 9436772 10735043 12146091 11470237 10869795 12407779 12515701 11615020 11642641 11814946
3901 11814946 9698258 9035871 11159366 11320915 9960097 8398575 8226995 8564686 9076332
3892 9076332 8437643 6296153 5966022 7671234 8588531 9311856 8196770 7861375 8191019
3883 8191019 9255919 8993333 8848524 8490149 7982896 8958660 9215365 6739712 7213951
3874 7213951 8575692 10012578 9360537 8516967 8300064 8513911 8275148 6110868 6427381
3865 6427381 7367201 8078939 8602550 7319604 6817944 7168250 6730809 6657423 7138104 7130861
3855 7130861 8127427 8308442 7533983 5622629 5853464 5938279 5520240 5834014 4937703 5264663
3845 5264663 5376631 4643309 3531464 4009409 5153448 5468007 7616891 6706625 4371847
3836 4371847 3060878 4626095 5477244 5367530 5868961 4862168 3478068 5139617 5425325
3827 5425325 4974467 3221813 3555397 5560096 6163799 5391295 5681033 4955350 4230178
3818 4230178 4576236 5703892 6815819 6838704 6301718 5729674 6275857 5708144 4257125
3809 4257125 2426603 1911376 2975534 4980419 3665548 2882065 2038261 1738539 2849520
3800 2849520 4956551 5104566 4403673 4297053 4932504 5005808 3824166 3096784 3480746
3791 3480746 2841786 2767878 3768426 3986459 2349560 2258613 3114154 3756628 4464554 4045980
3781 4045980 3347066 2892450 2838475 2674356 4591797 6533061 5945411 6652914 7030021
3772 7030021 7391269 6758286 4717463 3417749 3870987 4514716 3151797 2569925 3500831
3763 3500831 3345790 2648024 2028119 2020987 3778484 3643271 2178784 2234090 1960591 1838508
3753 1838508 2509769 2823523 3175708 3467736 2849862 1881108 3265877 3456765 1115750
3744 1115750 1544892 2296864 2755532 2461984 2451956 3074526 2389165 844851 1434304 3631935
3734 3631935 3054695 3319966 3565872 3140147 2889474 4354229 3878791 2896546 3917404
3725 3917404 3904751 3900155 2920412 2336607 2575239 3773507 3228746 3076813 2555871 1675393
3715 1675393 2450657 3355160 1427178 733986 1230758 1254562 1583508 614635 1407175 3138404
3705 3138404 2589988 1656441 2610530 3421371 1766605 1543988 2674050 2061663 853890
3696 853890 3090396 2694768 1275719 1220596 3227416 5337824 5009393 3339263 3257713
3687 3257713 2934558 3950943 4476291 3764981 3059873 3011066 3119311 1419408 2386030
3678 2386030 2871968 1988710 954276 735672 2301108 3154434 1646988 1807956 1873606
3669 1873606 2370552 1828621 1469854 1548119 2033436 2907725 3140683 1879890 1477897 1521301
3659 1521301 1666466 1569266 861316 -246380 166402 1041648 1581496 3190828 3439111
3650 3439111 2145938 2461320 2492533 2120983 1530309 2675751 3303244 4117172 3574249
3641 3574249 3247287 3178579 2887832 2286437 1283153 1938979 1361635 1267245 1999183 1614094
3631 1614094 -41562 1019493 1802966 1950105 1905841 668569 2081753 2040133 1216649
3622 1216649 2287386 3170747 3653803 3736988 2968658 2525527 1870901 2299609 2954881 1564374
3612 1564374 100341 91508 1581192 1877530 1317444 1550050 1206448 373758 2031663
3603 2031663 2803040 2497574 2361467 2178434 1385289 627646 1051296 1322694 1746337 1521958
3593 1521958 2045828 2776061 2501980 3009734 3672364 3033169 3136260 3161650 3060923 3494680
3583 3494680 4547722 4328359 2407210 686542 721034 831520 716328 820181 603453
3574 603453 -123356 769655 1013455 2530620 2590359 1552941 1599214 1949254 1686709 2854100
3564 2854100 3151493 1242355 1205285 2550204 1927500 1341661 2922869 3094588 2963307
3555 2963307 1565505 1370495 637923 2241895 3326579 2519753 2548419 1274614 2121896
3546 2121896 3100705 3603937 3279991 3544996 4638957 3657668 2725878 1744136 1564196
3537 1564196 911198 1509253 2906389 3911010 4653384 3553889 1112571 459677 -260874
3528 -260874 1582435 2016546 3265271 2952338 1346567 453708 272534 289998 1183627
3519 1183627 2253878 1599943 629020 2153723 2802478 3085209 2482297 3129328 5894618
3510 5894618 6395848 4427037 3031593 3921029 3481078 3052511 2927648 1998038 1923301
3501 1923301 2689335 906109 119301 378438 226756 1604566 3017630 2611409 1573649
3492 1573649 2072483 1505498 994342 1418165 2424615 2023759 1435737 2444896 2154094
3483 2154094 1417456 1658700 2151747 2604245 2598149 3612250 4166624 2700142 2850391 2334632
3473 2334632 2506147 3835226 4797270 4278663 4498903 2661906 1312549 2653872 2615695
3464 2615695 2769999 3804271 4728528 4092439 3909942 4001061 3338255 4458753 5725317
3455 5725317 4122636 3894370 4570253 3011438 3347776 3424567 3016928 2481060 3010247
3446 3010247 3594133 4778239 5282622 3930128 1539358 1977580 3035584 4168212 4668865
3437 4668865 4456931 4825318 4613881 5838595 5716432 4772828 5354053 6164560 5418505
3428 5418505 4470797 4907524 6139016 6490705 5332773 4339340 4831445 5908637 5910359
3419 5910359 5201806 4557902 3800440 4555770 6154168 5719115 4474023 4388197 5608818
3410 5608818 6114644 6125644 5089283 5340196 5768587 5372267 4526557 4294605 4719420 3782154
3400 3782154 4083338 4372789 3765891 3678156 3327288 3545164 3996166 3993310 4563729 4061883
3390 4061883 3937942 5015149 6146237 7063510 6784736 5679365 5599741 6200382 4711446
3381 4711446 3758740 3400889 3565985 4422528 4442381 3505443 4169550 5241658 5176130 4578511
3371 4578511 5176397 5228896 4397355 4604455 2666421 2166561 3563921 5110436 5505176
3362 5505176 6314578 4164972 1646250 3228252 4900087 3044882 2420560 3334150 4397410
3353 4397410 4404644 3958880 5106022 5764246 5692771 5327685 5141958 4283251 3332412 2453183
3343 2453183 2981282 1873812 2416193 3198641 3125339 2983424 3503006 3279775 3972620 4065863
3333 4065863 3892242 5239267 4034642 3810778 3541107 3245439 4167962 3166835 2527654
3324 2527654 3637430 3451884 4527055 3607507 1264994 637878 2750718 4838270 4500062
3315 4500062 3991535 3905206 4232741 3543914 2800888 3822656 3225095 2808186 2406770 2408372
3305 2408372 2374116 1790577 2589012 4009110 3247011 2945531 2949551 2802546 2600907 2523519
3295 2523519 1664576 2697998 2750999 1992851 2445224 3299437 3344877 1007695 59982 778445
3285 778445 2545726 2483022 896502 -293998 227745 688528 878445 2011130 2382751
3276 2382751 3567550 4222338 4250110 3267125 1306136 1769064 3666510 3730853 925286
3267 925286 1471966 2895291 2071420 1381262 1237338 996193 428199 1274862 1682769 1407764
3257 1407764 1249671 711197 400481 528518 1910090 3216035 2929610 2113013 1595720
3248 1595720 1315327 1746849 859283 1131645 195575 1166953 2986985 1499909 528028
3239 528028 529738 406634 215527 1162457 1567472 -83254 -582820 815690 1023694 1030092
3229 1030092 1928396 1892966 1278817 720634 235701 502808 127542 -472200 891989 1732180
3219 1732180 1284359 1933092 2149132 2295090 2872450 1918329 756806 79748 -56516
3210 -56516 840570 1012789 298961 641351 551592 892220 1463686 968411 273357 666216
3200 666216 3272451 3368126 2100087 447461 311561 841334 1253368 -497456 -197960
3191 -197960 995236 884014 940700 492125 -812961 -1623428 -829502 -304841 -387146 -326277
3181 -326277 -276505 -291695 -296498 -832853 -357000 845091 2134099 863664 348399 1002576
3171 1002576 772460 1013141 904064 1468362 851771 -795777 819404 919431 147931
3162 147931 -407715 260730 -480790 845236 1233781 739454 -385968 173800 -163819
3153 -163819 264014 376803 -1188287 -677839 1154276 624838 -191462 -323524 -117511
3144 -117511 557298 796918 -663565 -1684639 -131521 1081486 -17149 -618112 -1423919
3135 -1423919 -360464 2881316 1098675 -766258 -798358 -214720 1353045 2459982 1096545
3126 1096545 52529 125587 1738892 1614711 1779235 2035057 2867126 1890688 1290313
3117 1290313 1185094 1468046 13143 700631 2062415 1018655 581868 2095360 2296152
3108 2296152 1915513 1110522 -306626 4291 186773 -257298 1338186 583230 -608336
3099 -608336 1059957 2018848 1661895 1139142 1770363 963805 223153 -361858 -807799 413737
3089 413737 786937 2308427 2759527 2244430 1647146 2074541 2112296 1880596 1117986 935850
3079 935850 -251625 87756 389877 -477988 -432731 -54911 1539099 1782886 1078778 161867
3069 161867 791440 -317344 -563020 1051550 2002449 2181742 3232093 3057875 2519313
3060 2519313 1911759 2625844 2815768 1256240 624303 443341 -3584 -264489 28464
3051 28464 849835 1232355 1534531 1836103 2500407 2144526 1643195 -807552 -1213944 -763788
3041 -763788 1194960 2864221 2189419 -806816 -105895 3181104 993296 -1684466 -188807
3032 -188807 1376375 803162 726012 -304774 -469945 549115 1431351 2068954 1169833
3023 1169833 -1019773 19726 1239917 138974 -2359749 -1206182 1079583 304802
3015 304802 323408 132092 1333212 2420144 1751439 969300 1129575 1662706 975299 1452395
3005 1452395 237548 -82565 412024 23974 725529 1239676 261003 -968410 -958866 -428560
2995 -428560 -1210253 -883041 -1117610 -660210 -156319 -1007280 1533593 2527160 1063969
2986 1063969 -143083 590643 79929 -1484845 -1458654 -504279 -324660 -735153 -1545167
2977 -1545167 -659438 228950 -816549 -1351702 -1187265 -812715 188144 -785594 -1653827
2968 -1653827 -1855083 -838508 854877 1056994 1089397 141897 641277 -69020 -692076
2959 -692076 -1188032 -1459059 -1092346 -144859 -854992 -1058209 -1375969 -3164296 -2619610 -535422
2949 -535422 536555 -576798 -474194 -1379221 -2651472 -2247371 -1961311 -1930341 -381832
2940 -381832 706079 153803 -134983 -900277 -1748358 -1228601 -1250987 -1883581 -1131096 -97262
2930 -97262 -549609 -1469790 -1700189 -2436215 -2288936 -2533866 -2218174 -2515615 -3641792 -2119536
2920 -2119536 109477 1072474 -478636 -2051020 -2541067 -355395 -433745 -1844451 -1497742
2911 -1497742 -2902982 -2896666 -2359408 -1820441 -452569 -406459 413426 -422513 -684127 -220969
2901 -220969 -521829 -2360402 -3141287 -2644882 -3667677 -2884323 -2502900 -1461206 -1654926
2892 -1654926 -1164709 -548575 -753947 -1372298 -795406 -305319 47685 567819 115753 -8705
2882 -8705 268172 98360 7173 -332407 -911191 -2375925 -3367225 -3977241 -2481802 -1420201
2872 -1420201 -1068962 -1093717 -2444729 -864789 -2382184 -2524169 -1839259 -1615254 -1898777
2863 -1898777 -1294838 261333 207690 -1425074 -1698006 42645 -937567 -1557399 -2055244
2854 -2055244 -3050631 -3573175 -3643550 -3500823 -2506807 -1293970 -2405766 -2644571 -1141653
2845 -1141653 -594466 791022 1052455 -388316 -2110660 -2319295 -564085 761069 -704528
2836 -704528 -1723026 -1553756 -599911 -1212739 -1669265 -2888676 -2837531 139292 -730894
2827 -730894 -2629140 -2838554 -2109731 -3197479 -3379771 -1739295 -351361 -633670 -195150
2818 -195150 231404 674050 -2353587 -3325246 -1919732 -962128 -461384 -1818499 -2586416
2809 -2586416 -1924885 -1404242 -1745436 -1341728 -2075726 -2332979 -1624690 -1385924 -2413726
2800 -2413726 -2865402 -2167870 -1099055 -1343308 -932328 -1548033 -2084502 -1086782 -1319348
2791 -1319348 -3429878 -3962593 -2398687 -90495 1268092 521762 -587157 -1063153 -382951
2782 -382951 -221913 -1302237 -1808008 -2111044 -1598809 -1737227 -3273281 -4227278 -2247046
2773 -2247046 -392554 -793345 -1894425 -3419732 -2632928 -1979839 -1334428 -490297 -1729349
2764 -1729349 -1485810 -436093 -2459381 -2726909 -1598050 -2903743 -2936536 -2772880 -2703581
2755 -2703581 -1573283 -2826296 -2452629 -878776 -1238526 -1826174 -1208245 -559497 -1622774
2746 -1622774 -2985705 -764698 -722699 -2183572 -2017843 -1402783 -709576 -1087613 -1757972
2737 -1757972 -1901525 -1606217 -2053479 -1221453 -883039 -2822916 -2944521 -2418857 -3467636
2728 -3467636 -1781189 184549 10500 -543002 602648 271299 681776 -418927 -1203092
2719 -1203092 -864428 -1820853 -2086094 -2522979 -2484160 -3729692 -3865219 -3454587 -3670781 -3719971
2709 -3719971 -3274445 -2612933 -1997645 -3118469 -2828434 -800880 -2535662 -2597791 -153967
2700 -153967 850330 -111346 -749025 -2356940 -4019045 -3465126 -2042420 -1799375 -2460488
2691 -2460488 -2719850 -3449347 -3416795 -2232848 -1697240 -2725197 -2888891 -3909254 -3849707
2682 -3849707 -2653519 -1844880 -1543096 -870912 -582862 -259265 -530121 -1557628 -2665873
2673 -2665873 -3447262 -2612785 -1318831 -880348 -1123849 -1238742 -682946 -906428 -1686983
2664 -1686983 -2818642 -2030726 -2154877 -3300578 -2051578 -169921 -69400 -1109674 -1586351
2655 -1586351 -1466564 -1340378 -784546 -1008486 -1945829 -3175643 -3004389 -329128 -705759
2646 -705759 -1351265 -651376 -2067127 -2192885 -1221752 -2576985 -3296123 -1782316 -609090
2637 -609090 -3470741 -4097319 -3251546 -3303653 -2746412 -2344291 -2722093 -1752497 315054 165372
2627 165372 50602 -1290527 -2004268 -2040828 -1892623 -1239481 -1176290 33204 585188 -276297
2617 -276297 -2134780 -3319817 -3127432 -2375070 -3013793 -3426428 -3167724 -1862786 -1083895
2608 -1083895 -1241709 -1099644 -474118 -852570 -417431 591788 -561667 -1735828 -422453
2599 -422453 71791 -1684300 -2818476 -3148093 -3475605 -3443953 -2352935 -2332598 -2603902 -2816935
2589 -2816935 -2452050 -2143752 -3648814 -2687302 -75382 -685508 -1797611 -1846099 -795358
2580 -795358 118359 217764 -381972 -1141074 -1432330 -2636400 -3107642 -2923590 -3362742 -3881777
2570 -3881777 -2602849 -1310048 -2021746 -1980614 -2812881 -2434962 -783935 -907076 -2086198
2561 -2086198 -2252445 -1882944 -1565392 -337696 -418826 -918193 -1336449 -473401 -220170 -1553488
2551 -1553488 -2437715 -1686403 -2476584 -3284631 -2385701 -1491973 -2370170 -3268667 -3868189 -3430957
2541 -3430957 -1455779 -1645188 -3783804 -4496087 -2511845 -2784316 -2845546 -1692738 -1894649
2532 -1894649 -1363236 -329261 -1419668 -861734 -538366 -1574620 -1347997 -1855397 -2122488
2523 -2122488 -1061110 -1383410 -2680123 -2644035 -1428595 -1354292 -2506732 -2239778 -1294119
2514 -1294119 -2771021 -1735465 -2089166 -2943683 -2821249 -2582649 -2493930 -2307252 -1200095
2505 -1200095 -2124517 -2925869 -1758171 -610162 559264 -380610 -1510484 -1657886 -1538380
2496 -1538380 -493766 200573 -38948 -904823 -499835 103132 78635 -1389134 -1941024
2487 -1941024 -781773 -444489 -219150 407285 -488376 -2116484 -1930539 -1774755 -2089539
2478 -2089539 -1800581 -1015524 -630688 -556680 -1364602 -3232663 -2780731 -1917964 -1605429 -693635
2468 -693635 -284902 -140369 -1064944 -1344402 -2528393 -2487225 -1205306 -1500545 -1431304 -1600532
2458 -1600532 -2147186 -2665756 -1566199 -435319 452658 -647634 -292399 757783 99962
2449 99962 -1176560 -1107614 -747447 -711390 188046 -1291035 -1780948 -209865 -385756 -1440324
2439 -1440324 -1299390 -78160 751997 198072 -1167846 -1312613 -1233519 862627 -29109
2430 -29109 -1635164 -1382265 640068 209824 -1379479 -2995226 -3759336 -2251820 -1541671
2421 -1541671 -1492433 -1188393 -247488 1064942 714788 -1449999 -2375681 -976581 -315737
2412 -315737 -27225 -1343987 -1795347 -162664 1581940 524853 -140622 242686 416498
2403 416498 282200 -518261 -782763 421957 1264153 526364 -234935 133136 447670 75587
2393 75587 672227 345391 782775 110998 457547 372390 905804 968789 17181 1700010
2383 1700010 2627153 1346106 1660322 803511 1250122 619645 1600133 2370297 649805
2374 649805 875394 1049026 1514421 3297364 2763998 2151360 1694666 1864385 2021451 2559572
2364 2559572 2142296 2016972 2460861 3901525 3259852 2707889 2048877 2804785 3255790
2355 3255790 3780767 3881699 4099357 3548478 4016651 4635452 4267447 5451024 5004419
2346 5004419 3428552 2976889 5430870 5411859 4607638 4284403 4900603 5649490 5641495 6688913
2336 6688913 6758773 5801147 6916086 7777776 8983572 8996084 7934315 8424396 8647415
2327 8647415 9509467 10574229 9219044 8862156 9632056 9396232 8665566 10102641 10784186
2318 10784186 10942390 11401815 11836902 11257538 11140263 11078191 11197238 11298277 11319303 12262349
2308 12262349 13056948 11283303 10589543 10053482 11704711 11449743 11403686 10780231 9716458
2299 9716458 9638180 10868136 9981891 9952677 11214738 11372157 12497928 12036203 12164223
2290 12164223 10576099 9606196 9905553 10399676 10093592 8320823 8877518 9009663 6725761
2281 6725761 7134219 7540822 7654920 9135009 8929115 7393158 7147858 7251277 7486019
2272 7486019 6204638 6336776 8142179 8866675 7349574 6086812 6134446 6082130 6615518
2263 6615518 6569712 6245967 5746896 3639726 4714712 3863660 1723683 1828440 2948628
2254 2948628 3581979 2140526 3355992 3309059 2033566 2011048 2737487 3696996 3019824
2245 3019824 4977793 5395259 3329452 3059078 2344891 1952462 3580070 3315804 1462692
2236 1462692 1234562 1184453 141765 600866 1076961 17343 1287387 2390579 2250361
2227 2250361 3234869 3148996 1980254 2172072 1391553 785580 1960722 2522502 836387
2218 836387 1969847 2494137 228861 -19295 1115186 948534 26517 178103 -6893
2209 -6893 -101703 473686 1268195 1028990 320157 18936 2083928 1292581 457305 320746
2199 320746 353253 1092337 609921 307982 983108 1817786 1941244 529251 -846222 -661505
2189 -661505 531507 23123 -1959957 -2495708 347140 962717 -349858 76259 -17872
2180 -17872 39145 13769 -51674 3249 788861 209628 -15669 -708264 -1245445 -1615823 995522
2169 995522 1563943 -213732 89435 1072664 1373322 666029 -899662 -2249031 -803394
2160 -803394 -327800 -1072593 -1407313 -2037099 -1007288 -569364 -1191388 -1386822 -1200183 -151879
2150 -151879 871498 -988872 -2004885 -871568 -555115 -1458941 -1869846 -1584563 -1116791
2141 -1116791 116396 820159 -1341 -125297 1041922 140359 -1481752 -1614454 -1139022
2132 -1139022 -1470533 -1032278 -1980293 -2199512 -625467 -138264 560364 -144749 -1378591
2123 -1378591 -349838 181158 -483646 -1043467 -855798 -1760076 -240692 1290162 725620
2114 725620 -876083 -1318916 -1851542 -2392483 -1854491 -2861487 -2087296 -1489546 -1569944 -1502439
2104 -1502439 -440159 -915341 -846988 -13136 668526 1652577 660774 -1591904 -1590262 -194469
2094 -194469 1797152 585485 -427226 926552 1616559 1041964 -441684 -1716503 -1635319
2085 -1635319 -92811 873838 214609 -1331650 879335 2436982 1417203 -527629 -313988
2076 -313988 -902209 -369779 -705132 -1633067 -2659282 -2546549 -2648643 -1807190 -1129964 -436210
2066 -436210 829653 88392 -1217206 -641384 -722644 -3063211 -3764511 -1569067 -869278
2057 -869278 -2394073 -2268795 -739947 810351 -463488 -1016990 1474180 2011030 1225550
2048 1225550 1904855 895262 -735083 -328021 1847335 1837929 1337048 524786 1098227
2039 1098227 -209924 -937640 -2611093 -3403061 -2965409 -1592611 -1553934 -2778996 -2336115
2030 -2336115 -1605893 -1149672 -1328070 -796231 272704 997224 795313 -1117038 -921475
2021 -921475 242511 -882057 -1004316 -1400443 -2895722 -2220338 -1464183 -2406146 -3021920
2012 -3021920 -1785412 -1244762 -1840802 -1173346 -1512869 -692153 820796 289135 603429
2003 603429 2400760 2187007 -182610 58539 496901 106004 -1004370 -76303 1016160
1994 1016160 508521 -36081 -718811 -1684827 -2374686 -642528 580662 2183084 1482954
1985 1482954 -1774018 -2661552 -1449302 -959930 -1007189 -609564 -865998 -1338914 -158772
1976 -158772 -821124 -2115270 -2301907 -1859631 -1990088 -332147 509307 778565 715314 815697
1966 815697 795040 313544 1060639 244259 -816467 -3081033 -3958161 -1476699 -617343
1957 -617343 -904427 -619337 -753253 -1914893 -2002061 -2916224 -2613823 -984464 -489632 -845145
1947 -845145 -429401 782148 484891 -121440 -768006 -2046176 -349835 762860 -156869
1938 -156869 -264648 287359 316387 -675483 676331 1204432 267509 -180315 -322840 372566
1928 372566 -778281 -1129294 -681537 -997091 -693270 465324 -911524 -1077586 -1163226
1919 -1163226 43414 1120471 1274865 614719 -1072462 255642 240259 -247743 -948922
1910 -948922 -1036343 -1590369 -1192123 576917 -107457 -1189829 -934813 -682928 -284989 -1315964
1900 -1315964 -2469709 -2277860 -920452 -1439535 -2655353 -2373606 -429217 -954515 -1192934
1891 -1192934 -1293109 -974014 -1428255 -118892 53173 -2535441 -2743733 -811271 -688296
1882 -688296 -1556285 -1053891 271653 1376172 -1257 -787468 -721443 670909 281564
1873 281564 -1221586 -3021735 -2268292 -1400840 -374334 -932201 -1314459 -641812 285228
1864 285228 303449 -441825 -749987 -1094911 316245 615496 -615254 -2632880 -1675108
1855 -1675108 249434 732890 -1103892 -2727267 -2926564 -2502734 -881032 -850244 -2656961
1846 -2656961 -3673338 -2426151 -2305103 -3334357 -2197450 -2761264 -3132402 -2784193 -1589498
1837 -1589498 -1841928 -1836123 -1166034 -587659 -43891 245795 474380 2098307 4084839 1569097
1827 1569097 -875855 -911106 -4841 1120127 757102 -1058951 -2759225 -946504 551007
1818 551007 49546 -1381912 -2356101 -332765 973746 1035027 -129816 -1603106 -1163781
1809 -1163781 769666 568573 -591636 -262818 -458814 -1048765 -875465 -1849900 -2888086
1800 -2888086 -2101223 -3493004 -3575681 -1457286 -45180 -87490 -747528 -417546 -690375
1791 -690375 -461862 -113666 414712 1382188 893948 -519695 97659 1236994 499068
1782 499068 -349692 -1223676 -1080404 548297 -702528 -2403364 -2291960 -937296 -467959
1773 -467959 -457045 -804092 -1422256 -1597375 -1496893 -1408579 -1885644 -2003238 -799701 168198
1763 168198 -139963 -185833 149683 -67600 59949 -281008 -351850 -437200 -500414 -1337245
1753 -1337245 -1440554 -1701311 -1777924 -1131545 -231927 -740872 -1264326 -445736 583905 348256
1743 348256 548880 983105 406314 966029 461786 -404610 256788 839130 367987 -475616
1733 -475616 -2067003 -2444040 -1114365 -1777537 -4281794 -3494637 -2209652 -1828996 -910414
1724 -910414 -657640 -811730 -1778369 -733490 780167 -940697 -2590532 -2845504 -371418
1715 -371418 1361547 -627192 -2173686 -1553645 325766 937175 600839 -715736 -584851
1706 -584851 17193 -748430 -519975 -531625 659621 250292 -215474 -1360070 -624534 221811
1696 221811 -331933 -255427 -813538 -1058847 -1498804 -897689 -580787 -91702 111636 164818
1686 164818 -772388 -150194 1107883 -553448 -3107745 -3405960 -1305730 834992 23605
1677 23605 -429631 -1096512 -1551003 -1261429 -1312459 -1946464 -2204790 -1101083 -649160 -966912
1667 -966912 -1821109 -177615 -252823 -575458 -438913 1438585 2503853 1189373 -741567
1658 -741567 -315270 225101 -97617 -94891 83888 403156 1073850 1196412 614380 -644934
1648 -644934 -1453951 -306245 313535 -822426 -2458384 -1334465 -1403799 -1519541 -130287
1639 -130287 252883 1116992 911119 -320373 -591902 -522818 -585570 -1617171 -1255382 -1383159
1629 -1383159 -1873883 -1825402 -1113621 -863053 -1455491 -1773406 -1469756 -912870 -1329508 -2409623
1619 -2409623 -2653837 -1988653 -426132 1032037 886818 51247 -1073984 -995483 1765336
1610 1765336 2803133 220128 -95215 -218727 -441445 -684496 -454406 663120 810704
1601 810704 -300892 491678 1974135 1424148 -1340008 -1973342 401913 1097278 928873
1592 928873 -865478 -1269035 -900108 -95853 -512402 -839324 -2909 634901 -259887 -502916
1582 -502916 624856 142308 -158000 1060284 1321282 106052 -243681 635167 621370
1573 621370 -594960 -732707 147539 -9826 -594355 -1192685 -1541024 -1901333 -2195664 -1880597
1563 -1880597 -1082029 412373 -270415 -1339704 -1658850 -1313532 -811299 -850253 479978
1554 479978 2285118 1736044 -167079 -990171 -391906 781539 6415 -977395 -1747747
1545 -1747747 -1380661 -208684 -299637 -1244631 -1754196 -430116 820863 1675719 20171
1536 20171 -1128372 -490206 -114574 -414563 396051 371246 979095 1143813 502303 -191724
1526 -191724 164492 1142909 1480926 1772577 1123528 1723225 688035 -1177759 -865601
1517 -865601 -53983 -784842 -1656277 -908219 569797 -751935 -2340785 -1480925 -715638
1508 -715638 -1227321 -724800 292613 2199092 2547590 716109 47072 -611321 -363116
1499 -363116 1052721 476115 -441896 -485091 251770 671521 -38469 -1672434 -1686906 -1435341
1489 -1435341 -1246282 -695045 555303 666214 -866159 -73566 173141 -105716 384539
1480 384539 -508409 61951 -35371 363123 -153551 186310 1431886 600470 -110247 -595215
1470 -595215 905981 2623982 1690461 -1059323 -1369370 653133 888887 455137 1212907
1461 1212907 635068 587939 721936 -36140 -1432983 -2122629 -994447 137517 -437453
1452 -437453 -1469349 -1734187 -1095674 -1571872 -1319400 -368252 -214057 505193 660947 -673913
1442 -673913 -6121 150835 -1004540 -225644 598078 -719894 1065228 1588141 -494310
1433 -494310 -665775 145764 96141 -1046523 -2345188 -1054850 682442 -164993 -1138447
1424 -1138447 -1208640 -737028 -633979 28199 -541817 -1320362 -274485 211442 -954112
1415 -954112 -175393 -558360 -928064 824989 1498789 937155 636043 -741273 -2897209
1406 -2897209 -3546800 -2565878 -1733825 -1153308 -906027 -166528 1452006 -137139 -1300294
1397 -1300294 -145882 715872 90572 -511056 -495313 -1474394 -984088 -1130360 -2744758
1388 -2744758 -2332929 -1011489 -738408 -126482 -183201 -234202 -6761 -43233 1186992 2778901
1378 2778901 2538269 1046307 1564633 2769763 1516695 -343822 -1102434 -7523 -495173
1369 -495173 -2262780 -1553646 -486382 -1259463 -1061585 -387060 -2040625 -1208096 1218743
1360 1218743 1379710 791124 366454 -610586 211421 859909 -36296 -172212 280059 281163
1350 281163 -48364 -109113 -599322 -1700549 -323284 -1330298 -2399795 -845305 -535590
1341 -535590 -473739 -569652 -1522016 -2366391 -2447891 -2962489 -1493111 -333235 -435353 317167
1331 317167 564628 753130 -494621 -107053 1023053 1033801 762618 -152976 -1794809
1322 -1794809 -794350 385778 1113840 1094990 -182154 -298292 996303 1772310 -235300
1313 -235300 -1572409 -715340 -29402 838294 82924 -392769 505240 356657 384771 -238419
1303 -238419 195412 279569 284001 -562737 -175980 416486 344105 -1093005 317477 1201606
1293 1201606 116949 -308427 159619 127628 434502 -727380 -2260114 -1874011 -896341
1284 -896341 -880340 70093 638294 -39602 -1816101 -1614216 -2075720 -1969043 -862741 -1134513
1274 -1134513 -571209 -533951 743744 1954752 1101954 229414 146124 -74329 -493533 -1464964
1264 -1464964 -481315 -116296 -1854023 -1900688 -204276 -242266 -218459 183806 480819 1110461
1254 1110461 771238 1107224 178966 -474312 385825 1113478 1479630 1026196 1404266 687706
1244 687706 390599 -588255 -1551091 -985571 248887 -654855 -741555 -524253 -110717 1740276
1234 1740276 1144733 274731 1579338 770728 -533597 -2192404 -1944426 -375899 550699
1225 550699 402728 -116606 -1152502 -1006465 913481 118940 -1668412 -1249491 44434
1216 44434 563463 546614 551824 326750 1339240 1256375 -259770 -675576 932685 1057903
1206 1057903 -1188313 -1435372 496991 1601761 658228 304067 9240 -908741 -1059508
1197 -1059508 1323258 1603487 631375 104873 368791 198171 -358446 1921665 2267385
1188 2267385 2382768 2226774 2521757 1684735 -630431 -2240019 -1177395 -713273 -427129
1179 -427129 -802751 -1538417 -662382 -948132 -1111438 -2081370 -1425609 -116727 1248321
1170 1248321 151352 -728682 428528 -58977 -1113725 -193708 -307062 -6175 266210
1161 266210 -242477 -2077897 -2778077 -2430748 -155331 1600842 135223 -1247660 -165818
1152 -165818 -306032 -735648 612576 -12572 1605745 1323635 189906 504058 1249664
1143 1249664 1794924 2519478 2882740 -130319 -715566 -1329505 -908970 570778 -522152
1134 -522152 -1403372 -1353251 -772836 -653318 -723626 -1174348 -496936 208133 352292 539129
1124 539129 100665 99275 1603005 2470389 1395712 731585 1334580 1683665 162862 -2164802
1114 -2164802 -2916970 -2254030 -414029 -146535 -1587281 -916613 976793 821264 496810
1105 496810 1545106 512018 -136567 530947 968725 155868 -1400913 -1395911 433014
1096 433014 475384 1462278 1605638 582381 846107 1127197 1265552 -996637 -1055691 620156
1086 620156 -460951 -1072052 -1693804 -1755323 61483 -238698 -313039 -825771 -1042212 226203
1076 226203 927398 2022127 3376833 3425988 1685946 -238961 184895 1688974 853447
1067 853447 -703369 -1325090 -1241709 -1340252 -1408455 -1743468 -2201815 -622817 93076 225546
1057 225546 -380409 -540412 199503 985372 1093908 90499 -64599 1018947 1675491
1048 1675491 426065 -1124799 -1772911 -2254386 -937179 1572994 820763 540670 430040
1039 430040 1618040 -146511 -890915 1345200 1867635 2489567 1443714 -360971 -1537586
1030 -1537586 -523406 242621 430832 488525 43340 -708130 238318 -218844 129938 -465058
1020 -465058 76171 -509190 -76303 835399 1345 292269 430956 -205616 -187467 1070003
1010 1070003 319430 -599004 -550448 168445 747147 281411 69940 953034 -4029 -58136
1000 -58136 -241204 -40676 888688 1869721 2283876 -33476 935279 1402152 607638 -784025
990 -784025 -1923248 -385867 35940 -1470458 -1782839 -665862 1001340 1146100 102317
981 102317 -2771 -636658 325622 -138046 -1247656 -1039990 1024341 2995004 1818274
972 1818274 6085 906514 795651 43519 1004400 1369309 1556541 1355997 523459 403662
962 403662 316843 906464 868011 2141857 1941855 -492673 176134 1189060 200880 1569025
952 1569025 857279 -336454 712338 1341912 -329350 -684721 -303853 -2010699 -2045279
943 -2045279 -1308278 -1613452 -617337 -398759 -673199 246608 1024890 -401242 -1443270
934 -1443270 -908969 -50993 302594 -380308 -948608 -1028748 -506675 -130184 -405174 -1367231
924 -1367231 -2199311 -1228094 -188339 49091 288526 1288844 1135155 393864 1362880
915 1362880 1582292 1570094 760074 1468741 1989971 602970 599380 1713973 1346716 1370250
905 1370250 1703747 806227 -290647 1115910 35777 372129 1707724 1827492 438444
896 438444 380644 -127268 -668860 229054 784846 351608 786088 729811 2097 -901643
886 -901643 -336392 944232 1009233 -30769 160942 748642 317968 -269281 -938461 -569969
876 -569969 -419853 -78085 -918308 -342900 1834921 1086106 225789 1373506 1199714 2646543
866 2646543 2996863 2134673 642096 -122162 499427 1480683 1459211 1153680 471154 -597828
856 -597828 -1820990 -1491104 -894070 819653 1448411 -156157 -588378 106694 -1016199
847 -1016199 -1814595 101796 -44877 750685 1008251 38703 -235986 547875 2207569
838 2207569 623532 -568182 -460848 -36123 652313 1057897 396926 -1247171 90315
829 90315 643014 -460548 -443373 1378006 1230430 487780 -122831 -52519 485433 2160048
819 2160048 2109888 283155 -29823 -319840 -1247942 -408825 195899 -1080626 -1694877 -1190988
809 -1190988 -332720 -1822611 -411467 827620 1104829 1297994 2055857 1767992 2270396
800 2270396 985881 702882 665097 311518 486020 408735 300058 11722 1617936 1267028
790 1267028 1609404 576958 -1573240 -2108398 -1954833 -1108085 -186383 1239091 986402
781 986402 89143 1520124 1357789 1354586 854031 -207176 1347520 2997887 1366316
772 1366316 619862 267446 871514 1590544 410699 63008 743190 187325 -352122 681469
$$ [...]
##END NTUPLES=NMR SPECTRUM
##END=
