##TITLE=1H_CA-9395-0
 200.13MHz,CDCl3,
 8 sc
 
 12.11.2025
##JCAMPDX= 6.0         $$ Bruker NMR JCAMP-DX V2.0
##DATA TYPE= NMR SPECTRUM
##DATA CLASS= NTUPLES
##ORIGIN= UXNMR, Bruker Analytische Messtechnik GmbH
##OWNER= pz
$$ XWIN-NMR		Version 3.5
$$ Wed Nov 12 16:17:14 2025 Russian Standard Time (UT+4h)  she@DPX200
##.OBSERVE FREQUENCY= 200.1313
##.OBSERVE NUCLEUS= ^1H
##.ACQUISITION MODE= SIMULTANEOUS
##.ACQUISITION SCHEME= undefined
##.AVERAGES= 8
##.DIGITISER RES= 18
##SPECTROMETER/DATA SYSTEM= spect
##.PULSE SEQUENCE= zg30
##.SOLVENT NAME= CDCl3
##.SHIFT REFERENCE= (INTERNAL, CDCl3, 0, 15.4725)
##AUDIT TRAIL= $$ (NUMBER, WHEN, WHO, WHERE, WHAT)
$$ ##TITLE= Audit trail, XWIN-NMR		Version 3.5
$$ ##JCAMPDX= 5.01
$$ ##ORIGIN= Bruker BioSpin GmbH
$$ ##OWNER= she
$$ F:/spectra/data/she/nmr/H-C/1/pdata/1/auditp.txt
$$ ##AUDIT TRAIL=  $$ (NUMBER, WHEN, WHO, WHERE, WHAT)
(   1,<2025-11-12 16:15:52.00 +0400>,<she>,<DPX200>,
      <created by zg, POWCHK disabled, PULCHK disabled
       configuration hash MD5:
       00 E9 B6 7A A2 85 ED C7 34 08 36 98 17 FE 4E 26
       data hash MD5: 16K
       25 D5 12 1D E5 37 9D 5D 1D 46 DF 3D 99 0F 3D 43>)
(   2,<2025-11-12 16:15:54.07 +0400>,<she>,<DPX200>,
      <Start of raw data processing
       efp BC_mod = 2 LB = 0.25 FT_mod = 6 PKNL = 1 PHC0 = -2983.125 PHC1 = 9.192339 SI = 16K 
       data hash MD5: 16K
       2F 39 2E E0 0A E3 30 48 AA 8A 50 BD 97 48 F1 64>)
(   3,<2025-11-12 16:16:16.89 +0400>,<she>,<DPX200>,
      <pk PHC0 = -162.7211 PHC1 = 3.8 
       data hash MD5: 16K
       57 C8 8D 4A 99 B6 B8 9F 6A D8 E2 BF 1B DB D6 72>)
(   4,<2025-11-12 16:16:20.73 +0400>,<she>,<DPX200>,
      <abs ABSG = 5 
       data hash MD5: 16K
       8F A7 14 EC 98 2D 40 B4 C7 41 27 21 E2 37 99 9F>)
$$ ##END=
$$ 
$$ hash MD5
$$ 58 90 CE 33 5C 2B C4 9A B0 7B 5F 53 B8 2C 78 07
##$RELAX= 
##$RELAX= 
##$RELAX= 
##$RELAX= 
##$RELAX= 
##$RELAX= 
$$ Bruker specific parameters
$$ --------------------------
##$DU= <F:/spectra>
##$EXPNO= 1
##$NAME= <H-C>
##$PROCNO= 1
##$TYPE= <nmr>
##$USER= <she>
##$AMP= (0..31)
100 100 100 100 100 100 100 100 100 100 100 100 100 100 100 100 100 100 
100 100 100 100 100 100 100 100 100 100 100 100 100 100 
##$AQSEQ= 0
##$AQ_mod= 1
##$AUNM= <au_zg>
##$AUTOPOS= <>
##$BF1= 200.13
##$BF2= 200.13
##$BF3= 200.13
##$BF4= 200.13
##$BF5= 200.13
##$BF6= 200.13
##$BF7= 200.13
##$BF8= 200.13
##$BYTORDA= 1
##$CFDGTYP= 0
##$CFRGTYP= 5
##$CHEMSTR= <none>
##$CNST= (0..31)
1 1 145 1 1 1 1 1 1 1 1 1 1 1 1 1 1 1 1 1 1 1 1 1 1 1 1 1 1 1 1 1 
##$CPDPRG= <>
##$CPDPRG1= <>
##$CPDPRG2= <>
##$CPDPRG3= <>
##$CPDPRG4= <mlev>
##$CPDPRG5= <mlev>
##$CPDPRG6= <mlev>
##$CPDPRG7= <mlev>
##$CPDPRG8= <mlev>
##$CPDPRGB= <>
##$CPDPRGT= <>
##$D= (0..31)
0 0.7 0 0 0 0 0 0 0 0 0 0.03 0 0 0 0 0 0 0 0 0 0 0 0 0 0 0 0 0 0 0 0 
##$DATE= 1762949751
##$DBL= (0..7)
120 120 120 120 120 120 120 120 
##$DBP= (0..7)
150 150 150 150 150 150 150 150 
##$DBP07= 0
##$DBPNAM0= <>
##$DBPNAM1= <>
##$DBPNAM2= <>
##$DBPNAM3= <>
##$DBPNAM4= <>
$$ [...]
##$SUBNAM3= <"">
##$SUBNAM4= <"">
##$SUBNAM5= <"">
##$SUBNAM6= <"">
##$SUBNAM7= <"">
##$SUBNAM8= <"">
##$SUBNAM9= <"">
##$SW= 18.0517328524113
##$SWIBOX= (0..15)
0 0 2 0 0 0 0 0 0 0 0 0 0 0 0 0 
##$SW_h= 3612.71676300578
##$TD= 16384
##$TD0= 1
##$TE= 0
##$TE2= 300
##$TE3= 300
##$TEG= 300
##$TL= (0..7)
0 120 120 120 120 120 120 120 
##$TP= (0..7)
150 150 150 150 150 150 150 150 
##$TP07= 0
##$TPNAME0= <>
##$TPNAME1= <>
##$TPNAME2= <>
##$TPNAME3= <>
##$TPNAME4= <>
##$TPNAME5= <>
##$TPNAME6= <>
##$TPNAME7= <>
##$TPOAL= (0..7)
0.5 0.5 0.5 0.5 0.5 0.5 0.5 0.5 
##$TPOFFS= (0..7)
0 0 0 0 0 0 0 0 
##$TUNHIN= 0
##$TUNHOUT= 0
##$TUNXOUT= 0
##$USERA1= <user>
##$USERA2= <user>
##$USERA3= <user>
##$USERA4= <user>
##$USERA5= <user>
##$V9= 5
##$VALIST= <valist>
##$VCLIST= <CCCCCCCCCCCCCCC>
##$VD= 0
##$VDLIST= <DDDDDDDDDDDDDDD>
##$VPLIST= <PPPPPPPPPPPPPPP>
##$VTLIST= <TTTTTTTTTTTTTTT>
##$WBST= 1024
##$WBSW= 4
##$XGAIN= (0..3)
0 0 0 0 
##$XL= 0
##$YL= 0
##$YMAX_a= 579601
##$YMIN_a= -502811
##$ZGOPTNS= <>
##$ZL1= 120
##$ZL2= 120
##$ZL3= 120
##$ZL4= 120
##$ABSF1= 15.49348
##$ABSF2= -2.55837
##$ABSG= 5
##$ABSL= 3
##$ALPHA= 0
##$AQORDER= 0
##$ASSFAC= 0
##$ASSFACI= 0
##$ASSFACX= 0
##$ASSWID= 0
##$AUNMP= <proc_1d>
##$AZFE= 0.1
##$AZFW= 0.1
##$BCFW= 0
##$BC_mod= 2
##$BYTORDP= 0
##$COROFFS= 0
##$CY= -3
##$DATMOD= 1
##$DC= 0
##$DFILT= <>
##$DTYPP= 0
##$F1P= 0
##$F2P= 0
##$FCOR= 1
##$FTSIZE= 16384
##$FT_mod= 6
##$GAMMA= 0
##$GB= 0
##$INTBC= 1
##$INTSCL= 3.241238e-09
##$ISEN= 128
##$LB= 0.25
##$LEV0= 0
##$LPBIN= 0
##$MAXI= 10000
##$MC2= 0
##$MEAN= 0
##$ME_mod= 0
##$MI= 1.114404
##$NCOEF= 0
##$NC_proc= -7
##$NLEV= 6
##$NOISF1= 3.799351
##$NOISF2= 2.8
##$NSP= 0
##$NTH_PI= 0
##$NZP= 0
##$OFFSET= 15.47254
##$PC= 1
##$PHC0= -3145.846
##$PHC1= 12.99234
##$PH_mod= 1
##$PKNL= yes
##$PPARMOD= 0
##$PSCAL= 0
##$PSIGN= 0
##$REVERSE= no
##$SF= 200.130009838742
##$SI= 16384
##$SIGF1= 3
##$SIGF2= 2
##$SINO= 0.751879
##$SIOLD= 32768
##$SREGLST= <19F.Aceton>
##$SSB= 0
##$STSI= 16384
##$STSR= 0
##$SW_p= 3612.71676300578
##$SYMM= 0
##$S_DEV= 0
##$TDeff= 16384
##$TDoff= 0
##$TI= <>
##$TILT= no
##$TM1= 0
##$TM2= 0
##$TOPLEV= 0
##$USERP1= <user>
##$USERP2= <user>
##$USERP3= <user>
##$USERP4= <user>
##$USERP5= <user>
##$WDW= 1
##$XDIM= 16384
##$YMAX_p= 470219547
##$YMIN_p= -2331358
$$ End of Bruker specific parameters
$$ ---------------------------------
##NTUPLES= NMR SPECTRUM
##VAR_NAME=  FREQUENCY,     SPECTRUM/REAL,   SPECTRUM/IMAG
##SYMBOL=    X,             R,               I
##VAR_TYPE=  INDEPENDENT,   DEPENDENT,       DEPENDENT
##VAR_FORM=  AFFN,          ASDF,            ASDF
##VAR_DIM=   16384,         16384,           16384
##UNITS=     HZ,            ARBITRARY UNITS, ARBITRARY UNITS
##FACTOR=    0.220516191357247, 1,           1
##FIRST=     3096.51956276423, 0,            0
##LAST=      -516.197200241547, 0,           0
##MIN=       -516.197200241547, -2331358,    0
##MAX=       3096.51956276423, 470219547,    0
$$ Real data points
##PAGE= N=1
##DATA TABLE= (X++(R..R)), XYDATA
$$ [...]
5755A6618298K21364J40383J65209J86918J83693J53847O3848J81478K00262o5973
$$ 16618298 16839662 16980045 17145254 17332172 17515865 17669712 17733560 17915038 18115300 18049327
5745A8049327J86455J73667J52860J57713J99231J65669J88033J48654R9317M6754
$$ 18049327 18235782 18409449 18562309 18720022 18919253 19084922 19272955 19421609 19520926 19567680
5735A9567680J66093K27135L61603R0728J8927J65606J62115J31260J27384K01554
$$ 19567680 19733773 19960908 20322511 20413239 20432166 20597772 20759887 20891147 21018531 21220085
5725B1220085J83865J78719J60270J35132K38582J26427P7312L30927J95536L3157
$$ 21220085 21403950 21582669 21742939 21878071 22116653 22243080 22320392 22651319 22846855 22880012
5715B2880012J21391K53692J92222J24700J64934R4950N8295Q1456J84087J40473
$$ 22880012 23001403 23255095 23447317 23572017 23736951 23831901 23890196 23971652 24155739 24296212
5705B4296212R0474O2430n4984J26708J12281K12202O1006J37290J53534K75209
$$ 24296212 24386686 24449116 24394132 24520840 24633121 24845323 24906329 25043619 25197153 25472362
5695B5472362J14943k3555M9714l6537Q7964K62119L24907J78982J98943L02355
$$ 25472362 25587305 25563750 25613464 25576927 25664891 25927010 26251917 26430899 26629842 26932197
5685B6932197K29757Q3445Q49J31927J86628L00423K06746R3475J36040K36140
$$ 26932197 27161954 27245399 27246248 27378175 27564803 27865226 28071972 28165447 28301487 28537627
5675B8537627K61020J31114L2655j2151J62384K29537M7612J5066J73378J44656
$$ 28537627 28798647 28929761 28962416 28950265 29112649 29342186 29389798 29404864 29578242 29722898
5665B9722898K79248K33291K33761L22557L31066N65370N42017L39874N14333
$$ 29722898 30002146 30235437 30469198 30791755 31122821 31688191 32230208 32570082 33084415
5656C3084415O23298P49835P51979P82758R24452Q74180J024042J106979J198880
$$ 33084415 33707713 34457548 35209527 35992285 36916737 37790917 38814959 39921938 41120818
5647D1120818J285157J230045J360600J633808J558285J669987J797525J813867
$$ 41120818 42405975 43636020 44996620 46630428 48188713 49858700 51656225 53470092
5639E3470092J982062J878320J929439K020964K121040K030392K103907K084314
$$ 53470092 55452154 57330474 59259913 61280877 63401917 65432309 67536216 69620530
5631F9620530J977406J942060J816585J523248J419090J144562R63093N54272
$$ 69620530 71597936 73539996 75356581 76879829 78298919 79443481 80406574 80960846
5623H0960846M91902L2739l16697o39894j037594j222497j444746j464877j823840
$$ 80960846 81452748 81485487 81168790 80528896 79491302 78268805 76824059 75359182 73535342
5614G3535342j977884k181440k283633k236662k354814k439429k202131k325110
$$ 73535342 71557458 69376018 67092385 64855723 62500909 60061480 57859349 55534239
5606E5534239k143508k138863k134618j946289j874242j833069j712628j700697
$$ 55534239 53390731 51251868 49117250 47170961 45296719 43463650 41751022 40050325
5598D0050325j486951j332361j248918j151635j209884j023543r51121r68427
$$ 40050325 38563374 37231013 35982095 34830460 33620576 32597033 31645912 30677485
5590C0677485q03992p84416q38399n74173n28145p06850n71403m96805l18162
$$ 30677485 29873493 29089077 28250678 27676505 27148360 26441510 25870107 25373302 25055140
5581B5055140l58726l08809m02417k84021j98465l87355j01599k21742l20537
$$ 25055140 24696414 24387605 23985188 23701167 23502702 23115347 23013748 22792006 22471469
5572B2471469k67872j44712J8028j81170l25297n4049p7422j77544l6996J7198
$$ 22471469 22203597 22058885 22076913 21895743 21570446 21516397 21438975 21261431 21224435 21241633
5562B1241633l7145j63214j57191j52710k3389J0101O7N599N0459n9336O9038
$$ 21241633 21204488 21041274 20884083 20731373 20707984 20718085 20718152 20723751 20774210 20714874 20783912
5551B0783912p9512m3494l8866J28821J56289k7377J9181J3378K21570L1267p0511
$$ 20783912 20704400 20660906 20622040 20750861 20907150 20879773 20898954 20912332 21133902 21165169 21094658
5540B1094658J72338J91896K05694J91440m7763o4452M4714K36420q29N1543J06220
$$ 21094658 21266996 21458892 21664586 21856026 21808263 21743811 21788525 22024945 22024116 22075659 22181879
5529B2181879J27867J2475M1011J9348K7811R3699m6387L8132K9649o3426K4882
$$ 22181879 22309746 22322221 22363232 22382580 22410391 22504090 22457703 22495835 22525484 22462058 22486940
5518B2486940K895R3292J16760r1860q8944N9253J0796j2098j17022J7767n9107
$$ 22486940 22489835 22583127 22699887 22608027 22519083 22578336 22589132 22577034 22460012 22477779 22418672
5507B2418672o1982l1259J8511r0758n2801n0974j56808j63421m158l4644k27813
$$ 22418672 22356690 22325431 22343942 22253184 22200383 22149409 21992601 21829180 21825022 21790378 21562565
5496B1562565r4380o8086k9552j85471j14552n9061j80533j92685j49683j64226
$$ 21562565 21468185 21400099 21370547 21185076 21070524 21011463 20830930 20638245 20488562 20324336
5486B0324336m4629k26439k21498j18299l9518j21009j49860k22398J3122j60928
$$ 20324336 20279707 20053268 19831770 19713471 19673953 19552944 19403084 19180686 19193808 19032880
5476A9032880j24231j33611r1575R4925j34326k26444o9075o8403k13915m5986
$$ 19032880 18908649 18775038 18683463 18778388 18644062 18417618 18348543 18280140 18066225 18020239
5466A8020239p8805J2194k5950R6660n6321j32788l5066j5057M4885K9101r672
$$ 18020239 17941434 17953628 17927678 18024338 17968017 17835229 17800163 17785106 17829991 17859092 17849420
5455A7849420O8327J04724N84l8252K4304k2652J10347K29051J1524N2276J11513
$$ 17849420 17917747 18022471 18023055 17984803 18009107 17986455 18096802 18325853 18337377 18389653 18501166
5444A8501166K82800K70318K25460J74667P5926L55509J73246K57851M05905K60535
$$ 18501166 18783966 19054284 19279744 19454411 19530337 19885846 20059092 20316943 20722848 20983383
5434B0983383N37477L27879L29615N90916N74339O11255N66399P06015P06333
$$ 20983383 21520860 21848739 22178354 22769270 23343609 23954864 24521263 25227278 25933611
5425B5933611O86444P84156P59408Q23060P61614Q41054R14512R21884Q56472
$$ 25933611 26620055 27404211 28163619 28986679 29748293 30589347 31503859 32425743 33282215
5416C3282215Q75121Q70243Q63041P81315P06180P59732O35620O89343O83555
$$ 33282215 34157336 35027579 35890620 36671935 37378115 38137847 38773467 39462810 40146365
5407D0146365M32260M97543P11238N07848L33433N94751O38000M50918N82792
$$ 40146365 40578625 41076168 41787406 42295254 42628687 43223438 43861438 44312356 44895148
5398D4895148O11758O49812P73831P66556Q65569P76300Q80974R61048R51412
$$ 44895148 45506906 46156718 46930549 47697105 48562674 49338974 50219948 51180996 52132408
5389E2132408Q73093R26091Q70270P59377Q23429Q93664M60126N46692L84834
$$ 52132408 53005501 53931592 54801862 55561239 56384668 57278332 57738458 58285150 58669984
5380E8669984K02719K16469p8710k53571k01383k12674n08415o29671o95556n84873
$$ 58669984 58872703 59089172 59010462 58756891 58555508 58342834 57834419 57204748 56509192 55924319
5370E5924319o97133q03445q21262p45394j017465q20643o62569o52409q03927
$$ 55924319 55227186 54423741 53602479 52857085 51839620 51018977 50356408 49703999 48900072
5361D8900072p13816n85682n32414n41290o02837m53768m05905n06562m45665
$$ 48900072 48186256 47600574 47068160 46526870 45924033 45470265 45064360 44557798 44112133
5352D4112133o37687o19030n21878o98260o64530q82927q29379p57510r55271
$$ 44112133 43474446 42855416 42333538 41635278 40970748 40087821 39258442 38500932 37545661
5343C7545661q94407r21216r85440j024720j026811j097979j174739q82695r65157
$$ 37545661 36651254 35730038 34744598 33719878 32693067 31595088 30420349 29537654 28572497
5334B8572497j108055o77183r36821q21295q24846p91182o07307p24551n89801
$$ 28572497 27464442 26787259 25850438 25029143 24204297 23413115 22805808 22081257 21491456
5325B1491456o73958m57311n03423l22530l98297m58290m95524l91453j84948
$$ 21491456 20817498 20360187 19856764 19534234 19135937 18677647 18182123 17790670 17605722
5316A7605722l30639l39615j61951j92745l32752j24481k36458j05221j40382
$$ 17605722 17275083 16935468 16773517 16580772 16248020 16123539 15887081 15781860 15641478
5307A5641478j97045k32505k62484k06151R1959J7958k05129j27870j09263p0328
$$ 15641478 15444433 15211928 14949444 14743293 14835252 14853210 14648081 14520211 14410948 14340620
5297A4340620N2548N5845j81741k02996J27752k3010k02552N8836p5756O6463
$$ 14340620 14393168 14449013 14267272 14064276 14192028 14169018 13966466 14025302 13949546 14016009
5287A4016009k6861j39431J00775L8916j6759l1258N2062P998J26582N5812o7608
$$ 14016009 13989148 13849717 13950492 13989408 13972649 13941391 13993453 14001451 14128033 14183845 14116237
5276A4116237m6806O3391J18085K4388J28713J5210J62044J11055j08397o3885
$$ 14116237 14069431 14132822 14250907 14275295 14404008 14419218 14581262 14692317 14583920 14520035
5266A4520035J20448N9212J57422N9529M3209K5162J78734N2291m9887J00146
$$ 14520035 14640483 14699695 14857117 14916646 14959855 14985017 15163751 15216042 15166155 15266301
5256A5266301J19708J67830M5148L4602J47872J63122J41832l3607P4408J35133
$$ 15266301 15386009 15553839 15598987 15633589 15781461 15944583 16086415 16052808 16127216 16262349
5246A6262349M6508P2529J07886J47710J03908p483Q5134K39091J65198J56665
$$ 16262349 16308857 16381386 16489272 16636982 16740890 16733407 16818541 17057632 17222830 17379495
5236A7379495q872L5701R1700O1745K76002J90203q646L6979K55724N7652N9068
$$ 17379495 17370623 17406324 17498024 17559769 17835771 18025974 18017328 18054307 18310031 18367683 18426751
5225A8426751J22288J96787R9429N0146J13517J25018J70726J31231J31270J13714
$$ 18426751 18549039 18745826 18845255 18895401 19008918 19133936 19304662 19435893 19567163 19680877
5215A9680877J81756J44658K08462K54789K36276J79271K07879J55621K51322
$$ 19680877 19862633 20007291 20215753 20470542 20706818 20886089 21093968 21249589 21500911
5206B1500911J03726R0879L43319M11568J03087M49071K25047K68289M15979L19588
$$ 21500911 21604637 21695516 22038835 22450403 22553490 23002561 23227608 23495897 23911876 24231464
5196B4231464N15406L96983N48802M81143N01158N98956O64672O57726P01406
$$ 24231464 24746870 25143853 25692655 26173798 26674956 27273912 27938584 28596310 29297716
5187B9297716P21639P85639P52206R44555Q42360J005586J067377R84932J234032
$$ 29297716 30019355 30804994 31557200 32501755 33344115 34349701 35417078 36402010 37636042
5178C7636042J051621R61352R89261R85869J172479J205945Q44536Q27346R38114
$$ 37636042 38687663 39649015 40638276 41624145 42796624 44002569 44847105 45674451 46612565
5169D6612565Q46459Q01375P17428N96449N32532N73607M04504O67451N86557
$$ 46612565 47459024 48260399 48977827 49574276 50106808 50680415 51084919 51752370 52338927
5160E2338927L34678M31077L49725M68579N39649M74310M70411P15161N79758
$$ 52338927 52673605 53104682 53454407 53922986 54462635 54936945 55407356 56122517 56702275
5151E6702275N48519N72368O91122P19146N51515N58982N22410L49000K50328
$$ 56702275 57250794 57823162 58514284 59233430 59784945 60343927 60866337 61215337 61465665
5142F1465665M57540K33507R2817P5312j20634j87406l89700l74814m47663n91737
$$ 61465665 61923205 62156712 62249529 62324841 62204207 62016801 61627101 61252287 60804624 60212887
5132F0212887o93321q45178q60798q13444q62198q89477r38265r43967q68203
$$ 60212887 59519566 58674388 57813590 57000146 56137948 55248471 54310206 53366239 52498036
5123E2498036r22683q36285o25963p08902o96734o81692p86967o08906m52198
$$ 52498036 51575353 50739068 50113105 49404203 48707469 48025777 47238810 46629904 46177706
5114D6177706n85374o77456o37188n41666p42706n03198o27429o58753o58102
$$ 46177706 45592332 44914876 44277688 43736022 42993316 42490118 41862689 41203936 40545834
5105D0545834q04481q11052q63851q17088r39045r76242r41364o73002q67841
$$ 40545834 39741353 38930301 38066450 37249362 36310317 35334075 34392711 33719709 32851868
5096C2851868r88685p40977p13412p35087o08026p54361p66071p30523n68329
$$ 32851868 31863183 31122206 30408794 29673707 29065681 28311320 27545249 26814726 26246397
5087B6246397m57921n23609n28503l74541l63564l77794l85093m00793k76625
$$ 26246397 25788476 25264867 24736364 24361823 23998259 23620465 23235372 22834579 22557954
5078B2557954l75212l30977k76881j75200j53088j99631k75175j72430j78892
$$ 22557954 22182742 21851765 21574884 21399684 21246596 21046965 20771790 20599360 20420468
5069B0420468j24587k49077j07321j06434j25404j16113j63086r5589j07119o8949
$$ 20420468 20295881 20046804 19939483 19833049 19707645 19591532 19428446 19332857 19225738 19156789
5059A9156789q6115o5776J633k09644j62061j544j9340j78356N6930P0483n2748
$$ 19156789 19070674 19004898 19006531 18796887 18634826 18633282 18613942 18435586 18492516 18562999 18510251
5048A8510251N2345o4169R799m7039J3387M4675J572j15676m0365Q093L3323L5714
$$ 18510251 18562596 18498427 18508226 18461187 18474574 18519249 18520821 18405145 18364780 18372873 18406196 18441910
5036A8441910J59507j97715o084N2974J11649P1655Q5168q4932J75085r4139n4928
$$ 18441910 18601417 18403702 18397618 18450592 18562241 18633896 18719064 18634132 18809217 18715078 18660150
5025A8660150J68465O822o8720P9236r463M6235J87535Q8469j6761N8122J34616
$$ 18660150 18828615 18835437 18766717 18845953 18836490 18882725 19070260 19158729 19141968 19200090 19334706
5014A9334706O4147M8419J40171J45998l8148K03753L1283Q1807J36373J34401
$$ 19334706 19398853 19447272 19587443 19733441 19695293 19899046 19930329 20012136 20148509 20282910
5004B0282910k6474R0141L4030J23353R0620J53514J5372Q8013J75983J48783
$$ 20282910 20256436 20346577 20380607 20503960 20594580 20748094 20763466 20851479 21027462 21176245
4994B1176245J03770J20805J85332K33612J62981J89735M5008J00779L34660J67206
$$ 21176245 21280015 21400820 21586152 21819764 21982745 22172480 22217488 22318267 22652927 22820133
4984B2820133J78969K22529J20024O4530K25028K68775J93793J89414K31051M30834
$$ 22820133 22999102 23221631 23341655 23406185 23631213 23899988 24093781 24283195 24514246 24945080
4974B4945080K21200L63099M13152J12597K56998L12556L71053K44286K21581
$$ 24945080 25166280 25529379 25942531 26055128 26312126 26624682 26995735 27240021 27461602
4965B7461602Q2563L77692L96996M76347L95263K24928M58802L53963K45015N70861
$$ 27461602 27544165 27921857 28318853 28795200 29190463 29415391 29874193 30228156 30473171 31044032
4955C1044032L77675M07818L96818M75548L80554L82840M83091L97755M92054
$$ 31044032 31421707 31829525 32226343 32701891 33082445 33465285 33948376 34346131 34838185
4946C4838185M25831M78444N06107N76536L64942N05892M97516N03987N61103
$$ 34838185 35264016 35742460 36248567 36825103 37190045 37695937 38193453 38697440 39258543
4937C9258543N42380O25790N61607N59715N88736O58472N97135N69165O67551
$$ 39258543 39800923 40426713 40988320 41548035 42136771 42795243 43392378 43961543 44629094
4928D4629094O70035N59194P09389N63933P34278Q36884N30374P64295P11172
$$ 44629094 45299129 45858323 46567712 47131645 47865923 48702807 49233181 49997476 50708648
4919E0708648Q81456O20774N82496O91311O61567Q23588Q65523O19789P79599
$$ 50708648 51590104 52210878 52793374 53484685 54146252 54969840 55835363 56455152 57234751
4910E7234751P56673Q08821O25926P70883P48101R37480Q94287Q67483Q04000
$$ 57234751 57991424 58800245 59426171 60197054 60945155 61882635 62776922 63644405 64448405
4901F4448405Q35163Q15738P86235J074766R68309J004749J130211J148230J069054
$$ 64448405 65283568 66099306 66885541 67960307 68928616 69933365 71063576 72211806 73280860
4892G3280860J236352J333908J400599J322314J354361J554592J592313J570540
$$ 73280860 74517212 75851120 77251719 78574033 79928394 81482986 83075299 84645839
4884H4645839J707758J632152J998032J896026J988125K110666K241549K280627
$$ 84645839 86353597 87985749 89983781 91879807 93867932 95978598 98220147 100500774
4876A00500774K414299K773370K722700K774530L081310L178978L462403L526157
$$ 100500774 102915073 105688443 108411143 111185673 114266983 117445961 120908364 124434521
4868A24434521L743552M048128M109089M242782M608947M832064M668710M566116
$$ 124434521 128178073 132226201 136335290 140578072 145187019 150019083 154687793 159253909
4860A59253909M879071M937030M674593M696122M365128M084232L914404L404622
$$ 159253909 164132980 169070010 173744603 178440725 182805853 186890085 190804489 194209111
4852A94209111L036622K550483J916165J416674O64461l3902n06231r09404j566982
$$ 194209111 197245733 199796216 201712381 203129055 203793516 203759614 203253383 202343979 200776997
4843B00776997k051840k571472l068163l332971l711084m001638l932567m064219
$$ 200776997 198725157 196153685 193085522 189752551 186041467 182039829 178107262 174043043
4835A74043043l982121m035544m139180m011523m022466l885597l739780l438046
$$ 174043043 170060922 166025378 161886198 157874675 153852209 149966612 146226832 142788786
4827A42788786l330880l257057l177946l047069k833576k621950k681717k564802
$$ 142788786 139457906 136200849 133022903 129975834 127142258 124520308 121838591 119273789
4819A19273789k231742k138533k011751k157778k045498j801925j722869j445623
$$ 119273789 117042047 114903514 112891763 110733985 108688487 106886562 105163693 103718070
4811A03718070j695245j601837j471977j434647j333959j301766j190889j157554
$$ 103718070 102022825 100420988 98949011 97514364 96180405 94878639 93687750 92530196
4803I2530196j206256j279971j146986j225283j092635j204707j278106r70699
$$ 92530196 91323940 90043969 88896983 87671700 86579065 85374358 84096252 83125553
4795H3125553j087965j178916j041315j127105j002521j176626j047201q54097
$$ 83125553 82037588 80858672 79817357 78690252 77687731 76511105 75463904 74609807
4787G4609807j129403j070651r87873r21709r48247j032254r57463j000679r29541
$$ 74609807 73480404 72409753 71421880 70500171 69551924 68519670 67562207 66561528 65631987
4778F5631987q59936r11883q70980p55827p90163q15054n99781p17365q08998
$$ 65631987 64772051 63860168 62989188 62233361 61443198 60628144 60028363 59310998 58502000
4769E8502000q01683q76514p33261o65877q33724o41440n59189n91264o10206
$$ 58502000 57700317 56823803 56090542 55424665 54590941 53949501 53390312 52799048 52188842
4760E2188842n84991m92307o01440o50663m50641n12619l27864l82254l80739
$$ 52188842 51603851 51111544 50510104 49859441 49408800 48896181 48568317 48186063 47805324
4751D7805324m52462k99094k10322k61762o7971j83880p2710j02063q7340j23736
$$ 47805324 47352862 47053768 46843446 46581684 46513713 46329833 46257123 46155060 46067720 45943984
4741D5943984L9796L8697R4482m5600p4433J48891k3176M0481M1067J46835J01598
$$ 45943984 45983780 46022477 46116959 46071359 45996926 46145817 46122641 46163122 46204189 46351024 46452622
4730D6452622j2389o8870N8157L9175j6974r0909K6955q7722j65580j60571J08696
$$ 46452622 46440233 46371363 46429520 46468695 46451721 46360812 46387767 46300045 46134465 45973894 46082590
4719D6082590k57919m5257J6879k33716q6091k42172M9934l68549j24904j88732
$$ 46082590 45824671 45779414 45796293 45562577 45476486 45234314 45284248 44915699 44790795 44602063
4709D4602063r9679p1476n5375K1038j42340l6534J0790r7355J53627J32740p7680
$$ 44602063 44502384 44430908 44375533 44396571 44254231 44217697 44228487 44131132 44284759 44417499 44339819
4698D4339819j29992J44383J14708J79054J53494N8246J18768K58032K85204L47396
$$ 44339819 44209827 44354210 44468918 44647972 44801466 44859712 44978480 45236512 45521716 45869112
4688D5869112J95917L21473L70890L18679L77501L94284M34328M21685O15946
$$ 45869112 46065029 46386502 46757392 47076071 47453572 47847856 48282184 48703869 49319815
4679D9319815M84275M36387M78745O67842O62428P11814P89786O57634N48502
$$ 49319815 49804090 50240477 50719222 51387064 52049492 52761306 53551092 54208726 54757228
4670E4757228P12818O55750R95150R26124Q82688R11066J183863J195043J032525
$$ 54757228 55470046 56125796 57120946 58047070 58929758 59840824 61024687 62219730 63252255
4661F3252255J065871J305850J408957J409619J547850J457358J785347J947801
$$ 63252255 64318126 65623976 67032933 68442552 69990402 71447760 73233107 75180908
4653G5180908J860987K198773K188579K119219K332936K633713K875432K942798
$$ 75180908 77041895 79240668 81429247 83548466 85881402 88515115 91390547 94333345
4645I4333345L077408L210195L597224L658258M084023M241278M309346M487580
$$ 94333345 97410753 100620948 104218172 107876430 111960453 116201731 120511077 124998657
4637A24998657M655565M671438M695387M618114M626862M554618M220332L893061
$$ 124998657 129654222 134325660 139021047 143639161 148266023 152820641 157040973 160934034
4629A60934034L639528K947867K532641J980314J325681O78899O2036o41382j125941
$$ 160934034 164573562 167521429 170054070 172034384 173360065 174038964 174101000 173459618 172333677
4620A72333677j667303k052158k154933k518445k747806k794325k749430k668871
$$ 172333677 170666374 168614216 166459283 163940838 161193032 158398707 155649277 152980406
4612A52980406k380429k394051k144429j931490j680054j570480j404496j114145
$$ 152980406 150599977 148205926 146061497 144130007 142449953 140879473 139474977 138360832
4604A38360832q08564p01099n34047m96523m80925o07869o27254n24131o74587
$$ 138360832 137552268 136851169 136317122 135820599 135339674 134731805 134104551 133580420 132905833
4595A32905833q08779r67472j130395j411436j357365j498575j695625j770626
$$ 132905833 132097054 131129582 129999187 128587751 127230386 125731811 124036186 122265560
4587A22265560j729437j815541j769198j791007j816410j545850j661262j489706
$$ 122265560 120536123 118720582 116951384 115160377 113343967 111798117 110136855 108647149
4579A08647149j475594j301998j070785j045426j057550q22695p29365o36716
$$ 108647149 107171555 105869557 104798772 103753346 102695796 101873101 101143736 100507020
4571A00507020p79788n70537n46369m22070k82515k68372m05551j78821R5012
$$ 100507020 99727232 99156695 98610326 98188256 97905741 97637369 97231818 97052997 97148009
4562I7148009J04061J36792J37172K05846K45363M91859O27415P66228P79331
$$ 97148009 97252070 97388862 97526034 97731880 97977243 98469102 99096517 99862745 100642076
4553A00642076J061934J314960J506652J620364J998921K226189K322494K607193
$$ 100642076 101704010 103018970 104525622 106145986 108144907 110371096 112693590 115300783
4545A15300783L036632L250596L645774L973217M186958M505513M716564N186153
$$ 115300783 118337415 121588011 125233785 129207002 133393960 137899473 142616037 147802190
4537A47802190N315311N580119N622819N626361N819702N631670N561431N336837
$$ 147802190 153117501 158697620 164320439 169946800 175766502 181398172 186959603 192296440
4529A92296440N138702M632733L991827L502063K933170K346573J721857J264245
$$ 192296440 197435142 202067875 206059702 209561765 212494935 214841508 216563365 217827610
4521B17827610N43022P7685l09471n98882r40563j135746j338583j488779j316101
$$ 217827610 218370632 218448317 218138846 217539964 216599401 215463655 214125072 212636293 211320192
4512B11320192j194897j352776j355938j299419j220151j292953j218232j436130
$$ 211320192 210125295 208772519 207416581 206117162 204897011 203604058 202385826 200949696
4504B00949696j591258j347044j504653j556685j458277j672685j563703j717348
$$ 200949696 199358438 198011394 196506741 194950056 193491779 191819094 190255391 188538043
4496A88538043j645677j484089j503501j490372j546869j338865j280234j376568
$$ 188538043 186892366 185408277 183904776 182414404 180867535 179528670 178248436 176871868
4488A76871868j540666j418342j608798j644634j705197k085482k360049k293220
$$ 176871868 175331202 173912860 172304062 170659428 168954231 166868749 164508700 162215480
4480A62215480k494108k692650l133765l119531l357376l210194l485335l628174
$$ 162215480 159721372 157028722 153894957 150775426 147418050 144207856 140722521 137094347
4472A37094347l604219l635850l598602l419405l468693l295940l137125l341795
$$ 137094347 133490128 129854278 126255676 122836271 119367578 116071638 112934513 109592718
4464A09592718l145428l107068k705406k707852k672548k495907k428455k128118
$$ 109592718 106447290 103340222 100634816 97926964 95254416 92758509 90330054 88201936
4456H8201936k238558k229291k083545j919724j940562j762024j613179j627958
$$ 88201936 85963378 83734087 81650542 79730818 77790256 76028232 74415053 72787095
4448G2787095j398773j634686j432581j119973j257931j237235j168879r26226
$$ 72787095 71388322 69753636 68321055 67201082 65943151 64705916 63537037 62610811
4440F2610811r31686r58946q40407j027723q01238q72828p55998n53169n61993
$$ 62610811 61679125 60720179 59879772 58852049 58050811 57177983 56421985 55868816 55306823
4431E5306823n79825n94653m92364m09450l54138m16868m49972l61751l70090
$$ 55306823 54726998 54132345 53639981 53230531 52876393 52459525 52009553 51647802 51277712
4422E1277712k11109j54520j18257k93290l23753j82302l34228k13492j42461
$$ 51277712 51066603 50912083 50793826 50500536 50176783 49994481 49660253 49446761 49304300
4413D9304300k16283k27245j00763k56133j55693k16413j85602j77322j85074
$$ 49304300 49088017 48860772 48760009 48503876 48348183 48131770 47946168 47768846 47583772
4404D7583772k79229j3953O1005j46151k06786n0391p3086K497N4804k9227K19114
$$ 47583772 47304543 47290590 47351595 47205444 46998658 46948267 46875181 46877678 46932482 46903255 47122369
4393D7122369R8360J05232J0734J36055J10138l0154m9220Q3402P6792m8558k3417
$$ 47122369 47220729 47325961 47336695 47472750 47582888 47552734 47503514 47586916 47663708 47615150 47591733
4382D7591733L8677M6485J18745Q413l2946J15458M9123L2967N4991M191K2729
$$ 47591733 47630410 47676895 47795640 47804053 47771107 47886565 47935688 47968655 48023646 48027837 48050566
4371D8050566k5160L9796J54243J13100P4652Q7916p8780K21180L06999K53411
$$ 48050566 48025406 48065202 48219445 48332545 48407197 48495113 48416333 48637513 48944512 49197923
4361D9197923K29783K20583L35889L35132M15117M24020O14407O23939O38307
$$ 49197923 49427706 49648289 49984178 50319310 50734427 51158447 51772854 52396793 53035100
4352E3035100N43840Q75297Q52285Q43245J231835J106801J067933J324557J390466
$$ 53035100 53578940 54454237 55306522 56149767 57381602 58488403 59556336 60880893 62271359
4343F2271359J242397J542432J562845J646069J544769J814188J538129J444065
$$ 62271359 63513756 65056188 66619033 68265102 69809871 71624059 73162188 74606253
4335G4606253J408618J259159J001281Q08254O82249P71493L68467P0050j7937
$$ 74606253 76014871 77274030 78275311 79083565 79765814 80537307 80905774 80975824 80957887
4326H0957887k26685m04139o24598q00499r64478q44300j010754j095650j127611
$$ 80957887 80731202 80327063 79702465 78901966 77937488 77093188 76082434 74986784 73859173
4317G3859173j102104j107596r79256j164992j052003j083583j025979j151093
$$ 73859173 72757069 71649473 70670217 69505225 68453222 67369639 66343660 65192567
4309F5192567r64116r15055q47845p20542o76008n66309q06205o89962o09229
$$ 65192567 64228451 63313396 62465551 61745009 61069001 60502692 59696487 59006525 58397296
4300E8397296m85445m26891l93708k93534l9245k23964j50801j50087M822J02760
$$ 58397296 57911851 57484960 57091252 56797718 56758473 56534509 56383708 56233621 56238443 56341203
4290E6341203J71407L10589K83850M14921M55736M36319N19942M49772O35321
$$ 56341203 56512610 56823199 57107049 57521970 57977706 58414025 58933967 59383739 60019060
4281F0019060P54762N81596N52520N91283P89508Q01972N36442O00293P83844
$$ 60019060 60773822 61355418 61907938 62499221 63288729 64090701 64627143 65227436 66011280
4272F6011280N67362O23774O26710N63973M84694M63258M98692L90964K02555
$$ 66011280 66578642 67202416 67829126 68393099 68877793 69341051 69839743 70230707 70433262
4263G0433262K28357J55638K92451j5626Q961j21770k19862r9256l19361m32593
$$ 70433262 70661619 70817257 71109708 71094082 71103043 70981273 70761411 70662155 70342794 69910201
4253F9910201k92972o54137n39459o48285q92534p16374o14655q56166j009252
$$ 69910201 69617229 68963092 68423633 67775348 66882814 66166440 65551785 64695619 63686367
4244F3686367r42719j285124j025357j033634j138696j072749j289885j117831
$$ 63686367 62743648 61458524 60433167 59399533 58260837 57188088 55898203 54780372
4236E4780372j123302j332862j205800j329134j437586j108961j184151j035973
$$ 54780372 53657070 52324208 51118408 49789274 48351688 47242727 46058576 45022603
4228D5022603j096058j306214j216921j157010j120516j129836j024049r78846
$$ 45022603 43926545 42620331 41403410 40246400 39125884 37996048 36971999 35993153
4220C5993153j078009r38674q75458q27433q69377q18076p71317p90543p17530
$$ 35993153 34915144 33976470 33101012 32273579 31404202 30586126 29814809 29024266 28306736
4211B8306736q09854o00590n53695n98138p72869n81453n32602n54468m54386
$$ 28306736 27496882 26896292 26342597 25744459 24971590 24390137 23857535 23303067 22848681
4202B2848681m29645n52452o58083l48105k60933m97741n83810k46014k25474
$$ 22848681 22419036 21866584 21208501 20860396 20599463 20101722 19517912 19271898 19046424
4193A9046424l53572m68100l57099l13574l92184k70534k57888l33319k75411
$$ 19046424 18692852 18224752 17867653 17554079 17161895 16891361 16633473 16300154 16024743
4184A6024743l19471j81479j36139l12488l12517k52778j57937j83130k53942
$$ 16024743 15705272 15523793 15387654 15075166 14762649 14509871 14351934 14168804 13914862
4175A3914862k12671k37588l50381k27537j47435j93518j70653l59318m9555k4128
$$ 13914862 13702191 13464603 13114222 12886685 12739250 12545732 12375079 12015761 11966206 11942078
4165A1942078k37620k47891j20691j32968m0909j27955k10653k07663j67203Q208
$$ 11942078 11704458 11456567 11335876 11202908 11161999 11034044 10823391 10615728 10448525 10456733
4155A0456733p5456k37173k77637n6272j94517k7131o3257o2398j10193l8589
$$ 10456733 10381277 10144104 9866467 9810195 9615678 9588547 9525290 9462892 9352699 9314110
4145I314110l6625k12288r1643k6799k42776o4083j71618j7815l3834q6642j84644
$$ 9314110 9277485 9065197 8973554 8946755 8703979 8639896 8468278 8450463 8416629 8329987 8145343
4134H145343K8745r7211O692k9094j88314k03483l9964k2479j76054o5237p3069
$$ 8145343 8174088 8076877 8083569 8054475 7866161 7662678 7622714 7600235 7424181 7358944 7285875
4123G285875M2593l2892j00834j5678j53035j06880N9859L1315j44729p7751n2385
$$ 7285875 7328468 7295576 7194742 7179064 7026029 6919149 6979008 7010323 6865594 6787843 6735458
4112F735458j4334j1712r1303j26174j5122l9063J1524m0107j00405P2234q8793
$$ 6735458 6721124 6709412 6618109 6491935 6476813 6437750 6449274 6409167 6308762 6380996 6292203
4101F292203j36816o544k6801q8707L6401j79938j59272n1192n5723O8137q2107
$$ 6292203 6155387 6148843 6122042 6033335 6069736 5889798 5730526 5679334 5623611 5691748 5609641
4090E609641j29792j26401Q39J3407k30R0831j60006L0386k1703j91183N5564
$$ 5609641 5479849 5353448 5354287 5367694 5367464 5458295 5298289 5328675 5306972 5115789 5171353
4079E171353o9304o3891Q5304j3110j51376p8118M3487l1017k458o4488n0194
$$ 5171353 5102049 5038158 5123462 5110352 4958976 4880858 4924345 4893328 4890870 4826382 4776188
4068D776188l6082k6256N6278J6880j5472Q6314j81226j67674J51646j1770j42451
$$ 4776188 4740106 4713850 4770128 4787008 4771536 4857850 4676624 4508950 4660596 4648826 4506375
4057D506375l495O4446r2419j54289P4095m0686m6821L9566R0021m4659k0193
$$ 4506375 4502880 4567326 4474907 4320618 4394713 4354027 4307206 4346772 4436793 4392134 4371941
4046D371941J1327m3315j42057R3412K7037n5945k1911P0648l613j3728l9823
$$ 4371941 4383268 4339953 4197896 4291308 4318345 4262400 4240489 4311137 4307524 4293796 4253973
4035D253973j8839K1559L6344P672r5275q2268N7666J27583j05487o0425M9478
$$ 4253973 4235134 4256693 4293037 4300709 4205434 4123166 4180832 4308415 4202928 4142503 4191981
4024D191981J6591j0216o6886O3828K2271l2950l1466L2342j17913J13182L409
$$ 4191981 4208572 4198356 4131470 4195298 4217569 4184619 4153153 4185495 4067582 4180764 4184173
4013D184173j59850l5766L7335m0432p3242j5365j5921k1429q580l7861K04453
$$ 4184173 4024323 3988557 4025892 3985460 3912218 3896853 3880932 3859503 3850923 3813062 4017515
4002D017515O2718p0412O8303j25827m5233l3114j18752j28577M3791J36595J68666
$$ 4017515 4080233 4009821 4078124 3952297 3907064 3873950 3755198 3626621 3670412 3807007 3975673
3991C975673N6384j53249k3055M4932n5520O3862K0169m572k2404j17358l3807
$$ 3975673 4032057 3878808 3855753 3900685 3845165 3909027 3929196 3924624 3902220 3784862 3751055
3980C751055P2630q7663M0806K3205k366M2543j26329m0180Q451k1385K3326k8951
$$ 3751055 3823685 3736022 3776828 3800033 3797667 3840210 3713881 3673701 3682152 3660767 3684093 3655142
3968C655142M9538J21558M9462P0844J6266q9308K8986k8506L9220r0642j35940
$$ 3655142 3704680 3826238 3875700 3946544 3962810 3873502 3902488 3873982 3913202 3822560 3686620
3957C686620J09198R4527P1579Q576p8584J7826L6032N6426m8217j40133k5084
$$ 3686620 3795818 3890345 3961924 3970500 3891916 3909742 3945774 4002200 3953983 3813850 3788766
3946C788766J01829k1380j6593J67421l8331J1914L7521j25606K0723N0410J8637
$$ 3788766 3890595 3869215 3852622 4020043 3981712 3993626 4031147 3905541 3926264 3976674 3995311
3935C995311j05067l1323o2167N8181J81944O694j38716k5864L0254K4871j0790
$$ 3995311 3890244 3858921 3796754 3854935 4036879 4043573 3904857 3878993 3909247 3934118 3923328
3924C923328l7502K5207n1024j7504q186J05328O5459j71351O420J16975K0680
$$ 3923328 3885826 3911033 3860009 3842505 3834319 3939647 4005106 3833755 3840175 3957150 3977830
3913C977830l8463O4417j05565N6143j28306L9070J07243O9005p307k1293o6133
$$ 3977830 3939367 4003784 3898219 3954362 3826056 3865126 3972369 4041374 4034067 4012774 3946641
3902C946641P244j24027J01197J17030n6967k623J40552o970o3091K14309q5833
$$ 3946641 3953885 3829858 3931055 4048085 3991118 3988495 4129047 4122077 4058986 4273295 4187462
3891D187462j12061J9880p9638l8668J07760P2358r6012K2810J72449n6468n28
$$ 4187462 4075401 4095281 4015643 3976975 4084735 4157093 4061081 4083891 4256340 4199872 4199344
3880D199344R2945j5263j95337Q7542K07730P283p7468R1626M6041K0867J14240
$$ 4199344 4292289 4277026 4081689 4169231 4376961 4384244 4306776 4398402 4444443 4465310 4579550
3869D579550M0590p1698M6020l1367L3016P9300J5732o360m0288k1602R0458l2899
$$ 4579550 4620140 4548442 4594462 4563095 4596111 4675411 4691143 4684783 4644495 4622893 4713351 4680452
3857D680452P4349Q4200l2573o9228J61607J42475p9440m251J5447J8561L0833
$$ 4680452 4754801 4839001 4806428 4737200 4898807 5041282 4961842 4957591 4973038 4991599 5022432
3846E022432L4610l6525J46745O5543k8813l6499M6697n5542J37543K69900j39273
$$ 5022432 5057042 5020517 5167262 5232805 5203992 5167493 5214190 5158648 5296191 5566091 5426818
3835E426818J9797q2901J9852j28118J36187J28201M9672J52233n1285P8747J42960
$$ 5426818 5446615 5363714 5383566 5255448 5391635 5519836 5569508 5721741 5670456 5749203 5892163
3824E892163l7819m6115j5168N3440l2098L9667J40563O9315m033J19043l9230
$$ 5892163 5854344 5808229 5793061 5846501 5814403 5854070 5994633 6063948 6059915 6178958 6139728
3813F139728M6225J12422J1652j9230O8854j36337p6121P1306J65858K47528J67175
$$ 6139728 6185953 6298375 6310027 6290797 6359651 6223314 6147193 6218499 6384357 6631885 6799060
3802F799060L0941Q6551J15318J9672P4172M9899J13034K2614J04926N8067P9572
$$ 6799060 6830001 6916552 7031870 7051542 7125714 7175613 7288647 7311261 7416187 7474254 7553826
3791G553826Q0251M4506L6353O2684P6691K67185L4708P6388J29948J50335J56879
$$ 7553826 7634077 7678583 7714936 7777620 7854311 8121496 8156204 8232592 8362540 8512875 8669754
3780H669754J41260R6391P9703R3049R906J28237Q2389J12751J34580L8520J07673
$$ 8669754 8811014 8907405 8987108 9080157 9090063 9218300 9300689 9413440 9548020 9586540 9694213
3769I694213O9430J90604M8904j5736J56322K47086J03785R133N0369J4821Q4680
$$ 9694213 9763643 9954247 10003151 9987415 10143737 10390823 10494608 10503741 10554110 10568931 10653611
3758A0653611J52838J00242J14934q0194J94072R4926j14575J27099K22109K18081
$$ 10653611 10806449 10906691 11021625 10941431 11135503 11230429 11115854 11242953 11465062 11683143
3748A1683143J01598J69616J57837J95225K7050J46018J28351O8670J49163K12094
$$ 11683143 11784741 11954357 12112194 12307419 12334469 12480487 12608838 12677508 12826671 13038765
3738A3038765K21517M8704J00875J56711J82483L56368J02686N1698K27470K48351
$$ 13038765 13260282 13308986 13409861 13566572 13749055 14105423 14208109 14259807 14487277 14735628
3728A4735628J07398M1279J49726K34478J70255J82056K63175K62820J09457K37828
$$ 14735628 14843026 14884305 15034031 15268509 15438764 15620820 15883995 16146815 16256272 16494100
3718A6494100L31492K63628K43446P9021J83498K98392L14776J62794J33821J61487
$$ 16494100 16825592 17089220 17332666 17411687 17595185 17893577 18208353 18371147 18504968 18666455
3708A8666455L29603J96989K18163M07363J36034J68766K72995K89714K82478
$$ 18666455 18996058 19193047 19411210 19818573 19954607 20123373 20396368 20686082 20968560
3699B0968560K40705L64281K23085K03167K02897K67559L87874L68426K48213
$$ 20968560 21209265 21573546 21796631 21999798 22202695 22470254 22858128 23226554 23474767
3690B3474767L29651K99802K15186J86184N20582N07961M64506N53970M79593
$$ 23474767 23804418 24104220 24319406 24505590 25026172 25534133 25998639 26552609 27032202
3681B7032202L65008N93660N84381M89667N53164N63281N35206O10059O75517
$$ 27032202 27397210 27990870 28575251 29064918 29618082 30181363 30716569 31326628 32002145
3672C2002145Q26841O99377P90129P62014P42747O76850P48928P40520Q42275
$$ 32002145 32828986 33528363 34318492 35080506 35823253 36500103 37249031 37989551 38831826
3663C8831826J062209Q10817R29192R79839Q78942P42529R26673Q42540Q89181
$$ 38831826 39894035 40704852 41634044 42613883 43492825 44235354 45162027 46004567 46893748
3654D6893748Q05788O74995O92271N84367Q78353O47472L48168M63011L77525
$$ 46893748 47699536 48374531 49066802 49651169 50529522 51176994 51525162 51988173 52365698
3645E2365698M42451K35781K20283M0557J55324N9909j9015n6219j60449l67262
$$ 52365698 52808149 53043930 53264213 53304770 53460094 53520003 53500988 53444769 53284320 52917058
3635E2917058j02362j90582l30263n09563m08398l84333m86972m54993o66626
$$ 52917058 52814696 52624114 52293851 51784288 51375890 50991557 50504585 50049592 49382966
3626D9382966n85087n10580m21486n96120n96808o10856n12892l06541m74487
$$ 49382966 48797879 48287299 47865813 47269693 46672885 46062029 45549137 45242596 44768109
3617D4768109n57249n42778l08927k17615k55053k87074k63790l74142j91203
$$ 44768109 44210860 43668082 43359155 43141540 42886487 42599413 42335623 41961481 41770278
3608D1770278l1385Q2538J6800k32176O5798O6368J16073L5637K62041K30782
$$ 41770278 41738893 41821431 41838231 41606055 41671853 41738221 41854294 41889931 42151972 42382754
3598D2382754L32192L18305K71616K48128M55103L54228L51975N30185N24813
$$ 42382754 42714946 43033251 43304867 43552995 44008098 44362326 44714301 45244486 45769299
3589D5769299N66242Q10385Q28709P14016P55950Q15948R37442R61177J156346
$$ 45769299 46335541 47145926 47974635 48688651 49444601 50260549 51197991 52159168 53315514
3580E3315514J261768J060592J106211J415341J646035J594420J460407J942322
$$ 53315514 54577282 55637874 56744085 58159426 59805461 61399881 62860288 64802610
3572F4802610J837302K054661K139798K181556K318914K322617K368173K567282
$$ 64802610 66639912 68694573 70834371 73015927 75334841 77657458 80025631 82592913
3564H2592913K461981K601983K630327K567639K543758K492672K463294K308764
$$ 82592913 85054894 87656877 90287204 92854843 95398601 97891273 100354567 102663331
3556A02663331K246847K117459K036704J900508J800492J624180J453522J251298
$$ 102663331 104910178 107027637 109064341 110964849 112765341 114389521 115843043 117094341
3548A17094341J061006R52273P90258P15192N10685K60269J00624J64162N4571
$$ 117094341 118155347 119107620 119897878 120613070 121123755 121384024 121484648 121648810 121703381
3539A21703381j97661k05248l83111n44379o22132p00690o19938n31062n06872
$$ 121703381 121505720 121300472 120917361 120372982 119750850 119050160 118430222 117899160 117392288
3530A17392288m50633m33217k51980k19489J3267K9925J46231M68760O09712O86676
$$ 117392288 116941655 116508438 116256458 116036969 116050236 116080161 116226392 116695152 117304864 117991540
3520A17991540J078407J164444J320206J626583J767677K095011K268880K646972
$$ 117991540 119069947 120234391 121554597 123181180 124948857 127043868 129312748 131959720
3512A31959720K932364L111960L239754L444337L789644M276833M242619M337807
$$ 131959720 134892084 138004044 141243798 144688135 148477779 152754612 156997231 161335038
3504A61335038M486029M767485M992427N136313N313876N426254N300820N592193
$$ 161335038 165821067 170588552 175580979 180717292 186031168 191457422 196758242 202350435
3496B02350435N762359N775167N954979N894239N956147N944029N951864N926890
$$ 202350435 208112794 213887961 219842940 225737179 231693326 237637355 243589219 249516109
3488B49516109N785122N648623N664225N301833N238586N065072M689529M379014
$$ 249516109 255301231 260949854 266614079 271915912 277154498 282219570 286909099 291288113
3480B91288113M210714L609378L167888K837856K400342J976373J299940R52473
$$ 291288113 295498827 299108205 302276093 305113949 307514291 309490664 310790604 311743077
3472C11743077N61126K3844l29665p82719j203921j740528k222686k585842k743236
$$ 311743077 312304203 312328047 311998382 311215663 310011742 308271214 306048528 303462686 300719450
3463C00719450l080642l561062m007224m178945m531271m687236n011645n051056
$$ 300719450 297638808 294077746 290070522 285891577 281360306 276673070 271661425 266610369
3455B66610369n279487n487582n439794n587628n613525n423248n398402n282341
$$ 266610369 261330882 255843300 250403506 244815878 239202353 233779105 228380703 223098362
3447B23098362n216220n214074n019797m918889m546273m374645m270162m102258
$$ 223098362 217882142 212668068 207648271 202729382 198183109 193808464 189538302 185436044
3439A85436044l858212l668325l658260l542245l302369l079549l159761k781289
$$ 185436044 181577832 177909507 174251247 170709002 167406633 164327084 161167323 158386034
3431A58386034k648818k765944k433481k490472k457544k390032k297175k318100
$$ 158386034 155737216 152971272 150537791 148047319 145589775 143199743 140902568 138584468
3423A38584468k241180k018350k136641k160105j907879j718737j870570j773243
$$ 138584468 136343288 134324938 132188297 130028192 128120313 126401576 124531006 122757763
3415A22757763j738417j712173j525376j426285j330955j253591j297332j228406
$$ 122757763 121019346 119307173 117781797 116355512 115024557 113770966 112473634 111245228
3407A11245228j112192q15034q14396q83083p30619m87971m09102m25538k52309
$$ 111245228 110133036 109318002 108503606 107620523 106889904 106401933 105992831 105567293 105314984
3398A05314984l10495m0284J41416J55870K88543M07903N42996P04189Q62298
$$ 105314984 105004489 104964205 105105621 105261491 105550034 105957937 106500933 107205122 108067420
3389A08067420J146680J114864J390326J477680J792971J937204K063895K284082
$$ 108067420 109214100 110328964 111719290 113196970 114989941 116927145 118991040 121275122
3381A21275122K421837K561648K948836L105037L096656L262907L353706L568031
$$ 121275122 123696959 126258607 129207443 132312480 135409136 138672043 142025749 145593780
3373A45593780L636182L586553L828658L781678L712618L610330L576756L538896
$$ 145593780 149229962 152816515 156645173 160426851 164139469 167749799 171326555 174865451
3365A74865451L277043K974111L061271K825454K343497K061529J948816J507935
$$ 174865451 178142494 181116605 184177876 187003330 189346827 191408356 193357172 194865107
3357A94865107J209079R99800N63348K49109q5723m78205o63617r53611j285778
$$ 194865107 196074186 197073986 197637334 197886443 197800720 197322515 196658898 195705287 194419509
3348A94419509j392964j664304j877879j923441k047860k034678k043243k332010
$$ 194419509 193026545 191362241 189484362 187560921 185513061 183478383 181435140 179103130
3340A79103130k205389j938447k009742k111627j880521j518098j649736j458773
$$ 179103130 176897741 174959294 172949552 170837925 168957404 167439306 165789570 164330797
3332A64330797j383361j340582j097685j066146q81083p61321q23680o43015p00136
$$ 164330797 162947436 161606854 160509169 159443023 158561940 157800619 156976939 156333924 155633788
3323A55633788o62107p30431q23941p76092q29046r56610j059897r19700j125577
$$ 155633788 154971681 154241250 153417309 152641217 151812171 150855561 149795664 148875964 147750387
3314A47750387j244011j194683j264432j500067j398725j431582j332893j484061
$$ 147750387 146506376 145311693 144047261 142547194 141148469 139716887 138383994 136899933
3306A36899933j514726j381004j504317j377534j458141j502489j373702j474059
$$ 136899933 135385207 134004203 132499886 131122352 129664211 128161722 126788020 125313961
3298A25313961j502984j652717j527774j568365j834466j946856k001006k014443
$$ 125313961 123810977 122158260 120630486 119062121 117227655 115280799 113279793 111265350
3290A11265350k010987k209209k298777k295638k285804k324095k258458k391954
$$ 111265350 109254363 107045154 104746377 102450739 100164935 97840840 95582382 93190428
3282I3190428k278427k302832k132101k166881k076808k034367j974689j798539
$$ 93190428 90912001 88609169 86477068 84310187 82233379 80199012 78224323 76425784
3274G6425784j827390j714432j598332j523709j443300j277407j192760j159062
$$ 76425784 74598394 72883962 71285630 69761921 68318621 67041214 65848454 64689392
3266F4689392j162837j118795q83075q46130q56708p68944p91361p31888o04251
$$ 64689392 63526555 62407760 61524685 60678555 59821847 59052903 58261542 57529654 56925403
3257E6925403n59382m35923m41708m22243m42877m71548n64374l32247l50522
$$ 56925403 56366021 55930098 55488390 55066147 54623270 54151722 53587348 53255101 52904579
3248E2904579l69561m24711j57202j47379l25455l66624l52206l83248m96861
$$ 52904579 52535018 52110307 51953105 51805726 51480271 51113647 50761441 50378193 49881332
3239D9881332l60823m63387k86147m52245m29163m18410n27956o39865n29207
$$ 49881332 49520509 49057122 48770975 48318730 47889567 47471157 46943201 46303336 45774129
3230D5774129o18783o04385m22785n96743n27207n89559m78224n35070m03671
$$ 45774129 45155346 44550961 44128176 43531433 43004226 42414667 41936443 41401373 40997702
3221D0997702m30743l49809k32498l77177l07237k25216k17045k77042M9487k08569
$$ 40997702 40566959 40217150 39984652 39607475 39300238 39075022 38857977 38580935 38630422 38421853
3211C8421853r3924K21j59722m6999q2224j27119Q5648j917R0840o7913j22380
$$ 38421853 38327929 38328150 38168428 38121429 38039205 37912086 37997734 37995817 38086657 38018744 37896364
3200C7896364j10458J9687J05911O1929J690J40432o4357K4010N8337j15385J54600
$$ 37896364 37785906 37805593 37911504 37973433 37975123 38115555 38051198 38075208 38133545 38018160 38172760
3189C8172760P7305Q6585K04827L9239Q2566J38290J04056K55485K32542L24491
$$ 38172760 38250065 38336650 38541477 38580716 38663282 38801572 38905628 39161113 39393655 39718146
3179C9718146K98769L08149K53704K54163L71074N91951K93920L11051K73311
$$ 39718146 40016915 40325064 40578768 40832931 41204005 41795956 42089876 42400927 42674238
3170D2674238L54866N07342K22310N21305L94957M29292N98844M44504M78101
$$ 42674238 43029104 43536446 43758756 44280061 44675018 45104310 45703154 46147658 46625759
3161D6625759O45578O34068N67248M72043N28347P05695P50467P00595Q11384
$$ 46625759 47271337 47905405 48472653 48944696 49473043 50178738 50929205 51629800 52441184
3152E2441184Q87817J021045Q59590J086426R19390J007045J205917J035484J182854
$$ 52441184 53329001 54350046 55209636 56296062 57215452 58222497 59428414 60463898 61646752
3143F1646752J176652J311517J354717J548313J514957J487041J746248J866339
$$ 61646752 62823404 64134921 65489638 67037951 68552908 70039949 71786197 73652536
3135G3652536J881842K130487K168737K290427K634911K703655K908022K961605
$$ 73652536 75534378 77664865 79833602 82124029 84758940 87462595 90370617 93332222
3127I3332222L296013L623848L899961M202970M495151M748046N139713N612057
$$ 93332222 96628235 100252083 104152044 108355014 112850165 117598211 122737924 128349981
3119A28349981O046537O689274P113912P507695Q364039Q814368R619998J0446628
$$ 128349981 134396518 141085792 148199704 155707399 164071438 172885806 182505804 192952432
3111A92952432J0926238J1848738J2747578J3507563J4087576J4902336J5482490
$$ 192952432 203878670 215727408 228474986 241982549 256070125 270972461 286454951
3104B86454951J6039475J6389787J6778741J6757698J6589230J6138905J5704040
$$ 286454951 302494426 318884213 335662954 352420652 369009882 385148787 400852827
3097D00852827J4723418J3462186J2000310J0232807Q156963N941538L580251
$$ 400852827 415576245 429038431 441038741 451271548 459428511 465370049 468950300
3090D68950300J269247r31229l610554n658816p736768r797070j1331582j2549193
$$ 468950300 470219547 469288318 465677764 460018948 452282180 442485110 431153528 418604335
3082D18604335j3556982j4420145j4881368j5272394j5119833j5102789j4860917
$$ 418604335 405047353 390627208 375745840 360473446 345353613 330250824 315389907
3075C15389907j4418507j3983632j3237687j2672175j2088573j1223908j0378154
$$ 315389907 300971400 286987768 273750081 261077906 248989333 237765425 227387271
3068B27387271r952217r319346q556491q015123p428269o873564o477411n819498
$$ 227387271 217435054 208115708 199559217 191544094 184115825 177242261 170764850 164945352
3060A64945352n405444n231484m906555m769068m343658m105190l949305l763980
$$ 164945352 159539908 154308424 149401869 144632801 140289143 136183953 132234648 128470668
3052A28470668l627425l516883l340878l230693l222022l061780k968442l093636
$$ 128470668 124843243 121326360 117985482 114754789 111532767 108470987 105502545 102408909
3044A02408909k965561k806133k804808k747878k580008k441364k275507k364411
$$ 102408909 99443348 96637215 93832407 91084529 88504521 86063157 83787650 81423239
3036H1423239k367189k266535k083974k023160k043812j929424j772160j847200
$$ 81423239 79056050 76789515 74705541 72682381 70638569 68709145 66936985 65089785
3028F5089785j715553j640165j583481j415343j516851j537031j387008j376558
$$ 65089785 63374232 61734067 60150586 58735243 57218392 55681361 54294353 52917795
3020E2917795j232352j197039j348289j157998j221611r88851r68890j044420
$$ 52917795 51685443 50488404 49140115 47982117 46760506 45771655 44802765 43758345
3012D3758345j004817q86501r04201r48591q32874q45552p93445p25099q81617
$$ 43758345 42753528 41867027 40962826 40014235 39181361 38335809 37542364 36817265 35935648
3003C5935648p66673o92436n42700n72984n56660o61080n84578n91102n36828
$$ 35935648 35168975 34476539 33933839 33360855 32804195 32143115 31558537 30967435 30430607
2994C0430607m62370n25254n81454n50875o04569m81147l95665m42819n17315
$$ 30430607 29968237 29442983 28861529 28310654 27706085 27224938 26829273 26386454 25869139
2985B5869139n39336n16928n25523n53351m68899l54283n99728m18796o06443
$$ 25869139 25329803 24812875 24287352 23734001 23265102 22910819 22311091 21892295 21285852
2976B1285852n68059m11888m11514l67547l83613l19757l79061l83486m79694
$$ 21285852 20717793 20305905 19894391 19526844 19143231 18823474 18444413 18060927 17581233
2967A7581233n05323m01844l47652k51791k86496n58772l10706l18870k12834
$$ 17581233 17075910 16674066 16326414 16074623 15788127 15229355 14918649 14599779 14386945
2958A4386945l05150m22185k25199l19944o0622k92209m38394k60230j59246j22742
$$ 14386945 14081795 13659610 13434411 13114467 13053845 12761636 12323242 12063012 11903766 11781024
2948A1781024l60832k03599j79382o0529j29908j40981j49671j63388j11254j85164
$$ 11781024 11420192 11216593 11037211 10976682 10846774 10705793 10556122 10392734 10281480 10096316
2938A0096316l44873j65201n5601o9596q3161j24501j72034j22810j17779j39392
$$ 10096316 9751443 9586242 9530641 9461045 9377884 9253383 9081349 8958539 8840760 8701368
2928H701368j40228j5407j05111L103j21013k41671n6816j40743j3766j51449
$$ 8701368 8561140 8545733 8440622 8443725 8322712 8081041 8024225 7883482 7869716 7718267
2918G718267r9750j55236J1726o8378N030m8752k72539O939n6010l681J12302
$$ 7718267 7618517 7463281 7475007 7406629 7411659 7362907 7090368 7097307 7041297 7037616 7149918
2907G149918j52201j35811p4426Q2830j51141j03698j85387j07171l1652j2987
$$ 7149918 6997717 6861906 6787480 6870310 6719169 6615471 6430084 6322913 6291261 6278274
2897F278274j19151J51347p616j29582m9804k572j22167m7259N5374m1473R6255
$$ 6278274 6159123 6310470 6302854 6173272 6123468 6120896 5998729 5951470 6006844 5965371 6061626
2886F061626l9753m4618P0338o6634P3067q3969m1019n3352M42K31533J05592
$$ 6061626 6021873 5977255 6047593 5980959 6054026 5970057 5929038 5875686 5876128 6107661 6213253
2875F213253j23209n7430L5972l4431J8866o7621O6185o6394l9484N3775J65234
$$ 6213253 6090044 6032614 6068586 6034155 6053021 5985400 6051585 5985191 5945707 5999482 6164716
2864F164716n7416j23250Q1386O2843j5229Q681o007J22778r7281J51293J55200
$$ 6164716 6107300 5984050 6065436 6128279 6113050 6121731 6115724 6238502 6141221 6292514 6447714
2853F447714m6475j082M4398L3414k4828j32138j32630J66510j1217M0543k4083
$$ 6447714 6401239 6400157 6444555 6477969 6453141 6321003 6188373 6354883 6343666 6384209 6360126
2842F360126P6161n356j00096K02691J11388R4906K8132o2828L3431Q5365P931
$$ 6360126 6436287 6430931 6330835 6533526 6644914 6739820 6767952 6705124 6738555 6823920 6831851
2831F831851l4231R6974J93048m4296p4366p8540n3083K17799K05160j42942j8910
$$ 6831851 6797620 6894594 7087642 7043346 6968980 6890440 6837357 7055156 7260316 7117374 7098464
2820G098464R3142J34271K636P6797K9914l6391l9776J22953N3845k0320o6071
$$ 7098464 7191606 7325877 7328513 7405310 7435224 7398833 7359057 7482010 7535855 7515535 7449464
2809G449464j21976J4980J21644o9030n4925o9879j94293n1605q1582j40514J5547
$$ 7449464 7327488 7342468 7464112 7395082 7340157 7270278 7075985 7024380 6942798 6802284 6817831
2798F817831p6082k42574J7774J2670j24087j98217j42470j54120j95339q9728
$$ 6817831 6741749 6499175 6516949 6529619 6405532 6207315 6064845 5910725 5715386 5625658
2788E625658j06851j21678p1393j56650j48666k16876j0765q2701k39526q7660
$$ 5625658 5518807 5397129 5325736 5169086 5020420 4803544 4792779 4710078 4470552 4382892
2778D382892J31251n6339j16992q5339j47597o0139j33660j19938r5317r8874
$$ 4382892 4514143 4457804 4340812 4255473 4107876 4047737 3914077 3794139 3698822 3599948
2768C599948q1586J2158R205n7311j5824j49875k01192O3747J6141L9176n5717
$$ 3599948 3518362 3530520 3539725 3482414 3466590 3316715 3115523 3179270 3195411 3234587 3178870
2757C178870j58103r2601P8566q8482r3741O5091O3841o6295j17173J04823j7074
$$ 3178870 3020767 2928166 3006732 2918250 2824509 2889600 2953441 2887146 2769973 2874796 2857722
2746B857722k40888n8543r2058j5814K6604n8803O090o3447N0586n9036k3236
$$ 2857722 2616834 2558291 2466233 2450419 2477023 2418220 2424310 2360863 2411449 2352413 2329177
2735B329177q8628q8997j01425p6201k8123M6284l30J7791n2249m88J00321K5375
$$ 2329177 2240549 2151552 2050127 1973926 1945803 1992087 1991757 2009548 1957299 1956811 2057132 2082507
2723B082507j01458o6879o7150l3565m1876J07667j9750j38454o5842Q5838o8474
$$ 2082507 1981049 1914170 1847020 1813455 1771579 1879246 1859496 1721042 1655200 1741038 1672564
2712A672564k40270J4527J01653L50P6200k0166K1999K3267r7883o9673P6592
$$ 1672564 1432294 1446821 1548474 1548824 1625024 1604858 1626857 1650124 1552241 1482568 1559160
2701A559160Q2859j79455r4305J16025P4165p5787L3018p9324r0881p4424P8783
$$ 1559160 1642019 1462564 1368259 1484284 1558449 1482662 1515680 1436356 1345475 1271051 1349834
2690A349834R8432l9093j21703j4325J90446q1285q5171j58330J49796l6344j59334
$$ 1349834 1448266 1409173 1287470 1273145 1463591 1382306 1297135 1138805 1288601 1252257 1092923
2679A092923k1636L6549N0076k8765N009J0673M717N680J09974j1237j07998j9147
$$ 1092923 1071287 1107836 1157912 1129147 1134156 1144829 1149546 1155226 1265200 1253963 1145965 1126818
2667A126818J7061P4882j46092K3783L9630p3149O9318K8233J47972n9428o5567
$$ 1126818 1143879 1218761 1072669 1096452 1136082 1062933 1132251 1160484 1308456 1249028 1183461
2656A183461j29462O238O8034m8927L5596L4833p4602M8998M0441L0845l9247
$$ 1183461 1053999 1060237 1128271 1079344 1114940 1149773 1075171 1124169 1164610 1195455 1156208
2645A156208j00199j18936O5163J03177r1893p6196K00268o0985K2531k5819j0392
$$ 1156208 1056009 937073 1002236 1105413 1013520 937324 1137592 1076607 1099138 1073319 1062927
2634A062927k3809N5218J4258n7588r0233Q3019j3190J04826N8926l532j57603
$$ 1062927 1039118 1094336 1108594 1051006 960773 1043792 1030602 1135428 1194354 1190822 1033219
2623A033219p0884J02834K2733R8165l1265q5911j0593J13693R146J44628O1801
$$ 1033219 962335 1065169 1087902 1186067 1154802 1068891 1058298 1171991 1181137 1325765 1387566
2612A387566r4152r4318p3130R9725n7330l9616j971r2881j09120o6685J21616
$$ 1387566 1293414 1199096 1125966 1225691 1168361 1128745 1126774 1033893 924773 858088 979704
2601I79704J03055p8055J6124n6118K9378p9373j21411L4236J24524m7400j21204
$$ 979704 1082759 1004704 1020828 964710 994088 914715 793304 827540 952064 904664 783460
2590G83460J22757j11734K2665N4447J03494j90550K3622l6713N800n3404J00082
$$ 783460 906217 794483 817148 871595 975089 784539 808161 771448 777248 723844 823926
2579H23926L9185L7610P9425j72864q8652J40139P7689q5036p284K0175O9379
$$ 823926 863111 900721 980146 807282 718630 858769 936458 851422 844138 864313 933692
2568I33692r7171n1712L1055j5515j5815P9731q7094L6664J1245q1723R1222l1401
$$ 933692 836521 784809 815864 800349 784534 864265 777171 813835 825080 743357 834579 803178
2556H03178P6094r0319J11311n396j66740L0427n7046L6392K3395O6844J11638
$$ 803178 879272 788953 900264 894868 728128 758555 701509 737901 761296 828140 939778
2545I39778k463r6734m7955J1743k2142n1287n3691J59249m4328l9616J2306n599
$$ 939778 937315 840581 792626 804369 782227 730940 677249 836498 792170 752554 764860 759261
2533G59261J02636M5614j39190j26699J75823Q9450m7321m1478J5219j0589p3466
$$ 759261 861897 907511 768321 641622 817445 906895 859574 818096 833315 822726 749260
2522G49260J7131L1578P9648l2440M2126j56171r8074k1791J29346M8734p7465
$$ 749260 766391 797969 877617 845177 887303 731132 633058 611267 740613 789347 711882
2511G11882O6649k1281l5365k2059p4589M7477O037M372r0161M5400Q5389r2768
$$ 711882 778531 757250 721885 699826 625237 672714 678751 683123 592962 638362 723751 630983
2499F30983L006Q17J34489m9706J25522j01649M3012J54395o1971j23611Q6579
$$ 630983 633989 634806 769295 719589 845111 743462 786474 940869 878898 755287 841866
2488H41866J3429j08783m9623l9579R6909J31529R4839j61859j51M8090j21282
$$ 841866 855295 746512 696889 657310 754219 885748 980587 818728 818577 866667 745385
2477G45385M4681J13577M2573m7852j15367n1426K5685q9213k7329O9122P0111
$$ 745385 790066 903643 946216 898364 782997 731571 757256 668043 640714 709836 779947
2466G79947P2179k0428J0292k12903L8325J50843n6071L1262p2594P1020j2715
$$ 779947 852126 831698 841990 629087 667412 818255 762184 793446 720852 791872 779157
2455G79157K0544J26209K0852j31236J57264L6506o7648j1414O8897q5994L2906
$$ 779157 799701 925910 946762 815526 972790 1009296 941648 930234 999131 913137 946043
2444I46043J44250l1502N9710P1284r9448l2938l8323J6612Q4454R7562Q1123
$$ 946043 1090293 1058791 1118501 1189785 1090337 1057399 1019076 1035688 1120142 1217704 1298827
2433A298827k26640N790J25763q954N3290l8852j165Q1772L5739R1031m0211J17041
$$ 1298827 1072187 1077977 1203740 1194786 1248076 1209224 1208059 1289831 1325570 1416601 1376390 1493431
2421A493431l6880j67698J48735J45127o4833m2512L4198J21875R5988L3960j5774
$$ 1493431 1456551 1288853 1437588 1582715 1517882 1475370 1509568 1631443 1727431 1761391 1745617
2410A745617K648J71925l7761O8182k5149J47835N6142m5606m7095M7990R5814
$$ 1745617 1748265 1920190 1882429 1950611 1925462 2073297 2129439 2083833 2036738 2084728 2180542
2399B180542Q6473J03622J99956j9800k0426J03290N2673J35521n3532O3618J30936
$$ 2180542 2267015 2370637 2570593 2550793 2530367 2633657 2686330 2821851 2768319 2831937 2962873
2388B962873J29723J76252J06228m2802J09741R3184K26902K30869J09908J32389
$$ 2962873 3092596 3268848 3375076 3332274 3442015 3535199 3762101 3992970 4102878 4235267
2378D235267K10005J94062J38595K10712K70493L06750K91020M19797M25357M41317
$$ 4235267 4445272 4639334 4777929 4988641 5259134 5565884 5856904 6276701 6702058 7143375
2368G143375M58309M34731N84074P33970Q86040Q53740R19302R97562J197117
$$ 7143375 7601684 8036415 8620489 9354459 10240499 11094239 12013541 13011103 14208220
2359A4208220J250854J470090J287501J584557J763188J879293J891885K142971
$$ 14208220 15459074 16929164 18216665 19801222 21564410 23443703 25335588 27478559
2351B7478559K058930J917054K051597J914952J616555J521438J320716Q43675
$$ 27478559 29537489 31454543 33506140 35421092 37037647 38559085 39879801 40723476
2343D0723476N19992N8165l17042p58128j202365j361643j634119j793989k065593
$$ 40723476 41243468 41301633 40984591 40226463 39024098 37662455 36028336 34234347 32168754
2334C2168754k088025j901665k102234k115638j689911j652760j710388j526131
$$ 32168754 30080729 28179064 26076830 23961192 22271281 20618521 18908133 17382002
2326A7382002j427852j378080j165732j057684r01489q97784q64501p24497p10211
$$ 17382002 15954150 14576070 13410338 12352654 11451165 10553381 9688880 8964383 8254172
2317H254172o95884p15209m77387m29961k96622l05599l81406k48854l36154k24663
$$ 8254172 7558288 6843079 6365692 5935731 5639109 5333510 4952104 4703250 4367096 4142433
2307D142433q0602l10251l20097k18584j45228j39324j16900j17748j56542k26973
$$ 4142433 4061831 3751580 3431483 3212899 3067671 2928347 2811447 2693699 2537157 2310184
2297B310184K3152o9440k52589j49445L9712j31133l1751j13057k3968q0584q2312
$$ 2310184 2333336 2263896 2011307 1861862 1901574 1770441 1738690 1625633 1601665 1521081 1438769
2286A438769o329j05944J07732J7959j10373l4402n7354p3680q3172m7527n0071
$$ 1438769 1432440 1326496 1434228 1452187 1341814 1307412 1250058 1176378 1093206 1045679 995608
2275I95608O6627R7048p7233j05413l3212J3897o7715P963q4020n3677k8981m2419
$$ 995608 1062235 1159283 1082050 976637 943425 957322 889607 897570 813550 759873 730892 688473
2263F88473l8087p2002K37601k8393k197K7645n1053K36P2540j90894k38780K31020
$$ 688473 650386 578384 815985 787592 785395 813040 761987 762223 834763 643869 405089 636109
2251F36109J23015j65560K2729R3962o5271P813J4191r0293j47428L2955J92439
$$ 636109 759124 593564 616293 710255 644984 652797 666988 576695 429267 462222 654661
2240F54661r5662K0344P0404L0677k16036m9373P2790n4093o7763P21J19038l0240
$$ 654661 558999 579343 649747 680424 464388 415015 487805 433712 365949 366670 485708 455468
2228D55468R4789k7709L0187N6336j6728k41574P2102q0135r1801P8300J8619
$$ 455468 550257 522548 552735 609071 592343 350769 422871 342736 250935 329235 347854
2217C47854J40680j35460n2964J46587p112k057o1504j3858m3853K248q6115M1461
$$ 347854 488534 353074 300110 446697 439585 437528 376024 362166 318313 320561 234446 275907
2205B75907N3144m5640M0687N1997m7058r6099J9312l9481R0199j2172N8014P8008
$$ 275907 329051 283411 324098 376095 329037 232938 252250 212769 302968 290796 348810 426818
2193D26818j44081j07107r654R0851M0916K0244L1670J5242o8108K3589m5242
$$ 426818 282737 175630 165976 256827 297743 317987 349657 364899 296791 320380 275138
2182B75138l4055N2683N029m8574r7421m1536R1797O1581j42225j7639J3501O5420
$$ 275138 241083 293766 298795 250221 152800 111264 203061 264642 122417 104778 118279 183699
2170A83699Q0471R3164n6037n5195j0860n301k2872n4163J1668J12174l2230j52814
$$ 183699 264170 357334 301297 246102 235242 229941 207069 152906 164574 276748 244518 91704
2158I1704L55J52825P0991j89170q5833P3585j05595J81087J07572j26208o770
$$ 91704 92059 244884 315875 126705 40872 114457 8862 189949 297521 171313 164543
2147A64543L2363m620o8035J4644N622r390n7234J24492p9567L5366N3232k1355
$$ 164543 196906 192286 124251 138895 144517 135127 77893 202385 122818 158184 211416 190061
2135A90061j08709j26584J90465O0773k4624L2211o8529j667m4649P9951P0193
$$ 190061 81352 -45232 145233 206006 181382 213593 145064 143397 98748 178699 248892
2124B48892R9128q0624m385k6415M0520k8918q7776O3291n5550q3081m420J39936
$$ 248892 348020 267396 263011 236596 277116 248198 160422 223713 168163 85082 80662 220598
2112B20598k6615N614L5701m0313o1414j2523o4448K8494J05649p323L1678r4838
$$ 220598 193983 199597 235298 194985 133571 121048 56600 85094 190743 183420 215098 120260
2100A20260r2410R0007k1221J02261M6404r945j2692J29159j67631K7528J04441
$$ 120260 27850 117857 96636 198897 245301 235356 222664 351823 184192 211720 316161
2089C16161N6643n3807n181j62812J34589K4541r5464J60706r5961r0688Q3559
$$ 316161 372804 318997 313816 151004 285593 310134 214670 375376 279415 188727 272286
2078B72286Q7164j16168L5096p1967n7256J21120J61451K3377j563n7721J9562
$$ 272286 359450 243282 278378 206411 149155 270275 431726 455103 453540 395819 415381
2067D15381r6016o8078m8677J4892J02416Q3139j01143p1335K7821L1858r5971
$$ 415381 319365 251287 202610 217502 319918 403057 301914 230579 258400 290258 194287
2056A94287p4347M0574N261j70181O7985K2436K0198J25094Q9174n2931L8272
$$ 194287 119940 160514 165775 -4406 63579 86015 106213 231307 320481 267550 305822
2045C05822K7287j86732m0198j1758j76256M0458K4593J16932p1205N7153J39615
$$ 305822 333109 146377 106179 94421 -81835 -41377 -16784 100148 28943 86096 225711
2034B25711k8752o7109r8880p7693j0357J39164M2564L4578j65054k3546j22700
$$ 225711 196959 129850 30970 -46723 -57080 82084 124648 159226 -5828 -29374 -152074
2023a52074J27561K1181J08685J4764J4684j9570j15202n7843J43427R9638n8599
$$ -152074 -24513 -3332 105353 120117 134801 115231 29 -57814 85613 185251 126652
2012A26652q6201J27355l7667k6839k6431l6303K1507n3476r400l7466l0369N6961
$$ 126652 40451 167806 130139 103300 76869 40566 62073 8597 -803 -38269 -68638 -11677
2000a1677J8748L1547j29840l2601M4168J22475P3006N9587o4055j52763O754
$$ -11677 7071 38618 -91222 -123823 -79655 42820 115826 175413 111358 -41405 -34651
1989c4651o0167P2703J23476J93913q564j24823p1307p7300m7746J08930P788
$$ -34651 -94818 -22115 101361 295274 286710 161887 90580 13280 -34466 74464 82252
1978H2252K3610q1566n7204J0159j4173k2931J03253k6777L648p4462O2569j9891
$$ 82252 105862 24296 -32908 -22749 -36922 -59853 43400 16623 20271 -54191 8378 -11513
1966a1513p823J0937Q913K0517P74o3205J41969j11778J3188j4623L5735J08817
$$ -11513 -19336 -8399 514 21031 21805 -41400 100569 -11209 1979 -12644 23091 131908
1954A31908j29018l8875L5407l0801M679L2967l3955J81947M5349M3536j37073
$$ 131908 2890 -35985 -578 -31379 -26700 6267 -27688 154259 199608 243144 106071
1943A06071N918p8839j4635k6690N8535Q9184K1085q5518R2488M9784j06980n6839
$$ 106071 111989 33150 18515 -8175 50360 139544 160629 75111 167599 217383 110403 53564
1931E3564j0098k6972p1567q470O601m2717J4845J26197n560m3597K2700J5436
$$ 53564 43466 16494 -55073 -63543 -56942 -99659 -84814 41383 35823 -7774 14926 30362
1919C0362J9723L6478p46l7829k4094l7772R4101J44051j47165q6322j0958r044
$$ 30362 50085 86563 85817 47988 23894 -13878 80223 224274 77109 -9213 -20171 -29215
1907b9215m6877n7281q258J16841m1096j8273J55885n7944r6966K1912J11935
$$ -29215 -76092 -133373 -141631 -24790 -65886 -84159 71726 13782 -83184 -61272 50663
1896E0663J23990j05665J76060p9373j36852J4023p1671q8374k6907J69984p2227
$$ 50663 174653 68988 245048 165675 28823 42846 -28825 -117199 -144106 25878 -46349
1885d6349n7317k8534J23517j03872R6763K3344n7269Q3543N7610j32929J04151
$$ -46349 -103666 -132200 -8683 -112555 -15792 7552 -49717 33826 91436 -41493 62658
1874F2658J01434m6714p7975Q990N9509o3561L1107p5229o5931j0087J42954j51321
$$ 62658 164092 117378 39403 48393 107902 44341 75448 219 -65712 -75799 67155 -84166
1862h4166J60606j0951o7490J02927R5207o1083j11062L9367l1305p2051R6882
$$ -84166 76440 65489 -2001 100926 196133 135050 23988 63355 32050 -40001 56881
1851E6881p7540l5489L222R352o0345N4595J53261k9770l0088L3965l4845p4075
$$ 56881 -20659 -56148 -52926 -43574 -103919 -49324 103937 74167 44079 78044 43199 -30876
1839c0876M5252j24534r2915P4386J60444o7049J69127j07340o3660r4005Q0011
$$ -30876 14376 -110158 -203073 -128687 31757 -35292 133835 26495 -37165 -131170 -51159
1828e1159M1365j12714R1906N8978k5956L8876l626n9325J3393l3279R3397m6595
$$ -51159 -9794 -122508 -30602 28376 2420 41296 37670 -21655 -8262 -41541 51856 5261
1816E261j3710K9697J17587q2031j15372O1216j22988J01991L9208j3839J4989
$$ 5261 -8449 21248 138835 56804 -58568 2648 -120340 -18349 20859 7020 22009
1805B2009q0178j07831K343R1089j2712k268o2881O4918p1067P1356P4028j04329
$$ 22009 -58169 -166000 -163657 -72568 -85280 -87548 -150429 -85511 -156578 -85222 -11194 -115523
1793a15523L7979J07570J38095k0388k11608m7019M2648J18846J4510o9612m1944
$$ -115523 -77544 30026 168121 147733 -63875 -110894 -68246 50600 65110 -4502 -46446
1782d6446M1750J31913n8525l1054n7531K6812m0877n764l9811j10081J26915
$$ -46446 -4696 127217 68692 37638 -19893 6919 -33958 -39722 -79533 -189614 -62699
1771f2699m0068o4316Q7211M1041J4093p35O541n5996j54319Q5182J55303j6593
$$ -62699 -102767 -167083 -79872 -38831 -24738 -25473 -18932 -74928 -229247 -144065 11238 -5355
1759e355p965j78845R0321J42033j98132K7760N1306j6650M2500J07818L6767
$$ -5355 -13320 -192165 -101844 40189 -157943 -130183 -78877 -95527 -53027 54791 91558
1748I1558r2838R5773p4014j33542L8232o9756k3009J30856L9268M272j3577j6803
$$ 91558 -1280 94493 20479 -113063 -74831 -144587 -167596 -36740 2528 6800 -6777 -23580
1736b3580J2932k9957Q3575q925l6601J32251j07474m0186k2357o8195J41473
$$ -23580 -10648 -40605 42970 34045 -2556 129695 22221 -17965 -40322 -108517 32956
1725C2956j5245P3768k2813j10402k3756K1795p149O569m6853P7527L8196m0455
$$ 32956 17711 91479 68666 -41736 -65492 -43697 -50846 -44277 -91130 -13603 24593 -15862
1713a5862m5927k7253J32444m8420n3424N5727J47J37474K6707r7772K0859o6321
$$ -15862 -61789 -89042 43402 -5018 -58442 -2715 -2568 134906 161613 63841 84700 18379
1701A8379j9070j6216J7074j3910L7523N0253L6836k8994r7910l2322K3352m833
$$ 18379 -691 -16907 167 -13743 23780 74033 110869 81875 -16035 -48357 -25005 -29838
1689b9838j06923O0474j6398j07725R7076K8333p6788J28552m259n6808J7751
$$ -29838 -136761 -76287 -92685 -200410 -103334 -75001 -151789 -23237 -27496 -84304 -66553
1678f6553M2591l7228m6811R7394k2719q5608N468J4531M3575J07243j14280l9750
$$ -66553 -23962 -61190 -108001 -10607 -33326 -118934 -113466 -98935 -55360 51883 -62397 -102147
1666a02147K9141J09711q8740j07985K9590M2292P5624J4574n0677n1289J31678
$$ -102147 -73006 36705 -52035 -160020 -130430 -88138 -12514 2060 -48617 -99906 31772
1655C1772r2837O3114l6687P8646J02364j21006j8788P6604p277r0279Q34N8487
$$ 31772 -61065 2049 -34638 44008 146372 25366 6578 83182 75905 -14374 -13540 44947
1643D4947N2413j56599J5179J154L8529k8770Q1332k1086K1234J1521j7614K1541
$$ 44947 97360 -59239 -44060 -42906 -4377 -33147 48185 27099 48333 59854 42240 63781
1631F3781j64413N8261J01187j2467o2726l058O1597r8007m3175j03564J7833
$$ 63781 -100632 -42371 58816 46349 -16377 -19435 42162 -55845 -99020 -202584 -184751
1620a84751J3713j5824J71265l6191j09061J3092J50538m1272M7726j0676Q7939
$$ -184751 -171038 -186862 -15597 -51788 -160849 -147757 2781 -38491 9235 -1441 86498
1609H6498J372n2747j047n4209m5046L0908p3095n2909P6929j3187N7042R5659
$$ 86498 87870 35123 34076 -20133 -65179 -34271 -107366 -160275 -83346 -96533 -39491 56168
1597E6168j18572j18424R8797m8708M8280J48372j673n5757q5227j08138O5194
$$ 56168 -62404 -180828 -82031 -130739 -82459 65913 64240 8483 -76744 -184882 -119688
1586a19688m3939k0203K2554L6001N4225l5240L0962J33573j40129K8472q6190
$$ -119688 -163627 -183830 -161276 -125275 -71050 -106290 -75328 58245 -81884 -53412 -139602
1575a39602M6954L9362M0376N7614r1736R8723n4243m6920O3353m5710m6321j6782
$$ -139602 -92648 -53286 -12910 44704 -47032 51691 -2552 -49472 13881 -31829 -78150 -94932
1563i4932K674J74919J8542j19217k11507N4346J19328J11715j47484k4287p7795
$$ -94932 -92258 82661 101203 -18014 -229521 -175175 -55847 55868 -91616 -115903 -193698
1552a93698K0300J59744K1905n9720j6033o0667L6449P0284q5297Q1698M3792
$$ -193698 -173398 -13654 8251 -51469 -67502 -128169 -91720 -21436 -106733 -25035 18757
1541A8757j28451L0721L7634L9777k3725j10907O2768K05506j21541j47030N9604
$$ 18757 -109694 -78973 -41339 -1562 -25287 -136194 -73426 132080 10539 -136491 -76887
1530g6887M7880n4232j0815J1000P0397M33j23191J14731K5188j05556j49674
$$ -76887 -29007 -83239 -94054 -83054 -12657 -12224 -135415 -20684 4504 -101052 -250726
1519b50726J8124k7713N209O5043J68852l8881r4566Q2367n881m3615l3565k1232
$$ -250726 -232602 -260315 -255106 -190063 -21211 -60092 -154658 -72291 -78172 -121787 -155352 -176584
1507a76584J58854M21j87690q5213J60106k2666R7131J18151k3656O4623o5548
$$ -176584 -17730 -17309 -204999 -290212 -130106 -152772 -55641 62510 38854 103477 37929
1496C7929j06331J12584M5990l1377o6137L3358j39084j3192J44341L6016j65363
$$ 37929 -68402 44182 90172 58795 -7342 26016 -113068 -126260 18081 54097 -111266
1485a11266J3804Q2640N4578j0033j22791J7427k3125o0240k0911J34607m5975
$$ -111266 -97462 -14822 39756 29723 -93068 -75641 -98766 -159006 -179917 -45310 -91285
1474i1285K5664j08897N4228Q3610o1716o4513O8454P5865M6791M2215j09082
$$ -91285 -65621 -174518 -120290 -36680 -98396 -162909 -94455 -18590 28201 70416 -38666
1463c8666r7044m2601Q5011O0972p927R9578o9588M3107j59369l3688j0366L9786
$$ -38666 -135710 -178311 -93300 -32328 -40255 59323 -10265 32842 -126527 -160215 -170581 -130795
1451a30795J79134j42293m3642r198J03906r0713M1697J13653J3833O9189j03082
$$ -130795 48339 -93954 -137596 -146794 -42888 -133601 -91904 21749 35582 104771 1689
1440A689N9193J26805j16749r3379J4089n2585M5214O230j01474q5605J2846O8808
$$ 1689 60882 187687 70938 -22441 -8352 -60937 -15723 -9493 -110967 -196572 -183726 -114918
1428a14918J2917L8288j7619l0648n2219l883N7886j0133J6828K8086k0643j11758
$$ -114918 -102001 -63713 -81332 -111980 -164199 -168082 -110196 -120329 -103501 -75415 -96058 -207816
1416b07816k0515J31838o0833j6239Q1580L6946O4090p4218J5223k6390j78889
$$ -207816 -228331 -96493 -157326 -173565 -91985 -55039 9051 -65167 -49944 -76334 -255223
1405b55223K5388J18066J7622J10377l3494L2829Q2959j03537j24913O9392K2014
$$ -255223 -229835 -111769 -94147 16230 -17264 15565 98524 -5013 -129926 -60534 -38520
1394c8520r2818p258J11521L4063q8077J09507p4456q2137O9177j1190Q2481k1827
$$ -38520 -131338 -138596 -27075 6988 -81089 28418 -46038 -128175 -58998 -70188 12293 -9534
1382i534K5194N2917j9046o623m6094j04641l3901r6233K1990J16259N3558J085
$$ -9534 15660 68577 49531 42908 -3186 -107827 -141728 -237961 -215971 -99712 -46154 -45069
1370d5069M2414R0675j30848J0633o4994O900J7073J17842j13946m3474J39981
$$ -45069 -2655 88020 -42828 -32195 -97189 -90289 -73216 44626 -69320 -112794 27187
1359B7187j94018k7979M911J03113K01517K2255j64390j8354p5676r2370R5950
$$ 27187 -166831 -194810 -189899 -86786 114731 136986 -27404 -45758 -121434 -213804 -117854
1348a17854J01059n8225j30963Q0149J4974J34455p5147j4151l9248J2657M040
$$ -117854 -16795 -75020 -205983 -125834 -110860 23595 -51552 -65703 -104951 -92294 -88254
1337h8254j98773J53374J21662o7024L0364l6788J57215M6509j81254r4937j9910
$$ -88254 -287027 -133653 -11991 -79015 -48651 -85439 71776 118285 -62969 -157906 -177816
1326a77816l4254Q4686l1409N5798K2429l2525O994k02937J67666J69878L2433
$$ -177816 -212070 -127384 -158793 -102995 -80566 -113091 -106097 -309034 -141368 28510 60943
1315F0943k1378q8253n0324j0636J13692m8654n7676R5709j16180o4460J25327
$$ 60943 39565 -48688 -99012 -109648 4044 -44610 -102286 -6577 -122757 -187217 -61890
1304f1890R9091j81099K9672P1140n2186J3866R0462j09173M5923J23925q2693
$$ -61890 37201 -143898 -114226 -43086 -95272 -81406 9056 -100117 -54194 69731 -12962
1293a2962o7454J055J2623n2008N5607l8925j08274O0270Q2431p3882o7284J86114
$$ -12962 -80416 -79361 -66738 -118746 -63139 -102064 -210338 -150068 -67637 -141519 -208803 -22689
1281b2689L4423r2469M4904j3514k2613N9564Q1525j60797j10858K50902j12257
$$ -22689 11734 -80735 -35831 -49345 -71958 -12394 69131 -91666 -202524 48378 -63879
1270f3879P3607j4940n4319n2924j9298J99673k40679j2097N6957N7140L2079
$$ -63879 9728 -5212 -59531 -112455 -131753 67920 -172759 -184856 -127899 -70759 -38680
1259c8680K6752Q848P4767l5664j02421k8421O5772O7952j44808p2980K3357J30104
$$ -38680 -11928 -3080 71687 36023 -66398 -94819 -29047 38905 -105903 -178883 -155526 -25422
1247b5422L4298N6980M1575r7901L756o5216p6916q1407R3515j7424M4297M361
$$ -25422 8876 65856 107431 9530 13286 -51930 -128846 -210253 -116738 -134162 -89865 -85504
1235h5504J9180K808l2934k2764J0624Q5630m1887M4649j15548R0868R3201n1653
$$ -85504 -66324 -63516 -96450 -119214 -108590 -22960 -64847 -20198 -135746 -44878 48323 -3330
1223c330o844n503J7885j1345L7628N3751R180j27359m005j50622k7981K32200
$$ -3330 -10174 -15677 2208 -9137 28491 82242 91422 -35937 -39942 -190564 -218545 13655
1211A3655O6071l0798p1993n9569l4825P4451o9935J3235j41724K9280Q0575N4471
$$ 13655 79726 48928 -23065 -82634 -117459 -43008 -112943 -99708 -241432 -212152 -131577 -77106
1199g7106j2158q2311K2683K3545K5793o8264l5082Q9998J86992l2004l0177j72696
$$ -77106 -89264 -171575 -148892 -125347 -99554 -167818 -202900 -112902 74090 42086 11909 -160787
1187a60787j29927J19931P0888q4505L7680J65902j07625J1889p068l8166Q7599
$$ -160787 -290714 -170783 -99895 -184400 -146720 19182 -88443 -76554 -83622 -121788 -34189
1176c4189J2811n667L7357k6230j57491n7106M2777O0902N3623J68843k06997
$$ -34189 -21378 -27045 10312 -15918 -173409 -230515 -187738 -126836 -73213 95630 -111367
1165a11367L0388N26j14357J6777J62179J07979r1741M2012o4827j88432O0137
$$ -111367 -80979 -80453 -194810 -178033 -15854 92125 384 42396 -22431 -210863 -150726
1154a50726L4371j2563Q6328P3081p0750j14483J44096m4638L3636N6833J26287
$$ -150726 -116355 -128918 -42590 30491 -40259 -154742 -10646 -55284 -21648 35185 161472
1143A61472j91735o5248o1603Q5825M6924j7801J03408M3879j52328N9455M1715
$$ 161472 -30263 -95511 -157114 -71289 -24365 -42166 61242 105121 -47207 12248 53963
1132E3963r2934K7057m8440J10013L1948k1519n299q14j4713k5038m2836J1550
$$ 53963 -38971 -11914 -60354 49659 81607 60088 54789 53975 39262 14224 -28612 -17062
1120a7062r6660N8939j17382o7401J58674M8388p7660J25467o2698r4952M7889
$$ -17062 -113722 -54783 -172165 -239566 -80892 -32504 -110164 15303 -47395 -142347 -94458
1109i4458P0711O099J5826o2682Q5705K6390q8032J4962L7713k9486k0956m0569
$$ -94458 -23747 -17648 -1822 -64504 21201 47591 -40441 -25479 12234 -17252 -38208 -78777
1097g8777p1751L8473l4020L4441K3828L1211j3425k996n301N0874N7693J3819
$$ -78777 -150528 -112055 -146075 -111634 -87806 -56595 -70020 -73016 -78317 -27443 30250 44069
1085D4069m6826n0364K8121N7140l8348n5578q776J10102j9684r1898L1414l6751
$$ 44069 -2757 -53121 -25000 32140 -6208 -61786 -70562 39540 19856 -72042 -40628 -77379
1073g7379M7219K3206j34413J02719L439l1031Q9504M1721Q3349j18153j27542
$$ -77379 -30160 -6954 -141367 -38648 -35209 -66240 23264 64985 148334 30181 -97361
1062i7361J626m4242p664Q0342L5511n8131j7095N2697N4258m6074R1448o3620
$$ -97361 -95735 -139977 -147641 -67299 -31788 -89919 -107014 -54317 -59 -46133 45315 -18305
1050a8305O4104M8008m3383q2378l2847n4890j0901P2756o768n0503J02663K1265
$$ -18305 45799 93807 50424 -31954 -64801 -119691 -130592 -57836 -64604 -115107 -12444 8821
1038H821M5861M1959j23207n6663k6942R6534j0732k9175M7711j5544j41126J20636
$$ 8821 54682 96641 -26566 -83229 -110171 -13637 -24369 -53544 -5833 -21377 -162503 -41867
1026d1867O5452j13255l4743Q0921k8820L8728O1628j06182j44284j06833L0585
$$ -41867 23585 -89670 -124413 -43492 -72312 -33584 28044 -78138 -222422 -329255 -298670
1015b98670P3323Q7158j4501r1318J64513J2428M5589N7018J9431r1794l5799
$$ -298670 -225347 -138189 -152690 -244008 -79495 -67067 -21478 35540 54971 -36823 -72622
1004g2622p4523q5808J88709K2045m4406J46625O0560R4842k1324j10072p1368
$$ -72622 -147145 -232953 -44244 -22199 -66605 80020 140580 235422 214098 104026 32658
993C2658J5067N993o6054j04494J9023K2422K4775L4920l5875j54405m1187O5775
$$ 32658 47725 53718 -12336 -116830 -97807 -75385 -50610 -15690 -51565 -205970 -247157 -181382
981a81382J53744r550j191j6245q5997P2587Q4463O8587p3328j20696p8358M2859
$$ -181382 -27638 -37188 -38379 -54624 -140621 -68034 16429 85016 11688 -109008 -187366 -144507
969a44507N0870Q4822L4325N7363o2391k4223n0160R8543M5420j26784o1346O0583
$$ -144507 -93637 -8815 25510 82873 20482 -3741 -53901 44642 90062 -36722 -98068 -37485
957c7485j04749J3833M8871M4386J1228j0161j2847N5671P3706j07330M4615L3532
$$ -37485 -142234 -128401 -79530 -35144 -23916 -34077 -46924 8747 82453 -24877 19738 53270
945E3270K0685K3405q9299o5633p2483L9959J35995J16217q8833j05375q637j8290
$$ 53270 73955 97360 8061 -57572 -130055 -90096 45899 162116 73283 -32092 -40729 -59019
933e9019n8681L8984Q8759M2175j10272O6438J14837o153j56587L7470o2185m7284
$$ -59019 -117700 -78716 10043 52218 -58054 8384 123221 117068 -39519 -2049 -64234 -111518
921a11518P4240M0810n8011q9373N4035n20M89n9049Q2325J00758q0413k1382
$$ -111518 -37278 3532 -54479 -143852 -89817 -90337 -89848 -148897 -66572 34186 -46227 -67609
909f7609K2108n4854Q8369K3475M5515j20189Q9620q2350j0360l700j8470J15069
$$ -67609 -45501 -100355 -11986 11489 57004 -63185 26435 -55915 -66275 -69975 -88445 26624
897B6624j7314m547j0822m8137l629M2444j22616o8950J39606J46756j01843j23469
$$ 26624 9310 4763 -6059 -54196 -57825 -15381 -137997 -206947 -67341 79415 -22428 -145897
885a45897J05869r9284j8092N0542q18M7959Q4139j2196n2359q92l9148K2766
$$ -145897 -40028 -139312 -157404 -106862 -107680 -59721 24418 12222 -40137 -41029 -80177 -57411
873e7411M4082J23660j32652p8870J9387P6135n5106o2763J60565L527P385l6668
$$ -57411 -13329 110331 -22321 -101191 -81804 -5669 -60775 -123538 37027 40554 47939 11271
861A1271M014j0293j61547M2038Q7189j0481R2082K7194j811j58096m3838p0354
$$ 11271 15285 4992 -156555 -114517 -27328 -37809 54273 81467 79656 -78440 -122278 -192632
849a92632J0372J50975J50484R2248k01116p750n9199j9784J3671p4237O2732
$$ -192632 -182260 -31285 119199 211447 10331 2581 -56618 -76402 -62731 -136968 -74236
838g4236k6143J6736m0811n687J58520J93648l6735k69729J08316m2692P800r1583
$$ -74236 -100379 -83643 -124454 -130141 28379 222027 185292 -84437 23879 -18813 -11013 -102596
826a02596r9862Q8188Q4277k2817k8472P8283j27521Q3964Q7363M365k3898k6061
$$ -102596 -202458 -114270 -29993 -52810 -81282 -2999 -130520 -46556 40807 45172 21274 -4787
814d787n9582J25933J02118j63990O5718j01970j16698K1024J3841J17347P1642
$$ -4787 -64369 61564 163682 -308 65410 -36560 -153258 -132234 -118393 -1046 70596
803G0596n0433j7551j19352R608J56169M5392j48767r584N5738j7355P7364o1221
$$ 70596 20163 2612 -116740 -107132 49037 94429 -54338 -63922 -8184 -25539 51825 -9396
791i396l8655k7493O4214q1339J69728l1549r3239O5050l8781R9702J5951j81338
$$ -9396 -48051 -75544 -11330 -92669 77059 45510 -47729 17321 -21460 78242 94193 -87145
779h7145j3905m5602P7671M2033J14736o7490j45204R0725J4726N7329N1146M6845
$$ -87145 -101050 -146652 -68981 -26948 87788 20298 -124906 -34181 -19455 37874 89020 135865
767A35865p0194q9512L2191M853n2151J08506Q253p8312j8709P8441j6341M4164
$$ 135865 65671 -23841 8350 13203 -38948 69558 77811 -501 -19210 59231 42890 87054
755H7054M2720q4991m9808K7464j15976R3807N9729o8488j21642J00779L9598
$$ 87054 129774 44783 -5025 22439 -93537 270 59999 -8489 -130131 -29352 10246
744A0246j81831J43681K9431j18918Q2103m8170J21858J2325r1438M4168r6557
$$ 10246 -171585 -27904 1527 -117391 -35288 -83458 38400 50725 -40713 3455 -93102
733i3102J2030j2818r435R8244o0375L0167P1250J11618n382o5429L0049r7243
$$ -93102 -81072 -93890 -103325 -5081 -65456 -35289 35961 147579 142197 76768 106817 9574
721I574l9100J1767J02130n6910j05789R6962O551P7190P1897j4987j56913j44404
$$ 9574 -29526 -17759 84371 27461 -78328 18634 25185 102375 174272 159285 2372 -142032
709a42032k0593K7892K6852J14899O3934j0737j15183j593M0522J7020J54531
$$ -142032 -162625 -134733 -107881 7018 70952 60215 -54968 -56561 -16039 981 155512
698A55512p2684j61622q587Q2398o4241k1336P5854K5930k0293J00848j04876
$$ 155512 82828 -78794 -87381 -4983 -69224 -90560 -14706 11224 -9069 91779 -13097
687a3097p9534l4574o2604q6978J21252P6286Q545M6210j02203j47951J93952
$$ -13097 -92631 -127205 -189809 -276787 -155535 -79249 -70704 -24494 -126697 -274648 -80696
676h0696J87480l8641j35151O3846q2606k7253j5242O5694n3823J2269j35280
$$ -80696 106784 68143 -67008 -3162 -85768 -113021 -128263 -62569 -116392 -104123 -239403
665b39403Q1642K21831J4415N889J4938l08065p5736J74050j14441J38879R899
$$ -239403 -157761 64070 78485 84374 99312 -208753 -284489 -110439 -224880 -86001 -76102
654g6102j5537J10662J15478j58759j4149J76820K8996r0161n7012R974O688j48724
$$ -76102 -91639 19023 134501 -24258 -38407 138413 167409 77248 20236 30210 36898 -111826
642a11826K1165P6196J34320K3326j8763m2120P9042j5314p8852r2324l4833J03204
$$ -111826 -90661 -14465 119855 143181 124418 82298 161340 146026 67174 -25150 -59983 43221
630D3221J7777p8650n833o7004r6327M2359J38716m1635J38776j28704Q5761O0220
$$ 43221 60998 -17652 -23485 -90489 -186816 -144457 -5741 -47376 91400 -37304 48457 108677
618A08677J02266L0483R751q5896j20966J6017j08655Q0439M4133n91P1920J1745
$$ 108677 210943 241426 251177 165281 44315 60332 -48323 32116 76249 75658 147578 159323
606A59323q5756n4192K18177j2133j19495Q1436o0773p7252j67081J79348m9431
$$ 159323 73567 19375 237552 225419 105924 187360 126587 49335 -117746 61602 12171
595A2171j26444J17997Q390N337Q7391N8241o3166J6768k7232j19427N7618L428
$$ 12171 -114273 3724 12114 17451 104842 163083 99917 116685 89453 -29974 27644 31072
583C1072K3617j03179R906R0714M0602l9372k0099j3979K3722O377M1468o4507
$$ 31072 54689 -48490 -38584 52130 92732 53360 33261 19282 43004 49381 90849 26342
571B6342j15575J13941R1087j32898J7646k7711J33121k8645O3074j65264j05375
$$ 26342 -89233 24708 115795 -17103 543 -27168 105953 77308 140382 -24882 -130257
560a30257K42925l5804o9940n8063Q28M6216J5758j04763J90061j07282N563Q0522
$$ -130257 112668 76864 6924 -51139 -50311 -4095 11663 -93100 96961 -10321 -4758 75764
548G5764j01479K4858O8723J5692p2911n2052J4942n953O557R5569j30186r4124
$$ 75764 -25715 -857 67866 83558 10647 -41405 -26463 -32416 -25859 69710 -60476 -154600
536a54600O4669o030J6099J66958j32760L9011J56115k5073q8190k6451J37545
$$ -154600 -89931 -95961 -79862 87096 -45664 -6653 149462 124389 36199 9748 147293
525A47293n0183l3867k6459n9355K4114m5462M2685K8292n180r8327O1799J20467
$$ 147293 97110 63243 36784 -22571 1543 -43919 -1234 27058 21878 -76449 -14650 105817
513A05817l9337k53813L328J87947R350M3945p3339J52276P9171J6205r8924k6798
$$ 105817 66480 -187333 -184005 3942 13292 57237 -16102 136174 215345 231550 132626 105828
501A05828l7063j20588n4015L8111M4428k6119K2665J56072k8365j02298l9192
$$ 105828 68765 -51823 -105838 -67727 -23299 -49418 -26753 129319 100954 -1344 -40536
490d0536K2079K609N0052o4754j53662J37955R1500j12894j33800P6421K8250
$$ -40536 -18457 -15848 34204 -30550 -184212 -46257 45243 -67651 -201451 -125030 -96780
479i6780m3539R5125L2231n4480k9939j1795M4285J1471R557l443K3355p0666
$$ -96780 -140319 -45194 -12963 -67443 -97382 -109177 -64892 -53421 -43864 -47307 -23952 -94618
467i4618j6100J35085J764j43492N6916K2176k2619O0544p8877J3910P2683Q7378
$$ -94618 -110718 24367 26131 -117361 -60445 -38269 -60888 -344 -79221 -65311 7372 94750
455I4750r0534M1876J1051q4438o8361J1792j9785l0970P1380N9030K1202J16075
$$ 94750 4216 46092 57143 -27295 -95656 -83864 -103649 -134619 -63239 -4209 16993 133068
443A33068j06298n7413O2488M351j6K6953m2860o9575J1552p0069N8850K1359
$$ 133068 26770 -30643 31845 36196 36180 63133 20273 -49302 -37750 -107819 -48969 -27610
431b7610K4753n9577k5535q1263L8282M9234O7949l6017o2728R6810K1608m5619
$$ -27610 -2857 -62434 -87969 -169232 -130950 -81716 -13767 -49784 -112512 -15702 5906 -39713
419c9713q907q200Q3867K478j08984J12446j70000m836J66892p814M5602J7517
$$ -39713 -48620 -56820 27047 29525 -79459 32987 -137013 -141849 25043 17229 62831 80348
407H0348r7630J35247M3472o5120l060n5741m5932p820q863J66793m4370k6583
$$ 80348 -17282 117965 161437 96317 93257 37516 -8416 -16236 -25099 141694 97324 70741
395G0741j13205j26495J35244M1619m0569J6647R9977R5456J07430j48342O8812
$$ 70741 -42464 -168959 -33715 7904 -32665 -16018 83959 179415 286845 138503 207315
384B07315m8976l0519k2900O3523q7969r0252L8701n9202J1936J83253N1018m4610
$$ 207315 158339 127820 104920 168443 80474 -9778 28923 -30279 -18343 164910 215928 171318
372A71318j38923L5959R6034o4858n3505l5717Q2400m3864j565J54675j10376
$$ 171318 32395 68354 164388 99530 46025 10308 92708 48844 47279 201954 91578
361I1578q264j24949j35744O6089L1823m00J62936J14103r3542J6073j34371L2854
$$ 91578 83314 -41635 -177379 -111290 -79467 -79867 83069 197172 103630 119703 -14668 18186
349A8186M200j05017K2846J4092J34876k9489M2075r634k40956o9533J43391K08531
$$ 18186 22386 -82631 -59785 -45693 89183 59694 101769 92135 -148821 -218354 -74963 133568
337A33568P100R3446p0695o7803O7091k93j43486l4982j724O1807J78199J6935
$$ 133568 140668 234114 163419 95616 162707 162414 18928 -16054 -17778 44029 222228 239163
325B39163j64123m9362J04225r08n080k9873P8962O6255l7368r6798N029K2378
$$ 239163 75040 25678 129903 128995 123915 94042 173004 239259 201891 105093 110122 132500
313A32500n2564L4032P168n7145l0803J15722K7763r0367J71560l1387n0872J92539
$$ 132500 79936 113968 121136 63991 33188 148910 176673 86306 257866 226479 175607 368146
301C68146k30876j39613m4229R6326n8793m0297k4906P7514j1193L3439n617R3967
$$ 368146 137270 -2343 -46572 49754 -9039 -49336 -74242 3272 -7921 25518 19901 113868
289A13868M6146j12050j49332K1013k2874l5100J36860J26361K9072k80523N4298
$$ 113868 160014 47964 -101368 -80355 -103229 -138329 -1469 124892 153964 -126559 -72261
278g2261k5169L5514J78789N384q2907N1112j32185J07607q654J1549k0711m314
$$ -72261 -97430 -61916 116873 122257 39350 90462 -41723 65884 57230 68779 48068 43754
266D3754J00958m1077o6709N5033M995J00386j97444p6816O5469O3716K4195L552
$$ 43754 144712 103635 36926 91959 96954 197340 -104 -76920 -11451 52265 76460 80012
254H0012L4679k9421n8337J5715K6958n7175L6711l1656o6043Q698L8305p6055
$$ 80012 114691 85270 26933 42648 69606 12431 49142 17486 -48557 -39859 -1554 -77609
242g7609M0688K7600J74488m4812K6419k0076l8886k54K0189p8772P4718P7097
$$ -77609 -36921 -9321 165167 120355 146774 126698 87812 87558 107747 28975 103693 180790
230A80790r8769K5182n7363N6716K4494j40998O0179j17062P2417P6344n3106
$$ 180790 82021 107203 49840 106556 131050 -9948 50231 -66831 5586 81930 28824
219B8824p8485n4948O9495L1535M8716L9208o8326l0435k9211P6039j7946k8286
$$ 28824 -49661 -104609 -35114 -3579 45137 84345 16019 -14416 -43627 32412 14466 -13820
207a3820j9722M1944K2079R1868M3022k22310N8004J33505M2549o2443N6893N3253
$$ -13820 -33542 8402 30481 122349 165371 -56939 1065 134570 177119 114676 171569 224822
195B24822j39210l9441r3410J5648P9670O7844R9256r1617K5463K4409n667P3346
$$ 224822 85612 46171 -47239 -31591 48079 115923 215179 123562 149025 173434 167767 241113
183B41113p3139O3542l9749j56594R6894o3305K474m966l6278J30260M0057J16679
$$ 241113 167974 231516 191767 35173 132067 68762 71236 66270 29992 160252 200309 316988
171C16988J1194j32674p4129j24117P8219p0851L072O3920K9762m0636j3580r3799
$$ 316988 328182 195508 121379 -2738 75481 4630 7702 71622 101384 60748 47168 -46631
159d6631M3322P351m7025N2115Q4282n5136p0170m0273J06449m2947J4290J3227
$$ -46631 -3309 4042 -42983 9132 93414 38278 -31892 -72165 34284 -8663 5627 18854
147A8854L0767k7600q0963O1824O6660M5050n4007N7850j0001j42651m8146P1891
$$ 18854 49621 22021 -58942 2882 69542 114592 60585 118435 108434 -34217 -82363 -10472
135a0472O6174m4478Q2821N498n283J10831j8133k9843K1417k4107p7480q80Q811
$$ -10472 55702 11224 94045 99543 94260 205091 186958 157115 178532 154425 76945 76065 84876
122H4876n7010n9614R4987J31719O6177j57653q7351J1963Q7459Q6305m2008j49693
$$ 84876 27866 -31748 63239 194958 261135 103482 16131 28094 115553 201858 159850 10157
110A0157p2173J8540J07238j08932Q9936P3025j15902n2956Q1031M2827p3500
$$ 10157 -62016 -43476 63762 -45170 44766 117791 1889 -51067 29964 72791 -709
99g09N2876l2763j25701n426J21908K361J08633r5758k5015O8017L4251N197n026
$$ -709 52167 19404 -106297 -111723 10185 12546 121179 25421 406 68423 102674 107871 102845
86A02845m987J8815J3860j14301l5398k4259R3918r9107J35152q965k1195r939
$$ 102845 97858 116673 130533 16232 -19166 -43425 50493 -48614 86538 77573 56378 46439
74D6439j7667J5037j7012k4418J8715J271m0667k1178k9670M6228J8825K3737
$$ 46439 28772 43809 26797 2379 21094 22365 -18302 -39480 -69150 -22922 -4097 19640
62A9640m6316Q1263J54876j06304j20967R4803L7625n1380l7512J19014M3168
$$ 19640 -26676 54587 209463 103159 -17808 76995 114620 63240 25728 144742 187910
51A87910k0431q3200M4394q228k5756l1085m8730L2498l5095O018r302L9446K1617
$$ 187910 167479 84279 128673 120445 94689 63604 14874 47372 12277 18295 8993 48439 70056
38G0056Q2101o0931N1640m0880l7544k8917P1790K1022m0801k1983J2686O715
$$ 70056 152157 91226 142866 101986 64442 35525 107315 128337 87536 65553 78239 84954
26H4954P214o0145l5863Q1406k1979k666O5488l9536o0494m9471O1178M6302n8984
$$ 84954 92168 32023 -3840 77566 55587 52921 118409 78873 18379 -31092 30086 76388 17404
13A7404l5123P388K923K7104M1345j2026R0465n4856m4119L5388k0738j4764K8155
$$ 17404 -17719 -10331 -7408 19696 61041 49015 139480 84624 40505 75893 55155 40391 68546
0F8546
$$ 68546
$$ Imaginary data points
##PAGE= N=2
##DATA TABLE= (X++(I..I)), XYDATA
16383d766650J70688J00964p4941L8063J23089P4453J6214J67678J25639J28856
$$ -4766650 -4595962 -4494998 -4569939 -4531876 -4408787 -4334334 -4318120 -4150442 -4024803 -3895947
16373c895947J08072O3077K2302n1402Q3244J95648J00387n240J26017M8721N6381
$$ -3895947 -3787875 -3724798 -3702496 -3753898 -3670654 -3475006 -3374619 -3379859 -3253842 -3205121 -3148740
16362c148740M2026R9133N7094J1320P4471J45742J10431N1429M6006K593L8402
$$ -3148740 -3106714 -3007581 -2950487 -2939167 -2864696 -2718954 -2608523 -2557094 -2511088 -2508495 -2470093
16351b470093J46543O2993M0662N4050Q9834M2694N6345J85525P5879j9124N4894
$$ -2470093 -2323550 -2260557 -2219895 -2165845 -2076011 -2033317 -1976972 -1791447 -1715568 -1734692 -1679798
16340a679798K9167J55334J1464J92499J1074j1525P5131J47685L7596J3853P0287
$$ -1679798 -1650631 -1495297 -1483833 -1291334 -1280260 -1291785 -1216654 -1068969 -1031373 -1017520 -947233
16329i47233J15967Q6588Q497J23866L0174O0001K4167R7012R7216M0636P1523
$$ -947233 -831266 -744678 -736181 -612315 -582141 -522140 -497973 -400961 -303745 -263109 -191586
16318a91586J82340M7844j7684J8541r902J48059J14141M8507Q8117J33702M5881
$$ -191586 -9246 38598 20914 39455 29553 177612 291753 340260 428377 562079 607960
16307F07960P2j0663J06359J34369M2851l3925L7378P8374J36686N1414Q8410
$$ 607960 608032 597369 703728 838097 880948 847023 884401 962775 1099461 1150875 1239285
16296A239285L8310O4643k3956M3465J28888O1434J42714k9442M4213M2486p5099
$$ 1239285 1277595 1342238 1318282 1361747 1490635 1552069 1694783 1665341 1709554 1752040 1676941
$$ [...]
##END NTUPLES=NMR SPECTRUM
##END=
