##TITLE=1H_CA-9392-2
 200.13MHz,CDCl3,
 8 sc
 
 1.11.2025
##JCAMPDX= 6.0         $$ Bruker NMR JCAMP-DX V2.0
##DATA TYPE= NMR SPECTRUM
##DATA CLASS= NTUPLES
##ORIGIN= UXNMR, Bruker Analytische Messtechnik GmbH
##OWNER= pz
$$ XWIN-NMR		Version 3.5
$$ Sat Nov  1 13:45:54 2025 Russian Standard Time (UT+4h)  she@DPX200
##.OBSERVE FREQUENCY= 200.1313
##.OBSERVE NUCLEUS= ^1H
##.ACQUISITION MODE= SIMULTANEOUS
##.ACQUISITION SCHEME= undefined
##.AVERAGES= 8
##.DIGITISER RES= 18
##SPECTROMETER/DATA SYSTEM= spect
##.PULSE SEQUENCE= zg30
##.SOLVENT NAME= CDCl3
##.SHIFT REFERENCE= (INTERNAL, CDCl3, 0, 15.4615)
##AUDIT TRAIL= $$ (NUMBER, WHEN, WHO, WHERE, WHAT)
$$ ##TITLE= Audit trail, XWIN-NMR		Version 3.5
$$ ##JCAMPDX= 5.01
$$ ##ORIGIN= Bruker BioSpin GmbH
$$ ##OWNER= she
$$ F:/spectra/data/she/nmr/H-C/1/pdata/1/auditp.txt
$$ ##AUDIT TRAIL=  $$ (NUMBER, WHEN, WHO, WHERE, WHAT)
(   1,<2025-11-01 13:44:34.60 +0400>,<she>,<DPX200>,
      <created by zg, POWCHK disabled, PULCHK disabled
       configuration hash MD5:
       00 E9 B6 7A A2 85 ED C7 34 08 36 98 17 FE 4E 26
       data hash MD5: 16K
       9B E7 C9 45 17 B4 9A 6A FE 76 6D 08 B1 33 95 7C>)
(   2,<2025-11-01 13:44:36.70 +0400>,<she>,<DPX200>,
      <Start of raw data processing
       efp BC_mod = 2 LB = 0.25 FT_mod = 6 PKNL = 1 PHC0 = -2787.088 PHC1 = 11.19235 SI = 16K 
       data hash MD5: 16K
       5C 58 05 B9 71 BF 3D A7 10 F0 3E 7D 8C 29 EF CB>)
(   3,<2025-11-01 13:44:58.37 +0400>,<she>,<DPX200>,
      <pk PHC0 = -3.181203 PHC1 = 5.6 
       data hash MD5: 16K
       D1 FB 98 B7 C5 92 C7 4C 0C 83 43 D4 8F E8 1F 7B>)
(   4,<2025-11-01 13:45:02.29 +0400>,<she>,<DPX200>,
      <abs ABSG = 5 
       data hash MD5: 16K
       5D 25 0C EC 04 38 0E F8 69 68 34 5C 31 04 34 2C>)
$$ ##END=
$$ 
$$ hash MD5
$$ AF B0 76 08 33 60 8B 20 72 0E 54 B8 9A A8 DD A2
##$RELAX= 
##$RELAX= 
##$RELAX= 
##$RELAX= 
##$RELAX= 
##$RELAX= 
$$ Bruker specific parameters
$$ --------------------------
##$DU= <F:/spectra>
##$EXPNO= 1
##$NAME= <H-C>
##$PROCNO= 1
##$TYPE= <nmr>
##$USER= <she>
##$AMP= (0..31)
100 100 100 100 100 100 100 100 100 100 100 100 100 100 100 100 100 100 
100 100 100 100 100 100 100 100 100 100 100 100 100 100 
##$AQSEQ= 0
##$AQ_mod= 1
##$AUNM= <au_zg>
##$AUTOPOS= <>
##$BF1= 200.13
##$BF2= 200.13
##$BF3= 200.13
##$BF4= 200.13
##$BF5= 200.13
##$BF6= 200.13
##$BF7= 200.13
##$BF8= 200.13
##$BYTORDA= 1
##$CFDGTYP= 0
##$CFRGTYP= 5
##$CHEMSTR= <none>
##$CNST= (0..31)
1 1 145 1 1 1 1 1 1 1 1 1 1 1 1 1 1 1 1 1 1 1 1 1 1 1 1 1 1 1 1 1 
##$CPDPRG= <>
##$CPDPRG1= <>
##$CPDPRG2= <>
##$CPDPRG3= <>
##$CPDPRG4= <mlev>
##$CPDPRG5= <mlev>
##$CPDPRG6= <mlev>
##$CPDPRG7= <mlev>
##$CPDPRG8= <mlev>
##$CPDPRGB= <>
##$CPDPRGT= <>
##$D= (0..31)
0 0.7 0 0 0 0 0 0 0 0 0 0.03 0 0 0 0 0 0 0 0 0 0 0 0 0 0 0 0 0 0 0 0 
##$DATE= 1761990274
##$DBL= (0..7)
120 120 120 120 120 120 120 120 
##$DBP= (0..7)
150 150 150 150 150 150 150 150 
##$DBP07= 0
##$DBPNAM0= <>
##$DBPNAM1= <>
##$DBPNAM2= <>
##$DBPNAM3= <>
##$DBPNAM4= <>
$$ [...]
##$SUBNAM3= <"">
##$SUBNAM4= <"">
##$SUBNAM5= <"">
##$SUBNAM6= <"">
##$SUBNAM7= <"">
##$SUBNAM8= <"">
##$SUBNAM9= <"">
##$SW= 18.0517328524113
##$SWIBOX= (0..15)
0 0 2 0 0 0 0 0 0 0 0 0 0 0 0 0 
##$SW_h= 3612.71676300578
##$TD= 16384
##$TD0= 1
##$TE= 0
##$TE2= 300
##$TE3= 300
##$TEG= 300
##$TL= (0..7)
0 120 120 120 120 120 120 120 
##$TP= (0..7)
150 150 150 150 150 150 150 150 
##$TP07= 0
##$TPNAME0= <>
##$TPNAME1= <>
##$TPNAME2= <>
##$TPNAME3= <>
##$TPNAME4= <>
##$TPNAME5= <>
##$TPNAME6= <>
##$TPNAME7= <>
##$TPOAL= (0..7)
0.5 0.5 0.5 0.5 0.5 0.5 0.5 0.5 
##$TPOFFS= (0..7)
0 0 0 0 0 0 0 0 
##$TUNHIN= 0
##$TUNHOUT= 0
##$TUNXOUT= 0
##$USERA1= <user>
##$USERA2= <user>
##$USERA3= <user>
##$USERA4= <user>
##$USERA5= <user>
##$V9= 5
##$VALIST= <valist>
##$VCLIST= <CCCCCCCCCCCCCCC>
##$VD= 0
##$VDLIST= <DDDDDDDDDDDDDDD>
##$VPLIST= <PPPPPPPPPPPPPPP>
##$VTLIST= <TTTTTTTTTTTTTTT>
##$WBST= 1024
##$WBSW= 4
##$XGAIN= (0..3)
0 0 0 0 
##$XL= 0
##$YL= 0
##$YMAX_a= 178573
##$YMIN_a= -129038
##$ZGOPTNS= <>
##$ZL1= 120
##$ZL2= 120
##$ZL3= 120
##$ZL4= 120
##$ABSF1= 15.31057
##$ABSF2= -2.741276
##$ABSG= 5
##$ABSL= 3
##$ALPHA= 0
##$AQORDER= 0
##$ASSFAC= 0
##$ASSFACI= 0
##$ASSFACX= 0
##$ASSWID= 0
##$AUNMP= <proc_1d>
##$AZFE= 0.1
##$AZFW= 0.1
##$BCFW= 0
##$BC_mod= 2
##$BYTORDP= 0
##$COROFFS= 0
##$CY= -3
##$DATMOD= 1
##$DC= 0
##$DFILT= <>
##$DTYPP= 0
##$F1P= 0
##$F2P= 0
##$FCOR= 1
##$FTSIZE= 16384
##$FT_mod= 6
##$GAMMA= 0
##$GB= 0
##$INTBC= 1
##$INTSCL= 3.241238e-09
##$ISEN= 128
##$LB= 0.25
##$LEV0= 0
##$LPBIN= 0
##$MAXI= 10000
##$MC2= 0
##$MEAN= 0
##$ME_mod= 0
##$MI= 1.114404
##$NCOEF= 0
##$NC_proc= -8
##$NLEV= 6
##$NOISF1= 3.799351
##$NOISF2= 2.8
##$NSP= 0
##$NTH_PI= 0
##$NZP= 0
##$OFFSET= 15.46152
##$PC= 1
##$PHC0= -2790.269
##$PHC1= 16.79235
##$PH_mod= 1
##$PKNL= yes
##$PPARMOD= 0
##$PSCAL= 0
##$PSIGN= 0
##$REVERSE= no
##$SF= 200.130012043122
##$SI= 16384
##$SIGF1= 3
##$SIGF2= 2
##$SINO= 0.751879
##$SIOLD= 32768
##$SREGLST= <19F.Aceton>
##$SSB= 0
##$STSI= 16384
##$STSR= 0
##$SW_p= 3612.71676300578
##$SYMM= 0
##$S_DEV= 0
##$TDeff= 16384
##$TDoff= 0
##$TI= <>
##$TILT= no
##$TM1= 0
##$TM2= 0
##$TOPLEV= 0
##$USERP1= <user>
##$USERP2= <user>
##$USERP3= <user>
##$USERP4= <user>
##$USERP5= <user>
##$WDW= 1
##$XDIM= 16384
##$YMAX_p= 311324221
##$YMIN_p= -2694211
$$ End of Bruker specific parameters
$$ ---------------------------------
##NTUPLES= NMR SPECTRUM
##VAR_NAME=  FREQUENCY,     SPECTRUM/REAL,   SPECTRUM/IMAG
##SYMBOL=    X,             R,               I
##VAR_TYPE=  INDEPENDENT,   DEPENDENT,       DEPENDENT
##VAR_FORM=  AFFN,          ASDF,            ASDF
##VAR_DIM=   16384,         16384,           16384
##UNITS=     HZ,            ARBITRARY UNITS, ARBITRARY UNITS
##FACTOR=    0.220516191357247, 1,           1
##FIRST=     3094.31422283179, 0,            0
##LAST=      -518.40254017399, 0,            0
##MIN=       -518.40254017399, -2694211,     0
##MAX=       3094.31422283179, 311324221,    0
$$ Real data points
##PAGE= N=1
##DATA TABLE= (X++(R..R)), XYDATA
$$ [...]
11940g05685K97117J20855Q12036Q1527m34874j88832p12362J72253L53187L69097
$$ -705685 -408568 -287713 524323 605850 170976 -17856 -730218 -557965 -204778 164319
11930A64319N0606m51773L58296j81904o96027K03184Q62610m63512j83173J114905
$$ 164319 214925 -236848 121448 -60456 -756483 -553299 309311 -154201 -337374 777531
11920G77531r20725k59824O20434J87017j93583p61106N75435j92597j185563
$$ 777531 -143194 -403018 217416 404433 210850 -550256 25179 -167418 -1352981
11911a352981Q06732O91146p68694L09244J198387L1618p79324j40034k22043
$$ -1352981 -546249 144897 -623797 -314553 883834 915452 136128 -3906 -225949
11902b25949p65098m40310R86549J96959p92153N91316O49924j7240r5320Q9382
$$ -225949 -991047 -1431357 -444808 -247849 -1040002 -448686 201238 183998 88678 178060
11892A78060l61314m93094l441o4327L2945J19698K02433R52334o27352k52574
$$ 178060 -183254 -676348 -679789 -744116 -711171 -591473 -389040 563294 -64058 -316632
11882c16632L64497p05651J86728L41164J01253k89256k2460J01691j24049K81715
$$ -316632 47865 -657786 -471058 -129894 -28641 -317897 -340357 -238666 -362715 -81000
11872h1000L33416p59451n55836P56445P26299j83542J58323L98414m07252n48713
$$ -81000 252416 -507035 -1062871 -306426 419873 236331 394654 793068 385816 -162897
11862a62897O7767m49098q48395P88326R65777N5923m4654M0084l90895l93098
$$ -162897 -95130 -544228 -1392623 -604297 361480 417403 372749 412833 21938 -371160
11852c71160O08207L18064p58125j63691L21068l75638o28991j33507Q74547M84312
$$ -371160 237047 555111 -203014 -366705 -45637 -421275 -1050266 -1183773 -309226 175086
11842A75086J17021N68932n20548j166164K43435K88074J08024R44017l11077
$$ 175086 292107 861039 340491 -825673 -582238 -294164 -186140 757877 446800
11833D46800m74292j02010o81881L6609M72932N69775L51947n79176r1816l16123
$$ 446800 -27492 -129502 -811383 -774774 -301842 267933 619880 40704 -51112 -367235
11823c67235j136865R8032J081366O93124k77648m6570N5607p76691J40468N92119
$$ -367235 -1504100 -1406068 -324702 368422 90774 44204 99811 -676880 -536412 55707
11813E5707K01296k26253J42773K26984r87828j077734J111537L99229k34594
$$ 55707 257003 30750 173523 400507 -587321 -1665055 -553518 -154289 -388883
11804c88883J009106J61368n13950j081935n03805O22443k96760M62906J262212
$$ -388883 620223 781591 267641 -814294 -1318099 -695656 -992416 -529510 732702
11795G32702n79271q47250O42753K20921p73182P8226P33394M7531m96494l05775
$$ 732702 153431 -693819 -51066 169855 -603327 -525101 208293 255824 -240670 -546445
11785e46445j37108k19100K86967R83251J94043l27521k17546p5252n50273n12380
$$ -546445 -683553 -902653 -615686 367565 561608 234087 16541 -58711 -608984 -1121364
11775a121364N3606L39428K33929K83071M36083N9811j69842k38646k05476k2301
$$ -1121364 -1067758 -728330 -494401 -211330 224753 284564 114722 -123924 -329400 -351701
11765c51701n5134K14311k07449n51588q9067L79297J09766j19822K54239J49856
$$ -351701 -406835 -192524 -399973 -951561 -1040628 -661331 -551565 -671387 -417148 -267292
11755b67292m077L09484m87820k54046L55527M04723o831q34506m2345M18425
$$ -267292 -271369 38115 -449705 -703751 -348224 56499 49668 -784838 -827183 -408758
11745d08758J87422L64011O2380o89071m37104l9752O01011O34292L04396k78805
$$ -408758 -221336 142675 205055 -484016 -921120 -960872 -359861 274431 578827 300022
11735C00022k61385l18267o59664o8228M35869M28042L97141J51321l15941n93132
$$ 300022 38637 -279630 -939294 -1007522 -571653 -143611 253530 404851 88910 -504222
11725e04222m51454O4651N78143M20081Q46078o03169j167617Q51215m84144q99513
$$ -504222 -955676 -891025 -312882 107199 953277 350108 -817509 33706 -450438 -1349951
11715a349951N28456J093085O43245k63620p3095p72968j074243Q5799Q90501
$$ -1349951 -821495 271590 914835 651215 578120 -194848 -1269091 -1183292 -292791
11706b92791P13747l03719J94991k00059o83006j31713j8058K46517P28291M20624
$$ -292791 420956 117237 312228 112169 -570837 -702550 -720608 -474091 254200 674824
11696F74824j12664L9628k24635l62129j69061j32917j02454m64389K28289K70690
$$ 674824 562160 601788 377153 15024 -154037 -286954 -389408 -853797 -625508 -354818
11686c54818m63130N85700Q70612r54010P5050K26351j26868O2912m86276K97815
$$ -354818 -817948 -232248 638364 -315646 -240596 -14245 -141113 -78201 -564477 -266662
11676b66662k691J4337M45441m65231o35706M49774N91713J23667J87265m83183
$$ -266662 -269353 -255016 190425 -274806 -910512 -460738 130975 254642 441907 -41276
11666d1276J8526L03895m79221L70068j10510l35264K7239k73499J60657k7767
$$ -41276 -22750 281145 -198076 171992 61482 -273782 -246543 -520042 -359385 -387152
11656c87152q2358K61920L78353m51158m0209N56240l08281K11352K02032k70489
$$ -387152 -469510 -207590 170763 -280395 -320604 235636 -72645 138707 340739 70250
11646G0250l53163n37394k64239M51832N07587K74118L12211O16816k09156q66164
$$ 70250 -282913 -820307 -1084546 -632714 -125127 148991 461202 1078018 868862 2698
11636B698k42793k45929p07313L37930J412859j99071p84487Q53712O0018k85810
$$ 2698 -240095 -486024 -1193337 -855407 557452 358381 -426106 427606 487624 201814
11626B01814k54100K14298p00926k43998P26423N8102q67461k31139Q28746j90057
$$ 201814 -52286 162012 -538914 -782912 -56489 1613 -865848 -1096987 -268241 -458298
11616d58298R6601J255065p32731p78401M28586m78383m22672N96414P48410j65786
$$ -458298 -361697 893368 160637 -617764 -189178 -667561 -1090233 -493819 254591 88805
11606H8805j30958N60941J1376p83050P6066L74538q19385Q9089P23927n44291
$$ 88805 -42153 518788 530164 -252886 -176820 197718 -621667 -532578 191349 -352942
11596c52942J65347O96509L89587o87403o05189N91186o6813m74989K61905N2697
$$ -352942 -187595 508914 898501 211098 -394091 197095 130282 -344707 -82802 -30105
11586c0105m55208J04033N79499p1798l61625j02901L49134M37362J41286J6732
$$ -30105 -485313 -381280 198219 126421 -235204 -338105 11029 448391 589677 606409
11576F06409n11226r22938m30111K30938O58695J77068L92404K23153o37148K97186
$$ 606409 95183 -827755 -1257866 -1026928 -368233 -191165 201239 424392 -212756 84430
11566H4430M03519n31306n94965N06053N78577p46625L94011L03902r22727j31945
$$ 84430 487949 -43357 -638322 -132269 446308 -300317 93694 397596 -525131 -657076
11556f57076P21608k01370j84165N26409O24420n98448r70996L73888k99339q91414
$$ -657076 64532 -136838 -321003 205406 829826 231378 -739618 -365730 -665069 -1556483
11546a556483J333353M49789j56252M58097k90187j52206m3464n76067m38991
$$ -1556483 -223130 226659 70407 528504 238317 86111 42647 -533420 -972411
11537i72411M18165P95243J99472n260k07415j260559p72709P09761R99106N54008
$$ -972411 -554246 240997 440469 435209 227794 -1032765 -1805474 -1095713 -96607 457401
11527D57401K29056P01688j033640q59937L26242o74957l84415Q69389P86118
$$ 457401 686457 1388145 354505 -505432 -179190 -854147 -1238562 -369173 416945
11518D16945j08762n31076J24529L1709n54198Q24446M20465r96039K66202j82438
$$ 416945 308183 -222893 -98364 -66655 -620853 203593 624058 -371981 -105779 -288217
11508b88217n35382M91444l6026K79955J4097N72583k97546p02756J001895l102
$$ -288217 -823599 -332155 -368181 -88226 -74129 498454 200908 -501848 500047 496945
11498D96945o24863O94995J02064j573325p79567J282670L81070L9985J32624
$$ 496945 -127918 567077 669141 -904184 -1683751 -401081 -20011 19974 152598
11489A52598L46572r00127r98460J211119N43252p62129L21413J137232o96233
$$ 152598 499170 -400957 -1399417 -188298 354954 -407175 -85762 1051470 355237
11480C55237j155386M01778o31087m79285R00001J002334M30321k30609o0732
$$ 355237 -800149 -398371 -1029458 -1508743 -608742 393592 823913 593304 532572
11471E32572j40820j125846r9053R43945J3372m07132O15019j61733j342228L37899
$$ 532572 391752 -734094 -833147 110798 124170 -282962 332057 170324 -1171904 -834005
11461h34005P79154o0142j79384O81830j4687j164786j45001R80861m40706o92211
$$ -834005 -54851 -114993 -294377 387453 372766 -792020 -937021 43840 -396866 -1089077
11451a089077Q32159O64125m10630l09934L55770j469468n78655J369276P40832
$$ -1089077 -256918 407207 -3423 -313357 42413 -1427055 -2005710 -636434 104398
11442A04398j89495N34374M96908o80385n77320K67634j27204j447939J30571
$$ 104398 -85097 449277 946185 265800 -311520 -43886 -171090 -1619029 -1488458
11433a488458P97140k22569M83937M72404K54130j85520j89500J52970l43345
$$ -1488458 -691318 -913887 -429950 42454 296584 111064 -78436 74534 -268811
11424b68811k1928J4363l13166k83425n38432J13053L54236P75954P58157j20470
$$ -268811 -290739 -276376 -589542 -872967 -1411399 -1298346 -944110 -168156 590001 469531
11414D69531M12025Q4119o53338p11919l99219n54175M0609Q15284O88322P8114
$$ 469531 881556 965675 312337 -399582 -798801 -1352976 -1312367 -497083 191239 269353
11404B69353m20439j88883q3530M55494L63837J93678J95062j218308p49818N32194
$$ 269353 -151086 -339969 -423499 31995 395832 589510 784572 -433736 -1183554 -651360
11394f51360l08066N06784Q48398j21558J56693m85530o70560j85409Q5728L58742
$$ -651360 -959426 -452642 395756 274198 430891 -54639 -725199 -910608 -824880 -466138
11384d66138L99852M81887P7159j62524q48334k09464O86423q37226J60311N08376
$$ -466138 -66286 415601 492760 330236 -518098 -727562 -41139 -878365 -718054 -209678
11374b09678K2055J01099O41J39889k48304m50495M54395j19662k55257J42829
$$ -209678 -187623 -86524 -85883 54006 -194298 -644793 -190398 -310060 -565317 -422488
11364d22488M58947J56579L73575k39155p22782o06405r28311M23696R75140j25797
$$ -422488 36459 193038 566613 327458 -395324 -1001729 -1930040 -1506344 -531204 -657001
11354f57001J211568O93806m65962n47693l97450n80j365049K68894R25705L06684
$$ -657001 554567 1248373 782411 234718 -162732 -163312 -1528361 -1259467 -333762 -27078
11344b7078k30018m25308L54310j16592K00899L67823K82030M2257n33426m7160
$$ -27078 -257096 -682404 -328094 -444686 -243787 124036 406066 448323 -85103 -132263
11334a32263r07929k6653O75359j90116K04316M87831j91716J39859N29681m44067
$$ -132263 -1040192 -1066845 -391486 -581602 -377286 110545 -81171 58688 588369 144302
11324A44302m99491J26812K43851j12542l81521M31635n6548o45602M25635P64918
$$ 144302 -355189 -228377 15474 -97068 -478589 -46954 -103502 -749104 -323469 441449
11314D41449M8832j22615J03046j54174m79874M1270N46201m79297p27565l87260
$$ 441449 490281 367666 470712 316538 -163336 -122066 424135 -55162 -782727 -1169987
11304a169987L28102L03785K45484P75166N91331Q6831j018266j95219j00264
$$ -1169987 -841885 -538100 -292616 482550 1073881 1160712 142446 -52773 -153037
11295a53037j148913o03806Q56730M65350R4071Q78067P28699j097611o34907
$$ -153037 -1301950 -1905756 -1049026 -583676 -489605 388462 1117161 19550 -615357
11286f15357P33303o3172k55326L48001J71715k81107j261709l48912R44439p40221
$$ -615357 117946 54774 -200552 147449 319164 38057 -1223652 -1572564 -628125 -1368346
11276a368346O04034J597451P9400p33724m7866J53426m02720r61772J45472M74743
$$ -1368346 -764312 833139 912539 178815 130949 284375 -118345 -1080117 -934645 -459902
11266d59902m88655l9080L95349L98861k31492N4009P15031J05248l39314J12009
$$ -459902 -948557 -987637 -592288 -193427 -424919 -370910 344121 449369 110055 222064
11256B22064J14558k15131q25236J1717M73696J44065l08068j99684O53430K29771
$$ 222064 336622 121491 -703745 -692028 -218332 -74267 -382335 -582019 71411 301182
11246C01182o57072K84403L61665o91907k26347M02473M72922n41829l37179Q73388
$$ 301182 -355890 -71487 290178 -401729 -628076 -225603 247319 -294510 -631689 241699
11236B41699P2775p15719K59369M24294m21481m53543K31701Q5250m05467M19637
$$ 241699 314474 -401245 -141876 282418 -139063 -592606 -360905 -275655 -681122 -261485
11226b61485N81480k27164j62409K44211n05313l84451l18684L51728K43821k14701
$$ -261485 319995 92831 -69578 174633 -330680 -715131 -1033815 -682087 -438266 -652967
11216f52967K16987Q46702O0554n75466l98836p0700J07504l7917k35503J56693
$$ -652967 -435980 410722 471276 -104190 -503026 -573726 -466222 -504139 -739642 -582949
11206e82949K92523o51617J81512J89249l12844k91279P52856Q06854o71638k30606
$$ -582949 -290426 -942043 -760531 -571282 -884126 -1175405 -422549 384305 -287333 -517939
11196e17939L70444k54703m76789K8599L79476k70173J86688L76666K84362O9347
$$ -517939 -147495 -402198 -878987 -850388 -470912 -741085 -554397 -177731 106631 175978
11186A75978j83587L89265l92544r12824O5877M86368q208N2709M64856k57513
$$ 175978 -7609 381656 -10888 -923712 -857835 -371467 -379675 -326966 137890 -119623
11176a19623j82658o85264M39349P18323k43241J77399j42557m07964k17188k46322
$$ -119623 -302281 -987545 -548196 170127 -73114 104285 -38272 -446236 -663424 -909746
11166i09746M41705J38326O5578R90145N1303k6024n27872r67526q7711j26780
$$ -909746 -468041 -329715 -264137 726008 777311 751287 223415 -744111 -831822 -958602
11156i58602M99931M92264k71426J62887o5346n18171M67433N78949k61726n83611
$$ -958602 -458671 33593 -237833 -74946 -140292 -658463 -191030 387919 126193 -457418
11146d57418M26779l0469q14278k9192O91238j39575m25224J98382K79663L13668
$$ -457418 -30639 -61108 -875386 -904578 -213340 -352915 -778139 -579757 -300094 13574
11136A3574j96993Q22445L091r98576J11339j44009j71911m79604L89593J008952
$$ 13574 -183419 639026 642117 -356459 -245120 -389129 -561040 -1040644 -651051 357901
11126C57901n99412K08066L98228p37344n49640L10836O80162n33586m58598R89800
$$ 357901 -241511 -33445 364783 -372561 -922201 -611365 68797 -464789 -923387 66413
11116F6413m9307q25072M02538P13158l12420q97334J58329M62099o76002j23194
$$ 66413 17106 -807966 -405428 307730 -4690 -902024 -743695 -281596 -957598 -1080792
11106a080792J368542Q7645k60191K08982j09742k38486m95547j7798L18871K92568
$$ -1080792 287750 375395 115204 324186 214444 -24042 -519589 -537387 -218516 74052
11096G4052n2209Q6318M48785m16830j24291J94520q21661K7876o8203L60365
$$ 74052 21843 108161 556946 140116 15825 210345 -611316 -583440 -651643 -291278
11086b91278P27318J03045R1670m1372k4589n37257l06923q7770m03537L90830
$$ -291278 436040 539085 630755 589383 564794 27537 -279386 -367156 -770693 -379863
11076c79863K23612K77863J98691n36218K14822M91967J55781j97131J28947l13237
$$ -379863 -156251 121612 320303 -215915 -1093 490874 646655 449524 578471 265234
11066B65234j124657J27996L27541o6106k24290N83151Q30165k32299l99684q7385
$$ 265234 -859423 -731427 -403886 -469992 -694282 -111131 719034 486735 87051 -334
11056c34p28780O2430Q25045K59011n05930K73901J74733p76473q31576j43758
$$ -334 -729114 -666684 158361 417372 -88558 185343 360076 -416397 -1247973 -1391731
11046a391731R78107N62341L49932M35059o05769o09693k39184L7107j53163j09402
$$ -1391731 -413624 148717 498649 933708 327939 -281754 -520938 -483831 -636994 -746396
11036g46396Q7810K14059N95037j39483n80321L99993m6416k45450J57943L67620
$$ -746396 -658586 -444527 150510 11027 -569294 -169301 -215717 -461167 -303224 64396
11026F4396L55531k81952l26990K38799J17261j145623N27149M32103n72803K55575
$$ 64396 419927 137975 -189015 49784 167045 -978578 -451429 -19326 -592129 -336554
11016c36554L58579K8589j08459J06285J56509k75219k01362Q5058N17581l12121
$$ -336554 22025 50614 -57845 48440 204949 -70270 -271632 -186574 331007 18886
11006A8886q42533K31213j20292j48541J627547L36503q75912n13291q5368l74316
$$ 18886 -823647 -592434 -712726 -861267 766280 1102783 226871 -286420 -371788 -746104
10996g46104j94037K75608Q10600k97275q0179N73227j14456k33727k37242n583
$$ -746104 -940141 -664533 146067 -151208 -231387 341840 227384 -6343 -243585 -249168
10986b49168K91056l06948M85081j12631p82371P20694q4596k32260J21545j97023
$$ -249168 41888 -265060 220021 107390 -674981 45713 -38883 -271143 -149598 -346621
10976c46621R9825J21075M00935j31220l96775N09883K01873p03869r11370Q3493
$$ -346621 -246796 -125721 275214 143994 -252781 257102 458975 -244894 -1156264 -1072771
10966a072771J43769K72077Q25671L46788n92655k49456L21882K13854m55905
$$ -1072771 -929002 -656925 168746 515534 -77121 -326577 -4695 209159 -246746
10957b46746O0209J23339r15605j22771R85961n66261l7456J086650j02939l6349
$$ -246746 -186537 -63198 -978803 -1101574 -115613 -681874 -719330 367320 264381 228032
10947B28032N1789o75545l87449m09674O07043N53912q1476K86496N4640r00891
$$ 228032 279821 -395724 -783173 -1192847 -585804 -31892 -113368 173128 227768 -673123
10937f73123m7242L97562n11719k32705Q01958O07327J42997l18600L410m03951
$$ -673123 -720365 -322803 -834522 -1067227 -265269 342058 485055 166455 169865 -234086
10927b34086p30929N9446J13020L76734K5422M35658O64097l79343m11548N19693
$$ -234086 -965015 -905569 -792549 -415815 -390393 45265 709362 330019 -81529 438164
10917D38164k26630K731P3537l18757q39867k6565M95327L06669M48521K96691
$$ 438164 211534 214265 287802 -30955 -870822 -897387 -402060 -95391 353130 649821
10907F49821l20167j050658K66037O43430l54589j86333O32728P24279n77055
$$ 649821 329654 -721004 -454967 188463 -166126 -352459 280269 1004548 427493
10898D27493o00880J5355o24013r0140O69186M32873n25270l43250K61433k58130
$$ 427493 -173387 -158032 -782045 -872185 -202999 229874 -295396 -638646 -377213 -635343
10888f35343J4874R73382J80309k14587k57841n14420o97322r11824R54327Q76553
$$ -635343 -620469 352913 533222 318635 60794 -453626 -1150948 -2062772 -1108445 -231892
10878b31892K28659J71346p7051r78629m28377M71897J217609L07375q85348M13574
$$ -231892 -3233 168113 91062 -887567 -1315944 -844047 373562 680937 -204411 209163
10868B09163k1225r56226O9548o7718o24853k36097J010344P70513k23082L46574
$$ 209163 187938 -768288 -698740 -766458 -1391311 -1627408 -617064 153449 -69633 276941
10858B76941L42237K17989k36425r4445n15411j034561k6548M27693O8363L42797
$$ 276941 619178 837167 600742 506297 -9114 -1043675 -1070223 -642530 -574167 -231370
10848b31370L78510k04072n30671O49086O42515m91995K57744K76085q60247n41418
$$ -231370 147140 -56932 -587603 61483 703998 212003 469747 745832 -114415 -655833
10838f55833k82068p1391O48379J084163K03890k38523j191192J54800L95650
$$ -655833 -937901 -1009292 -360913 723250 927140 688617 -502575 -347775 47875
10829D7875l68310P64778m02071l71017K87787J4550k61407l04991N11957K85273
$$ 47875 -320435 444343 42272 -328745 -40958 -26408 -287815 -592806 -80849 204424
10819B04424J65231L81069o76410r12612m87477N89585N43487P4997M19551o080
$$ 204424 369655 750724 74314 -838298 -1325775 -736190 -192703 -117706 301845 295765
10809B95765n34950m42891l67731J46915J10980K16846K91429J66492l09612m01085
$$ 295765 -239185 -682076 -1049807 -902892 -791912 -575066 -283637 -117145 -426757 -827842
10799h27842k22071Q25J020294M79584k87412o4371l64751n84828O9976k60359
$$ -827842 -1049913 -1049088 -28794 450790 163378 99007 -265744 -850572 -780596 -1040955
10789a040955k72115K8089R62260O20952o54131p48433N0972P12962K49802k68626
$$ -1040955 -1313070 -1284981 -322721 298231 -355900 -1104333 -1053361 -340399 -90597 -359223
10779c59223K26668j63269n87008K43433J20359o79727O93949M93476J78852K27670
$$ -359223 -132555 -295824 -882832 -639399 -519040 -1198767 -504818 -11342 167510 395180
10769C95180m21469K04335k30972o09845M72951J76900j44764j8791j83174O7630
$$ 395180 -26289 178046 -52926 -662771 -189820 -12920 -157684 -176475 -359649 -292019
10759b92019j12015M44282j10573N398K61139L21407l20979n12236O7432L95424
$$ -292019 -404034 40248 -70325 -64927 196212 517619 196640 -315596 -248164 147260
10749A47260j42275k75495K07378n16901K21469R25463m0191n64907K76999o6475
$$ 147260 4985 -270510 -63132 -580033 -358564 566899 526708 -38199 238800 172325
10739A72325m37649k34813L65377l3633o44467M49415P00020K90875j75839M58726
$$ 172325 -265324 -500137 -134760 -168393 -812860 -363445 336575 627450 451611 910337
10729I10337l79140j481879q9742j0807l06141K57708K28205M18429O50516l89224
$$ 910337 531197 -950682 -1040424 -1051231 -1357372 -1099664 -871459 -453030 197486 -191738
10719a91738j09064J04983l05581M33450k93717m45599J32708l67929l96091m1935
$$ -191738 -300802 -195819 -501400 -67950 -361667 -807266 -674558 -1042487 -1438578 -1480513
10709a480513n4861R21710O99128O65208j72744j053468k71413J47728m47814
$$ -1480513 -1535374 -613664 85464 750672 577928 -475540 -746953 -599225 -1047039
10700a047039M40940N94129q6876n15113m44099L73620J41222k09869P91485L68756
$$ -1047039 -606099 -11970 -98846 -613959 -1058058 -684438 -543216 -753085 38400 407156
10690D07156l31729M85860M39663r94807q48293k29132J82929j57310J41155Q66624
$$ 407156 75427 561287 1000950 6143 -842150 -1071282 -888353 -1045663 -904508 -37884
10680c7884L87017K26906K90273j98592j209441k68447O94976O4491J19743O41836
$$ -37884 349133 576039 866312 667720 -541721 -810168 -115192 -50701 69042 710878
10670G10878L8543k72683m25951j36202p44043m23637Q93173P24370j5757K2149
$$ 710878 749421 476738 50787 -85415 -829458 -1253095 -359922 364448 348691 370840
10660C70840j36759o88789N9220O42527Q4148j06001k42597n65846K76328N38392
$$ 370840 234081 -454708 -395488 247039 331187 225186 -17411 -583257 -306929 231463
10650B31463m6877m66182l46107J26899j3235N38316K7120m86627k24860M84839
$$ 231463 184586 -281596 -627703 -500804 -514039 24277 51397 -435230 -660090 -175251
10640a75251O3957r30706l01494O79868N8389L78039K96431k59773m66595J63220
$$ -175251 -111294 -1042000 -1343494 -663626 -605237 -227198 69233 -190540 -657135 -493915
10630d93915J86238o81409j67537Q50827L34538j76506j62444J33170j66341k35526
$$ -493915 -307677 -989086 -1156623 -305796 28742 -147764 -310208 -177038 -343379 -578905
10620e78905k17291K57139j875j34612O01169L16346K63388j45284o89927o485
$$ -578905 -796196 -539057 -540932 -675544 -74375 241971 505359 360075 -329852 -336337
10610c36337l56531K4614O77300J42340o68303o26487j12698O99376R04241q1109
$$ -336337 -692868 -668254 9046 151386 -516917 -1143404 -1256102 -556726 347515 266406
10600B66406j28273K71446k07665n82626j69527k5540O56317M24744j65319Q0321
$$ 266406 138133 409579 201914 -380712 -550239 -575779 80538 505282 339963 420284
10590D20284p39143o42697N52610q4536K15981O36655O01012j98749p54365l56359
$$ 420284 -318859 -961556 -408946 -493482 -277501 359154 960166 761417 7052 -349307
10580c49307J83149J60016O0356N44071k01090j008277o08427l49063N90743Q65845
$$ -349307 -166158 -6142 54214 598285 397195 -611082 -1219509 -1568572 -977829 -111984
10570a11984J097958N13852n87742q78076j5682p40051o25100K49514M11196L75059
$$ -111984 985974 1499826 912084 34008 18326 -721725 -1346825 -1097311 -686115 -311056
10560c11056K41350j98783K69044n22507Q1655O96606n51017q109Q43736m96325
$$ -311056 -69706 -268489 555 -521952 -440297 256309 -294708 -302817 540919 44594
10550D4594q08083j96118n3331j27839M7774J132208N87941q03051L69877M86414
$$ 44594 -763489 -959607 -1012938 -1140777 -1093003 39205 627146 -175905 193972 680386
10540F80386j221588k70441P84381k7630n99402n5504J43917l15329n89364K85767
$$ 680386 -541202 -811643 -27262 -54892 -654294 -709798 -565881 -881210 -1470574 -1184807
10530a184807N17963O87644N17604J83113p10305q74464n5168K45920K35867M59272
$$ -1184807 -666844 20800 538404 721517 11212 -863252 -918420 -672500 -436633 22639
10520B2639l5289l13532Q3758K4784j71177N42631P8045k50212m31378j02539
$$ 22639 -12650 -326182 -242424 -217640 -388817 153814 231859 -18353 -449731 -552270
10510e52270j02270j47107M37385J74978n4561M69651K17625j27710r71922l74120
$$ -552270 -654540 -801647 -364262 -189284 -243845 225806 443431 315721 -656201 -1030321
10500a030321Q52985l58365k95589R8569L55161K86100L60047j82770o62617k19972
$$ -1030321 -177336 -535701 -831290 -732721 -377560 -91460 268587 85817 -576800 -796772
10490g96772L54791m1475m04713J67754J74622M50206q4551k67581J25106n01650
$$ -796772 -441981 -483456 -888169 -720415 -545793 -95587 -180138 -447719 -322613 -824263
10480h24263l06867J191874j50430k43852K63833n42867p06015j14126J433011
$$ -824263 -1131130 60744 -89686 -333538 -69705 -612572 -1318587 -1432713 298
10471B98K97984j027476R2903O61068n65587J45019M18961k4947l54197M4999
$$ 298 298282 -729194 -636291 24777 -540810 -395791 23170 -1777 -355974 -310975
10461c10975K21606j015724k37086J001251M14161n85152K48804K97460m75325
$$ -310975 -89369 -1105093 -1342179 -340928 73233 -511919 -263115 34345 -440980
10452d40980J25492N81508n25406k02919k20629J3703J32648m37692j96423Q59381
$$ -440980 -315488 266020 -259386 -462305 -682934 -669231 -536583 -974275 -1170698 -311317
10442c11317N94935J87111J25998p02928o95118m76518N79717J263363j2278k64289
$$ -311317 283618 470729 596727 -106201 -801319 -1277837 -698120 565243 552965 288676
10432B88676p27181q08099Q23401L73133l96771L18931L15222k18926k2495j28897
$$ 288676 -438505 -1246604 -423203 -50070 -446841 -127910 187312 -31614 -54109 -183006
10422a83006k89328q1514q0946K41596M4621p79539M96685L19999n26343O43802
$$ -183006 -472334 -553848 -634794 -393198 -348577 -1128116 -631431 -311432 -837775 -193973
10412a93973L1596l09841K78243R9238k45550m37221L36362J99404m30742R4235
$$ -193973 -162377 -472218 -193975 -94737 -340287 -777508 -441146 -241742 -672484 -578249
10402e78249O76138k96430l40203N44035L35411m71074k80771m6893m0537L06821
$$ -578249 97889 -198541 -538744 5291 340702 -130372 -411143 -458036 -498573 -191752
10392a91752P18986Q3600m63374m71370L11684n50322M10903M42399q69608M3093
$$ -191752 527234 610834 147460 -323910 -12226 -562548 -151645 290754 -578854 -535761
10382e35761J98980l93574K52734K17740R70818Q60392n81283l54275m05268q51636
$$ -535761 -336781 -730355 -477621 -259881 710937 1571329 990046 635771 230503 -621133
10372f21133J08937J6276J26168M71311M6022j27326j53824L9935J29008K95500
$$ -621133 -512196 -495920 -369752 101559 147581 20255 -133569 -93634 35374 330874
10362C30874m33131L30551N05669n57684k91736J45609J97196k51310J46749L40621
$$ 330874 -102257 228294 733963 176279 -115457 30152 227348 -23962 122787 463408
10352D63408o46976p31484Q79938Q53873r74624k46453Q50886k52040j42954Q90193
$$ 463408 -183568 -915052 -35114 818759 -155865 -402318 448568 196528 53574 943767
10342I43767j71666r96431m18093K06535m89632J06309O20031O21146l78698N4650
$$ 943767 772101 -224330 -642423 -435888 -925520 -819211 -199180 421966 43268 97918
10332I7918M11262l97793p32716M94000K54541O2171M71319o59457q17112L84428
$$ 97918 509180 111387 -621329 -127329 127212 189383 660702 1245 -815867 -431439
10322d31439o91144J04393N82638R5185M01808M31585M82294l72479q40139J49242
$$ -431439 -1122583 -1018190 -435552 -340367 61441 493026 975320 602841 -237298 -88056
10312h8056P64775n34222l66286l99903q3441n835M12363O97643P2613j1485J95224
$$ -88056 676719 142497 -223789 -623692 -707133 -712968 -300605 397038 469651 458166 653390
10301F53390K58567k25803l46697p34948m60499k22071N1998N79703N41017k92610
$$ 653390 911957 686154 339457 -395491 -855990 -1078061 -1026063 -446360 94657 -197953
10291a97953L17702O33174l22518P3206J18570l54207j6477k04347k07851j78167
$$ -197953 119749 752923 430405 503611 622181 267974 251497 47150 -160701 -338868
10281c38868p59452L02831M10209M47908J74401p25042N08266Q54210r59770m25570
$$ -338868 -1098320 -795489 -385280 62628 237029 -488013 20253 874463 -85307 -510877
10271e10877O81637k07974j50269K15353j46830n75708o55582O97707P54111m37672
$$ -510877 170760 -37214 -187483 27870 -118960 -694668 -1350250 -652543 101568 -336104
10261c36104j12799R37940j02688o90920Q43378J79042q09366n50439r9458M24185
$$ -336104 -448903 489037 386349 -304571 538807 717849 -91517 -641956 -741414 -317229
10251c17229M15523n17040K95092o9392k43774M36675k42724l11835J12533J186082
$$ -317229 98294 -418746 -123654 -193046 -436820 -145 -242869 -554704 -442171 743911
10241G43911N92369q86917p97311n8309j06739K99787L78558L61185k89967L39044
$$ 743911 1336280 449363 -347948 -406257 -512996 -213209 165349 526534 236567 575611
10231E75611N73722j52521o08959o97212K70037M5446K5359L24044n75124K80146
$$ 575611 1149333 996812 387853 -309359 -39322 6124 31483 355527 -219597 60549
10221F0549Q5536J43015O38866j66545l25417J7359l26852L4572K5965n39308
$$ 60549 146085 289100 927966 761421 436004 453363 126511 161083 187048 -352260
10211c52260j95063L25172N76184L6494l94046k28773r1420N08627K99520J27505
$$ -352260 -547323 -222151 354033 390527 -3519 -232292 -323712 184915 484435 611940
10201F11940l92738L56398N01573o86110r91931m60179n84269N87748J625673
$$ 611940 219202 575600 1077173 391063 -600868 -1061047 -1645316 -1057568 568105
10192E68105Q5469n04882r0558K92082K3528o97222Q651L04466p04189K9914P47201
$$ 568105 653574 148692 58134 350216 373744 -323478 -314827 -10361 -714550 -684636 62565
10181F2565n82257o50111O48945O67884J57514N77991L763p23089n44189j41044
$$ 62565 -519692 -1169803 -520858 147026 304540 882531 886294 163205 -380984 -522028
10171e22028L49693l1345n20765N2718O51114l09464K66335L2779p23209N31141
$$ -522028 -172335 -203680 -724445 -671727 -20613 -330077 -63742 -30963 -754172 -223031
10161b23031R83832J41132l83432p59483M54024k52279o57119j50272o8275K30664
$$ -223031 760801 901933 518501 -240982 213042 -39237 -696356 -846628 -914903 -684239
10151f84239P59348P02760L39998J64026j22147o79852n09897K14375L96378q81598
$$ -684239 75109 777869 1117867 1281893 1159746 479894 -30003 184372 580750 -300848
10141c00848Q878N46720l74819J47694M98830k07098n50004O35410J008540p18317
$$ -300848 -291970 254750 -120069 27625 526455 319357 -230647 404763 1413303 694986
10131F94986o18836K54950O0233o10666K90481K3424o56458N92529O42041Q2741
$$ 694986 76150 331100 391333 -219333 71148 94572 -561886 30643 672684 755425
10121G55425m15277l25422M87911o22421j53021J175008l85281j254576j11174
$$ 755425 340148 14726 502637 -119784 -272805 902203 516922 -737654 -848828
10112h48828K45661m73356Q5208P14115Q29079M43485l26679n34644r99348r74368
$$ -848828 -603167 -1076523 -991315 -277200 551879 995364 668685 134041 -865307 -1839675
10102a839675J287876P34197k75619J04814j25627k34805j18222N82653K37113
$$ -1839675 -551799 182398 -93221 11593 -114034 -348839 -467061 115592 352705
10093C52705n90774l53419O28228L33727o53539K56942L86001K7215o4877j59642
$$ 352705 -238069 -591488 36740 370467 -283072 -26130 359871 387086 322209 162567
10083A62567p79040o16838L14850J008744P23106O02083L561n37228o39108n84801
$$ 162567 -616473 -1233311 -918461 90283 813389 1415472 1419033 881805 242697 -342104
10073c42104K3839j92301P63314L49593l98644N83669j01400n01478l7339O87017
$$ -342104 -318265 -510566 252748 602341 203697 787366 685966 184488 147149 834166
10063H34166L36698l49514n33679p76386K15691O82763O92017J75739p02530J11319
$$ 834166 1170864 821350 287671 -488715 -273024 409739 1101756 1277495 574965 686284
10053F86284l1056l96747R5559N981J16658P7853R1577j39030o01484K39723N09169
$$ 686284 655228 258481 354040 360021 476679 554532 646109 507079 -94405 145318 654487
10042F54487J27313M27307R7247k90356k33084o50439k95036L82621L32543L15835
$$ 654487 781800 1209107 1306354 1015998 782914 132475 -162561 220060 552603 868438
10032H68438L87408k57484j31853K7735n38723K11070M47512M387m57562l59622
$$ 868438 1255846 998362 866509 894244 355521 566591 1014103 1018490 560928 201306
10022B01306o037R35159P25664r2703n3493p95380l06572R70068m88799o42445
$$ 201306 195269 1130428 1856092 1763389 1709896 914516 607944 1578012 1089213 446768
10012D46768K04014R1054o1825o24713M61968J18592j56294N52119O39651k58293
$$ 446768 650782 741836 680011 55298 517266 635858 479564 1031683 1671334 1413041
10002A413041o39287K87476l62998r08758L04606N31920J99014k06029N25957
$$ 1413041 773754 1061230 698232 -210526 94080 626000 825014 618985 1144942
9993A144942L51285q44204j50604Q02317o11369L53058R40346l23134k45384j4216
$$ 1144942 1496227 652023 501419 1303736 692367 1045425 1985771 1662637 1417253 1403037
9983A403037Q5214j61474j196402L25484N60465k1656R89752m95920p90297M7482
$$ 1403037 1488251 1326777 130375 455859 1016324 994668 1984420 1488500 698203 745685
9973G45685M99243J62262j00732m3138j04653k85380o96016r3412J85391j41095
$$ 745685 1244928 1407190 1306458 1263320 1158667 873287 177271 83859 269250 128155
9963A28155M26366O6381o9249L13507l0283k80105l2235o2702J81201j05960k35476
$$ 128155 554521 620902 551653 865160 834877 554772 522537 459835 641036 535076 299600
9952B99600k34783N0732K1366L19161k48399j84462N53704k69189j54831O347
$$ 299600 64817 115549 136915 456076 207677 23215 576919 307730 152899 159246
9942A59246j10312N30639N0337l70306l12336M8708O60927L17417m24772j08478
$$ 159246 48934 579573 629910 259604 -52732 -4024 656903 974320 549548 441070
9932D41070M7833k07073r01762L80193Q25888K70263m01607l4763j01710n56868
$$ 441070 488903 281830 -619932 -239739 586149 856412 454805 420042 318332 -238536
9922b38536N19904O99798J6765l63540l70910P30520j0914p10312L16272M080
$$ -238536 281368 981166 997931 634391 263481 994001 983087 272775 589047 593127
9912E93127N9676K09674l10782n22720K58771K95749M51587N73858N00944n93688
$$ 593127 652803 862477 551695 28975 287746 583495 1035082 1608940 2109884 1516196
9902A516196o29793L32n91653l41103P86093J59359k25305J80191K85877m0458
$$ 1516196 886403 886735 295082 -46021 740072 899431 674126 854317 1140194 1099736
9892A099736m28214N32069L21543q13215K50093J85417o42141j65934P2025K70402
$$ 1099736 671522 1203591 1525134 711919 962012 1147429 505288 339354 411379 681781
9882F81781k52803K20845R98749K68571P0451o44091o23158N88152J89682m30849
$$ 681781 428978 649823 1648572 1917143 1987594 1343503 720345 1308497 1498179 1067330
9872A067330Q4370k90611l77503K84025O76274j44410m65044N46278Q0256j77734
$$ 1067330 1151700 861089 483586 767611 1443885 1299475 834431 1380709 1460965 1283231
9862A283231M94727j26999k69365k76912n13894K34872o11178Q8599R98011M08210
$$ 1283231 1777958 1650959 1381594 1104682 590788 825660 214482 303081 1301092 1709302
9852A709302J24453M00698k16588q65676o16140O3712L59516l93501J27132Q48331
$$ 1709302 1833755 2234453 2017865 1152189 536049 599761 959277 565776 692908 1541239
9842A541239P64150l92692n01437K36706j64396m0697O51160J40079p87384n13558
$$ 1541239 2305389 1912697 1411260 1647966 1483570 1442873 2094033 2234112 1446728 933170
9832I33170K89136O21370k26234L16571J57010k05039L72177k74228K63451K77626
$$ 933170 1222306 1843676 1617442 1934013 2091023 1885984 2258161 1983933 2247384 2525010
9822B525010L24721K97481o74864m17839J36863k48250J70883M79989o9421M1524
$$ 2525010 2849731 3147212 2472348 2054509 2191372 1943122 2114005 2593994 2524573 2566097
9812B566097n512n73044j13682N87561N99295m02817j64094M61739n85402r52711
$$ 2566097 2560585 1987541 1873859 2461420 3060715 2657898 2493804 2955543 2370141 1417430
9802A417430N18709L05900L05429O22562J88411l86970p45117j43074R09891J18117
$$ 1417430 1936139 2242039 2547468 3170030 3358441 2971471 2226354 2083280 2993171 3111288
9792C111288q55385K38963K44562m19517J74946N75399M45702k74429k29420N9709
$$ 3111288 2255903 2494866 2739428 2319911 2494857 3070256 3515958 3241529 3012109 3071818
9782C071818l86202k13232O59491L76496k86159K28697L75501p06563q20207P05705
$$ 3071818 2685616 2472384 3131875 3508371 3222212 3450909 3826410 3119847 2299640 3005345
9772C005345J136781K36387K64720j04807p81248n99257J24395L80217k46711
$$ 3005345 4142126 4378513 4643233 4538426 3757178 3157921 3282316 3662533 3415822
9763C415822M39760O82900j52483l62777n2111k1870O21961K60649L26434l58230
$$ 3415822 3855582 4538482 4385999 4023222 3971111 3949241 4571202 4831851 5158285 4800055
9753D800055J06711L59461l59941M35525J78714l5913q4501j82629M29427O33902
$$ 4800055 4906766 5266227 4906286 5341811 5520525 5484612 5400111 5217482 5646909 6280811
9743F280811P15792K03250r76446J45974O04738l42230J53963M14406O9024Q0618
$$ 6280811 6996603 7199853 6223407 6369381 6974119 6631889 6785852 7200258 7269282 7349900
9733G349900O29341R15731l06028o44431J265246O82182n00614L991m1520K16280
$$ 7349900 7979241 8894972 8588944 7944513 9209759 9891941 9391327 9395318 9353798 9570078
9723I570078k2328N81167J235066J88154Q6632n8738n81825M4882R59089J167938
$$ 9570078 9547750 10128917 11363983 11552137 11638769 11580031 10998206 11043088 12002177 13170115
9713A3170115J084427P89783P39905m90385p0917M97187Q61617J099395R57189
$$ 13170115 14254542 15044325 15784230 15293845 15222928 15720115 16581732 17681127 18638316
9704A8638316J071652Q4736O75065J532701P32822R06098J647913J653879J946547
$$ 18638316 19709968 19794704 20469769 22002470 22735292 23641390 25289303 26943182 28889729
9695B8889729J897788J643766J057751J530221L060243L175172J896581K481676
$$ 28889729 30787517 32431283 33489034 35019255 38079498 41254670 43151251 45632927
9687D5632927K941937K454736K299846L036391L365468K007919K493173L626176
$$ 45632927 48574864 51029600 53329446 56365837 59731305 61739224 64232397 67858573
9679F7858573K881690J976693K408452K966279K431281K816765M339481L900312
$$ 67858573 70740263 72716956 75125408 78091687 80522968 83339733 87679214 91579526
9671I1579526M259212M861194N159129N060295M929429N137413N634156N766584
$$ 91579526 95838738 100699932 105859061 110919356 115848785 120986198 126620354 132386938
9663A32386938N714044M056904K560175K601136J351939K12428r07976k328329
$$ 132386938 138100982 142157886 144718061 147319197 148671136 148883564 147975588 145647259
9655A45647259k933029l087994l220395l082310l457746l079490k639488l278419
$$ 145647259 142714230 139626236 136405841 133323531 129865785 126786295 124146807 120868388
9647A20868388l219200k869969k692791j531367m890n28050o28158K6586k38110
$$ 120868388 117649188 114779219 112086428 110555061 110550171 110022121 109393963 109420549 109182439
9638A09182439O69141J633584K245527L084219L389693L567615L519774L562166
$$ 109182439 109851580 111485164 113730691 116814910 120204603 123772218 127291992 130854158
9630A30854158L291507K959065K709521K582320K071610L9696k043850l602255
$$ 130854158 134145665 137104730 139814251 142396571 144468181 144507877 142464027 138861772
9622A38861772m106654m972593n542710o819118p468079p488184p254324p283694
$$ 138861772 134755118 129782525 124239815 117420697 109952618 102464434 95210110 87926416
9614H7926416p143688o531582n927767n483030n168897m295271m353806m338755
$$ 87926416 80782728 74251146 68323379 62840349 57671452 53376181 49022375 44683620
9606D4683620l401009l442223l332546k728267j764480k153572k146013q97344
$$ 44683620 41282611 37840388 34507842 31779575 30015095 27861523 25715510 24818166
9598B4818166q64431j815247k060893j458072o39709j106824j023176k81278o94656
$$ 24818166 23953735 22138488 20077595 18619523 17979814 16872990 15849814 15568536 14873880
9589A4873880r81605m59507n02409q15236m47984k32024j23464k00490p98165
$$ 14873880 13892275 13432768 12930359 12115123 11667139 11435115 11311651 11111161 10312996
9580A0312996n10583k16120l65238o59397l44865k31949m0581L67332P6974j52508
$$ 10312996 9802413 9586293 9221055 8561658 8216793 7984844 7944263 8311595 8388569 8236061
9570H236061l04039r3290P05910m80578l45251K20246p46910l19487l11568k73440
$$ 8236061 7932022 7838732 8544642 8064064 7718813 7939059 7192149 6872662 6561094 6287654
9560F287654J33888R879N2250L29797J79297M84416k27596r80512J18591L2900
$$ 6287654 6421542 6431421 6483671 6813468 6992765 7477181 7249585 6269073 6387664 6420564
9550F420564m83954M51776L25317j274027l80946P04566N19309j4997J68570K53004
$$ 6420564 5936610 6388386 6713703 5439676 5058730 5763296 6282605 6267608 6436178 6689182
9540F689182k95787p42378K70374N9097j037676O86224j70617n23528j79118N17993
$$ 6689182 6393395 5651017 5921391 5980488 4942812 5629036 5458419 4934891 4755773 5273766
9530E273766M23075L8033j19510K22421o80265n60765K6910j1481n42853K2693
$$ 5273766 5696841 5734874 5615364 5837785 5157520 4596755 4623665 4612184 4069331 4092024
9520D092024L8786L31956J74082J04354L50655o86941q43833P75653K14737q86898
$$ 4092024 4130810 4462766 4636848 4741202 5091857 4404916 3561083 4336736 4551473 3664575
9510C664575m93351M11261M13859Q7371Q5035j15921p14024o66646M66894j83983
$$ 3664575 3171224 3582485 3996344 4083715 4168750 4052829 3338805 2672159 3139053 2955070
9500B955070m25192R04556K15965o74197J56428J19952j64092l99575N13027j58212
$$ 2955070 2529878 3434434 3650399 2976202 3132630 3252582 3088490 2688915 3201942 3043730
9490C043730n58947k15495M51220N7587N89224J84250m17007m989o48267n28041
$$ 3043730 2484783 2269288 2720508 2778095 3367319 3551569 3134562 3129573 2481306 1953265
9480A953265Q19973K37397o69087M79447P95425l7761j109479k82589R2333k19897
$$ 1953265 2773238 3010635 2341548 2820995 3616420 3578659 2469180 2186591 2278924 2059027
9470B059027P28737J048512n56944j044716M51136N68569l25329L28206L06372
$$ 2059027 2787764 3836276 3279332 2234616 2685752 3254321 2928992 3257198 3563570
9461C563570o63502j36784J34797J1555j08928M08248O92680o17219l97335J55097
$$ 3563570 2900068 2763284 2898081 2909636 2800708 3208956 3901636 3284417 2887082 3042179
9451C042179l94676K41686N36822m15132k34132R467n22702k20797N65283N60574
$$ 3042179 2647503 2889189 3426011 3010879 2776747 2786214 2263512 2042715 2607998 3168572
9441C168572J7651J93305L14071n18471l67588k20056n89588J54894P13234Q57518
$$ 3168572 3186223 3379528 3693599 3175128 2807540 2587484 1997896 2152790 2866024 3723542
9431C723542o02831p61344L86940j23494q2911P57785j07098j51552N17784K44759
$$ 3723542 3120711 2359367 2746307 2622813 2539902 3297687 3190589 3039037 3556821 3801580
9421C801580p21987n26783k83077L831K20912N78066O48676k00954k44925k75553
$$ 3801580 3079593 2552810 2269733 2273564 2494476 3072542 3721218 3520264 3275339 2999786
9411B999786r03860n73520K37034P16421N84101M23613o1187n92766n30587l00868
$$ 2999786 2095926 1522406 1759440 2475861 3059962 3483575 3422388 2829622 2299035 1998167
9401A998167L25047m6183K27093J65958L08579M36913k07587J28300j21799r91066
$$ 1998167 2323214 2277031 2504124 2670082 2978661 3415574 3207987 3336287 3214488 2223422
9391B223422O6231N49806r45285m53606M28183K23446N98091Q37677l35601q41296
$$ 2223422 2289653 2839459 1894174 1440568 1868751 2092197 2690288 3527965 3192364 2351068
9381B351068j75656N4954j66116m00686J148447K84065j079490N49510K237o76400
$$ 2351068 2175412 2230366 2064250 1663564 2812011 3096076 2016586 2566096 2568333 1891933
9371A891933N1600R0916j9544l68576j833O18080j98132O43327J056841o22882
$$ 1891933 1943533 2034449 2014905 1646329 1644496 2262576 2064444 2707771 3764612 3141730
9361C141730j296138j10328m47791n41729J379034L18967k21755L66774L00168
$$ 3141730 1845592 1735264 1287473 745744 2124778 2443745 2221990 2588764 2888932
9352B888932j97147p18525j06885Q52936R1433j66387k48223o17150o35916K46482
$$ 2888932 2691785 1973260 1866375 2719311 2810744 2644357 2396134 1778984 1143068 1389550
9342A389550J153846N02743L35959l78018o12787m51436q68516N74926R46171
$$ 1389550 2543396 3046139 3382098 3004080 2391293 1939857 1071341 1646267 2592438
9333B592438O83404O72385k28643p17290q39167n2031M02855M67640L09516L47448
$$ 2592438 3275842 3948227 3719584 3002294 2163127 2111096 2513951 2981591 3291107 3638555
9323C638555k85471k79152O15029K96484j92921m08841j03293J89518o354k44535
$$ 3638555 3353084 3073932 3688961 3985445 3792524 3383683 3280390 3469908 3463554 3219019
9313C219019j42389N23108L63938K0348L06208n05060p91068P22732P60979K36530
$$ 3219019 3076630 3599738 3963676 3984024 4290232 3785172 2994104 3716836 4477815 4714345
9303D714345j25559l68716k0038q40348J85545L59735o4993M77843P0909J14227
$$ 4714345 4588786 4220070 4200032 3359684 3545229 3904964 3839971 4317814 4388723 4502950
9293D502950j72304k69M43560m74572k17087O43369l08696l60627K66852K57412
$$ 4502950 4330646 4330377 4773937 4299365 4082278 4725647 4416951 4056324 4323176 4580588
9283D580588L10818J66075K45889m45157n13032M20622K01434j6740j96365J45769
$$ 4580588 4891406 5057481 5303370 4858213 4345181 4765803 4967237 4950497 4754132 4899901
9273D899901K71914j36796J67007j65135o75635R35457K57019n22685M41293m5939
$$ 4899901 5171815 5035019 5202026 5036891 4361256 5296713 5553732 5031047 5472340 5426401
9263E426401o0977l8192O13940N55816q77184m72455N31525m25592m4435K64960
$$ 5426401 5365424 5327232 5941172 6496988 5619804 5147349 5678874 5253282 5208847 5473807
9253E473807N96668R7641j84141Q54058M92099m08798J64964M46485o76653j25131
$$ 5473807 6070475 6168116 5983975 6838033 7330132 6921334 7086298 7532783 6856130 6730999
9243F730999O17242K28184j42812R78820J039175l33033m0186M98661r0648l75449
$$ 6730999 7348241 7576425 7433613 8412433 9451608 9118575 9078389 9577050 9486402 9110953
9233I110953k65892K14792R430l4810R33917O1734o09707l55121j47813K8013
$$ 9110953 8845061 9059853 9069283 9034473 9968390 10030124 9420417 9065296 8917483 8945496
9223H945496M88792J62482j32686P31812N01736O8058J08754k60395j02643j11700
$$ 8945496 9434288 9596770 9464084 10195896 10697632 10765690 10874444 10614049 10511406 10399706
9213A0399706P62539P96927J22197O49605M47933J92874J006361R79924O7668
$$ 10399706 11162245 11959172 12081369 12730974 13178907 13371781 14378142 15358066 15425734
9204A5425734m94692k17936Q33125J3165k39234J008757R16189K06443L97967
$$ 15425734 14931042 14713106 15546231 15559396 15320162 16328919 17245108 17451551 17849518
9195A7849518o07770p22778n46814r3444O99096K12540k51677l99985k9197K00405
$$ 17849518 17241748 16518970 15972156 15878712 16577808 16790348 16538671 16138686 16109489 16309894
9185A6309894j65428M26334R22522M86969K26877J98219M301p15673n16455J634541
$$ 16309894 16144466 16570800 17493322 17980291 18207168 18405387 18409688 17694015 17177560 18812101
9175A8812101P90801o5936J18625l69078m41473j81615J225954J221435K51382
$$ 18812101 19602902 19536966 19655591 19286513 18845040 18663425 19889379 21110814 21362196
9166B1362196N61049M09279l45488o80926l75729M75941J071502J054917J516248
$$ 21362196 21923245 22332524 21987036 21306110 20930381 21406322 22477824 23532741 25048989
9157B5048989P27107Q7532P60697Q69497O49620O66459J219302J253037L57540
$$ 25048989 25776096 25863628 26624325 27493822 28143442 28809901 30029203 31282240 31639780
9148C1639780M06570L5207L09645J349874J411340J839379J161502M50073J79005
$$ 31639780 32046350 32081557 32391202 33741076 35152416 36991795 38153297 38603370 38782375
9139C8782375J41658J009326J382111J085092J905365Q12551J177239J321377
$$ 38782375 38924033 39933359 41315470 42400562 44305927 45118478 46295717 47617094
9131D7617094R36075J900373J625983K022791K422452J792045J516903K088860
$$ 47617094 48553169 50453542 52079525 54102316 56524768 58316813 59833716 61922576
9123F1922576J293635J672978K385283J299688J754540K000019J779814J839846
$$ 61922576 63216211 64889189 67274472 68574160 70328700 72328719 74108533 75948379
9115G5948379K146963K745220K727623K609552K043789K614499K394761K471274
$$ 75948379 78095342 80840562 83568185 86177737 88221526 90836025 93230786 95702060
9107I5702060M258952M058179M037198M243004L872722M266221M985624N251944
$$ 95702060 99961012 104019191 108056389 112299393 116172115 120438336 125423960 130675904
9099A30675904O519400P321559P833205Q169769Q388712R558466R472381J0270321
$$ 130675904 137195304 144516863 152350068 160519837 168908549 178467015 187939396 198209717
9091A98209717J1775263J1930592J1363253J1660096J1856825J1302503J1300348
$$ 198209717 209984980 221915572 233278825 244938921 256795746 268098249 279398597
9084B79398597J0441474Q414773N348237M426343K557391P37406l31285o80214
$$ 279398597 289840071 298254844 303603081 308029424 310586815 311324221 310992936 310312722
9076C10312722r6629j327861j606012o69404j202455r60267m86616m00146j303875
$$ 310312722 310216093 308888232 307282220 306612816 305410361 304450094 303963478 303563332 302259457
9067C02259457j996465j658656l400225m638580n426531p373093r229154j0022454
$$ 302259457 300262992 298604336 295204111 290565531 285139000 277765907 268536753 258514299
9059B58514299j0428457j1714067j2010971j0722839j0926611j1426804j0774178
$$ 258514299 248085842 236371775 224360804 213637965 202711354 191284550 180510372
9052A80510372r485546r715570r905152q227390p714219p956182o810622o188381
$$ 180510372 171024826 161309256 151404104 143176714 135462495 127506313 120695691 114507310
9044A14507310n571793n002691n421401m620511l375425m326114l654458l108693
$$ 114507310 108935517 103932826 98511425 93890914 90515489 86189375 82534917 79426224
9036G9426224l026950k723487k761831j300943j283068k650221j903085j526503
$$ 79426224 76399274 73675787 70913956 69613013 68329945 65679724 63776639 62250136
9028F2250136j349146j801633j784116j101185k456234j950263p15295j928017
$$ 62250136 60900990 59099357 57315241 56214056 53757822 51807559 51092264 49164247
9020D9164247j789679j051829q80759j614867k242229o57457r53869j468973j152080
$$ 49164247 47374568 46322739 45441980 43827113 41584884 40927427 39973558 38504585 37352505
9011C7352505q21586j516114j570905m87599k71891j157371o25763j12231n80400
$$ 37352505 36530919 35014805 33443900 32956301 32684410 31527039 30901276 30789045 30208645
9002C0208645l46378p11051j257969r13207q60700m96215k58251J82025l1866
$$ 30208645 29862267 29151216 27893247 26980040 26119340 25623125 25364874 25546899 25515033
8993B5515033j161834l50393j15532n28941m24642l60927K60597P2l27102N91909
$$ 25515033 24353199 24002806 23887274 23358333 22933691 22572764 22833361 22833433 22506331 23098240
8983B3098240j17238m89325j58403K53747m88411o01982M08845O18084j47394
$$ 23098240 22981002 22491677 22333274 22587021 22098610 21496628 21905473 22523557 22376163
8974B2376163N51256N87091n6205J88291K25439M05171K46054o19511K701P69616
$$ 22376163 22927419 23514510 23458305 23646596 23872035 24277206 24523260 23903749 23906450 24676066
8964B4676066J42054R00366J072094L58689j59371J68627O54331P44873J080458
$$ 24676066 24818120 25718486 26790580 27149269 26989898 27158525 27812856 28557729 29638187
8955B9638187N08894J014354J627932N90628J195631J298815J159431J148095
$$ 29638187 30147081 31161435 32789367 33379995 34575626 35874441 37033872 38181967
8947C8181967J803008K479555J925133J750527K451453K017423J683979K026481
$$ 38181967 39984975 42464530 44389663 46140190 48591643 50609066 52293045 54319526
8939E4319526K756764K182909J529434K304441K815444K023382K967157L353676
$$ 54319526 57076290 59259199 60788633 63093074 65908518 67931900 70899057 74252733
8931G4252733L220656M017975M461634N205100N270002M929153M734852M010356
$$ 74252733 77473389 81491364 85952998 91158098 96428100 101357253 106092105 110102461
8923A10102461K429919K598944K520514J970604N50265m33100n94327n47357j89745
$$ 110102461 112532380 115131324 117651838 119622442 120172707 119739607 119145280 118597923 118408178
8914A18408178O2188J42416l28713p17214o60501p6929j77763n13692Q0292P14107
$$ 118408178 118470366 118612782 118284069 117566855 116906354 116829425 116651662 116137970 116218262 116932369
8904A16932369L85891N87027J639715J425829M44458J083881J696700N25406m67154
$$ 116932369 117318260 117905287 119545002 120970831 121415289 122499170 124195870 124721276 124254122
8895A24254122p88094n92080p14081n19885l03113m57387j620322q16003k1997
$$ 124254122 123466028 122873948 122159867 121639982 121336869 120879482 119259160 118443157 118421160
8886A18421160j347562o65929R43465Q45246R19850P77278l89625j285806j472663
$$ 118421160 117073598 116407669 117351134 118196380 119116230 119893508 119503883 118218077 116745414
8877A16745414j037395j295241j783302j573500j726024k010746j861583k123935
$$ 116745414 115708019 114412778 112629476 111055976 109329952 107319206 105457623 103333688
8869A03333688j832081j565263p15216m18166j187205j273949j716124k215851
$$ 103333688 101501607 99936344 99221128 98802962 97615757 96341808 94625684 92409833
8861I2409833j581489q55523k149901k832831l006120l377464l677707l003236
$$ 92409833 90828344 89972821 87822920 84990089 81983969 78606505 74928798 71925562
8853G1925562k442645k028421k098222j950780j465099k458486l190848j496070
$$ 71925562 69482917 67454496 65356274 63405494 61940395 59481909 56291061 54794991
8845E4794991j836587j821130j986182k915226j683217j650921j729134j862011
$$ 54794991 52958404 51137274 49151092 46235866 44552649 42901728 41172594 39310583
8837C9310583k116050k590631k418302j758070j918774k744593j634591j002667
$$ 39310583 37194533 34603902 32185600 30427530 28508756 25764163 24129572 23126905
8829B3126905p20475r53795p86704j997761k075501n82866m09915n84908n67218
$$ 23126905 22406430 21452635 20665931 18668170 16592669 16009803 15599888 15014980 14447762
8820A4447762n87372n30337n96738o64217q43012R0883p28864m24556p5291j036498
$$ 14447762 13860390 13330053 12733315 12069098 11226086 11316969 10588105 10163549 10088258 9051760
8810I051760p95351p30979l18435M80345O92519P5677K88748l20070j289442r80738
$$ 9051760 8256409 7525430 7206995 7687340 8379859 8455536 8744284 8424214 7134772 6154034
8800F154034p26549M4592P62333N71442N80062k50067p34352o47885o12450j48926
$$ 6154034 5427485 5472077 6234410 6805852 7385914 7135847 6401495 5753610 5141160 4992234
8790D992234k70428K5157K81017o3424N55226P69626j06353k74443m60854o07301
$$ 4992234 4721806 4746963 5027980 4964556 5519782 6289408 6183055 5908612 5447758 4840457
8780D840457p12095r7409M75391N0001K00661M81926M7272p63030n81908K47511
$$ 4840457 4128362 4030953 4506344 4556345 4757006 5238932 5286204 4523174 3941266 4188777
8770D188777k07397k53906N36924K6283J19451j84877o09913n21156K84341L44459
$$ 4188777 3981380 3727474 4264398 4290681 4410132 4225255 3615342 3094186 3378527 3722986
8760C722986J42120l27177M43967k34710o31786L55094j42475o44033J51795N48489
$$ 3722986 3865106 3537929 3981896 3747186 3115400 3470494 3328019 2683986 2835781 3384270
8750C384270j534l86201M56380J75664j95973J68138M5299n77679j36839M46070
$$ 3384270 3382736 2996535 3452915 3628579 3432606 3600744 3646043 3068364 2931525 3377595
8740C377595L9542l14313o893M84877p5970j5011L78758l79824n58870L1108q9732
$$ 3377595 3417137 3102824 3095931 3580808 3504838 3489827 3868585 3488761 2929891 2960999 2871267
8729B871267L04736K6053m27418K68303K20229O5895k65217q4172M14786n76024
$$ 2871267 3176003 3202056 2774638 3042941 3263170 3329065 3063848 2979676 3394462 2818438
8719B818438P3922N28940k58737o42774J25639N43808m6342K64990K8424j68833
$$ 2818438 2892360 3421300 3162563 2519789 2645428 3189236 3142894 3407884 3436308 3267475
8709C267475n79227l68884K81909o61288K14137J081940L67389n05342q422k56620
$$ 3267475 2688248 2319364 2601273 1939985 2154122 3236062 3603451 3098109 3089687 2833067
8699B833067o21051k21297L18109N80785M7490N59743O59302n25318r31767m13268
$$ 2833067 2212016 1990719 2308828 2889613 2937103 3496846 4156148 3630830 2699063 2285795
8689B285795o88938l23136J30857R50242N80106j60684J55698j41540q19157n32478
$$ 2285795 1596857 1273721 1404578 2354820 2934926 2774242 2929940 2788400 1969243 1436765
8679A436765K36122J20139l161M75063l583m76627k81580J85268K87158j37743
$$ 1436765 1672887 1793026 1789865 2264928 2261345 1784718 1503138 1688406 1975564 1837821
8669A837821k87856J25650k34740j56591j49363j57825P14557k65123L37715j9807
$$ 1837821 1549965 1675615 1440875 1284284 1134921 977096 1691653 1426530 1764245 1744438
8659A744438n45652n17066j05415J86815L71698J34497L75106P1932p20483j68682
$$ 1744438 1198786 681720 576305 763120 1134818 1269315 1644421 1716353 995870 827188
8649H27188r7880k34955J09041P55795J55722m26794J12411l53925k71611K91138
$$ 827188 729308 494353 603394 1359189 1514911 1088117 1200528 846603 574992 866130
8639H66130O4153Q2276L68057r0059q1032l21896K24144K44606q96681Q47691
$$ 866130 930283 1012559 1380616 1290557 1209525 887629 1111773 1356379 459698 1307389
8629A307389P93258q81765l93464J72308r178J19893K05991P6002R9350j05542
$$ 1307389 2100647 1218882 825418 997726 988548 1108441 1314432 1390434 1489784 1384242
8619A384242L24579n85024n06687l96363j8670M64603O01415P67776k62348j45238
$$ 1384242 1708821 1123797 617110 220747 202077 666680 1268095 2035871 1773523 1628285
8609A628285n97578q99403L37343L35855L51147Q72270k51574n19971n17872O128
$$ 1628285 1030707 131304 468647 804502 1155649 2027919 1776345 1256374 738502 744630
8599G44630j55964p04592N37957O52616o0407N45506q3066r452k71093p93717
$$ 744630 588666 -115926 422031 1074647 1014240 1559746 1476680 1467228 1196135 402418
8589D02418n6911m36044m83484P49718L05939L33551O90619J45381p79281R7309
$$ 402418 345507 -90537 -574021 175697 481636 815187 1505806 1651187 871906 969215
8579I69215l77933j03241J37738l13908K43436P3955k79246k16337N63091m6940
$$ 969215 591282 488041 625779 311871 555307 629262 350016 133679 696770 649830
8569F49830J28792R69505J3326n32279q64035m42285J75661k45770M81335L07952
$$ 649830 778622 1748127 1761453 1229174 365139 -77146 98515 -147255 334080 642032
8559F42032p4354L08040J43215L3399J32770n570j23264R284K60385p95689k74301
$$ 642032 567678 875718 1018933 1052332 1185102 1179532 1056268 1065552 1325937 530248 255947
8548B55947P87415k66700l84909N91738J38724j49794J89704N97900k02037j001930
$$ 255947 1043362 776662 391753 983491 1122215 972421 1162125 1760025 1557988 556058
8538E56058Q2427O77132n86131M79164O93054p61302m75528M07670L86007o60274
$$ 556058 638485 1315617 729486 1208650 1901704 1140402 664874 1072544 1458551 798277
8528G98277K55186K96784m27775K17964Q2309o02299o25588J86443Q37860M43036
$$ 798277 1053463 1350247 922472 1140436 1222745 620446 -5142 181301 1019161 1462197
8518A462197N32455N33310r57004q12906O4679l27304j72027O00459P41244m50353
$$ 1462197 1994652 2527962 1570958 758052 822731 495427 323400 923859 1665103 1214750
8508A214750o14329J90378J0123K80747N68400J04571J85301m96683o31297q00349
$$ 1214750 600421 790799 800922 1081669 1650069 1754640 1939941 1443258 811961 11612
8498A1612j074212J02244K47486Q25283K291902N01941p87309p36879q64265o36316
$$ 11612 -1062600 -960356 -712870 112413 2404315 2906256 2118947 1382068 517803 -118513
8488a18513l11174Q77809L47518l30971J019282j28084o53143m622o31927M78664
$$ -118513 -429687 448122 795640 464669 1483951 1355867 702724 698102 66175 544839
8478E44839R8407o9750M72371l26363o36034j51299p2320J74059K77049O00942
$$ 544839 643246 573496 1045867 719504 83470 -67829 -140149 33910 310959 911901
8468I11901L97834j40356J16182n81137o24082j96765L00602J95256l20043k0206
$$ 911901 1309735 1169379 1285561 704424 80342 -116423 184179 379435 59392 39186
8458C9186L37464M0109L00654N07730j08498j61897l7808M72934m64997j13409
$$ 39186 376650 416759 717413 1225143 1116645 954748 916940 1389874 924877 811468
8448H11468j15999q98483L98187Q28274J39214K96221K84021L0105m01376l85985
$$ 811468 695469 -203014 195173 1023447 1162661 1458882 1742903 1773008 1371632 985647
8438I85647l48015m55105P7227P3344J78367O28177K65729l62863m39568n3858
$$ 985647 637632 182527 259754 333098 511465 1139642 1405371 1042508 602940 549082
8428E49082J81259J26567K70147K44302j97200l82229k00766o65006r3503K80309
$$ 549082 730341 856908 1127055 1371357 1174157 791928 591162 -73844 -167347 112962
8418A12962N99273J87969K62289J68441n84130J1274N75802r05451k97478Q67745
$$ 112962 712235 900204 1162493 1330934 746804 758078 1333880 428429 130951 998696
8408I98696m28701J5665K56551l16644m86729Q08687J282049l98747n33004Q1485
$$ 998696 569995 585660 842211 525567 38838 847525 2129574 1730827 1197823 1279308
8398A279308r51925j207127M33104J340098l49763n19727R98574P16714q25525
$$ 1279308 327383 -879744 -446640 893458 543695 23968 1022542 1739256 913731
8389I13731j42618L30381q82894o69206R85112J003681o71050j55237L31624m69587
$$ 913731 771113 1101494 218600 -450606 534506 1538187 867137 711900 1043524 573937
8379E73937k69257r079L86649K78313l27993Q6965j90270p72629O42524P93897
$$ 573937 304680 295601 682250 960563 632570 719535 529265 -243364 399160 1193057
8369A193057j78424K89772j65425o67882o32072M92982L58052n44920k31964O39167
$$ 1193057 1014633 1304405 1138980 471098 -160974 332008 690060 145140 -86824 552343
8359E52343P93530l02651n4798j43723j030696K84541R48101O5462k21827O2486
$$ 552343 1345873 1043222 988424 844701 -185995 98546 1046647 1112109 890282 952768
8349I52768k64202n28847P76242N1521n95167j14541L91565j96522k06484N12992
$$ 952768 688566 159719 935961 987482 392315 277774 669339 472817 266333 779325
8339G79325j19772k54225L53358K57233r74631l4332J251096j80305l34388L81072
$$ 779325 659553 405328 758686 1015919 41288 6956 1258052 1077747 743359 1124431
8329A124431p07004J69341O63435J75242j72616j105195m41586K34652K59198
$$ 1124431 417427 586768 1250203 1425445 1252829 147634 -293952 -59300 199898
8320A99898O27718J99284l60215j99036L95487M7351k79243m41406n58373K74040
$$ 199898 827616 1026900 666685 467649 863136 910487 631244 189838 -368535 -94495
8310i4495R39625m98803j59269N15554k41056L40938R36984l85117p15339l86120
$$ -94495 845130 346327 187058 702612 461556 802494 1739478 1354361 639022 252902
8300B52902P3679j42353R3730J9891r0705J98143N9482O5154m75499K64853R56121
$$ 252902 326581 184228 277958 297849 207144 405287 464769 529923 54424 319277 1275398
8289A275398J86432o1981N9635j775879q78563P73700L4824l24428Q20791P73069
$$ 1275398 1461830 1399849 1459484 -316395 -1194958 -421258 -386434 -710862 109929 882998
8279H82998J68538M79071J00150r19263q84288k79529J288809K77910r53427j54510
$$ 882998 1051536 1530607 1630757 711494 -172794 -452323 836486 1114396 160969 6459
8269F459l20740P9932J294460P89206Q7573l48109p24410K0655J1580p96962k48895
$$ 6459 -314281 -234349 1060111 1849317 1936890 1588781 864371 885026 896606 99644 -149251
8258a49251P70060K53559L84765J091346r24178q82875J33259K01118J60828K0774
$$ -149251 620809 874368 1259133 2350479 1426301 543426 676685 877803 1038631 1059405
8248A059405K20616n0680q40545L21042J97998r42191N10482Q80899k43166l22534
$$ 1059405 1280021 1229341 388796 709838 907836 -34355 476127 1357026 1113860 791326
8238G91326M882n39393j32784J005317Q52226o07320q22708q22294N84637N54001
$$ 791326 796208 256815 124031 1129348 1981574 1374254 551546 -270748 313889 867890
8228H67890K56835k40820k12623L84457K89913p481j56677l35968j130528J096
$$ 867890 1124725 883905 671282 1055739 1345652 1338171 1181494 845526 -285002 -283906
8218b83906J257937l66343q20206O00310L97803L18871J315312L26299j409425
$$ -283906 974031 607688 -212518 387792 785595 1104466 2419778 2746077 1336652
8209A336652j008975j04119l68005k51581R6431L40469N73130O18177Q7131r95474
$$ 1336652 327677 223558 -144447 -396028 -299597 40872 614002 1232179 1319310 323836
8199C23836q2731Q89720k65752N1190j46045j583421r60899J882531J864706j415538
$$ 323836 241105 1130825 865073 916263 770218 -813203 -1774102 108429 1973135 557597
8189E57597L22307M47335o30949n6702O90830l61125q42581Q80640J362430o7687
$$ 557597 879904 1327239 696290 639588 1330418 969293 126712 1007352 2369782 2302095
8179B302095j546149o33982p28153k66627J350190Q56959o1402O8921l37407L33527
$$ 2302095 755946 121964 -606189 -872816 477374 1334333 1272931 1341852 1004445 1337972
8169A337972O20629l56191p95155J87284Q60615l6134n64157m77569l49719p1087
$$ 1337972 1958601 1602410 807255 994539 1855154 1819020 1254863 777294 427575 356488
8159C56488K21140P38928K77644q7202L35532J55057k41976j350551r69393M62502
$$ 356488 577628 1316556 1594200 1506998 1842530 1997587 1755611 405060 -564333 -101831
8149a01831Q39808K62144M83634j17815j067070m04357Q75443O50386j187576
$$ -101831 737977 1000121 1483755 1365940 298870 -105487 769956 1420342 232766
8140B32766Q1633J348218m0009n29656K0921o87320j347280O58488J891427K29336
$$ 232766 314399 1662617 1622608 1092952 1113873 426553 -920727 -262239 1629188 1858524
8130A858524m84777j17997n62486k86751j23664L57670o5360l5638P03324j14855
$$ 1858524 1373747 1255750 693264 406513 282849 640519 575159 539521 1242845 1127990
8120A127990p57223o98194J238P95419N35944M50868J29449p62157j29461o33659
$$ 1127990 370767 -327427 -326189 469230 1005174 1456042 1585491 823334 693873 60214
8110F0214O1803j8711r6244P81829Q11111j50221p99821j10898r6353k64190R25727
$$ 60214 122017 103306 7062 788891 1600002 1449781 649960 539062 442709 178519 1104246
8099A104246J094783k64310r55441n99575o07502J31043N20437p87M90300N18684
$$ 1104246 2199029 1934719 979278 379703 -227799 -96756 423681 422894 913194 1431878
8089A431878L75093m1766m94382n99955j034003K62166J241675k23807M0228J78080
$$ 1431878 1806971 1765205 1270823 670868 -363135 -100969 1140706 916899 957127 1135207
8079A135207j81112j79605K58568R8609o32587l34430M89428l04866l67247P01249
$$ 1135207 954095 774490 1033058 1131667 499080 164650 654078 349212 -18035 683214
8069F83214M33610l65671M5004K46458n92954p08179L98865R15553k18338o27738
$$ 683214 1116824 751153 796157 1042615 449661 -258518 140347 1055900 837562 209824
8059B09824j92446l13376M62961M44697O37501N83769k66173k83911n29147m86536
$$ 209824 17378 -295998 166963 611660 1249161 1832930 1566757 1282846 753699 267163
8049B67163j151319j03476J002967J041120N89708o57446n12116n00598m61269
$$ 267163 -884156 -987632 15335 1056455 1646163 988717 476601 -23997 -485266
8040d85266O23789J199148j73969m09849l02752j96089l85640p89009j839R82567
$$ -485266 138523 1337671 1163702 753853 451101 255012 -130628 -919637 -921476 61091
8030F1091N08516l6304N51466l49959m98187K86884R62550k69433n02219m60722
$$ 61091 569607 533303 1084769 734810 236623 523507 1486057 1216624 714405 253683
8020B53683O0967j18437n67362k42286J26519K06280P97055R30159K07350m67350
$$ 253683 314650 196213 -371149 -613435 -486916 -280636 516419 1446578 1653928 1186578
8010A186578o71429O8681j21904k26782n68902k81163K92879O39183J219043Q3677
$$ 1186578 515149 583830 461926 235144 -333758 -614921 -322042 317141 1536184 1619861
8000A619861q01015p1652m29860l92184N2621J94902l38590L85R26476Q85378
$$ 1619861 818846 747194 317334 -74850 -22229 172673 -165917 -165532 760944 1646322
7990A646322o12021J51003P45757r69295n00038K06713j42716p19441M72036J379969
$$ 1646322 1034301 1185304 1931061 961766 461728 668441 525725 -193716 278320 1658289
7980A658289m14397o00792O45713K45186l44636n19004K60938k9675n50298P90299
$$ 1658289 1243892 643100 1288813 1533999 1189363 670359 931297 901622 351324 1141623
7970A141623J42681j076116l66408N61069M75324J75747J61619m0621k85071k52288
$$ 1141623 1284304 208188 -158220 402849 878173 1053920 1215539 1174918 889847 637559
7960F37559N1565P63864N0024n91509j31681m66261r43935J30257O57880M09455
$$ 637559 689124 1452988 1503012 911503 779822 313561 -630374 -500117 157763 567218
7950E67218O36967O52323L17054n51536o25765l19102l37195k37036l39287O7447
$$ 567218 1204185 1856508 2173562 1622026 996261 677159 339964 102928 -236359 -168912
7940a68912L88089K87509K1548K59976O48644N09818p16635m20789o9995j051304
$$ -168912 219177 506686 528234 788210 1436854 1946672 1230037 809248 739253 -312051
7930c12051m01837R48094M48214n46356l70869O64753K89043m17909M49973K80953
$$ -312051 -713888 234206 682420 136064 -234805 429948 718991 301082 751055 1032008
7920A032008k73414J07109j00599o47308k12620j37514L03503M41834J56058J17185
$$ 1032008 758594 865703 765104 117796 -94824 -232338 71165 512999 669057 786242
7910G86242J22674m33801n1636k07956m53774j75817O46064Q75488O1182q21230
$$ 786242 908916 475115 423479 215523 -238251 -414068 231996 1107484 1168666 347436
7900C47436n62529J39123O3700J75656P27794j03494o58392Q11719k39857j193103
$$ 347436 -215093 -75970 -12270 163386 891180 787686 129294 941013 701156 -491947
7890d91947k68992L72976k15242O26300Q90155n23514q26173P4783R7477m33022
$$ -491947 -760939 -387963 -603205 23095 913250 389736 -436437 -361654 -264177 -697199
7880f97199K00421J017181J26331k87541M14336o44489j103753O95001Q65171
$$ -697199 -496778 520403 646734 359193 773529 129040 -974713 -279712 585459
7871E85459l09751p7761K99893k89412p21505Q68207J61397p42020P3341M22917
$$ 585459 275708 197947 497840 208428 -513077 355130 516527 -225493 -152152 270765
7861B70765j40609K54633K79444o02730j155842L63320N97730j82495j54191J49184
$$ 270765 130156 384789 664233 61503 -1094339 -731019 -133289 -315784 -469975 -320791
7851c20791k87130N27808O20661n25331l32128o0831j08514k90852m45978M76832
$$ -320791 -607921 -80113 540548 15217 -316911 -377742 -486256 -777108 -1223086 -746254
7841g46254O58949m54355L00541O29425p51136r7675N67023J13284K31961n31032
$$ -746254 -87305 -541660 -241119 388306 -362830 -460505 106518 219802 451763 -79269
7831g9269m30421L58885l73794m12643O07144q4235o03016P47578Q98710l3366
$$ -79269 -509690 -150805 -524599 -937242 -330098 -414333 -1017349 -269771 628939 595573
7821E95573P5302j31930q59693n54721L55465j76448k40480J37871N26990p504
$$ 595573 670875 538945 -320748 -875469 -520004 -696452 -936932 -799061 -272071 -279575
7811b79575Q232J89964Q6255o61631J15495N48608o09863l04221Q03672r7193
$$ -279575 -271343 -81379 4876 -656755 -541260 7348 -602515 -906736 -103064 -200257
7801b00257J72420K07251k10159j79978K46154q8340m8464L49402J70922l74808
$$ -200257 -27837 179414 -30745 -210723 35431 -52909 -101373 248029 418951 44143
7791D4143p6347k00100m93008k37650n8385M45220O33603N34583k86254p52364
$$ 44143 -32204 -232304 -725312 -962962 -1021347 -576127 57476 592059 305805 -446559
7781d46559l95826k48210k27292J216682M58352p46308K69427M01537q16336j375381
$$ -446559 -842385 -1090595 -1317887 -101205 357147 -389161 -119734 281803 -534533 -1909914
7771a909914K10741J020392j62324R33795J150104j394231j525033k39540P65673
$$ -1909914 -1699173 -678781 -841105 92690 1242794 -151437 -1676470 -1916010 -1150337
7762a150337m36020N70990J593749k65207K32927O0990j380168j157476l40385
$$ -1150337 -1586357 -1015367 578382 313175 546102 607092 -773076 -1930552 -2270937
7753b270937O40208J233988N42935J85214j53186p94204l04305J06881l77811
$$ -2270937 -1630729 -396741 146194 331408 178222 -615982 -920287 -813406 -1191217
7744a191217K85180M90805P53675J06490j25242j296849p49346P38959j48014
$$ -1191217 -906037 -415232 338443 444933 319691 -977158 -1726504 -987545 -1135559
7735a135559L1414Q34532K31609L03251J81112m93484n50839o51516j89816R50518
$$ -1135559 -1104145 -269613 -38004 265247 446359 -47125 -597964 -1249480 -1439296 -488778
7725d88778O21969p25920q1008O66257j52049J19683P39780n7863j230104p35828
$$ -488778 133191 -592729 -673737 -7480 -159529 -39846 699934 642071 -588033 -1323861
7715a323861Q40592m6022j194536N1460Q03221M58731M90501O58481m20296p46733
$$ -1323861 -483269 -529291 -1723827 -1672367 -869146 -410415 80086 738567 318271 -428462
7705d28462j29638L18356k05921q24563l86307K81029R57406N26990j35391k60370
$$ -428462 -558100 -239744 -445665 -1270228 -1656535 -1375506 -418100 108890 -26501 -286871
7695b86871J58859k26049o80721K84549M39150n20058P8817J111008m83372r00038
$$ -286871 -128012 -354061 -1034782 -750233 -311083 -831141 -752324 358684 -124688 -1024726
7685a024726J10474K5942P9400K55751j45310K39844K92755l7560J64834J16941
$$ -1024726 -914252 -888310 -808910 -553159 -698469 -458625 -165870 -203430 -38596 78345
7675G8345n11926n85307l46947L28704L09255m91453j7840Q07747j54249j400
$$ 78345 -433581 -1018888 -1365835 -1037131 -727876 -1219329 -1237169 -429422 -583671 -585071
7665e85071P99201n72089l62474J78082p6421n24049k7579L04059M98898J15238
$$ -585071 214130 -357959 -720433 -542351 -618772 -1142821 -1170400 -866341 -367443 -252205
7655b52205M16504O0348n70677n20742k4164P7624l90994M12015L42672o0190
$$ -252205 164299 224647 -346030 -866772 -890936 -813312 -1204306 -792291 -449619 -509809
7645e09809N38661k52361q33672j02709j58832K51944J009289L60337l77577k35566
$$ -509809 28852 -223509 -1057181 -1159890 -1318722 -1066778 -57489 302848 -74729 -310295
7635c10295k69721o42306l49355M13250P2692J65996M15991M58619j89167l07242
$$ -310295 -580016 -1222322 -1571677 -1158427 -1085735 -919739 -503748 -45129 -234296 -541538
7625e41538K87988K78201l86336k73829k65521k74225r2239o7695J72693K50223
$$ -541538 -253550 24651 -361685 -635514 -901035 -1175260 -1267499 -1335194 -1162501 -912278
7615i12278K65437L03003j59066l39227J02846L5815j31133j58691M18759L21401
$$ -912278 -646841 -343838 -502904 -842131 -739285 -703470 -834603 -993294 -574535 -253134
7605b53134l69779k7969J50717m36820K02628K30840J96212m25258K34086Q17778
$$ -253134 -622913 -650882 -500165 -936985 -734357 -503517 -307305 -732563 -498477 319301
7595C19301n66039r03666K25306k22883n25721K92416O58572M7881N77268K97284
$$ 319301 -246738 -1150404 -925098 -1147981 -1673702 -1381286 -722714 -674833 -97565 199719
7585A99719J06689J85751q53753k89314J939m65110j31427J85735n13753L11380
$$ 199719 306408 492159 -361594 -650908 -648969 -1114079 -1245506 -1059771 -1573524 -1262144
7575a262144L96099K22105M67113L7820n53734j68145R2682N28395l5724n26129
$$ -1262144 -866045 -643940 -176827 -139007 -692741 -860886 -768204 -239809 -275533 -801662
7565h01662N45199j06807q46235k86154J04612k59216L27507J390647O32667j89641
$$ -801662 -256463 -363270 -1209505 -1495659 -1391047 -1650263 -1322756 67891 700558 510917
7555E10917l64027R5823l08852p02446N2961k29598j74124L71450l0784l78769
$$ 510917 146890 242713 -66139 -768585 -715624 -945222 -1119346 -747896 -778680 -1157449
7545a157449M33164N55498m1808O4720q715q17303m39236M95479K31010l81448
$$ -1157449 -724285 -168787 -210595 -145875 -154590 -971893 -1411129 -915650 -684640 -1066088
7535a066088N98274N11605m06201m27481k65100j41647r5228J96096N05656J17495
$$ -1066088 -467814 43791 -362410 -789891 -1054991 -1196638 -1291866 -1095770 -590114 -472619
7525d72619M2769L35784m25661j86345P92767o52311n15993N43285k33764l89097
$$ -472619 -429850 -94066 -519727 -706072 86695 -565616 -1081609 -538324 -772088 -1161185
7515a161185J59831p7702Q6432P68979M64153r7901o62453k23030L11015l13410
$$ -1161185 -1001354 -1079056 -992624 -223645 240508 142607 -519846 -742876 -431861 -745271
7505g45271k49862K97807k04834k43124J13644M4814K01954L62182J01882J63527
$$ -745271 -995133 -697326 -902160 -1145284 -1031640 -986826 -784872 -422690 -320808 -157281
7495a57281M2346m7260k34413J57729j3942p32369L28142J92123p71968K26457
$$ -157281 -114935 -162195 -396608 -238879 -252821 -985190 -657048 -464925 -1236893 -1010436
7485a010436J216464L62514j121653K69967J73095q52843j14555J073235k53092
$$ -1010436 206028 568542 -553111 -283144 -110049 -962892 -1077447 -4212 -257304
7476b57304q27686M31437L91306n07986k51185L10375L96184j77193l34003j76176
$$ -257304 -1084990 -653553 -262247 -770233 -1021418 -711043 -314859 -492052 -826055 -1002231
7466a002231j21546M62420L17376K90873J1401o01273n11038k48239L29687k8648
$$ -1002231 -1123777 -661357 -343981 -53108 -41707 -642980 -1154018 -1402257 -1072570 -1101218
7456a101218O51046Q62715J9795k52816l90229n91196j66016J77827M42342J49869
$$ -1101218 -450172 412543 432338 179522 -210707 -801903 -967919 -790092 -347750 -197881
7446a97881K30775p13167q60960M21918K84401N50216N87232N57802Q3200q81884
$$ -197881 32894 -680273 -1541233 -1119315 -834914 -284698 302534 860336 943536 61652
7436F1652j61908J35274j248811J67088R86335L1371j43219J84846K4269j59126
$$ 61652 -100256 35018 -1213793 -1046705 -60370 -28999 -172218 12628 36897 -122229
7426a22229Q5078L56030p1500k10526K9678J00704n00152N5944J50736k32398
$$ -122229 -37151 318879 247379 36853 66531 167235 -332917 -276973 -126237 -358635
7416c58635j60488l9491l93257M37198O55543l00932O5522J115330o94556p59848
$$ -358635 -519123 -558614 -951871 -514673 140870 -160062 -94540 1020790 326234 -433614
7406d33614K62969k17005m64386L07228M09698j43836o18016J06790K69547p01726
$$ -433614 -170645 -387650 -852036 -544808 -135110 -278946 -896962 -790172 -520625 -1222351
7396a222351m09158J578685N46408n54149M19770n38554o34742k83395J71181
$$ -1222351 -1631509 -52824 493584 -60565 359205 -179349 -814091 -1097486 -926305
7387i26305R21806J78973k55739J30301k60245o32158m17469M40885L32769M40624
$$ -926305 -4499 174474 -81265 49036 -211209 -843367 -1260836 -819951 -487182 -46558
7377d6558N40675P413l33631q83576m24328M03257L06028J03759L04231K64064
$$ -46558 494117 501530 167899 -715677 -1140005 -736748 -430720 -326961 -22730 241334
7367B41334k28816m96609p70435M17901P65609J49661L81461L28673r87446q75234
$$ 241334 12518 -484091 -1254526 -836625 -71016 78645 460106 788779 -198667 -1073901
7357a073901l76294J93580N59891N80373j23287J37738J85822j71888k19143l94765
$$ -1073901 -1450195 -1256615 -696724 -116351 -239638 -101900 83922 -87966 -307109 -701874
7347g01874M31748N98255m11596J96039J87704q54443m36918L72528m73371j67174
$$ -701874 -270126 328129 -83467 112572 300276 -554167 -991085 -618557 -1091928 -1259102
7337a259102J018730L84636j65734J19907j04272n19269k7924J64849j36866l67451
$$ -1259102 -240372 144264 -21470 98437 -5835 -525104 -553028 -388179 -525045 -892496
7327h92496o5920L24318n49252k66063J091713l9926n80557Q06438P29413p50326
$$ -892496 -958416 -634098 -1183350 -1449413 -357700 -397626 -978183 -171745 557668 -192658
7317a92658j55506m13963m48142L8893K54866N19829J00092l39920M26045N46570
$$ -192658 -348164 -762127 -1210269 -1171376 -916510 -396681 -296589 -636509 -210464 336106
7307C36106o36094l4000l3999o25321J91796J04704j58870J52226R0439L1605
$$ 336106 -299988 -333988 -367987 -993308 -801512 -696808 -855678 -703452 -613013 -581408
7297e81408K51181p2400K05927j10353l90114J19384n32155J53709M73124n14503
$$ -581408 -330227 -402627 -196700 -307053 -697167 -577783 -1109938 -956229 -483105 -997608
7287i97608K49828L39859J27737k25232N7891K46583l85074k28639P478k81126
$$ -997608 -747780 -407921 -280184 -505416 -447525 -200942 -586016 -814655 -807177 -1088303
7277a088303L47416J001808M60504m49845l57909m56748o21955j29994M13122
$$ -1088303 -740887 260921 721425 271580 -86329 -543077 -1165032 -1295026 -881904
7268h81904R28092o5570L29758L82639o40666o51609M24794j61297N4261O45315
$$ -881904 46188 -19382 310376 693015 52349 -599260 -174466 -335763 -281502 363813
7258C63813k21232l85913j50718l89066L87510M82433L72872N84824k62448o86308
$$ 363813 142581 -243332 -394050 -783116 -395606 86827 459699 1044523 782075 95767
7248I5767j94304r23971r8251Q68043N62644P1889L89128p12001l88204K5719
$$ 95767 -98537 -1022508 -1120759 -252716 309928 381817 770945 58944 -329260 -303541
7238c03541L36463P35432N8217k01175n9783j90095n72317j39642K13157M17960
$$ -303541 32922 768354 826571 625396 565613 375518 -196799 -336441 -123284 294676
7228B94676k01296J69058j27503k18030r5028J67170O19632L65308L58364L78108
$$ 294676 93380 262438 134935 -83095 -178123 -10953 608679 973987 1332351 1710459
7218A710459r11201m88014l3928J8209K57405P82339K36056l34635l08343M5683
$$ 1710459 799258 311244 277316 295525 552930 1335269 1571325 1236690 928347 974030
7208I74030K06456P665J103740O27400l44205o88396m62459k86459l26735N09185
$$ 974030 1180486 1188151 2291891 2919291 2575086 1886690 1424231 1137772 811037 1320222
7198A320222M11465R03078Q03392m72368k78038k01152n79273N9129J142826L48596
$$ 1320222 1731687 2634765 3438157 2965789 2687751 2486599 1907326 1966455 3109281 3457877
7188C457877j73509K59546n33294o62462M8907L98359M00801K1640M68173O07588
$$ 3457877 3284368 3543914 3010620 2348158 2397065 2795424 3196225 3217865 3686038 4293626
7178D293626o15178j39181J10631p42916n13216J266732L70499n59475K83392
$$ 4293626 3678448 3539267 3649898 2906982 2393766 3660498 4030997 3471522 3754914
7169C754914L89061l76313j79172J71458p8309k34102K45425R889L3378J39967
$$ 3754914 4143975 3767662 3588490 3759948 3681639 3447537 3692962 3702851 3736229 3876196
7159C876196j55352K54727K04989l5190m47275j69308K52359o25378j69930M87070
$$ 3876196 3720844 3975571 4180560 4145370 3698095 3528787 3781146 3155768 2985838 3472908
7149C472908j97460K24999N88822O97143Q84o95030l52496J80618k59112L4920
$$ 3472908 3275448 3500447 4089269 4786412 4787296 4092266 3739770 3920388 3661276 3696196
7139C696196L98494l35345L09533K00905n58937Q5177q7596q11408n1372M45855
$$ 3696196 4094690 3759345 4068878 4269783 3710846 3796023 3708427 2897019 2845647 3291502
7129C291502n22805l27557N40196l9163p66909l00806K13274k36525n61761K43280
$$ 3291502 2768697 2441140 2981336 2942173 2175264 1874458 2087732 1851207 1289446 1532726
7119A532726P1102l91077L40362J22262j80278l12978j47981K05704k39914L74525
$$ 1532726 1603828 1212751 1553113 1675375 1495097 1182119 1034138 1239842 999928 1374453
7109A374453L15525p29910l26834j09708l09237K76830L61016J04899M27457p78674
$$ 1374453 1689978 960068 633234 523526 214289 491119 852135 957034 1384491 605817
7099F05817p31128J99346j54381L01441K68211N07587O2553p06716o79775m43654
$$ 605817 -125311 74035 -80346 221095 489306 996893 1059446 352730 -327045 -770699
7089g70699n35715O98583O88309K99681K44091P1726k90462o95718k60784o55648
$$ -770699 -1306414 -607831 80478 380159 624250 695976 405514 -290204 -550988 -1206636
7079a206636L6640J105535L14695o32983o22931M35378M9414l36968P37698M11653
$$ -1206636 -1169996 -64461 250234 -382749 -1005680 -570302 -520888 -857856 -120158 291495
7069B91495o61752m04208L63341j96972p04463M05229J062242j22189l98240L13904
$$ 291495 -370257 -774465 -411124 -608096 -1312559 -907330 154912 32723 -365517 -51613
7059e1613p23419l87072P9822L87639M55808l61794O82105N29207j039936k94860
$$ -51613 -775032 -1162104 -1082282 -694643 -238835 -600629 81476 610683 -429253 -724113
7049g24113J0902l766l966O62990J05995n14056p6368m7273L56858K26115n05471
$$ -724113 -713211 -716977 -720943 -57953 48042 -466014 -542382 -589655 -232797 -6682 -512153
7038e12153K64171J22367m93075K70861j10101k04483K45492M23481L57848l37089
$$ -512153 -247982 -125615 -618690 -347829 -457930 -662413 -416921 6560 364408 27319
7028B7319l33632P0360m90500l85033l63988O89296R41935j12416N9823L76009
$$ 27319 -306313 -235953 -726453 -1111486 -1475474 -786178 155757 43341 103164 479173
7018D79173n46749m99218K42473L50049p51872l43540O10570K8194p95020J55134
$$ 479173 -67576 -566794 -324321 25728 -726144 -1069684 -459114 -430920 -1225940 -1070806
7008a070806O43603N8658k7470J116186J17031j180097m28606l06090l52610n0908
$$ -1070806 -427203 -368545 -396015 720171 837202 -342895 -771501 -1077591 -1430201 -1481109
6998a481109M35787O20291p48151j49354R91438m32913L63447J176149j53358
$$ -1481109 -1045322 -425031 -1173182 -1322536 -331098 -764011 -400564 775585 622227
6989F22227l59359l56151o50745r27826n72677J115484O82233n60049O15483M48874
$$ 622227 262868 -93283 -744028 -1671854 -2244531 -1129047 -446814 -1006863 -391380 57494
6979E7494m0854l29521N4393P4988l96775J84482K0082p21146o6109N78231J08373
$$ 57494 16640 -312881 -258488 -183500 -580275 -395793 -375711 -1096857 -1162966 -584735 -476362
6968d76362K72092M30921m74655o97193N20311O18149m4900L77025K70090l28476
$$ -476362 -204270 226651 -248004 -945197 -424886 193263 148363 525388 795478 467002
6958D67002j212888p73021O27780k74883K89318J477048M25517j96857q29802
$$ 467002 -745886 -1518907 -891127 -1166010 -876692 600356 1025873 829016 -786
6949g86l51088j32699o6443O36947r6607l25999l71155l4022p4942l3749R0485
$$ -786 -351874 -484573 -551016 85931 -10676 -336675 -707830 -741852 -816794 -850543 -760058
6938g60058Q66023P33118k77149l37716m31181j066659m63767N17314P40900q5091
$$ -760058 105965 839083 561934 224218 -206963 -1273622 -1737389 -1220075 -479175 -564266
6928e64266L50139P8960l14326K00144J28027k1625O8733j73333o417k50379k89691
$$ -564266 -214127 -135167 -449493 -249349 -121322 -142947 -74214 -247547 -253964 -504343 -794034
6917g94034q4229k40558O61438J16262l94816P9959M24565R6948J9071K37459
$$ -794034 -878263 -1118821 -457383 -341121 -735937 -655978 -231413 -134465 -115394 122065
6907A22065k01827q40965M62439J73737q49000j04786O15809Q01042j42155J12047
$$ 122065 -79762 -920727 -458288 -284551 -1133551 -1238337 -622528 178514 36359 148406
6897A48406K43169k14229n48227Q41520O301q80446m61077M70772L3971p53240
$$ 148406 391575 177346 -370881 470639 476940 -403506 -864583 -393811 -359840 -1113080
6887a113080J62361R00964n924k96334J024724j44144o83394l77108L19942p08745
$$ -1113080 -950719 -49755 -55679 -352013 672711 528567 -154827 -531935 -211993 -920738
6877i20738r2291L78393K67909K92617p2923K42747M4947n96455J98260L81524
$$ -920738 -1013029 -634636 -366727 -74110 -147033 95714 140661 -455794 -257534 123990
6867A23990m80168K60131L16412k97999k16344j87802N4903K8309L30097k397
$$ 123990 -356178 -96047 220365 -77634 -293978 -481780 -426877 -398568 -68471 -70868
6857g0868K45496j20300l79583P6839k3768k86036k18304K76480L69674L03642
$$ -70868 174628 54328 -325255 -248416 -272184 -558220 -776524 -500044 -130370 173272
6847A73272l05682j14295m6849m40765m6122R40121J34232l65883k26431n1423
$$ 173272 -132410 -246705 -293554 -734319 -780441 159680 293912 -71971 -298402 -349825
6837c49825j87256O5941L11405J81562K25891K81700L13485n72683q74124p0137
$$ -349825 -537081 -471140 -159735 21827 247718 529418 842903 270220 -603904 -674041
6827f74041k74861J63955R44645J05711k91792J47509k74799j33762l29239K54056
$$ -674041 -948902 -784947 159698 265409 -26383 121126 -153673 -287435 -616674 -362618
6817c62618J094997L33898k5132K24131o86407q48995l20375j33097l44232M34531
$$ -362618 732379 1066277 1041145 1265276 578869 -270126 -590501 -723598 -1067830 -633299
6807f33299O98008N32543M06747j60794p88777l96788K38051j3272j32310m56808
$$ -633299 64709 597252 1003999 843205 54428 -342360 -104309 -117581 -249891 -706699
6797g06699N6125L52625J24206J66097R8927m30725M02999J39935l78436L39295
$$ -706699 -650574 -297949 -173743 -7646 91281 -339444 63555 203490 -174946 164349
6787A64349K19446p98876j55581N31539p2258q708M67173l1588k95885l50852
$$ 164349 383795 -415081 -570662 -39123 -111381 -120089 347084 315496 19611 -331241
6777c31241l51294n99389K68062P28177O26320l82938J75350J3410n76177M52555
$$ -331241 -682535 -1281924 -1013862 -285685 340635 -42303 133047 146457 -429720 22835
6767B2835O2772r66924k46027J226465J85656k50929O2585L61829q52246k86350
$$ 22835 85607 -881317 -1127344 99121 284777 33848 96433 458262 -393984 -680334
6757f80334R32047k02613L4689Q43593m71137n30311o8315k42229l80585o02799
$$ -680334 251713 49100 83789 927382 456245 -74066 -142381 -384610 -765195 -1367994
6747a367994Q18490J059304J1067J21364j0635j99327q383m35092J14831L45893
$$ -1367994 -549504 509800 520867 642231 631596 432269 423886 -11206 103625 449518
6737D49518p54780l30601K68331R5421k03110L40135Q36500p8254j219793K62625
$$ 449518 -305262 -635863 -367532 -272111 -475221 -135086 701414 623160 -596633 -334008
6727c34008Q17918r9005l56393O23012r4538j189497L29808K62493j00794J41508
$$ -334008 483910 384905 28512 651524 556986 -632511 -302703 -40210 -141004 504
6717E04L48240M4482m29862m99662L91934L59232j80609k87319N46316Q8011k58669
$$ 504 348744 393226 -36636 -536298 -144364 214868 34259 -253060 293256 381267 122598
6706A22598r0837k94426j06480L70128R23627L18164q40263o89576k01351j94890
$$ 122598 31761 -262665 -369145 983 924610 1242774 402511 -287065 -488416 -683306
6696f83306Q2091R95729M01150k69256J66621O2314o34223M1248K74896l67018
$$ -683306 -601215 394514 795664 526408 693029 755343 121120 162368 437264 70246
6686G0246P1855J15416l19148J37553O32885K10313j97730K31239j26387r49803
$$ 70246 142101 257517 -61631 75922 708807 919120 721390 952629 826242 -123561
6676a23561J74048N56640O4914k35157n1267R02816m18599m65416P08672q24364
$$ -123561 50487 607127 672041 436884 385617 1288433 869834 404418 1113090 288726
6666B88726k06662R16854J73716p49654m25260J44663O0744L81384J02367r0654
$$ 288726 82064 998918 1172634 422980 -2280 142383 203127 584511 686878 596224
6656E96224j32443J02215L06780J49207L16757m80678p39842R2501J81273l77699
$$ 596224 463781 565996 872776 1021983 1338740 858062 118220 210721 391994 14295
6646A4295j25012Q13890J89761k45545L47192n87357L07651L88150M37455J76522
$$ 14295 -110717 703173 892934 647389 994581 407224 714875 1103025 1540480 1717002
6636A717002j338529p02318n8987r7240Q66681K73150J06463Q91152j1706j42347
$$ 1717002 378473 -323845 -382832 -480072 386609 659759 766222 1657374 1645668 1503321
6626A503321n9490q83570o82753M17487J208332J64976m18494m33315j78224k51591
$$ 1503321 1443831 560261 -122492 294995 1503327 1668303 1249809 816494 638270 386679
6616C86679P07035M26813n42111M7467K46359K18786m19743m4303R9496j39937
$$ 386679 1093714 1520527 978416 1025883 1272242 1491028 1071285 1026982 1126478 986541
6606I86541k34629L71112P00945l12486J12439P43154m52030o64142n75329N71342
$$ 986541 751912 1123024 1823969 1511483 1623922 2367076 1915046 1250904 675575 1246917
6596A246917J419086l40489j73425j56014o31060O7753N84617N87888j9805l61612
$$ 1246917 2666003 2325514 2152089 1996075 1365015 1432768 2017385 2605273 2585468 2223856
6586B223856k81624l52759j90323j44889l84228J60334J645344J194589n79132
$$ 2223856 1942232 1589473 1399150 1254261 870033 1030367 2675711 3870300 3291168
6577C291168j06561q36027j376884j939J098109K55523p9887O20413K08358p57081
$$ 3291168 3184607 2348580 971696 969757 2067866 2323389 2243502 2863915 3072273 2315192
6567B315192l34113M86051m7667l15946Q04673K61109n87402K97508P1329m26821
$$ 2315192 1981079 2467130 2419463 2103517 2908190 3169299 2581897 2879405 2950734 2523913
6557B523913k84348L60679j38864l00320J183989L61853o61211K7535K69187m85702
$$ 2523913 2239565 2600244 2461380 2161060 3345049 3706902 3045691 3073226 3342413 2856711
6547B856711l08796N33756j67275m20344J43733J42160j33596K33091J75710l9706
$$ 2856711 2547915 3081671 2914396 2494052 2637785 2779945 2646349 2879440 3055150 3015444
6537C015444M72032N94900K03473q88283n18587K31060n60001J76166R40133n9364
$$ 3015444 3487476 4082376 4285849 3397566 2878979 3110039 2550038 2726204 3666337 3606973
6527C606973j41933j52617N34365k68665k58363K95964j04995j47754L53329J2606
$$ 3606973 3465040 3312423 3846788 3578123 3319760 3615724 3510729 3362975 3716304 3728910
6517C728910j10083p8324N93728M35773m94554N5213J87095k13200L92284O2736
$$ 3728910 3618827 3540503 4134231 4570004 4075450 4130663 4317758 4104558 4496842 4559578
6507D559578k65898l4336p7815R40505K89641q11759J59354J61290J56587O73737
$$ 4559578 4293680 4259344 4181529 5122034 5411675 4599916 4759270 4920560 5077147 5750884
6497E750884N75850j42676q56697N1933j74044l08712M51993M68264k1467j01503
$$ 5750884 6326734 6184058 5327361 5379294 5205250 4896538 5348531 5816795 5795328 5693825
6487E693825O27007L57028j314176k87830M56472l36996Q14118Q51875l21609
$$ 5693825 6320832 6677860 5363684 5075854 5532326 5195330 6009448 6861323 6539714
6478F539714p02011k28324J58462k02474P89500J028465o58178l13615R4970o06479
$$ 6539714 5837703 5609379 5767841 5565367 6354867 7383332 6725154 6411539 6506509 5900030
6468E900030o7040N64777J132561K56062o21636J76444j3113r08660N99482N33220
$$ 5900030 5832990 6397767 7530328 7786390 7164754 7341198 7328085 6419425 7018907 7552127
6458G552127K7624L30336l5723O2676J00530l57596m07175J02712J012183M72701
$$ 7552127 7579751 7910087 7874364 7937040 8037570 7679974 7272799 7375511 8387694 8860395
6448H860395r7618m79627m11247J25189J08446Q69686R2837q01666O90742R2625
$$ 8860395 8762777 8283150 7871903 7997092 8105538 8975224 9068061 8266395 8957137 9049762
6438I049762J95799P64321o28182n76527K19862l15803K88912k30055M05168O52870
$$ 9049762 9245561 10009882 9381700 8805173 9025035 8709232 8998144 8768089 9173257 9826127
6428I826127j91480N09641R69403K57354L54492N06189j79231n66442o99259j13104
$$ 9826127 9634647 10144288 11113691 11371045 11725537 12231726 12052495 11486053 10786794 10673690
6418A0673690K41358L85884N20005K63106j49041R3725L64314O3729l72427k03174
$$ 10673690 10915048 11300932 11820937 12084043 11935002 12028727 12393041 12456770 12084343 11881169
6408A1881169l26033M37208J19408K3429r2009k86963l57222J30764J97010M90307
$$ 11881169 11555136 11992344 12111752 12135181 12043172 11756209 11398987 11529751 11726761 12217068
6398A2217068K66086J31727N00897J52842K33827Q3097Q6506m75785l85819L94351
$$ 12217068 12483154 12614881 13115778 13268620 13502447 13585544 13672050 13196265 12810446 13204797
6388A3204797J91240k3695M02339O50582K41085n22837K98611J71587j279316
$$ 13204797 13396037 13372342 13774681 14425263 14666348 14143511 14442122 14613709 13334393
6379A3334393m65221K46215K24220J18402K70824J082556o65885j299454M95705
$$ 13334393 12869172 13115387 13339607 13458009 13728833 14811389 14145504 12846050 13341755
6370A3341755L03926k62203O20926J120953l50471j20918K03789J28716j95480
$$ 13341755 13645681 13383478 14004404 15125357 14774886 14653968 14857757 14986473 14790993
6361A4790993R8444O64924M84680j72924K83461k16339j35425O92610P12754O95413
$$ 14790993 14889437 15554361 16039041 15866117 16149578 15933239 15797814 16490424 17203178 17898591
6351A7898591R76868O44400k70517L3079l16229L92046R59771N01757J050698
$$ 17898591 18875459 19519859 19249342 19282421 18966192 19358238 20318009 20819766 21870464
6342B1870464j01834k06675R21427Q38890J259653J022944J361222J085969K99827
$$ 21870464 21768630 21561955 22483382 23322272 24581925 25604869 26966091 28052060 28351887
6333B8351887R92981J589013J184244N59782Q02119R23051J331965J823495J605090
$$ 28351887 29344868 30933881 32118125 32677907 33480026 34403077 35735042 37558537 39163627
6324C9163627K012117J268343M81626Q03094l40720k60264j9746P77259R29182
$$ 39163627 41175744 42444087 42925713 43728807 43388087 43127823 43108077 43885336 44814518
6315D4814518j61373l14272r08696m84083p84740k27403J051816M40570N7580
$$ 44814518 44653145 44338873 43430177 42946094 42161354 41933951 42985767 43426337 43483917
6306D3483917l46219j641833j246079q04788J79027R35806R58275M75270m02315
$$ 43483917 43137698 41495865 40249786 39444998 39624025 40559831 41518106 41993376 41591061
6297D1591061p66761k34314O71168O14897R08487J190935N54975Q40775L78186
$$ 41591061 40824300 40589986 41261154 41876051 42784538 43975473 44530448 45371223 45749409
6288D5749409P10514R80138J305128J481207J529453K166632J281389J149286
$$ 45749409 46459923 47440061 48745189 50226396 51755849 53922481 55203870 56353156
6280E6353156J832173J816595J612184K109434L003765K882526K311437L340974
$$ 56353156 58185329 60001924 61614108 63723542 66727307 69609833 71921270 75262244
6272G5262244L178474L206692K987643K896432L267591K693185L618758L837290
$$ 75262244 78440718 81647410 84635053 87531485 90799076 93492261 97111019 100948309
6264A00948309K560495K769963K204453J227028J347648J300888J319145N80548
$$ 100948309 103508804 106278767 108483220 109710248 111057896 112358784 113677929 114258477
6256A14258477K90358k39819l50075m74303L15416l9204k30750N49462m91428
$$ 114258477 114548835 114309016 113958941 113484638 113800054 113760850 113530100 114079562 113588134
6247A13588134p48255J79591R12654J22477O17859J458308M46932K10116O74992
$$ 113588134 112839879 113019470 113932124 114054601 114672460 116130768 116577700 116787816 117462808
6238A17462808Q61416l7650j002874R22280K77882j651555j108478j324608l068959
$$ 117462808 118324224 118286574 117283700 118205980 118483862 116832307 115723829 114399221 111330262
6229A11330262l605967k110518k776784m262932l265097k661398l874297m524891
$$ 111330262 107724295 105613777 102836993 98574061 95308964 92647566 88773269 84248378
6221H4248378k639814k844312m934821l328118k129520l326078l622484j782062
$$ 84248378 81608564 78764252 73829431 70501313 68371793 65045715 61423231 59641169
6213E9641169k143645k880271j820411j303072j552182k878913j891519j012826
$$ 59641169 57497524 54617253 52796842 51493770 49941588 47062675 45171156 44158330
6205D4158330j835583j236276n93769p15276j169980j715330o85551j166692j111693
$$ 44158330 42322747 41086471 40492702 39777426 38607446 36892116 36206565 35039873 33928180
$$ [...]
##END NTUPLES=NMR SPECTRUM
##END=
