##TITLE=1H_CA-9392-1
 200.13MHz,CDCl3 ,
 8 sc
 
 1.11.2025
##JCAMPDX= 6.0         $$ Bruker NMR JCAMP-DX V2.0
##DATA TYPE= NMR SPECTRUM
##DATA CLASS= NTUPLES
##ORIGIN= UXNMR, Bruker Analytische Messtechnik GmbH
##OWNER= pz
$$ XWIN-NMR		Version 3.5
$$ Sat Nov  1 13:39:00 2025 Russian Standard Time (UT+4h)  she@DPX200
##.OBSERVE FREQUENCY= 200.1313
##.OBSERVE NUCLEUS= ^1H
##.ACQUISITION MODE= SIMULTANEOUS
##.ACQUISITION SCHEME= undefined
##.AVERAGES= 8
##.DIGITISER RES= 18
##SPECTROMETER/DATA SYSTEM= spect
##.PULSE SEQUENCE= zg30
##.SOLVENT NAME= CDCl3
##.SHIFT REFERENCE= (INTERNAL, CDCl3, 0, 15.3106)
##AUDIT TRAIL= $$ (NUMBER, WHEN, WHO, WHERE, WHAT)
$$ ##TITLE= Audit trail, XWIN-NMR		Version 3.5
$$ ##JCAMPDX= 5.01
$$ ##ORIGIN= Bruker BioSpin GmbH
$$ ##OWNER= she
$$ F:/spectra/data/she/nmr/H-C/1/pdata/1/auditp.txt
$$ ##AUDIT TRAIL=  $$ (NUMBER, WHEN, WHO, WHERE, WHAT)
(   1,<2025-11-01 13:37:20.53 +0400>,<she>,<DPX200>,
      <created by zg, POWCHK disabled, PULCHK disabled
       configuration hash MD5:
       00 E9 B6 7A A2 85 ED C7 34 08 36 98 17 FE 4E 26
       data hash MD5: 16K
       73 C0 24 66 38 F4 D9 D4 18 44 ED F5 41 AC 85 78>)
(   2,<2025-11-01 13:37:28.56 +0400>,<she>,<DPX200>,
      <Start of raw data processing
       efp BC_mod = 2 LB = 0.25 FT_mod = 6 PKNL = 1 PHC0 = -2623.288 PHC1 = 1.19235 SI = 16K 
       data hash MD5: 16K
       E0 6F B1 49 87 19 93 4B 47 BC 4E E8 05 51 E7 AD>)
(   3,<2025-11-01 13:38:03.21 +0400>,<she>,<DPX200>,
      <pk PHC0 = -163.8004 PHC1 = 9.999999 
       data hash MD5: 16K
       71 5F 1F E0 42 CC FF 83 10 3A 95 AB 50 6E 84 BD>)
(   4,<2025-11-01 13:38:07.00 +0400>,<she>,<DPX200>,
      <abs ABSG = 5 
       data hash MD5: 16K
       40 8D 2A DB 39 96 60 53 B9 91 E4 16 AA F6 CA F6>)
$$ ##END=
$$ 
$$ hash MD5
$$ C8 EE A6 A1 2B D2 0D 5E A4 A2 40 80 85 AD 32 69
##$RELAX= 
##$RELAX= 
##$RELAX= 
##$RELAX= 
##$RELAX= 
##$RELAX= 
$$ Bruker specific parameters
$$ --------------------------
##$DU= <F:/spectra>
##$EXPNO= 1
##$NAME= <H-C>
##$PROCNO= 1
##$TYPE= <nmr>
##$USER= <she>
##$AMP= (0..31)
100 100 100 100 100 100 100 100 100 100 100 100 100 100 100 100 100 100 
100 100 100 100 100 100 100 100 100 100 100 100 100 100 
##$AQSEQ= 0
##$AQ_mod= 1
##$AUNM= <au_zg>
##$AUTOPOS= <>
##$BF1= 200.13
##$BF2= 200.13
##$BF3= 200.13
##$BF4= 200.13
##$BF5= 200.13
##$BF6= 200.13
##$BF7= 200.13
##$BF8= 200.13
##$BYTORDA= 1
##$CFDGTYP= 0
##$CFRGTYP= 5
##$CHEMSTR= <none>
##$CNST= (0..31)
1 1 145 1 1 1 1 1 1 1 1 1 1 1 1 1 1 1 1 1 1 1 1 1 1 1 1 1 1 1 1 1 
##$CPDPRG= <>
##$CPDPRG1= <>
##$CPDPRG2= <>
##$CPDPRG3= <>
##$CPDPRG4= <mlev>
##$CPDPRG5= <mlev>
##$CPDPRG6= <mlev>
##$CPDPRG7= <mlev>
##$CPDPRG8= <mlev>
##$CPDPRGB= <>
##$CPDPRGT= <>
##$D= (0..31)
0 0.7 0 0 0 0 0 0 0 0 0 0.03 0 0 0 0 0 0 0 0 0 0 0 0 0 0 0 0 0 0 0 0 
##$DATE= 1761989839
##$DBL= (0..7)
120 120 120 120 120 120 120 120 
##$DBP= (0..7)
150 150 150 150 150 150 150 150 
##$DBP07= 0
##$DBPNAM0= <>
##$DBPNAM1= <>
##$DBPNAM2= <>
##$DBPNAM3= <>
##$DBPNAM4= <>
$$ [...]
##$SUBNAM3= <"">
##$SUBNAM4= <"">
##$SUBNAM5= <"">
##$SUBNAM6= <"">
##$SUBNAM7= <"">
##$SUBNAM8= <"">
##$SUBNAM9= <"">
##$SW= 18.0517328524113
##$SWIBOX= (0..15)
0 0 2 0 0 0 0 0 0 0 0 0 0 0 0 0 
##$SW_h= 3612.71676300578
##$TD= 16384
##$TD0= 1
##$TE= 0
##$TE2= 300
##$TE3= 300
##$TEG= 300
##$TL= (0..7)
0 120 120 120 120 120 120 120 
##$TP= (0..7)
150 150 150 150 150 150 150 150 
##$TP07= 0
##$TPNAME0= <>
##$TPNAME1= <>
##$TPNAME2= <>
##$TPNAME3= <>
##$TPNAME4= <>
##$TPNAME5= <>
##$TPNAME6= <>
##$TPNAME7= <>
##$TPOAL= (0..7)
0.5 0.5 0.5 0.5 0.5 0.5 0.5 0.5 
##$TPOFFS= (0..7)
0 0 0 0 0 0 0 0 
##$TUNHIN= 0
##$TUNHOUT= 0
##$TUNXOUT= 0
##$USERA1= <user>
##$USERA2= <user>
##$USERA3= <user>
##$USERA4= <user>
##$USERA5= <user>
##$V9= 5
##$VALIST= <valist>
##$VCLIST= <CCCCCCCCCCCCCCC>
##$VD= 0
##$VDLIST= <DDDDDDDDDDDDDDD>
##$VPLIST= <PPPPPPPPPPPPPPP>
##$VTLIST= <TTTTTTTTTTTTTTT>
##$WBST= 1024
##$WBSW= 4
##$XGAIN= (0..3)
0 0 0 0 
##$XL= 0
##$YL= 0
##$YMAX_a= 441024
##$YMIN_a= -312034
##$ZGOPTNS= <>
##$ZL1= 120
##$ZL2= 120
##$ZL3= 120
##$ZL4= 120
##$ABSF1= 15.47051
##$ABSF2= -2.58134
##$ABSG= 5
##$ABSL= 3
##$ALPHA= 0
##$AQORDER= 0
##$ASSFAC= 0
##$ASSFACI= 0
##$ASSFACX= 0
##$ASSWID= 0
##$AUNMP= <proc_1d>
##$AZFE= 0.1
##$AZFW= 0.1
##$BCFW= 0
##$BC_mod= 2
##$BYTORDP= 0
##$COROFFS= 0
##$CY= -3
##$DATMOD= 1
##$DC= 0
##$DFILT= <>
##$DTYPP= 0
##$F1P= 0
##$F2P= 0
##$FCOR= 1
##$FTSIZE= 16384
##$FT_mod= 6
##$GAMMA= 0
##$GB= 0
##$INTBC= 1
##$INTSCL= 3.241238e-09
##$ISEN= 128
##$LB= 0.25
##$LEV0= 0
##$LPBIN= 0
##$MAXI= 10000
##$MC2= 0
##$MEAN= 0
##$ME_mod= 0
##$MI= 1.114404
##$NCOEF= 0
##$NC_proc= -7
##$NLEV= 6
##$NOISF1= 3.799351
##$NOISF2= 2.8
##$NSP= 0
##$NTH_PI= 0
##$NZP= 0
##$OFFSET= 15.31057
##$PC= 1
##$PHC0= -2787.088
##$PHC1= 11.19235
##$PH_mod= 1
##$PKNL= yes
##$PPARMOD= 0
##$PSCAL= 0
##$PSIGN= 0
##$REVERSE= no
##$SF= 200.130042252988
##$SI= 16384
##$SIGF1= 3
##$SIGF2= 2
##$SINO= 0.751879
##$SIOLD= 32768
##$SREGLST= <19F.Aceton>
##$SSB= 0
##$STSI= 16384
##$STSR= 0
##$SW_p= 3612.71676300578
##$SYMM= 0
##$S_DEV= 0
##$TDeff= 16384
##$TDoff= 0
##$TI= <>
##$TILT= no
##$TM1= 0
##$TM2= 0
##$TOPLEV= 0
##$USERP1= <user>
##$USERP2= <user>
##$USERP3= <user>
##$USERP4= <user>
##$USERP5= <user>
##$WDW= 1
##$XDIM= 16384
##$YMAX_p= 314480681
##$YMIN_p= -756503
$$ End of Bruker specific parameters
$$ ---------------------------------
##NTUPLES= NMR SPECTRUM
##VAR_NAME=  FREQUENCY,     SPECTRUM/REAL,   SPECTRUM/IMAG
##SYMBOL=    X,             R,               I
##VAR_TYPE=  INDEPENDENT,   DEPENDENT,       DEPENDENT
##VAR_FORM=  AFFN,          ASDF,            ASDF
##VAR_DIM=   16384,         16384,           16384
##UNITS=     HZ,            ARBITRARY UNITS, ARBITRARY UNITS
##FACTOR=    0.220516191357247, 1,           1
##FIRST=     3064.10497362325, 0,            0
##LAST=      -548.611789382527, 0,           0
##MIN=       -548.611789382527, -756503,     0
##MAX=       3064.10497362325, 314480681,    0
$$ Real data points
##PAGE= N=1
##DATA TABLE= (X++(R..R)), XYDATA
$$ [...]
12093E9016K4793r9923n3421M2872p0803J3714M5141n383k7441r555K1798l8736
$$ 59016 83809 -16114 -69535 -26663 -97466 -83752 -38611 -43994 -71435 -80990 -59192 -97928
12081i7928L2308p307J3609o061K0341Q1955o2498J4757K9589P269R337m0614
$$ -97928 -65620 -72927 -59318 -65379 -45038 36917 -25581 -10824 18765 26034 35371 -5243
12069e243m460o116k6859M4163m4765m4124k4200O3488j7095Q5343Q1563o6139
$$ -5243 -9703 -15819 -42678 1485 -43280 -87404 -111604 -48116 -65211 20132 101695 35556
12057C5556o4564K2893K1176m6564m8136R344m820k1540J3179k8652J5329P8040
$$ 35556 -29008 -6115 15061 -31503 -79639 -70295 -75115 -96655 -83476 -112128 -96799 -18759
12045a8759J7589n062L9498m4419n3381L0568J2390n2426O7708j204k1716N0017
$$ -18759 -1170 -6232 33266 -11153 -64534 -33966 -21576 -74002 -6294 -7498 -29214 20803
12033B0803o7094r984K3366L870j0509K3274J00186j1188m3894K4782m2142k7663
$$ 20803 -46291 -56275 -32909 -29039 -39548 -16274 83912 72724 28830 53612 11470 -16193
12021a6193n0116L8789K9602J430R877m5092M1102k6880L0644k6990K1953l4365
$$ -16193 -66309 -27520 2082 3512 13389 -31703 9399 -17481 13163 -13827 8126 -26239
12009b6239J979l3996k7714P1813L9924l6651K7359k8146m121l1459m0596M7483
$$ -26239 -24260 -58256 -85970 -14157 25767 -10884 16475 -11671 -15792 -47251 -87847 -40364
11997d0364K0728o2174o575J3834J4265K7681L624J6508j456J8188l8329p3103
$$ -40364 -19636 -81810 -88385 -74551 -60286 -32605 -28981 -12473 -13929 4259 -34070 -107173
11985a07173k731R4842j30j2002J7214L4150N4723n911j09382M2374j0884J9740
$$ -107173 -109904 -15062 -15192 -27194 -9980 24170 78893 72982 -36400 5974 -4910 14830
11973A4830n1717k9270P0329O454r0576k7929K3646M824J4011J0621J8266K2799
$$ 14830 -36887 -66157 4172 10626 -79950 -107879 -84233 -79409 -65398 -54777 -36511 -13712
11961a3712l6721K0563M5712l0579p134o968j9884L0071m23j600n7746j1610j0223
$$ -13712 -50433 -29870 15842 -14737 -21871 -28839 -48723 -18652 -19075 -20675 -78421 -90031 -100254
11948a00254K2491L132l3729J08631J7726o9053N0602K7552m7414J510k796m665
$$ -100254 -77763 -74631 -108360 271 17997 -51056 -454 27098 -20316 -18806 -21602 -26267
11936b6267n9002O2400Q2058m7144k8361m2370M3209n4062J3556M5459L4624m1601
$$ -26267 -85269 -22869 59189 12045 -16316 -58686 -15477 -69539 -55983 -10524 24100 -17501
11924a7501J5115M3971p690j0091j745J1473q2142P0934m9048L6440P097l5471
$$ -17501 -2386 41585 33895 23804 22059 33532 -48610 22324 -26724 9716 16813 -18658
11912a8658r7156J3403K7287J2647L2249j631J7244j09j8084m5003M1650k3027
$$ -18658 -115814 -102411 -75124 -62477 -30228 -31859 -14615 -14724 -32808 -77811 -36161 -59188
11900e9188l645N25L1166k8627k2379K4958K4073O1254m8810J6642k4665L6932
$$ -59188 -62833 -62308 -31142 -59769 -82148 -57190 -33117 28137 -20673 -4031 -28696 8236
11888H236k6570n8356O1323M3866P2428m9441o2653q77k4406j2059O4155l734
$$ 8236 -18334 -76690 -15367 28499 100927 51486 -11167 -12044 -36450 -48509 15646 11912
11876A1912L1598j8651k8928K6608J9211p784O072j6816n2591m1784P484O3529
$$ 11912 43510 24859 -4069 22539 41750 33966 40038 23222 -29369 -71153 -63669 -140
11864a40M468j9147l1273J8407J8288R0187k890p3407m3310n0690M0671N268m1571
$$ -140 4328 -14819 -46092 -27685 -9397 80790 77900 4493 -38817 -89507 -48836 -43568 -85139
11851h5139n1178L0901P3517l4218O472J2229L3529M6953K1084j7613n8316n1245
$$ -85139 -136317 -105416 -31899 -66117 -59645 -47416 -13887 33066 54150 36537 -21779 -73024
11839g3024K1562j3275N4895K2124k0658j5255N8171J5031j2557R949l0798k3925
$$ -73024 -51462 -64737 -9842 12282 -8376 -23631 34540 49571 37014 46963 16165 -7760
11827g760J1059O096P549n2243M1914M327n7326k7081j6580J1539O5670P6773
$$ -7760 3299 9395 16944 -35299 6615 10942 -46384 -73465 -90045 -78506 -12836 63937
11815F3937n2524r3894J8936K0861q7511L4045N0150j3531l3950j1812K0024K7390
$$ 63937 11413 -82481 -63545 -42684 -130195 -96150 -46000 -59531 -93481 -105293 -85269 -57879
11803e7879O5584k5250o063j7429l3614N6385O0416N96L655l1380q6456L963J0710
$$ -57879 7705 -17545 -23608 -41037 -74651 -18266 42150 42746 46401 15021 -71435 -67472 -56762
11790e6762L7209J980J5113K4967k1822m9074k3091L0723N4257j8300k4757l8015
$$ -56762 -19553 -17573 -2460 22507 685 -48389 -71480 -40757 13500 -4800 -29557 -67572
11778f7572P5261n7063N0027k8866q4941M3253M8251k4376m9654M9889J5788m2942
$$ -67572 7689 -49374 653 -28213 -113154 -69901 -21650 -46026 -95680 -45791 -30003 -72945
11766g2945O5287j8107r2814K1060k7162L2832O5448m136l1828P2947N4143r1393
$$ -72945 -7658 -25765 -118579 -97519 -124681 -91849 -26401 -30537 -62365 10582 64725 -26668
11754b6668p8405l256K8223k604N8423k8994L2818n593P576k0581M1758j8832
$$ -26668 -105073 -108329 -80106 -82710 -24287 -53281 -20463 -26056 -18480 -39061 2697 -16135
11742a6135n8337M8795m3679J0426M8688j14639j4904O7711o528L4918M7726k7702
$$ -16135 -74472 -25677 -69356 -58930 -10242 -124881 -139785 -72074 -78602 -43684 4042 -23660
11730b3660j9171L9420O152n8428j3172J7775J8322Q095p4628K2817J7219R625
$$ -23660 -42831 -3411 2741 -55687 -68859 -51084 -32762 -24667 -99295 -76478 -59259 -49634
11718d9634Q1926Q463n9444K7362J2355j0019l4242Q735Q156m6608o6342N7915
$$ -49634 32292 40755 -18689 8673 21028 11009 -23233 -14498 -6342 -52950 -119292 -61377
11706f1377J7176M8342n0201j5638O682m290M1495M1201l3365m3753j9799q480
$$ -61377 -44201 4141 -46060 -61698 -55016 -59306 -17811 23390 -9975 -53728 -73527 -82007
11694h2007J772N3571m636k2277J2140K3225j2359P93K8214J2984j2622p4055
$$ -82007 -80235 -26664 -31300 -53577 -41437 -18212 -30571 -29778 -1564 11420 -1202 -75257
11682g5257L9582P5160p979m4676j5828P12o406L1771l6165O1358j2546p1821
$$ -75257 -35675 39485 31506 -13170 -28998 -28286 -34692 -2921 -39086 22272 9726 -62095
11670f2095K3311P8865J1849l8412J5638k549Q797j6012k6134o5880L8834M8985
$$ -62095 -38784 40081 51930 13518 29156 26607 35404 19392 -6742 -72622 -33788 15197
11658A5197p2157q349L8320M4338j3638K3117M2414l9941j2604k3199k9495p5484
$$ 15197 -56960 -65309 -26989 17349 3711 26828 69242 29301 16697 -6502 -35997 -111481
11646a11481J5326M2071J5501j2111K3279J6791k2354K0796R935J6347m8438L0570
$$ -111481 -96155 -54084 -38583 -50694 -27415 -10624 -32978 -12182 -2247 14100 -34338 -3768
11634c768n4477m2004O7484j4770K6141p2893J5482L4565L5802m8904M0153P2101
$$ -3768 -58245 -100249 -32765 -47535 -21394 -94287 -78805 -44240 -8438 -57342 -17189 54912
11622E4912p3464n7012N109L8012K4667O334J1743m1332m7716N7167l6208L4104
$$ 54912 -18552 -75564 -70455 -32443 -7776 -1442 10301 -31031 -78747 -21580 -57788 -23684
11610b3684J3450j6580L9072k2354n1305l4878l1151Q5522k4389l0708L3002o5629
$$ -23684 -10234 -26814 12258 -10096 -61401 -96279 -127430 -41908 -66297 -97005 -64003 -129632
11598a29632N4633M8042j6882O4280j4566m8018K8426L4544k4405l6468J0719
$$ -129632 -74999 -26957 -43839 20441 5875 -42143 -13717 20827 -3578 -40046 -29327
11587b9327L4106n1235J2786J423J776L5238l7397R460j9788K8707n0720J1024
$$ -29327 4779 -46456 -33670 -32247 -30471 4767 -32630 -23170 -42958 -14251 -64971 -53947
11575e3947N9442L777k0247L4952m7975o782j8035Q883N1567j2312n2829l887
$$ -53947 5495 9272 -10975 23977 -23998 -30780 -48815 -39932 11635 -677 -53506 -57393
11563e7393n465j3656O6437M2322q372l3467K1814K3383L1480L6947n2236r0249
$$ -57393 -62858 -76514 -10077 32245 23873 -9594 12220 35603 67083 104030 51794 -38455
11551c8455K5361M374j4835l0568o6290r737p44K9423O629O3882l8030R054J24295
$$ -38455 -13094 -8720 -23555 -54123 -120413 -130150 -130894 -101471 -94842 -30960 -68990 -59936 64359
11538F4359p2684n2301l8314L5676L0732q148J24825q5236k5069L6624n7370L7988
$$ 64359 -8325 -60626 -98940 -63264 -32532 -40680 84145 -1091 -26160 10464 -46906 -8918
11526h918j9129l4540P1750m7477l2057L4173l2905K5666m6348N8921K0746o6697
$$ -8918 -28047 -62587 9163 -38314 -70371 -36198 -69103 -43437 -89785 -30864 -10118 -76815
11514g6815m1354O6893O8468M4391m9590n8427O5589m8190l8804J4899O6931m6764
$$ -76815 -118169 -51276 17192 61583 11993 -46434 19155 -29035 -67839 -52940 13991 -32773
11502c2773k0762O0942Q781r3473K9583L9857n1798p943P96N1739k8621j4836
$$ -32773 -53535 7407 16188 -77285 -47702 -7845 -59643 -67586 -66790 -15051 -43672 -58508
11490e8508j6172r039L4461N1549K010m7003n4573M3897K8413o2096l8176N8228
$$ -58508 -74680 -83719 -49258 2291 4301 -42702 -97275 -53378 -24965 -87061 -125237 -67009
11478f7009N5460l2483l8801L2435R85R472k3997k0609J4480j2317l6477L6021
$$ -67009 -11549 -44032 -82833 -50398 -49413 -39941 -63938 -84547 -70067 -82384 -118861 -82840
11466h2840N7549r943l5207N4890l3046J979j6439l308j2082K214M4605r2366
$$ -82840 -25291 -35234 -70441 -15551 -48597 -46618 -63057 -66365 -78447 -76233 -31628 -123994
11454a23994R531l4169L0208K1173K3682J7040j126m0740l8511M8314L5473J3082
$$ -123994 -114463 -148632 -118424 -97251 -73569 -56529 -57655 -98395 -136906 -88592 -53119 -40037
11442d0037m7595K4167P368n1326k329k56L3233k0130l4573m745q503k423O9775
$$ -40037 -87632 -63465 -56097 -107423 -109752 -110008 -76775 -96905 -131478 -136223 -144726 -147149 -77374
11429g7374M5505L847k7378k8556J0456l0370N9969M1772j2000k5312l1263Q105
$$ -77374 -31869 -28022 -55400 -83956 -73500 -103870 -43901 -2129 -14129 -39441 -70704 -62599
11417f2599r502m2409L5840P3665p4701j3052N6403L3047j0927n8261O2484p15
$$ -62599 -72101 -114510 -78670 -5005 -79706 -92758 -36355 -3308 -14235 -72496 -10012 -10727
11405a0727r1005L5492k1609L852Q4049l8969q0067l2415N1726J1305l655o1904
$$ -10727 -101732 -66240 -87849 -83997 52 -38917 -118984 -151399 -99673 -88368 -92023 -153927
11393a53927q827P7115J5697o734k1198J6237P0142p3558L3350J0340R249K737
$$ -153927 -162754 -85639 -69942 -76676 -97874 -81637 -11495 -85053 -51703 -41363 -32114 -29377
11381b9377K6377Q4636o6651R202m5068j1313k4898q0212P6133O9690l3011J5302
$$ -29377 -3000 81636 14985 24187 -20881 -32194 -57092 -137304 -61171 8519 -24492 -9190
11369i190k8884o0948k2729L3019J1721o7252O3305O0979r816P927K9109Q732
$$ -9190 -38074 -99022 -121751 -88732 -77011 -144263 -80958 -19979 -29795 -21868 7241 15973
11357A5973j3484q868l6784n78n0589K1331O6054K693J6553o796n9449q642j728
$$ 15973 2489 -6379 -43163 -43741 -94330 -72999 -6945 -4252 12301 5505 -53944 -62586 -64314
11344f4314N3754R420j055k8685J3880j4859k5841J946L8247l1198J0045J0182
$$ -64314 -10560 -1140 -2195 -30880 -17000 -31859 -57700 -55754 -17507 -48705 -38660 -28478
11332b8478m6383L1362J0606K8245j1096l634k9479J9883o673J550K5052l74k0497
$$ -28478 -74861 -43499 -32893 -4648 -15744 -19378 -48857 -28974 -35647 -34097 -9045 -9419 -29916
11319b9916K0318o0229K018J8220N7976m65M6043p5238r8312P4553K962L153q6856
$$ -29916 -9598 -69827 -67809 -49589 8387 7922 53965 -21273 -119585 -45032 -42070 -38917 -125773
11306a25773j5158J24035O4481o7308N841k9681k9460o5130M9323q262Q6519L9129
$$ -125773 -140931 -16896 47585 -19723 -13882 -43563 -73023 -138153 -88830 -97092 -10573 28556
11294B8556l4664J1451J1723M9219k4612j0569q817l4476k9431o061Q5066k5427
$$ 28556 -6108 5343 17066 66285 41673 31104 22287 -12189 -41620 -47681 37385 11958
11282A1958l9178J4916L0288O99n5800k0047J4220N686M6458n0227M8492K048
$$ 11958 -27220 -12304 17984 18683 -37117 -57164 -42944 -37258 9200 -41027 7465 9513
11270I513p6252K3739K1615j8595r8909P2071n733m3133N7929J6285L1693J0995
$$ 9513 -66739 -43000 -21385 -39980 -138889 -66818 -72551 -115684 -57755 -41470 -9777 1218
11258A218k6756j3884N877k9226l0661N6049m5594k5069K1264P5960k8191N3344
$$ 1218 -25538 -39422 -33545 -62771 -93432 -37383 -82977 -108046 -86782 -10822 -39013 14331
11246A4331q4524l4684K0659N308K4980L5113K1163J2092k4070k0151p431Q6257
$$ 14331 -70193 -104877 -84218 -78910 -53930 -18817 2346 14438 -9632 -29783 -37214 49043
11234D9043j5520N218l4156p2157P0109j9085q582k0355o8099O1895N1288r414
$$ 49043 33523 38741 4585 -67572 2537 -16548 -25130 -45485 -113584 -51689 -401 -9815
11222i815l5129k4458j8832l9670J2952L5155Q589r48M8624k0793o6247O4801
$$ -9815 -44944 -69402 -88234 -127904 -114952 -79797 -71208 -72156 -23532 -44325 -110572 -45771
11210d5771J2001l8769J7727m3331M3060k6102n560K5800L2902N3159J4719l6765
$$ -45771 -33770 -72539 -54812 -98143 -55083 -81185 -86745 -60945 -28043 25116 39835 3070
11198C070l5604N6J0537k0460l9204O649k6188M0072J4573J1427P5241n6300j3520
$$ 3070 -32534 -32478 -21941 -42401 -81605 -74956 -101144 -61072 -46499 -35072 40169 -16131 -29651
11185b9651M4650J7632K4032L0838q4390K4463j8919m3233L8503J6952L0917l8105
$$ -29651 14999 32631 56663 87501 3111 27574 8655 -34578 3925 20877 51794 13689
11173A3689j7368K7589n6445j9485q124N2120n0481k5298R1423o606k3138m8796
$$ 13689 -3679 23910 -32535 -52020 -60144 -8024 -58505 -83803 7620 1014 -22124 -70920
11161g0920j9199J7762n111N4803j7172K8100k7419n9076M9139L4726k3391K3503
$$ -70920 -90119 -72357 -77468 -22665 -39837 -11737 -39156 -98232 -49093 -14367 -37758 -14255
11149a4255J1221o1678k5171O769j2854N9917O2451k929o495J7450q7111j01291
$$ -14255 -3034 -64712 -89883 -83114 -95968 -36051 26400 23471 16976 34426 -52685 -153976
11137a53976R0523O4686L5913n6438k8125O5674l9869m4898q721R35L4555o9928
$$ -153976 -63453 1233 37146 -19292 -47417 18257 -21612 -66510 -75231 -74296 -39741 -109669
11125a09669K6227L2901K9796j158j2473K7643o2179J0593N6759K1894k3958l0950
$$ -109669 -83442 -50541 -20745 -21903 -34376 -6733 -68912 -58319 -1560 20334 -3624 -34574
11113c4574r114n6672l1341J8265M0156L6069M6295n6010n7502N9535N9701J696
$$ -34574 -43688 -100360 -131701 -113436 -73280 -37211 9084 -46926 -104428 -44893 14808 16504
11101A6504r1545l6612L3106k1095j0457N7474N022m7113K0647N2655m0732M80
$$ 16504 -75041 -111653 -78547 -99642 -110099 -52625 -47603 -94716 -74069 -21414 -62146 -61666
11089f1666j5465j7790O227N7978P9902k1414n2940l1339L9729m1378o921K7158
$$ -61666 -77131 -94921 -88694 -30716 49186 27772 -25168 -56507 -16778 -58156 -65077 -37919
11077c7919L6451l4404N532Q224P2261q174o909n98p3173J1542L4178L8543j5636
$$ -37919 -1468 -35872 -30340 -22116 50145 41971 35062 34464 -38709 -27167 7011 45554 29918
11064B9918q4443j9961o7j3931L9195j6637N0633j8549J5812o9388K724R8776
$$ 29918 -54525 -74486 -74553 -88484 -49289 -65926 -15293 -33842 -18030 -87418 -84694 14082
11052A4082k0890j3143j7422k7736J6268L1884n813k4976q613r280K4862j7612
$$ 14082 -6808 -19951 -37373 -65109 -48841 -16957 -22770 -47746 -56359 -65639 -40777 -58389
11040e8389n9794J9279R6850L7021p5114J8878k2060k677N2017n6165k4021K3987
$$ -58389 -118183 -98904 -2054 34967 -40147 -21269 -43329 -46006 6011 -50154 -74175 -50188
11028e0188J612q7158L6134j8026L0325O5097o8671k4779j2865M1193L0142o1885
$$ -50188 -48576 -135734 -99600 -117626 -87301 -22204 -90875 -115654 -128519 -87326 -57184 -119069
11016a19069M5710L8422n9124O3536J6l0935j501L3221j0495M9211L2241m0642
$$ -119069 -73359 -34937 -94061 -30525 -30509 -61444 -62945 -29724 -40219 8992 41233 591
11004E91o7310K491K792n653k8631J1624R943L9330K1373o0604J4033J3863L3232
$$ 591 -66719 -64228 -61436 -67089 -95720 -84096 -74153 -34823 -13450 -74054 -60021 -46158 -12926
10991a2926J9871l8024j3117j446L0535r686l5296N8893M221p0064j8678J7790
$$ -12926 6945 -31079 -44196 -45642 -15107 -24793 -60089 -1196 3025 -67039 -85717 -67927
10979f7927M3104K3189J400j3375J1416k1189m810L2186n3066l4976J3101K1283
$$ -67927 -24823 -1634 -234 -13609 -2193 -23382 -28192 3994 -49072 -84048 -70947 -49664
10967d9664m9213K3152J6329M9044k8157M1332P5552o3144o8316k0265k9251N0291
$$ -49664 -98877 -75725 -59396 -10352 -38509 2823 78375 15231 -53085 -73350 -102601 -52310
10955e2310L0198o5039m0933J5016K5440J2862n263L9818M4329n7568K5388m722
$$ -52310 -22112 -87151 -128084 -113068 -87628 -74766 -80029 -40211 4118 -53450 -28062 -32784
10943c2784l0093j0013P2930K0837o757j2003q2987j4K2203J1433q6083L3683
$$ -32784 -62877 -72890 40 20877 14120 2117 -80870 -80884 -58681 -47248 -133331 -99648
10931i9648Q9042K1603o9782L4392O8320J2096o8755p7486J7982k0105K0946J772
$$ -99648 -10606 10997 -58785 -24393 43927 56023 -12732 -90218 -72236 -92341 -71395 -69623
10919f9623l4437J2402P4038q01M804l6577L7252K043k6082J6656L7306j1508
$$ -69623 -104060 -91658 -17620 -18421 -13617 -50194 -12942 -10899 -36981 -20325 16981 5473
10907E473m8949j3955J9590N9387q2751l8270K5604l9201l5608N9320J2184m541
$$ 5473 -43476 -57431 -37841 21546 -61205 -99475 -73871 -113072 -148680 -89360 -77176 -81717
10895h1717K6283J1290P0891j7364n2225q696L1595N0687o4579K5238M2400l6513
$$ -81717 -55434 -44144 26747 9383 -42842 -51538 -19943 30744 -33835 -8597 33803 -2710
10883b710j1488j8226J0823J2050L099j4609M956O000l5205O7213j638r1703k4955
$$ -2710 -14198 -32424 -21601 -9551 -6452 -21061 -16105 -10105 -45310 21903 20265 -71438 -96393
10870i6393m7539L8260j8710L4237P6205j4821p0957R7872j2219k7246p710l5792
$$ -96393 -143932 -105672 -124382 -90145 -13940 -28761 -99718 -1846 -14065 -41311 -49021 -84813
10858h4813O6388m8789Q0309L1016p3692K7900l7242k0488P6492M681n7544k1238
$$ -84813 -18425 -67214 13095 44111 -29581 -1681 -38923 -59411 17081 21762 -35782 -57020
10846e7020K5847K8171L484j8739O2077k6969J1971Q4503m8098j06870n3536N3411
$$ -57020 -31173 -3002 482 -18257 43820 16851 28822 113325 65227 -41643 -95179 -41768
10834d1768M8569K8543l3915p1544l4653J5526O9979P935k301P793j5494K8727
$$ -41768 6801 35344 1429 -70115 -104768 -89242 -19263 -11328 -13629 -5836 -21330 7397
10822G397n663o4110J5762L671J0497n760O383l56J144j906k7249J1976M7726
$$ 7397 1734 -62376 -46614 -42943 -32446 -38206 -31823 -32179 -31035 -32941 -60190 -48214 -488
10809d88n4042j4353P2298K4023j6020P780L6703J925p582Q803P86p6677l0200
$$ -488 -54530 -68883 3415 27438 11418 19198 55901 57826 50244 59047 59833 -16844 -47044
10796d7044K8108L3390o8700m7397K0401K6942K0504J9230o998N7746o0054O350
$$ -47044 -18936 14454 -54246 -101643 -81242 -54300 -33796 -14566 -21564 36182 -23872 -17522
10784a7522P397j7853J980j9696m9139N713N4116l094k0253K2155J2115k9545
$$ -17522 -10125 -27978 -25998 -45694 -94833 -89120 -35004 -38098 -58351 -36196 -24081 -53626
10772e3626O8171N3442o907k1343J0434k6551l6538l5290N5951j542k6831m0816
$$ -53626 14545 67987 61080 39737 50171 23620 -12918 -48208 7743 6201 -20630 -61446
10760f1446P269R465Q0394k0427k7690K4030L355m1963j7310M6975m053q0148
$$ -61446 -54177 -44712 35682 15255 -12435 11595 14950 -27013 -44323 2652 -1401 -81549
10748h1549P4684N8274K3242L6229l3900o6656M0948l1162k0669J6665l6680M4907
$$ -81549 -6865 51409 74651 110880 76980 10324 51272 20110 -559 16106 -20574 24333
10736B4333M449p3922L3822L3510K5641j305j9126J2103l4420L4224m946J791
$$ 24333 28782 -45140 -11318 22192 47833 46528 27402 39505 5085 39309 34363 36154
10724C6154l967p129k7325L0283j5169O1702o383l6610n4767j6293m153K5185
$$ 36154 32187 25058 -2267 28016 12847 74549 68166 31556 -23211 -39504 -43657 -18472
10712a8472K9616M8412n5261M524j5988k9046j9490L3879j2145m1213o084N1267
$$ -18472 11144 59556 4295 8819 -7169 -36215 -55705 -21826 -33971 -75184 -81268 -30001
10700c0001j6627K086N9211m8076m5700p3761L6948J01806K2742n7284l2379P7284
$$ -30001 -46628 -44542 14669 -33407 -79107 -152868 -115920 -14114 8628 -48656 -81035 -3751
10688c751L5798J4429j04435m5280N1169j867k7667O3764O0228o4316j3371K4634
$$ -3751 32047 46476 -57959 -103239 -52070 -53937 -81604 -17840 42388 -21928 -35299 -10665
10676a0665K4279N467p774k3722p0468J7520m2359j2342L2185r065J04183M4802
$$ -10665 13614 19081 11307 -12415 -82883 -65363 -107722 -120064 -87879 -96944 7239 52041
10664E2041k0827n9123N623r143K8496p1200l8901J0283r695k0538Q9248K0634
$$ 52041 31214 -27909 -22286 -31429 -2933 -74133 -113034 -102751 -112446 -132984 -43736 -23102
10652b3102Q2327j0028k8610k8905l1316k2542O7208j8606P0394K6075m7913K5406
$$ -23102 59225 49197 20587 -8318 -39634 -62176 5032 -13574 56820 82895 34982 60388
10640F0388o4886k8707j9309O6777q450J6515p935k4131j5124l0568M3704R0480
$$ 60388 -4498 -33205 -52514 14263 5813 22328 14393 -9738 -24862 -55430 -11726 78754
10628G8754r3780m9275N3216L8465j0662l2743j8011L06L5189J712L3638j04268
$$ 78754 -15026 -64301 -11085 27380 16718 -16025 -34036 -33730 1459 3171 36809 -67459
10616f7459K2320R7562m8110J3027l8539m4529n3074K4625j1307l9030O0710J5777
$$ -67459 -45139 52423 4313 17340 -21199 -65728 -118802 -94177 -105484 -144514 -83804 -68027
10604f8027J029K664j8569L3045M9016k6650K637j4757j9124o3592M8561K3775
$$ -68027 -66998 -64334 -82903 -49858 -842 -27492 -24855 -39612 -58736 -122328 -73767 -49992
10592d9992M078J6194j3409n6614L7086L1700q241N1871l2839k902m287L3722
$$ -49992 -45914 -29720 -43129 -99743 -62657 -30957 -39198 12673 -20166 -23068 -27355 6367
10580F367j4735m798m1954l9851Q823N5246q724r5389J9812J5468M4557O0539
$$ 6367 -8368 -13166 -55120 -94971 -86148 -30902 -39626 -135015 -115203 -99735 -55178 5361
10568E361l8381R26j6592M8254K9141n2625j9222O2890n4436l2170K2981P1365
$$ 5361 -33020 -32094 -48686 -432 28709 -23916 -43138 19752 -34684 -66854 -43873 27492
10556B7492m336k6801J2062k4870K8174L1898J1555k0576K4436j2240j8203l6258
$$ 27492 23156 -3645 8417 -16453 11721 43619 55174 34598 59034 46794 28591 -7667
10544g667l067J386O002P3714n3039m7036l581k0915L2880l4297k8637L186L1570
$$ -7667 -10734 -9348 -3346 70368 17329 -29707 -33288 -54203 -21323 -55620 -84257 -81071 -49501
10531d9501K4863J0471K9216l8135m6569K5708K4100j07060M0177L0303K7554
$$ -49501 -24638 -14167 15049 -23086 -69655 -43947 -19847 -126907 -86730 -56427 -28873
10520b8873k3438p1091L8289l635m459k4380M0412R808K2158Q9627o1346k2324
$$ -28873 -52311 -123402 -85113 -88748 -93207 -117587 -77175 -67367 -45209 44418 -16928 -39252
10508c9252J4726J6263J6798M3469n47J5764n0613J910k0357j2527M0718j2202
$$ -39252 -24526 -8263 8535 52004 51457 67221 16608 18518 -1839 -14366 26352 14150
10496A4150k8684q0250O1859L6812k4821J2392R5754o4952k7435k2094M7068n8944
$$ 14150 -14534 -94784 -32925 3887 -20934 -8542 87212 22260 -5175 -27269 19799 -39145
10484c9145K1560k1394J1052n013L9972N3786K1022j7279j30576J04724M8544
$$ -39145 -17585 -38979 -27927 -32940 7032 60818 81840 64561 -66015 38709 87253
10473H7253n3096j2756M2593K7747L8464m1202J0902r106m1796m499N5644m2577
$$ 87253 34157 21401 63994 91741 130205 89003 99905 90799 49003 44504 100148 57571
10461E7571q2324k2992N6315P65P6834L4577k6745k5827j7192L1963p9973J589
$$ 57571 -24753 -47745 8570 9335 86169 120746 94001 68174 50982 82945 2972 4561
10449D561q06l7960K0071l289j830p4940J9544P7256l4004j5677L6189M3934n3122
$$ 4561 3755 -34205 -14134 -17423 -19253 -94193 -74649 2607 -31397 -47074 -10885 33049 -20073
10436b0073J2921J2956K562J8278n3535N2072L6483J4381k5983p2813P9742n7811
$$ -20073 -7152 5804 8366 26644 -26891 25181 61664 76045 50062 -22751 56991 -820
10424h20J2147J3317n3779j0934k6788K0694M6928l444o1250J7232l3617L6153
$$ -820 11327 24644 -29135 -40069 -66857 -46163 765 -2679 -63929 -46697 -80314 -44161
10412d4161R4016k7275M527P993k9978p635P5904l1707j4770J597l4468J4895
$$ -44161 49855 22580 27107 35100 5122 -2513 73391 41684 26914 28511 -5957 8938
10400H938q34J0244K6561J7280O4636l9490K6954K0363n6519n49m8537r5622R056
$$ 8938 8104 18348 44909 62189 126825 87335 114289 134652 78133 77584 29047 -66575 -57519
10387e7519K6415p812j4898J929J1583N3015m84K979R890l8208j4778M6077L259
$$ -57519 -31104 -38916 -53814 -51885 -40302 12713 12229 15208 25098 -13110 -27888 18189 21448
10374B1448J9460J238m0258j4133O614N4683k7672J8524k859J5536m5491K593
$$ 21448 40908 42146 1888 -12245 -5631 49052 21380 39904 37045 52581 7090 9683
10362I683L8007r5980J9525K2864l1045N1960n3159n3679l0121P6985L9431m979
$$ 9683 47690 -48290 -28765 -5901 -36946 15014 -38145 -91824 -121945 -44960 -5529 -10508
10350a0508j1940o377o759j7153K8219N7810M0992j7673p448k3817K5424m6469
$$ -10508 -22448 -28825 -35584 -52737 -24518 33292 74284 56611 49163 25346 50770 4301
10338D301k264M2025R381J1770l9481p792p934L2956l2154Q806q251k0317l711
$$ 4301 2037 44062 53443 65213 25732 17940 10006 42962 10808 19614 11363 -8954 -12665
10325a2665p797o0031J8983O7256J9929j9594L9183p281j9311K5416o9763q0143
$$ -12665 -20462 -80493 -61510 5746 25675 6081 45264 37983 18672 44088 -25675 -105818
10313a05818N6928L1046K8431N3391j001l2759j1646q998j879j6228l2821p643
$$ -105818 -48890 -17844 10587 63978 62977 30218 18572 9574 7695 -8533 -41354 -48997
10301d8997N8568K0839J8058l6696k2309k7270L2385n7129J0690L2825L2237m1404
$$ -48997 9571 30410 48468 11772 -10537 -37807 -5422 -62551 -51861 -19036 13201 -28203
10289b8203L927M3360J9425m258o0266J58735n917o5908m2579k0667M6530K1546
$$ -28203 -24276 19084 38509 34251 -26015 132720 126803 60895 18316 -2351 44179 65725
10277F5725m0589k6578Q669J5301k983O1262o0198J1478L6910j4534l0835N982
$$ 65725 25136 -1442 7227 22528 19545 80807 20609 32087 68997 54463 23628 29610
10265B9610K6837L6942O680Q3305l3527m3055j7583j694O1553m4820n5644O8108
$$ 29610 56447 93389 100069 183374 149847 106792 89209 87515 149068 104248 48604 116712
10253A16712N9270n422j21939J5060P3673j3112N4697M2326q0018k5916P489l4318
$$ 116712 175982 170560 48621 63681 137354 124242 178939 221265 141247 115331 122820 88502
10241H8502J8736J3211o1474J5336M7145K4909r346j4120K059R452m5921K939
$$ 88502 107238 120449 58975 74311 121456 146365 137019 122899 124958 134410 88489 91428
10229I1428M1307m0192j3837o3575K6716N9308N44O5478N042p761n7070L8388
$$ 91428 132735 92543 78706 15131 41847 101155 101699 167177 172219 164458 107388 145776
10217A45776N5807m8240r3683L6613J4826m1345J225J5004M425J5606K2851l3759
$$ 145776 201583 153343 59660 96273 111099 69754 70979 85983 90408 106014 128865 95106
10205I5106L3535M4108J1795n7135j7194j7040L0876j06826J0135Q6560j9111
$$ 95106 128641 172749 184544 127409 110215 93175 124051 17225 27360 113920 94809
10194I4809O406m9198K7885k8226k1205j5558P174p001j144J3985k721K6045K1120
$$ 94809 101215 52017 79902 51676 30471 14913 22087 15086 13942 27927 25206 51251 72371
10181G2371M5258j8887l2378k5347K7945o2294l9186O0564M0713K5621K9968L9956
$$ 72371 117629 98742 66364 41017 68962 6668 -32518 28046 68759 94380 124348 164304
10169A64304M6672n4157K899J7240J8201n0472l6969J4681j2436K268L7516K2271
$$ 164304 210976 156819 159718 176958 195159 144687 107718 122399 109963 112231 149747 172018
10157A72018r814K4673k9117k8458O6832J4582n2324n9176J942j9780J8677K901
$$ 172018 162204 186877 157760 129302 196134 210716 158392 99216 101158 81378 100055 102956
10145A02956J01638m0438m4863M8013M7074P5112o500q3031j4862M4603m2737
$$ 102956 204594 164156 119293 167306 214380 289492 282992 199961 185099 229702 186965
10134A86965L8243Q9253J5678m0582m7552k3417J7506L7254M3166P0074o900l3682
$$ 186965 225208 314461 330139 289557 242005 218588 236094 273348 316514 386588 379688 346006
10122C46006j2683L4582l0307K5676n74L0757L8801J9586q905L9942L1890k8282
$$ 346006 333323 367905 337598 363274 362700 393457 432258 451844 442939 482881 514771 486489
10110D86489N4393M1327K8287k5794L6247P058N5989N7917P5080Q358p030J8276
$$ 486489 540882 582209 610496 584702 620949 628007 683996 741913 816993 825351 818321 836597
10098H36597M5952J11275k4746M1540M0420K0098P5234J6185J2425Q908J05544
$$ 836597 882549 993824 969078 1010618 1051038 1071136 1146370 1162555 1174980 1183888 1289432
10087A289432J22636O0252P7227K9899K7576J05858l3039j0176L1910q7495n9029
$$ 1289432 1412068 1472320 1549547 1579446 1607022 1712880 1679841 1669665 1701575 1614080 1555051
10076A555051L4844O764l5635k3984K5912l3435J5250j09483m7246n160K1801
$$ 1555051 1589895 1596659 1561024 1537040 1562952 1529517 1544767 1435284 1388038 1382878 1404679
10065A404679m3024j2367K1626q1069l5319O5846J2166J8213N4699P280J09697
$$ 1404679 1361655 1349288 1370914 1289845 1254526 1320372 1332538 1350751 1405450 1412730 1522427
10054A522427P7001l562R0372Q9141L6118J689L4975J3260k5641P7707o6103o0110
$$ 1522427 1599428 1595866 1686238 1775379 1811497 1813186 1848161 1861421 1835780 1913487 1847384 1787274
10042A787274J06079k6827k1942m6290r1654p2233j06463q7801j6656n6008q0824
$$ 1787274 1893353 1866526 1844584 1798294 1706640 1634407 1527944 1440143 1423487 1367479 1286655
10031A286655n8689o1435n8506J793j31919m6412K6405n7640l3181M3551m4792
$$ 1286655 1227966 1166531 1108025 1109818 977899 931487 957892 900252 867071 910622 865830
10020H65830r6889N7833l1325j414J6503P2558P2619j3706K0575L488p214J7421
$$ 865830 768941 826774 795449 794035 810538 883096 955715 942009 962584 966072 958858 976279
10008I76279k7422N248K4564O050M4281K7687M6927L9732J52903O0511m2567M2468
$$ 976279 948857 954105 978669 984719 1029000 1056687 1103614 1143346 1296249 1356760 1314193 1356661
9996A356661J05455R9670J24742R7004J13773J17555O5280R8986J15879J52439
$$ 1356661 1462116 1561786 1686528 1783532 1897305 2014860 2080140 2179126 2295005 2447444
9986B447444K9419Q3702Q668o5176r1899p5384q5477m9991j48281j08045q1235
$$ 2447444 2476863 2560565 2569233 2504057 2412158 2336774 2251297 2201306 2053025 1944980 1863745
9975A863745p2305r8896q3587j29707j36175j09704l4350r4532o1200k5106K257
$$ 1863745 1791440 1692544 1608957 1479250 1343075 1233371 1199021 1104489 1043289 1018183 1020440
9964A020440j2065L992o2058k4099M6546M764q0698L7056K0394q6973M1120k774
$$ 1020440 1008375 1012367 950309 926210 972756 977520 896822 933878 954272 867299 908419 905645
9952I05645O149n0560L6894L8974J9123k3236j264N418J5780Q2690L1870k9077
$$ 905645 911794 861234 898128 937102 956225 932989 931725 937143 952923 1035613 1067483 1038406
9940A038406M377L8550n4343j0681K6207j934L3518N2343n1314k977P6719o87
$$ 1038406 1042783 1081333 1026990 1016309 1042516 1040582 1074100 1126443 1075129 1072152 1148871 1148184
9928A148184P190m3522L0492q704r901l422l9971K2202K0350r344n240k5953k6221
$$ 1148184 1155374 1111852 1142344 1133640 1123739 1120317 1080346 1102548 1122898 1113554 1108314 1082361 1056140
9915A056140j1776l1978K2008M224l8439p7138N7070q2649K890N1993n561L8826
$$ 1056140 1044364 1012386 1034394 1038618 1000179 923041 980111 897462 900352 952345 946784 985610
9903I85610n1283N3080k4753j7176l2078l8999P7016O3418m2938Q577j7771j1912
$$ 985610 934327 987407 962654 945478 913400 874401 951417 1014835 971897 980474 962703 950791
9891I50791K9956O0287J3762M3614J5805m5513J82R2344J4676K746j3444L2560
$$ 950791 980747 1041034 1054796 1098410 1114215 1068702 1068884 1161228 1175904 1178650 1165206 1197766
9879A197766J14845L8139J8205l5192J2240O607K2844J14139J1029j3138K5549
$$ 1197766 1312611 1350750 1368955 1333763 1346003 1352610 1375454 1489593 1500622 1487484 1513033
9868A513033J5365O9930P6770j0333O3803O1031l9244l5839K8922Q5050O2294
$$ 1513033 1528398 1598328 1675098 1664765 1728568 1789599 1750355 1714516 1743438 1828488 1890782
9857A890782p893M9079N8119L4860M856P5819J15385K5910M6468J13282L3257
$$ 1890782 1882889 1931968 1990087 2024947 2029803 2105622 2221007 2246917 2293385 2406667 2439924
9846B439924M9942P8040P339J01921M5051L5976J14875O4101J33745P6207K3122
$$ 2439924 2489866 2567906 2575245 2677166 2722217 2758193 2873068 2937169 3070914 3147121 3170243
9835C170243M5306P1971J03122P4478L1235J04514J26073R566P5373J38094Q7750
$$ 3170243 3215549 3287520 3390642 3465120 3496355 3600869 3726942 3736508 3811881 3949975 4037725
9824D037725N8681J16379J04166P8917N4099J39974O8927N9148Q9938J32740J36432
$$ 4037725 4096406 4212785 4316951 4395868 4449967 4589941 4658868 4718016 4807954 4940694 5077126
9813E077126Q6904K28671J38661J50998J13019J26436J32793R6501J98855J53625
$$ 5077126 5164030 5392701 5531362 5682360 5795379 5921815 6054608 6151109 6349964 6503589
9803F503589J43512J47949J16094J33964J92576R8411J09469J79949J52696J78448
$$ 6503589 6647101 6795050 6911144 7045108 7237684 7336095 7445564 7625513 7778209 7956657
9793G956657K23495K06710K49485J82655J90671K10625K00794K35892K66965K58116
$$ 7956657 8180152 8386862 8636347 8819002 9009673 9220298 9421092 9656984 9923949 10182065
9783A0182065K49158K51075L54076L60828L79898M32445M19512M42898M58277
$$ 10182065 10431223 10682298 11036374 11397202 11777100 12209545 12629057 13071955 13530232
9774A3530232M93752N88980O33291O60263P39611Q21263Q12923Q87002R36735
$$ 13530232 14023984 14612964 15246255 15906518 16646129 17467392 18280315 19167317 20104052
9765B0104052J046835J120882J217303J331437J310659J528297J671521J749958
$$ 20104052 21150887 22271769 23489072 24820509 26131168 27659465 29330986 31080944
9757C1080944J970124K148365K340772K584950K862970L129514L325854L551695
$$ 31080944 33051068 35199433 37540205 40125155 42988125 46117639 49443493 52995188
9749E2995188L766908L885335M092972M338808M341772M550912M716104M823698
$$ 52995188 56762096 60647431 64740403 69079211 73420983 77971895 82687999 87511697
9741H7511697N053349N250867N531135O155783O669795P266205Q002345Q795199
$$ 87511697 92565046 97815913 103347048 109502831 116172626 123438831 131441176 140236375
9733A40236375R711418J0593824J1391307J1874570J2087671J1996317J1611694
$$ 140236375 149947793 160541617 171932924 183807494 195895165 207891482 219503176
9726B19503176J0899296R758248Q157675O358183M686180K818694Q07640j352941
$$ 219503176 230402472 240160720 248318395 254676578 259362758 262181452 262989092 261636151
9718B61636151l286340n051291o577581p599733q442085q771846q642258q268752
$$ 261636151 258349811 253298520 246720939 239121206 230679121 221907275 213265017 204996265
9710B04996265p818072p208668o497014n456618m440708l405291k422480j149532
$$ 204996265 197178193 189969525 183472511 178015893 173575185 170169894 167747414 166597882
9702A66597882J41275J543874K995731M382205N706869P099784Q213667Q954031
$$ 166597882 166739157 168283031 171278762 175660967 181367836 188467620 196681287 205635318
9694B05635318R371992R397772R109872Q202733P088817N513439L555127J402361
$$ 205635318 215007310 224405082 233514954 241717687 248806504 254319943 257875070 259277431
9686B59277431q42352l331424n886776q253050j0338320j2063147j3420498j4299332
$$ 259277431 258435079 255103655 249216879 240963829 230625509 218562362 205141864 190842532
9678A90842532j4691881j4640821j4157421j3557328j2987204j2115133j1167104
$$ 190842532 176150651 161509830 147352409 133795081 120807877 108692744 97525640
9671I7525640j0248374r304867q297012p404054o616285n716998n043544m313447
$$ 97525640 87277266 77972399 69675387 62271333 55655048 49938050 44894506 40581059
9663D0581059l724843l240688k777620k384840k144192j770767j600471j455640
$$ 40581059 36856216 33615528 30837908 28453068 26308876 24538109 22937638 21481998
9655B1481998j224271j101342r99060r21032p44592p82382p10934n89450o32446
$$ 21481998 20257727 19156385 18157325 17236293 16491701 15709319 14998385 14408935 13776489
9646A3776489n81398n02146m29225m91466m49765k77133l38223l46268l01220
$$ 13776489 13195091 12692945 12263720 11772254 11322489 11045356 10707133 10360865 10059645
9637A0059645k13385j93493j70321k25145j46108j83994k04037j08139j96481
$$ 10059645 9846260 9652767 9482446 9257301 9111193 8927199 8723162 8615023 8418542
9628H418542k70134r4102j8323k23048j36734o7046j32930j62046r7958r4111
$$ 8418542 8148408 8054306 8035983 7812935 7676201 7609155 7476225 7314179 7216221 7122110
9618G122110j13885j27725o3972j03450l9312r3492n8157q86j1185O3332L2903
$$ 7122110 7008225 6880500 6816528 6713078 6673766 6580274 6522117 6521231 6510046 6573378 6606281
9607F606281J45044J20197L6943j4552l5904P4715j03192p7818o9202M668p8285
$$ 6606281 6751325 6871522 6908465 6893913 6858009 6932724 6829532 6751714 6682512 6687180 6608895
9596F608895m5986k1257K2399l4104n7858P3390r5259p1484j2268k4744j2405
$$ 6608895 6562909 6541652 6564051 6529947 6472089 6545479 6450220 6378736 6366468 6341724 6329319
9585F329319l054p3968m7288j10118l8530p5669o2298q9273k3015o4087j0181
$$ 6329319 6326265 6252297 6205009 6094891 6056361 5980692 5918394 5829121 5806106 5742019 5731838
9574E731838O3798J4138j01249j00164J2135n3816k8500p3233n146n7203j885
$$ 5731838 5795636 5809774 5708525 5608361 5620496 5566680 5538180 5464947 5459801 5402598 5400713
9563E400713m701m6640O9035N7309O7756J01273J14351J76279J71049J53928L27133
$$ 5400713 5396012 5349372 5418407 5475716 5543472 5644745 5759096 5935375 6106424 6260352 6587485
9552F587485L05890M23001M80080M59634N13633O68970P14105Q38842J010305
$$ 6587485 6893375 7316376 7796456 8256090 8769723 9438693 10152798 10991640 12001945
9543A2001945J053426J265749J321914J339739J331770J214114R16390N45858
$$ 12001945 13055371 14321120 15643034 16982773 18314543 19528657 20445047 20990905
9535B0990905L26986p3729l49815o45631q82890j014785j101041j099234j070171
$$ 20990905 21317891 21244162 20894347 20248716 19365826 18351041 17250000 16150766 15080595
9526A5080595j097830j148052r91431j007056r38778q47555p21730o79753o44012
$$ 15080595 13982765 12834713 11843282 10836226 9897448 9049893 8328163 7648410 7004398
9517G004398m80662m25378m10390k92333j72661k06737j78033k41659j49316q0198
$$ 7004398 6523736 6098358 5687968 5395635 5222974 5016237 4838204 4596545 4447229 4367031
9507D367031j47j20221j22399j5191l9436L7154K8120K5188M4549N5350J29028
$$ 4367031 4366884 4246663 4124264 4109073 4069637 4106791 4134911 4160099 4204648 4259998 4389026
9496D389026J26804J42445J27358J81741K45553K82322K83221K08224K08498J69750
$$ 4389026 4515830 4658275 4785633 4967374 5212927 5495249 5778470 5986694 6195192 6364942
9486F364942J28785J69237J96427N4329L844k2011j37535j23006j38502j87831
$$ 6364942 6493727 6662964 6859391 6913720 6917564 6895553 6758018 6635012 6496510 6308679
9476F308679k69564k08920k06356k18766j18421j75627k22749j76667r3911j10464
$$ 6308679 6039115 5830195 5623839 5405073 5286652 5111025 4888276 4711609 4617698 4507234
9466D507234q9266p4002L7975j11556r4220j44517r8618k7603l1646j146M1038
$$ 4507234 4417968 4343966 4381941 4270385 4176165 4031648 3933030 3905427 3873781 3872635 3913673
9455C913673P3985k4761k5425m7808N8491L3882Q286o3200l3127q574J8651o1236
$$ 3913673 3987658 3962897 3937472 3889664 3948155 3982037 3990323 3927123 3893996 3885422 3904073 3842837
9443C842837L9323M2426m933j9675L6055J63759R4115J41677Q3765J84996K79896
$$ 3842837 3882160 3924586 3919653 3899978 3936033 4099792 4193907 4335584 4419349 4604345 4884241
9432D884241J89901J91567K68020L35045K35869J15317J89545M7719M5457j55300
$$ 4884241 5074142 5265709 5533729 5868774 6104643 6219960 6409505 6457224 6502681 6347381
9422F347381j72653k47292j90016k46674k80914k97616k63069k82752k13180k21573
$$ 6347381 6174728 5927436 5737420 5490746 5209832 4912216 4649147 4366395 4153215 3931642
9412C931642k05835j95958j91106k12176j65751r7801j05049p3545o781p3816
$$ 3931642 3725807 3529849 3338743 3126567 2960816 2863015 2757966 2684421 2677640 2603824
9402B603824l0448J4320k5109r084n2794m8190l7518K1561k4952L5391m3012L9932
$$ 2603824 2573376 2587696 2562587 2553503 2500709 2452519 2415001 2436562 2411610 2447001 2403989 2443921
9390B443921k5958m5727m8999Q063q213N4704O1537k1196o093r52j6615N3510
$$ 2443921 2417963 2372236 2323237 2331300 2323087 2377791 2439328 2418132 2412039 2411087 2394472 2447982
9378B447982l6636O6684Q9239j2938N609J32781N1766K8886O8204J32423L9198
$$ 2447982 2411346 2478030 2567269 2554331 2559940 2692721 2744487 2773373 2841577 2974000 3013198
9367C013198O9637J32147P5028R1500N9703Q3333Q9138K1490J6813j4091P5123
$$ 3013198 3082835 3214982 3290010 3381510 3441213 3524546 3613684 3635174 3651987 3637896 3713019
9356C713019N9152m4715L9804M1039N2730r7907l4237P8066M2050K5289o0165
$$ 3713019 3772171 3727456 3767260 3808299 3861029 3763122 3728885 3806951 3849001 3874290 3814125
9345C814125p7627O0331P2872K9040l65R831O7400N0147K6609L3450Q0970P0732
$$ 3814125 3736498 3796829 3869701 3898741 3898376 3908207 3975607 4025754 4052363 4085813 4166783 4237515
9333D237515O6970R8187K9033R2020J15102O0729J31520R5169M5042N1936O1018
$$ 4237515 4304485 4402672 4431705 4523725 4638827 4699556 4831076 4926245 4971287 5023223 5084241
9322E084241P1663J09151J18602J43261Q9206R5555J46096P4117J37930J54122
$$ 5084241 5155904 5265055 5383657 5526918 5616124 5711679 5857775 5931892 6069822 6223944
9312F223944N2519J84798J70773Q7120N4636j2266o504k5460j19714j34065j76142
$$ 6223944 6276463 6461261 6632034 6719154 6773790 6761524 6755020 6729560 6609846 6475781 6299639
9301F299639k04043j60226k11960k64332j24133j04738p2794q1090j35261k6869
$$ 6299639 6095596 5935370 5723410 5459078 5334945 5230207 5157413 5076323 4941062 4914193
9291D914193j60223l1407O8036p4501L2274M8298J5499J09550J22556R9223O1881
$$ 4914193 4753970 4722563 4790599 4716098 4748372 4796670 4812169 4921719 5044275 5143498 5205379
9280E205379Q4969N5229J20246M2591J24803J40156M5191j6194O0539O9362L7927
$$ 5205379 5290348 5345577 5465823 5508414 5633217 5773373 5818564 5802370 5862909 5932271 5970198
9269E970198M0397k165O9202N3218K860K9664M5681K0738J47737J38560M1754
$$ 5970198 6010595 6008430 6077632 6130850 6133710 6163374 6209055 6229793 6377530 6516090 6557844
9258F557844L2977J44581K08745R5822J27210J91110J91336J00789J53593K26649
$$ 6557844 6590821 6735402 6944147 7039969 7167179 7358289 7549625 7650414 7804007 8030656
9248H030656J70991J56147K14351K21650K19826J92546J60621J53862L17584K40497
$$ 8030656 8201647 8357794 8572145 8793795 9013621 9206167 9366788 9520650 9838234 10078731
9238A0078731J63337L07995K04292K89871L59814L66934L38287L79905L64037
$$ 10078731 10242068 10550063 10754355 11044226 11404040 11770974 12109261 12489166 12853203
9229A2853203L50352M37207N11616N49833N31564N97409P40731P47395P42646
$$ 12853203 13203555 13640762 14152378 14702211 15233775 15831184 16571915 17319310 18061956
9220A8061956P77759P98033Q46452R32571J021559R65814R67209J062744J197286
$$ 18061956 18839715 19637748 20484200 21416771 22438330 23404144 24371353 25434097 26631383
9211B6631383J201741J410081J387715J495044J773611J917001K172293K393636
$$ 26631383 27833124 29243205 30630920 32125964 33899575 35816576 37988869 40382505
9203D0382505K667521K854871L054812L232792L311763L320850L212535L035889
$$ 40382505 43050026 45904897 48959709 52192501 55504264 58825114 62037649 65073538
9195F5073538K777406K489644K098590J712930J374257Q88224N49330L11828K13741
$$ 65073538 67850944 70340588 72439178 74152108 75526365 76414589 76963919 77275747 77489488
9186G7489488K1053K6388J70893K56045L32977M60186N93390Q16464R83635J248489
$$ 77489488 77510541 77536929 77707822 77963867 78296844 78757030 79350420 80166884 81150519 82399008
9176H2399008J552845J853860K202952K468714K888739L193652L527564L727116
$$ 82399008 83951853 85805713 88008665 90477379 93366118 96559770 100087334 103814450
9168A03814450L774570M120077M445239M614247M572339M496798M381244M130064
$$ 103814450 107589020 111709097 116154336 120768583 125340922 129837720 134218964 138349028
9160A38349028L643866K921619K149449J401443R09278J97158p55997j422595
$$ 138349028 141992894 144914513 147063962 148465405 149374683 149571841 148815844 147393249
9152A47393249j995949k317167k432623k306889j996370j700681j193372n11147
$$ 147393249 145397300 143080133 140647510 138340621 136344251 134643570 133450198 132939051
9144A32939051J29018Q58099J694238K609335L426384M425726N502797O441198
$$ 132939051 133068069 133926168 135620406 138229741 141656125 146081851 151584648 158025846
9136A58025846P304903P895949Q448350Q696043Q716734Q445960P665227O765247
$$ 158025846 165330749 173226698 181675048 190371091 199087825 207533785 215199012 221964259
9128B21964259O006966N417787M708912L784640K952763K188807J360629O04593
$$ 221964259 227971225 233389012 238097924 241882564 244835327 247024134 248384763 248989356
9120B48989356J00423m83616q97522j246776j750664k467448l227674l590500
$$ 248989356 249089779 248606163 247708641 246461865 244711201 242243753 239016079 235425579
9112B35425579m007473m550812m667463m375130m134241l535642k786464k384601
$$ 235425579 231418106 226867294 222199831 217824701 213690460 210154818 207368354 204983753
9104B04983753j931239j860744j592725j542005j653391j854882k106336k410704
$$ 204983753 203052514 201191770 199599045 198057040 196403649 194548767 192442431 190031727
9096A90031727k888654l351342l666212l707338l539501l176771k674571k038382
$$ 190031727 187143073 183791731 180125519 176418181 172878680 169701909 167027338 164988956
9088A64988956j404006q08514k61687k6971J23941K54771K55690L09339L74777
$$ 164988956 163584950 162776436 162514749 162487778 162611719 162866490 163122180 163431519 163806296
9079A63806296N58474N84530P12450P85401Q84865J080471J215341J192919J102652
$$ 163806296 164364770 164949300 165661750 166447151 167332016 168412487 169627828 170820747 171923399
9070A71923399J086791J040066O04411j08658j014135k110231l013322l722892
$$ 171923399 173010190 174050256 174654667 174546009 173531874 171421643 168408321 164685429
9062A64685429m532732n250133n936044o477493o846447p038507o918760o608957
$$ 164685429 160152697 154902564 148966520 142489027 135642580 128604073 121685313 115076356
9054A15076356o148852n727834n215166m744704m220783l638036k948516k495247
$$ 115076356 108927504 103199670 97984504 93239800 89019017 85380981 82432465 79937218
9046G9937218k077555j816441j524397j162142j050791r73425p52941o79917o68770
$$ 79937218 77859663 76043222 74518825 73356683 72305892 71332467 70579526 69899609 69230839
9037F9230839n06213m99212m75892m92566m03521l57493k11450j05308J06157
$$ 69230839 68724626 68225414 67749522 67256956 66853435 66495942 66284492 66179184 66285341
9028F6285341K63287M99966O67956R57622J137204J403789J656105J952387K189117
$$ 66285341 66548628 67048594 67716550 68674172 69811376 71215165 72871270 74823657 77012774
9019G7012774K315422K481608K631230K956623L399583L758349L983128M324380
$$ 77012774 79328196 81809804 84441034 87397657 90797240 94555589 98538717 102863097
9011A02863097M548954M585080M493453M150332L832487L422258L031449K738876
$$ 102863097 107412051 111997131 116490584 120640916 124473403 127895661 130927110 133665986
9003A33665986K507934K219957J844602J327703R32531R10438J199536J890260
$$ 133665986 136173920 138393877 140238479 141566182 142498713 143409151 144608687 146498947
8995A46498947K705074L484023M542593N549986O588883P496130Q096411Q471159
$$ 146498947 149204021 152688044 157230637 162780623 169369506 176865636 184962047 193433206
8987A93433206Q599792Q538496P748325O740556N575533M290748L020368K097862
$$ 193433206 202032998 210571494 218319819 225060375 230635908 234926656 237947024 240044886
8979B40044886J110503K38487j34139n10047q71924j186735j832385k352593k798164
$$ 240044886 241155389 241393876 241259737 240749690 239877766 238691031 236858646 234506053 231707889
8970B31707889l308740l501477l390017l204373k915730k602020j937535j177064
$$ 231707889 228399149 224897672 221507655 218303282 215387552 212785532 210847997 209670933
8962B09670933k7299J447760L163145M866690O621069Q387744R711859J0650105
$$ 209670933 209643634 211091394 214254539 219121229 225742298 234130042 243841901 254492006
8954B54492006J1322374J1534253J1105362R883359P815512N445032K765932J16851
$$ 254492006 265814380 277348633 288453995 298337354 306152866 311597898 314363830 314480681
8946C14480681k576018n207210p495074r533469j0982759j2118268j2754558j2972115
$$ 314480681 311904663 306697453 299202379 289668910 278686151 266567883 253813325 240841210
8938B40841210j2981307j2910969j2841909j2595146j2029008j1277090j0213230
$$ 240841210 227859903 214948934 202107025 189511879 177482871 166205781 155992551
8931A55992551r123152p900612o481096n006759l586095k212071r82107J30071
$$ 155992551 146869399 138968787 132487691 127480932 123894837 121682766 120700659 120830730
8923A20830730J054426J585032J986964K097979K154940K332729K192808J905860
$$ 120830730 121885156 123470188 125457152 127555131 129710071 132042800 134235608 136141468
8915A36141468J565605R23480L26701n53457j356969k181568l322551m190402
$$ 136141468 137707073 138630553 138957254 138403797 137046828 134865260 131542709 127352307
8907A27352307n121903n822858o403426o788473o908963p014274o830962o669157
$$ 127352307 122230404 116407546 110004120 103215647 96306684 89292410 82461448 75792291
8899G5792291o346298n886372n466781n023650m666321m289247l804816l421653
$$ 75792291 69445993 63559621 58092840 53069190 48402869 44113622 40308806 36887153
8891C6887153l008529k647652k328601k058648j736540j517918j331187j112617
$$ 36887153 33878624 31230972 28902371 26843723 25107183 23589265 22258078 21145461
8883B1145461r73726q95573o62543o34558n06206m05216m01701l89735l31549
$$ 21145461 20171735 19276162 18613619 17979061 17472855 17067639 16665938 16276203 15944654
8874A5944654k60996l21275l70341l39976m56927l80258m02451l97263m94653
$$ 15944654 15683658 15362383 14992042 14652066 14195139 13814881 13412430 13015167 12520514
8865A2520514m64045m14450m40124l93032l91303m12237l11639k44640l14868
$$ 12520514 12056469 11642019 11201895 10808863 10417560 10005323 9693684 9449044 9134176
8856I134176k59513k59278k82387k20279j66851k18655k39685k05307j30365j49084
$$ 9134176 8874663 8615385 8332998 8112719 7945868 7727213 7487528 7282221 7151856 7002772
8846G002772j28914j97406k04576j85512j48811q1693r4247o2518j11997j82600
$$ 7002772 6873858 6676452 6471876 6286364 6137553 6055860 5961613 5899095 5787098 5604498
8836E604498j79462j36536q5717r3164p9899n0357j30459n956K732r306J3371
$$ 5604498 5425036 5288500 5202783 5109619 5029720 4979363 4848904 4842948 4845680 4836374 4849745
8825D849745j11034k3436K2339j2829o3633p7164J905k0809p1304m801r8291k4381
$$ 4849745 4738711 4715275 4737614 4724785 4661152 4583988 4585893 4565084 4493780 4488979 4390688 4366307
8813D366307p9664o7316m4690j160q7159o1229n6931k3487o7214n0523J83p7650
$$ 4366307 4286643 4219327 4174637 4173477 4086318 4025089 3968158 3944671 3877457 3826934 3827117 3749467
8801C749467n1559P062J4926r021q3944k2397k041m4606r138P4668J5295k9726
$$ 3749467 3697908 3704970 3719896 3710875 3626931 3604534 3602493 3557887 3548749 3623417 3638712 3608986
8789C608986M262p2945j8538q529Q3742n1878o0841k9128q8220o3629m2277j7229
$$ 3608986 3613248 3540303 3521765 3513236 3596978 3545100 3484259 3455131 3366911 3303282 3261005 3243776
8777C243776m7509j0869L6249k4003m8930J266l847j1760n4911Q2552p232j11002
$$ 3243776 3196267 3185398 3221647 3197644 3148714 3149980 3146133 3134373 3079462 3162014 3154782 3043780
8765C043780k4080J08441J3507j4747L7126j11634J6262J5421k7648m7338l7206
$$ 3043780 3019700 3128141 3141648 3126901 3164027 3052393 3068655 3084076 3056428 3009090 2971884
8754B971884r5240j0731p6422l1037n7291l7546q2587j7676j0198m4447j6509
$$ 2971884 2876644 2865913 2789491 2758454 2701163 2663617 2581030 2563354 2553156 2508709 2492200
8743B492200l4135L0168L7187L2659j04103O436N3568R480L5750j1545M9679J561
$$ 2492200 2458065 2488233 2525420 2558079 2453976 2460412 2513980 2523460 2559210 2547665 2597344 2598905
8731B598905l948K7712m1834k3143m1350K6995M0949p1941r0405n2320m9664m2419
$$ 2598905 2594957 2622669 2580835 2557692 2516342 2543337 2584286 2512345 2421940 2369620 2319956 2277537
8719B277537j4448k115j82839l9633p5715l6965o6684l2662l8790l5682m792n3145
$$ 2277537 2263089 2260974 2078135 2038502 1962787 1925822 1859138 1826476 1787686 1752004 1747212 1694067
8707A694067j9124j11575M2472m8554k6240N8687k0756l9482J0797K5525J3276
$$ 1694067 1674943 1563368 1605840 1557286 1531046 1589733 1568977 1529495 1540292 1565817 1579093
8696A579093L0272m1899l5138o1557o1609J2845Q299J4528r745p3631J0341m4011
$$ 1579093 1609365 1567466 1532328 1470771 1409162 1422007 1430306 1444834 1435089 1361458 1371799 1327788
8684A327788k8172k8282N9410n134p2570j04369m5058P2521k1649k2470k8200
$$ 1327788 1299616 1271334 1330744 1325610 1253040 1148671 1103613 1176134 1154485 1132015 1103815
8673A103815j6697l8779m1504J0794L2371l0379J5716J7675k8032m3225L7556
$$ 1103815 1087118 1048339 1006835 1017629 1050000 1019621 1035337 1053012 1024980 981755 1019311
8662A019311j3496Q690p7109J9009K3537K6944J6294k7816K5015m0808p528L445
$$ 1019311 1005815 1014505 937396 956405 979942 1006886 1023180 995364 1020379 979571 972043 975488
8650I75488N6205Q074l1283K2308Q3542m704m0846M406L6442P7359K6464J2109
$$ 975488 1031693 1039767 1008484 1030792 1114334 1109630 1068784 1073190 1109632 1186991 1213455 1225564
8638A225564r087l7921J7353k8309J4284j1595Q5690Q7234m0427O2057L5869O2232
$$ 1225564 1216477 1178556 1195909 1167600 1181884 1170289 1255979 1343213 1302786 1364843 1400712 1462944
8626A462944o668n553N5229Q7113j1515Q521Q4688J1666p946N1266l6443q7428
$$ 1462944 1456276 1450723 1505952 1593065 1581550 1590071 1674759 1686425 1678479 1729745 1693302 1605874
8614A605874N7626M9496K5573k2342j9916P7588n9069q9424P1640m1023J11286
$$ 1605874 1663500 1712996 1738569 1716227 1696311 1773899 1714830 1625406 1697046 1656023 1767309
8603A767309k3281k4018P7641p6858q0155J0836M3329K683N6258M7922Q5152p9278
$$ 1767309 1744028 1720010 1797651 1720793 1640638 1651474 1694803 1697486 1753744 1801666 1886818 1807540
8591A807540Q0534R2069M9080m781M6517j9968P6116L001J8632j64861j30092
$$ 1807540 1888074 1980143 2029223 2024442 2070959 2050991 2127107 2130108 2148740 1983879 1853787
8580A853787J33587j03982p014o0098q7356k4824m1465r3435R038j01962j05050
$$ 1853787 1987374 1883392 1876378 1816280 1728924 1704100 1662635 1569200 1578238 1476276 1371226
8569A371226r1910m589N8293o0456k444k9732K0299n214M1720K4569r4295L9936
$$ 1371226 1279316 1274727 1333020 1272564 1270120 1240388 1260687 1255473 1297193 1321762 1227467 1267403
8557A267403P5074K4594L671K1662k3653J11575L0508j0122l8857N8010l4716
$$ 1267403 1342477 1367071 1370742 1392404 1368751 1480326 1510834 1500712 1461855 1519865 1485149
8546A485149n3474r6575n8141q993m4922J2552M3782n4512j13358l99l9885j2219
$$ 1485149 1431675 1335100 1276959 1267966 1223044 1235596 1279378 1224866 1111508 1111109 1071224 1059005
8534A059005k2300J120r2895j2234M87k0555P148M1148p8258Q440J4544m664p152
$$ 1059005 1036705 1037825 944930 932696 933183 912628 919776 960924 882666 891106 905650 900986 893834
8521H93834n2624J2811n3506N768L8387j7272l7921k3990J7234K6342l7167Q77
$$ 893834 841210 854021 800515 806283 844670 827398 789477 765487 782721 809063 771896 772773
8509G72773m571l8469M9442J9883J4906P5767o459m1870l6468J22940K0124P48
$$ 772773 768202 729733 779175 799058 813964 889731 883272 841402 804934 927874 947998 948746
8497I48746K1307K125P656Q3764Q6634P1213N6469N8492N7322P5677O2538O9059
$$ 948746 970053 972178 979834 1063598 1150232 1221445 1277914 1336406 1393728 1469405 1531943 1601002
8485A601002J75394P4066M3533J06545R3014J22021L3008l4910J41724J15310
$$ 1601002 1776396 1850462 1893995 2000540 2093554 2215575 2248583 2213673 2355397 2470707
8475B470707j0495l172N6069R9337R1000k4660J2487L4164J1019r9718l0335k3707
$$ 2470707 2460212 2457040 2513109 2612446 2703446 2678786 2691273 2725437 2736456 2636738 2606403 2582696
8463B582696k3812m6366j24816k0266o8512o3161r6831m1475q5837r8661o3564
$$ 2582696 2558884 2512518 2387702 2367436 2298924 2235763 2138932 2097457 2011620 1912959 1849395
8452A849395q1579j05995r3225q7597j3592L2791m7384n1307r693j9830l8446
$$ 1849395 1767816 1661821 1568596 1480999 1467407 1500198 1452814 1401507 1391814 1371984 1333538
8441A333538j4697l4041k2634l8249J5342j5157j3819r2900P16j4990J8553k3788
$$ 1333538 1318841 1284800 1262166 1223917 1239259 1224102 1210283 1117383 1118099 1103109 1121662 1097874
8429A097874m6794j8416o8505O080j2711p6034J8280J8012l4812n3666m9052Q14
$$ 1097874 1051080 1032664 964159 970239 957528 881494 899774 917786 882974 829308 780256 781070
8417G81070K916K7444l1674k4041M756N3288k9805o5091j3586K4192m1639l7877
$$ 781070 783986 811430 779756 755715 760471 813759 783954 718863 705277 729469 687830 649953
8405F49953M2121n385O1393O2559l0623J6384O8685k941m0666n539L388O9520
$$ 649953 692074 686689 748082 810641 780018 796402 865087 862146 821480 815941 819329 888849
8393H88849M9786k360P7861L4697J6981K7085n260O64L136Q4650J14920j5544
$$ 888849 938635 936275 1014136 1048833 1065814 1092899 1087639 1088303 1091439 1176089 1291009 1275465
8381A275465P3083L3277r6191M762Q0727j217n4736M1332N1624L4772J2909M5455
$$ 1275465 1348548 1381825 1285634 1290396 1371123 1369906 1315170 1356502 1408126 1442898 1455807 1501262
8369A501262o1476r793K5952m8320K4179m1673p151L927k871n6391m821n0450
$$ 1501262 1439786 1429993 1455945 1407625 1431804 1390131 1382980 1386907 1384036 1327645 1322824 1272374
8357A272374L2419L4866r050R790J07293L1431r2410L2415K4437k265M2746K8506
$$ 1272374 1304793 1339659 1330609 1340399 1447692 1479123 1386713 1419128 1443565 1441300 1484046 1512552
8345A512552m2687P2686J7033N9644J00144Q2079J0542P280L324K0442Q615O3926
$$ 1512552 1469865 1542551 1559584 1619228 1719372 1801451 1811993 1819273 1822597 1843039 1851654 1915580
8333A915580J0266L8450j9216j9085n942p6364L5180j2237k1862r4821o2213o9525
$$ 1915580 1925846 1964296 1945080 1925995 1920053 1843689 1878869 1866632 1844770 1749949 1687736 1618211
8321A618211j203K2317l4834j07616r1991K5037n2495q993p3383n9582K086j2411
$$ 1618211 1617008 1639325 1604491 1496875 1404884 1429921 1377426 1368433 1295050 1235468 1237554 1225143
8309A225143m1676k3422k4989Q005m2860l9740j24530K3698K4484j2860K534l5588
$$ 1225143 1183467 1160045 1135056 1143061 1100201 1060461 935931 959629 984113 971253 973787 938199
8297I38199J6087o546l7872q2016N2508n8985j253k496q953M5666K847J9253k4187
$$ 938199 954286 947740 909868 827852 880360 821375 820122 817626 808673 854339 857186 876439 852252
8284H52252j4164K2172J2973J1945k6003P8207N2926n0176k4403O196K323J5170
$$ 852252 838088 860260 873233 885178 859175 937382 990308 940132 915729 921925 924248 939418
8272I39418J0684l9129m5803P371O0044n799l0696l5820R461N4824l4265j2381
$$ 939418 950102 910973 865170 872541 932585 926786 896090 860270 869731 924555 890290 877909
8260H77909L776Q1224L2026j5307j51P763R717J08209O6521n819k5958j238M0779
$$ 877909 881685 962909 994935 979628 979477 987240 996957 1105166 1171687 1165868 1139910 1138672 1179451
8247A179451l7944J08173M6511J1730K5760O6066L8779P658O3980j8304O3599
$$ 1179451 1141507 1249680 1296191 1307921 1333681 1399747 1438526 1446184 1510164 1491860 1555459
8236A555459Q1250K8628l376P1311P6007J3881O6156n5225J6215N2936M4433j5916
$$ 1555459 1636709 1665337 1661961 1733272 1809279 1823160 1889316 1834091 1850306 1903242 1947675 1931759
8224A931759l2431n86n74o0812J0334K53m4580K7859n2492n8932N062L0858L878
$$ 1931759 1899328 1898742 1898168 1837356 1847690 1847943 1803363 1831222 1778730 1719798 1724860 1755718 1759596
8211A759596j03811j9027j6452j24121j02537J05228j5737k9363o7459K298o6359
$$ 1759596 1655785 1636758 1620306 1496185 1393648 1498876 1483139 1453776 1386317 1388615 1322256
8200A322256m8731l2791K2090O4475K8485j46550o3983k32479n40647O21315K01151
$$ 1322256 1273525 1240734 1262824 1327299 1355784 1209234 1145251 912772 372125 993440 1194591
8189A194591l6822m8681J17465N5427o5028K39L2722N0112n414J5403q9096J942
$$ 1194591 1157769 1109088 1226553 1281980 1216952 1217191 1249913 1300025 1294611 1310014 1220918 1222860
8177A222860J2822j5943j04763L1978M6048j3145o7894m5638k8453n153l9334
$$ 1222860 1235682 1219739 1114976 1146954 1193002 1179857 1111963 1066325 1037872 1032719 993385
8166I93385L693m7136j35040k5531K7028k2067m9320o498j1052p7649L539p0016
$$ 993385 997078 949942 814902 789371 816399 794332 745012 738514 727462 649813 653352 583336
8154E83336m113O082j0260L1975j018j3910J9936j5512o0674l8549p51o9861M294
$$ 583336 579223 585305 575045 607020 606002 592092 612028 596516 535842 497293 496542 426681 430975
8141D30975K1669j0570K2322M9086n6501p334m6026o2751O8176M4958K264k9502
$$ 430975 452644 442074 464396 513482 456981 449647 403621 340870 409046 454004 456268 426766
8129D26766J3722l8525o2243m647M8537M2989O2170n289o0592l1476J8551r48
$$ 426766 440488 401963 339720 335073 383610 426599 488769 483480 422888 391412 409963 409015
8117D09015l723K6989J2268R189o3718l8112P2337l025R447k740o0626K7741K2044
$$ 409015 405292 432281 444549 453738 390020 351908 424245 421220 430667 427927 367301 395042 417086
8104D17086J5588M1594o9499j269O7216j5084o3074J1692j1061k8020K146N6479
$$ 417086 432674 474268 404769 403500 470716 455632 392558 404250 393189 365169 367315 423794
8092D23794O5486l7758m6275L2749N0996j4633o8726k6759k445P3383O3503o82
$$ 423794 489280 451522 405247 437996 488992 474359 405633 378874 376429 449812 513315 512633
8080E12633m4734j09918J0565P7797N3263M76l13k592L3034K2824j0207m3028
$$ 512633 467899 357981 368546 446343 499606 500082 499769 497177 530211 553035 542828 499800
8068D99800l1760k020M2403O263n986L641j6274K6349L3103n9677k0665J2435
$$ 499800 468040 466020 508423 514686 508700 512341 496067 522416 555519 495842 475177 487612
8056D87612j0768o112m8757n5323j8214L1272q5761l8114J6265j6974L0767j7830
$$ 487612 476844 470732 421975 366652 348438 379710 293949 255835 272100 255126 285893 268063
8044B68063O1094k0914q4212M8916J9459n6626q006O8396l2290j6266K0344p7520
$$ 268063 329157 308243 224031 272947 292406 235780 227774 296170 263880 247614 267958 190438
8032A90438k6722L609J6977k344k1116k3954L5494j620l699P190N0777J4308q0063
$$ 190438 163716 167325 184302 181958 160842 136888 172382 170762 167063 174253 225030 239338 159275
8019A59275p3757P9382j7962j3476J4265O2464J9429r719m3803l8610K2069j5139
$$ 159275 85518 164900 146938 133462 147727 210191 229620 219901 176098 137488 159557 144418
8007A44418K1304o855k2974l9538N9241j07541L102Q8201j9541J4553l5724M9774
$$ 144418 165722 158867 135893 96355 155596 48055 51157 139358 119817 134370 98646 148420
7995A48420l0141l9312R6079l4921l9842J5783M7228l5736n7619J4024O6098N527
$$ 148420 118279 78967 175046 140125 100283 116066 163294 127558 69939 83963 150061 155588
7983A55588k3379l3625j220k7971K6465j9408L986J523J5430M0484J2467L7061
$$ 155588 132209 98584 97364 69393 95858 76450 80436 81959 97389 137873 150340 187401
7971A87401j8472J8882Q637m9943J4485L50o328M9154j5085J4302L6982l0303
$$ 187401 168929 187811 196448 146505 160990 161340 155012 204166 189081 203383 240365 210062
7959B10062k0961J1952P9192o5246N4402L2718k7908M3239n0410J1830j1015L4128
$$ 210062 189101 201053 280245 214999 269401 302119 274211 317450 267040 278870 267855 301983
7947C01983P423L8224K9343k5864J2895k1120l4411P828n0478q611N9739m9595
$$ 301983 309406 347630 376973 351109 364004 342884 308473 316301 265823 257212 316951 267356
7935B67356M7514m0557l1742j605l283M3484l0594l2218q8529k132M0909N3734
$$ 267356 314870 274313 242571 240966 237683 281167 250573 218355 129826 127694 168603 222337
7923B22337o775j43693M518J8570o2421l551j6440o214K3082M2125J7873j7712
$$ 222337 215562 71869 76387 94957 32536 28985 12545 6331 29413 71538 89411 71699
7911G1699l1313K7760l8789l230M3395k8224j8241o6778J7o324l1209L5001O4014
$$ 71699 40386 68146 29357 26127 69522 41298 23057 -43721 -43704 -50028 -81237 -46236 17778
7898A7778L9351J8233n6n7031m7038K7955P0944j4342j7085n9839p332P588M4614
$$ 17778 57129 75362 75306 18275 -28763 -808 70136 55794 38709 -21130 -28462 -20874 23740
7885B3740O053l0669J0079k6866j2879j50593J3177J12380j9347j9920P079J32747
$$ 23740 29793 -876 9203 -17663 -30542 -181135 -167958 -55578 -74925 -94845 -87766 44981
7873D4981L936N58k331j8949L7251k2526J5425L2995l5512P957j0751m6735N1870
$$ 44981 48917 49475 47144 28195 65446 42920 58345 91340 55828 63785 53034 6299 58169
7860E8169l0742l2761o5769o5599J1702P2917n311n8300L512n7063J2939M8212
$$ 58169 27427 -5334 -71103 -136702 -125000 -52083 -57394 -115694 -112182 -169245 -156306 -108094
7848a08094m4162L7357K3803n6620k5450k5288j1709J8361O923J3758K3687O739
$$ -108094 -152256 -114899 -91096 -147716 -173166 -198454 -210163 -191802 -184879 -171121 -147434 -140695
7836a40695P6332l066J1974o0914r546k4874L9521k2685M9093J2809J1542M2791
$$ -140695 -64363 -67429 -55455 -116369 -125915 -150789 -111268 -133953 -84860 -72051 -60509 -17718
7824a7718p5689j17150n0219J17729P220k045M1744M9904j7669k3239l8768l7116
$$ -17718 -93407 -210557 -260776 -143047 -135827 -137872 -96128 -46224 -63893 -87132 -125900 -163016
7812a63016p2434o130J3244J9927J9369r8439P1901j9704j14068m07153J73272
$$ -163016 -235450 -241580 -228336 -208409 -189040 -287479 -215578 -235282 -349350 -756503 -583231
7801e83231O22573M0317N0071l708L9255q6200o4444n8518m4757J0853O3019m7749
$$ -583231 39342 79659 129730 126022 165277 79077 14633 -43885 -88642 -77789 -14770 -62519
7789f2519n176K530n630n645o7597L1943j9943O7763L1962j2743M4544L8269K4672
$$ -62519 -67695 -65165 -70795 -76440 -144037 -112094 -132037 -64274 -32312 -45055 -511 37758 62430
7776F2430n9861n2428k0982K8003l4690L8574M6985Q560j8974m5386K7795p0182
$$ 62430 2569 -49859 -70841 -42838 -77528 -38954 8031 16591 -2383 -47769 -19974 -90156
7764i0156k6025n262O7250K0007k2387j4466l1220K8888K5205l3677n9462J2439
$$ -90156 -116181 -121443 -54193 -34186 -56573 -71039 -102259 -73371 -48166 -81843 -141305 -128866
7752a28866J8960K3764J5620O967j4645j224M3607J2454j1303l846m7421N553
$$ -128866 -109906 -86142 -70522 -63555 -78200 -79424 -35817 -23363 -34666 -38512 -85933 -80380
7740h0380N9410l147o609m860m8687k7843M4110P4286O691m5382k1063L4118J8222
$$ -80380 -20970 -24117 -30726 -35586 -84273 -112116 -68006 6280 12971 -32411 -53474 -19356 -1134
7727a134m4679j2383J7322k9990j8769J540K6821P1477M6216J6046m7416J440
$$ -1134 -45813 -58196 -40874 -70864 -89633 -88093 -61272 10205 56421 72467 25051 26491
7715B6491j6264r6759Q9419N5622k0121K621K2949j9955m7279K1584L7804K1054
$$ 26491 10227 -86532 2887 58509 38388 41009 63958 44003 -3276 18308 56112 77166
7703G7166r415N4806K7661j9576k8052M3441k8367p3565l678M2039O7721r414
$$ 77166 67751 122557 150218 130642 102590 146031 117664 44099 40421 82460 150181 140767
7691A40767p7806M9624P1684J9072k2994J982M0028J7476L6311O6671M9962m7426
$$ 140767 62961 112585 184269 203341 180347 182329 222357 239833 276144 342815 392777 345351
7679C45351M5245N344k8245L7987L2105O5484q3471K0771N6834N9352K017n9558
$$ 345351 390596 395940 367695 405682 437787 503271 419800 440571 497405 556757 558774 499216
7667D99216m6775K0340N3822o7119k2116P7429L9404p1902L0532j6409K6766K3851
$$ 499216 452441 472781 526603 459484 437368 514797 554201 482299 512831 496422 523188 547039
7655E47039M9523Q2183l8119m101L3313J8514n516j797N0633O7805L1629p8747
$$ 547039 596562 678745 640626 636525 669838 688352 682836 681039 731672 799477 831106 752359
7643G52359K344J9295j356k9971R630p83l4206m3806J1833n597m4870L633m952
$$ 752359 754703 773998 772642 742671 752301 751518 717312 673506 685339 679742 634872 638505 633553
7630F33553k1859K007j3647K153j019P3618j1495r6305q719j0847J5458l9583
$$ 633553 611694 613701 600054 602207 601188 674806 663311 567006 558287 547440 562898 523315
7618E23315j7723P8448J6179r2165L5015R7263p6632o2151P8865j15429k6342
$$ 523315 505592 584040 600219 508054 543069 640332 563700 501549 580414 464985 438643
7607D38643R395j9822K5722k2934q01k8354n5815n6958j0677K9113o0483K9424
$$ 438643 448038 428216 453938 431004 430203 401849 346034 289076 278399 307512 247029 276453
7595B76453l6147J2740K314k9483R02M2589L167l8281r176j0739N2335q5148j2920
$$ 276453 240306 253046 255360 225877 226779 269368 272535 234254 225078 214339 266674 181526 168606
7582A68606J9108m5575O5340m1141k8180j644O060J2402K6163l8271j9472j2404
$$ 168606 187714 142139 207479 166338 138158 136514 142574 154976 181139 142868 123396 110992
7570A10992j2739k9211k1137l8745Q3661l653r0166P148N0127M1630m5394o0318
$$ 110992 98253 69042 47905 9160 92821 89168 -998 6150 56277 97907 52513 -7805
7558g805N9608R6603o0253o9485j130L5023P36j387j7123j6646k7318k1652K2878
$$ -7805 51803 148406 88153 18668 17538 52561 53297 51910 34787 18141 -9177 -30829 -7951
7545g951M8463l5871L1272L2311j349L1019l7474M210R6107R620p800n8911J2089
$$ -7951 40512 4641 35913 68224 66875 97894 60420 64630 160737 170357 162557 103646 115735
7532A15735J4481j2279K3028Q9707j01536N3534n543N0649Q2740k9640K5113l6977
$$ 115735 130216 117937 140965 230672 129136 182670 177127 227776 310516 280876 305989 269012
7520B69012p4447N1119m053n8150j4206j1220q6001l4068O5213K398q3103K114
$$ 269012 194565 245684 241631 183481 169275 158055 72054 37986 103199 105597 22494 24608
7508B4608K0700M3625J392m6155l902k7212J2182j0089M7040p3497J9102J12224
$$ 24608 45308 88933 90325 44170 40268 13056 25238 15149 62189 -11308 7794 120018
7496A20018j1888r7811o3050j8690Q4468K0360k5718K818J9603Q9270N969K607
$$ 120018 108130 10319 -52731 -71421 13047 33407 7689 10507 30110 119380 125349 127956
7484A27956Q33M9798K4353n6334p3635j6527R1175j06411l0591K5104O6560N9363
$$ 127956 128789 178587 202940 146606 72971 56444 147619 41208 10617 35721 102281 161644
7472A61644j1742n3815o5788k3612K3269P2241Q361k2146n0051k1246m146K6551
$$ 161644 149902 96087 30299 6687 29956 102197 110558 88412 38361 17115 12969 39520
7460C9520N3160N029M9098L2046k4059r0252M1719L6414l2242K6828j2686J3631
$$ 39520 92680 97709 146807 178853 154794 64542 106261 142675 110433 137261 124575 138206
7448A38206O9470N25n6762J5533P2897J5125j5411k1927N4789M1325J892N849
$$ 138206 207676 208201 151439 166972 239869 254994 239583 217656 272445 313770 315662 321511
7436C21511N5264N4362p4323L5844J0975q345N9579J2534j1825R576Q3473q46
$$ 321511 376775 431137 356814 392658 403633 395288 454867 467401 455576 465152 548625 547779
7424E47779J0006R599j2158n352J21990P033o591N0799J5776P7106l3619M9831
$$ 547779 557785 567384 555226 549874 671864 678897 672306 723105 738881 815987 782368 832199
7412H32199J00799Q7570J7405l2208L8418R9167J2663M5398Q6048j25105O3366
$$ 832199 932998 1020568 1037973 1005765 1044183 1143350 1156013 1201411 1287459 1162354 1225720
7401A225720P7874L895L2985l3064J27748N6215M5686J3614N5988l9589O9340
$$ 1225720 1303594 1307489 1340474 1307410 1435158 1491373 1537059 1550673 1606661 1567072 1636412
7390A636412M5207M3099N2265o8445J53896M0763o0179L3708O9141M7899R507
$$ 1636412 1681619 1724718 1776983 1708538 1862434 1903197 1843018 1876726 1945867 1993766 2003273
7379B003273j2628J4229J7418j2734J1577l4101O2734K9662o4006L3505J8653
$$ 2003273 1990645 2004874 2022292 2009558 2021135 1987034 2049768 2079430 2015424 2048929 2067582
7368B067582l8784P7562N7784l5970L8643O1950J382L2948K5205K5757J08m4026
$$ 2067582 2028798 2106360 2164144 2128174 2166817 2228767 2230149 2263097 2288302 2314059 2314167 2270141
7356B270141m7476m2725l7009q340l0475n9094j5720o2351j40457j04656O5760
$$ 2270141 2222665 2179940 2142931 2134591 2104116 2045022 2029302 1966951 1826494 1721838 1787598
7345A787598k3678k1154j4324n2150J658j3244r181J5651p8274k7750n5970o5671
$$ 1787598 1763920 1742766 1728442 1676292 1677950 1664706 1655525 1671176 1592902 1565152 1509182 1443511
7333A443511O2915k7066m9284k1184M2082n2080l7309p7945m8014j0224j53110
$$ 1443511 1506426 1479360 1430076 1408892 1450974 1398894 1361585 1283640 1235626 1225402 1072292
7322A072292p1950m8610N14j7305l4312m9241p6929k4414j3470K3967q338j04461
$$ 1072292 1000342 951732 952246 934941 900629 851388 774459 750045 736575 760542 752204 647743
7310F47743l8728k9455O4168m8477k2220j814k985p0906j7003p024j1368l9944
$$ 647743 609015 579560 643728 595251 573031 571217 568232 497326 480323 473299 461931 421987
7298D21987k8225R788j1802K2710k64k5059m1673r888p0489k5242L7138L3961
$$ 421987 393762 403550 391748 414458 414194 389135 347462 337574 267085 241843 278981 312942
7286C12942l6387q4084J5344N2552J9282k8658p7327l2887J9388K0920O5356K0309
$$ 312942 276555 192471 207815 260367 279649 250991 173664 140777 160165 181085 246441 266750
7274B66750O558j4364J4821Q4667k8628m6738k4193N5928O070k0161k6603m0179
$$ 266750 273308 258944 273765 358432 329804 283066 258873 314801 320871 300710 274107 233928
7262B33928K2733K4851o3789q473N6922j298j0219J4283j6640R3157l1243l3795
$$ 233928 256661 281512 217723 209250 266172 264874 254655 268938 252298 345455 314212 280417
7250B80417M1876K5130q4560K4950N254L5173K7904N2778k1461l6371L918m348
$$ 280417 322293 347423 262863 287813 293067 328240 356144 408922 387461 351090 355008 350660
7238C50660M152n7225n3495L5308k9544M0310P3298M7964P922n5961N6840j2956
$$ 350660 354812 297587 244092 279400 249856 290166 363464 411428 419350 363389 420229 407273
7226D07273m5149L9036l0314k3901L0182O8072L8716J1412r2863l7019L0140L3023
$$ 407273 362124 401160 370846 346945 377127 445199 483915 495327 402464 365445 395585 428608
7214D28608L7364j2787L7117K3093O0831l8752j0367J1637J4666l6270N6059M1172
$$ 428608 465972 453185 490302 513395 574226 535474 525107 536744 551410 515140 571199 612371
7202F12371L9176k3875M0511Q5137J0063J2278P461J3504J6072K8670l4480m0769
$$ 612371 651547 627672 668183 753320 763383 775661 783122 796626 812698 841368 806888 766119
7190G66119N1662P5569J2836M6063R014K7587M9920Q051O9263n054M7465K8564
$$ 766119 817781 893350 906186 952249 961263 988850 1038770 1046821 1116084 1111030 1158495 1187059
7178A187059J07622J34468R9736O9088N4116K06732J36543M5400R4140N3568P0794
$$ 1187059 1294681 1429149 1528885 1597973 1652089 1858821 1995364 2040764 2134904 2188472 2259266
7167B259266P3054J52000L6556P7782J58542N9884J93753J47501P7262K14840
$$ 2259266 2332320 2484320 2520876 2598658 2757200 2817084 3010837 3158338 3235600 3450440
7157C450440J38736J92416J93336K09514J89149L27198K74295K21924L04025M89961
$$ 3450440 3589176 3781592 3974928 4184442 4373591 4700789 4975084 5197008 5501033 5990994
7147E990994N03021M52926N54635N54337O56212O93804Q48398J057187J115749
$$ 5990994 6494015 6946941 7501576 8055913 8712125 9405929 10254327 11311514 12427263
7138A2427263J412710J659808J825532K109777K370789K701941L452282L973031
$$ 12427263 13839973 15499781 17325313 19435090 21805879 24507820 27960102 31933133
7130C1933133M262909M526305M458223M442658L640709J551603j21076j326694
$$ 31933133 36196042 40722347 45180570 49623228 53263937 54815540 54694464 53367770
7122E3367770k631765k978325l145516l315807l154942l102988l131260l195531
$$ 53367770 50736005 47757680 44612164 41296357 38141415 35038427 31907167 28711636
7114B8711636l286748k755259k440286k422322k361666k020197j585320j350637
$$ 28711636 25424888 22669629 20229343 17807021 15445355 13425158 11839838 10489201
7106A0489201j130531r86612q55348o14625m99009m37521m29571l13679k97962
$$ 10489201 9358670 8372058 7516710 6902085 6403076 5965555 5535984 5222305 4924343
7097D924343j50609j82765k03442k14356j52713j67842j33825q4592j58951j63994
$$ 4924343 4773734 4590969 4387527 4173171 4020458 3852616 3718791 3634199 3475248 3311254
7087C311254p6161j92438j10217j20364j88054p9910o0892o9203j13422p8723
$$ 3311254 3235093 3042655 2932438 2812074 2624020 2544110 2483218 2414015 2300593 2221870
7077B221870j30044o2124q7571n1888j26392l5660j38898m2927l6159j14838l7536
$$ 2221870 2091826 2029702 1942131 1890243 1763851 1728191 1589293 1546366 1510207 1395369 1357833
7066A357833k2074q6054o7579n6710n6028r7119n9631m5458o039N8296m0294j31641
$$ 1357833 1335759 1249705 1182126 1125416 1069388 972269 912638 867180 861141 919437 879143 747502
7054G47502j07445n6350o0672K5804n6637j14183j185K7878k6410J5693k9355
$$ 747502 640057 583707 523035 548839 492202 378019 376834 404712 378302 393995 364640
7043C64640m2361k0873J8985r892K8175k1478j3312L6211N562l1263l6405K3895
$$ 364640 322279 301406 320391 310499 338674 317196 303884 340095 345657 314394 277989 301884
7031C01884m6072k6873N6735j0031o010l6056q6008j7575N1428k9143L1089L6654
$$ 301884 255812 228939 285674 275643 269633 233577 147569 129994 181422 152279 183368 220022
7019B20022l7941o5940l6412L7746O4158j3369k6201j4579M2696p830o0824k3370
$$ 220022 182081 116141 79729 117475 181633 168264 142063 127484 170180 162350 101526 78156
7007G8156n3681M2429K306M0886L6856l5560L6049K8837j7054k9299J9124l9689
$$ 78156 24475 66904 69210 110096 146952 111392 147441 176278 159224 129925 149049 109360
6995A09360j3618P223m4917k898l9826M6565K8335r890N4700l7327k2385m3160
$$ 109360 95742 102965 58048 55150 15324 61889 90224 80334 135034 97707 75322 32162
6983C2162l3588L3817p261N6447k3487k2466j4449J8426o401L7273m5034k2683
$$ 32162 -1426 32391 25130 81577 58090 35624 21175 39601 33200 70473 25439 2756
6971B756k1638k502R195J3693L7905l4536j4112P3373K6052J3983k0821J7221
$$ 2756 -18882 -21384 -12189 1504 39409 4873 -9239 64134 90186 104169 83348 100569
6959A00569j6634l8096j7495J1150L7019N714p4650j1283P4185L0673l8838o2854
$$ 100569 83935 45839 28344 39494 76513 82227 7577 -3706 70479 101152 62314 -540
6947e40l817m9293Q2245K1344M531K8394m4120l1792J6625n8768J2068J3679o9969
$$ -540 -4357 -53650 28595 49939 54470 82864 38744 6952 23577 -35191 -23123 -9444 -79413
6934g9413M0785l7866l9792r1O2362J0637M8860j1210n9304k865M9974P1089o3375
$$ -79413 -38628 -76494 -116286 -116377 -54015 -43378 5482 -5728 -65032 -67897 -17923 53166 -10209
6921a0209n469j1843L7572m1910O0732n2958j3177k3401p9j3415K549O2169k030
$$ -10209 -15678 -27521 10051 -31859 28873 -24085 -37262 -60663 -60742 -74157 -71608 -9439 -11469
6908a1469N034K573m9034M6062J0883m4847L2293m4631k4316L5286q699l8540
$$ -11469 -6435 -3862 -52896 -6834 4049 -40798 -8505 -53136 -77452 -42166 -50865 -89405
6896h9405Q9811o1766K8448l7459p043N6989j6755M3616q417n0288m0792n3491
$$ -89405 406 -61360 -32912 -70371 -77414 -20425 -37180 6436 -1981 -52269 -93061 -146552
6884a46552L7414O3159k9665N9586M6632l3039M2203m3294p6262n093n248k7582
$$ -146552 -109138 -45979 -75644 -16058 30574 -2465 39738 -3556 -79818 -84911 -90159 -117741
6872a17741n4864R3330R2809j9958j1136L3733Q1740K383n9785k6264O7772p1469
$$ -117741 -172605 -79275 13534 -6424 -17560 16173 97913 100296 40511 14247 82019 10550
6860A0550r201J756k0796j6733j4188K0632J0362n3433J0001P6711p2410K7926
$$ 10550 1349 3105 -17691 -34424 -48612 -27980 -17618 -71051 -61050 15661 -56749 -28823
6848b8823L7445l9244O4899O4675l9233k0138m1607k3106j6030m6987M9930j543
$$ -28823 8622 -30622 34277 98952 59719 39581 -2026 -25132 -41162 -88149 -38219 -39762
6836c9762m064P0384J6500l8243j348r139j8139N162j5602p015K318Q8274l5528
$$ -39762 -43826 26558 43058 4815 3467 -5672 -23811 -18649 -34251 -41266 -38948 49326 13798
6823A3798N4582N6309m5001l0543k0283J1993Q8873m87J0432o197K6382r8336
$$ 13798 68380 124689 79688 49145 28862 40855 129728 129241 139673 133476 159858 61522
6811F1522K0835M7617n9702o414O3529J7496n0336J3390J1414R030m541o327m837
$$ 61522 82357 129974 70272 63858 127387 144883 94547 107937 119351 128381 123840 117513 112676
6798A12676n363k048n1605j039J37516j5877k2705m2960K2334L0705j2135j6491
$$ 112676 107313 105265 53660 52621 190137 174260 151555 108595 130929 161634 149499 133008
6786A33008o661K3124O745n9540j0560J9777K415K5922O0189J925j9700Q2546
$$ 133008 126347 149471 156216 96676 86116 105893 108308 134230 194419 196344 176644 259190
6774B59190l3583o8269j2613q331L3187k7072R826k6392J3434O872k9633K6770
$$ 259190 225607 157338 144725 136394 169581 142509 152335 125943 139377 146249 116616 143386
6762A43386j2716j7598k46Q7919j5910J655M5995J7774k6297n1980K356L2062
$$ 143386 130670 113072 112826 200745 184835 186490 232485 250259 223962 171982 174338 206400
6750B06400K3306K4615r839k0964n0636j8305L4627j2799J6886J0425Q1821L2906
$$ 206400 229706 254321 244482 223518 172882 154577 189204 176405 193291 203716 285537 318443
6738C18443m8385q4212J5604N1354L0395J7131k3519j8397N0942J844M2004j9915
$$ 318443 270058 185846 201450 252804 283199 300330 276811 258414 309356 311200 353204 333289
6726C33289p2939J05218J09795L3930K2238P587k7616J8925q693l2418m6477J3630
$$ 333289 260350 365568 475363 509293 531531 539118 511502 530427 521734 489316 442839 456469
6714D56469M4533M0548n6573L4724M1327p5164k0054L872l0720j9724l5466J5188
$$ 456469 501002 541550 484977 519701 561028 485864 465810 469682 438962 419238 383772 398960
6702C98960q472J2656o578q1045J1393p1471N4261O2045J7909N3982Q922K3109
$$ 398960 390488 403144 396566 315521 326914 255443 309704 371749 389658 443640 452562 475671
6690D75671J3655j22607k1605K1626N8451K0735p447K6458k574J191M1201m6524
$$ 475671 489326 366719 345114 366740 425191 445926 438479 464937 462363 463554 504755 458231
6678D58231m78J8444L3033M1713l1578L459o2794R848P6114L8961j1850O3149
$$ 458231 457753 476197 509230 550943 519365 522824 460030 469878 545992 584953 573103 636252
6666F36252O7275o854m6349L9853K3105J5770Q948J5691M9317M4954J5296L5930
$$ 636252 703527 696673 650324 690177 713282 729052 738000 753691 803008 847962 863258 899188
6654H99188L2516l0643P904M8239N4920j12291O0808M2621l2o3417o4505k8926
$$ 899188 931704 901061 908965 957204 1012124 899833 960641 1003262 1003230 939813 875308 846382
6642H46382P134K7416J198o6970j8699L4356M4192j2874J467N6843j5032J0098
$$ 846382 853516 880932 882130 815160 796461 830817 875009 862135 863602 920445 905413 915511
6630I15511M6897L5006j6665K9355l68M4704q904l604j8553M1971j9260J6236
$$ 915511 962408 997414 980749 1010104 1009736 1054440 1045536 1041932 1023379 1065350 1046090 1062326
6618A062326j2893K3405j7112M5447J0401l1238O816l2069k875M2785o892M5348
$$ 1062326 1049433 1072838 1055726 1101173 1111574 1080336 1087152 1055083 1052208 1094993 1088101 1133449
6606A133449P2611r6475k1289J2643m1468Q9048L2922L6989K6456N4927K1781
$$ 1133449 1206060 1109585 1088296 1100939 1059471 1148519 1181441 1218430 1244886 1299813 1321594
6595A321594Q6696M1513l5480N1010J39682R4368J0571K894M0543K753M1801J1799
$$ 1321594 1408290 1449803 1414323 1465333 1605015 1699383 1709954 1712848 1753391 1756144 1797945 1809744
6583A809744j5780M7594J7867q462N1145p6658N715P8653k2027k393Q1440O8908
$$ 1809744 1793964 1841558 1859425 1850963 1902108 1825450 1831165 1909818 1887791 1885398 1966838 2035746
6571B035746R05M3830j3847J7540L3057J20586M3542J01021M9081P9872P7823
$$ 2035746 2036651 2080481 2066634 2084174 2117231 2237817 2281359 2382380 2431461 2511333 2589156
6560B589156Q7345P6374K9830O6971P0454Q9338M4242r919M9171L6441J7112N6593
$$ 2589156 2676501 2752875 2782705 2849676 2920130 3009468 3053710 3043791 3092962 3129403 3146515 3203108
6548C203108M5342P3522J27795N8106Q0095R5335J82792L6343J15879J71382J81706
$$ 3203108 3248450 3321972 3449767 3507873 3587968 3683303 3866095 3902438 4018317 4189699 4371405
6537D371405J78205J19333J78474K13348J41265J92347J80244J01392K13199J89215
$$ 4371405 4549610 4668943 4847417 5060765 5202030 5394377 5574621 5676013 5889212 6078427
6527F078427J77408J38239K06735J83082J25405J67694J68040J76254K88860K68414
$$ 6078427 6255835 6394074 6600809 6783891 6909296 7076990 7245030 7421284 7710144 7978558
6517G978558J94645K52448L14061L17562L24994L34373L21349K38779L28072K74069
$$ 7978558 8173203 8425651 8739712 9057274 9382268 9716641 10037990 10276769 10604841 10878910
6507A0878910J94095K75599K00457J56504J69505J52104J42673J71415K11142
$$ 10878910 11073005 11348604 11549061 11705565 11875070 12027174 12169847 12341262 12552404
6498A2552404J51119J31224K22513J60535J95701K27247K63865K28817K85558
$$ 12552404 12703523 12834747 13057260 13217795 13413496 13640743 13904608 14133425 14418983
6489A4418983L50663K44393L30755L20152M00561L63958L57423L94767M26781
$$ 14418983 14769646 15014039 15344794 15664946 16065507 16429465 16786888 17181655 17608436
6480A7608436M23310M06514L67804L26751L29711K64117J91448M8622J41427K9407
$$ 17608436 18031746 18438260 18806064 19132815 19462526 19726643 19918091 19966713 20108140 20137547
6470B0137547j02026k5477m0533n0816p0148k9137q5382p3391m9758L6673J29592
$$ 20137547 20035521 20010044 19969511 19918695 19848547 19819410 19734028 19660637 19610879 19647552 19777144
6459A9777144P4463J79140Q1191J19587K17084L04719L01491K45305L04325L71311
$$ 19777144 19851607 20030747 20111938 20231525 20448609 20753328 21054819 21300124 21604449 21975760
6449B1975760K82175L09211L00617J35353K7676P183r5708j39649j26937k41469
$$ 21975760 22257935 22567146 22867763 23003116 23030792 23037975 22942267 22802618 22675681 22434212
6439B2434212k51207k25880k90655k74173l14639l42464l84850k86140l55605
$$ 22434212 22183005 21957125 21666470 21392297 21077658 20735194 20350344 20064204 19708599
6430A9708599m15508l99510m05692l53806l29577l09403k44211k63139k83804
$$ 19708599 19293091 18893581 18487889 18134083 17804506 17495103 17250892 16987753 16703949
6421A6703949k15149j63790j93271k77183k73191k75608k75348l13107l49194
$$ 16703949 16488800 16325010 16131739 15854556 15581365 15305757 15030409 14717302 14368108
6412A4368108l43200k46308k59108k47730k59644k66172j90982j58036j98271
$$ 14368108 14024908 13778600 13519492 13271762 13012118 12745946 12554964 12396928 12198657
6403A2198657j50607j39336k0459l4583k520P7243J45714J83572K70711J54899
$$ 12198657 12048050 11908714 11888255 11853672 11851152 11928395 12074109 12257681 12528392 12683291
6393A2683291K87523L43558L38400L15059K88881L60664M71755L42422M73641
$$ 12683291 12970814 13314372 13652772 13967831 14256712 14617376 15089131 15431553 15905194
6384A5905194N44262N64252O61179P01170P25477P92576Q19098P57647O57824
$$ 15905194 16449456 17013708 17674887 18376057 19101534 19894110 20713208 21470855 22128679
6375B2128679N92197L51189K57821K20294J2135k1651K7984Q8171J76006K47717
$$ 22128679 22720876 23072065 23329886 23550180 23562315 23540664 23568648 23656819 23832825 24080542
6365B4080542L38327L92069M43811N23627L96503L39366K85900J54698J1432N3737
$$ 24080542 24418869 24810938 25254749 25778376 26174879 26514245 26800145 26954843 26966275 27020012
6355B7020012N4633Q8806O4634J37568K04792L67612M58834O00949P63993Q01676
$$ 27020012 27074645 27163451 27228085 27365653 27570445 27938057 28396891 28997840 29761833 30563509
6345C0563509R52900R70596J110227J091809J099035R26395P59964N37526L44999
$$ 30563509 31516409 32487005 33597232 34689041 35788076 36714471 37474435 38011961 38356960
6336C8356960K80103j7877k51263m16391n35065p29668q11251q85785r00714r07129
$$ 38356960 38637063 38619186 38367923 37951532 37416467 36686799 35875548 34989763 34089049 33181920
6326C3181920p68503p07050o71110o00530n21154m54011k67978j50349j5105O0306
$$ 33181920 32413417 31706367 31035257 30434727 29913573 29459562 29191584 29041235 29026130 29086436
6316B9086436K00687M34010N87678P12109R58895J124600J334854J540116J745010
$$ 29086436 29287123 29721133 30308811 31020920 31979815 33104415 34439269 35979385 37724395
6307C7724395J818667K016505K081800K023706J738339J422484J032482O00262
$$ 37724395 39543062 41559567 43641367 45665073 47403412 48825896 49858378 50458640
6299E0458640K72767p8635l94883n65243o29536o20292n14614m98834m61034k66267
$$ 50458640 50731407 50652772 50257889 49692646 49063110 48442818 47928204 47429370 46968336 46702069
6289D6702069j73759j9630J40417K57152M29922O35851P99846R87969J243060
$$ 46702069 46528310 46508680 46649097 46906249 47336171 47972022 48771868 49759837 51002897
6280E1002897J459283J660274J783702K028117K284142K379079K561048K797611
$$ 51002897 52462180 54122454 55906156 57934273 60218415 62597494 65158542 67956153
6272F7956153K786968K776274K710827K438883K103575J518150J057782N40820
$$ 67956153 70743121 73519395 76230222 78669105 80772680 82290830 83348612 83889432
6264H3889432P8070k61556p03231p81925p96990r45103r12952q76842r60872r54055
$$ 83889432 83967502 83705946 83002715 82220790 81423800 80478697 79565745 78688903 77728031 76773976
6254G6773976j141503j262327j317583j359268j247255j119912q68608n83109
$$ 76773976 75632473 74370146 73052563 71693295 70446040 69326128 68457520 67874411
6246F7874411k57636Q4407M66951R12786J244378J615349K022036K431874K710798
$$ 67874411 67616775 67701182 68168133 69080919 70325297 71940646 73962682 76394556 79105354
6237G9105354K937722L071417L226746L204499L106247K816159K431289K063625
$$ 79105354 82043076 85114493 88341239 91545738 94651985 97468144 99899433 101963058
6229A01963058J394591O42931j10116q95037j531926k049830k427820k648706
$$ 101963058 103357649 104000580 103890464 102995427 101463501 99413671 96985851 94337145
6221I4337145k669652k564478k294980k215682j884950j649551j255862p86324
$$ 94337145 91667493 89103015 86808035 84592353 82707403 81057852 79801990 79015666
6213G9015666l59881P5644M36203P60161J122808J324254J548774J728709J836124
$$ 79015666 78655785 78731429 79167632 79927793 81050601 82374855 83923629 85652338 87488462
6204H7488462J893406K010722K046301K010145J882669J651237J398081J103206
$$ 87488462 89381868 91392590 93438891 95449036 97331705 98982942 100381023 101484229
6196A01484229P42196N22710K03551O9982L9436J04888J79457L28535O61474Q80125
$$ 101484229 102226425 102749135 102952686 103022668 103062104 103166992 103346449 103674984 104336458 105216583
6186A05216583J303802J519339J917914K302078K502851K610776K642278K536177
$$ 105216583 106520385 108039724 109957638 112259716 114762567 117373343 120015621 122551798
6178A22551798K291299J912146J426464Q19583L09132l22708r15463j485586k012999
$$ 122551798 124843097 126755243 128181707 129001290 129310422 128987714 128072251 126586665 124573666
6169A24573666k317614k619675k857175l046530l285510l436407l615401l758478
$$ 124573666 122256052 119636377 116779202 113732672 110447162 107010755 103395354 99636876
6161I9636876l763447l869370l870704l907262l849269l622023l538128l329834
$$ 99636876 95873429 92004059 88133355 84226093 80376824 76754801 73216673 69886839
6153F9886839l121853k698864k498975k239199j889782j538566j111290p87015
$$ 69886839 66764986 64066122 61567147 59327948 57438166 55899600 54788310 54001295
6145E4001295m37701j51388J32188M71198O67988P89943R19221Q85643P56619
$$ 54001295 53563594 53412206 53544394 54015592 54683580 55473523 56392744 57278387 58035006
6136E8035006N97979L35442O5111j90043m77251o99040q96195j197993j338337
$$ 58035006 58632985 58968427 59033538 58843495 58366244 57667204 56771009 55573016 54234679
6127E4234679j542810j598193j708234j704747j648769j629383j557172j452029
$$ 54234679 52691869 51093676 49385442 47680695 46031926 44402543 42845371 41393342
6119D1393342j288709j128165j091709q71531p82664p11403o07314m85427n33021
$$ 41393342 40104633 38976468 37884759 37013228 36230564 35519161 34911847 34426420 33893399
6110C3893399m90475n20621n86166o15084q89861q45923q89323r22884q79761
$$ 33893399 33402924 32882303 32296137 31681053 30791192 29945269 29055946 28133062 27253301
6101B7253301q55170j017173q34678p80870p06608o00809n39643n14780l53665
$$ 27253301 26398131 25380958 24546280 23765410 23058802 22457993 21918350 21403570 21049905
6092B1049905j84914j27298k9527m05N8687J2737J16380O6851K0046l575k0L6452
$$ 21049905 20864991 20737693 20708166 20707761 20766448 20779185 20895565 20962416 20982462 20978887 20978867 21015319
6080B1015319O0887M1013k6501k4183Q7654j193n0829M87l0477j08932q0577q7602
$$ 21015319 21076206 21117219 21090718 21066535 21154189 21152996 21102167 21102654 21072177 20963245 20882668 20795066
6068B0795066j56870j61601k00577k14325k99882l10807k02144l13915l09501
$$ 20795066 20638196 20476595 20276018 20061693 19761811 19451004 19248860 18934945 18625444
6059A8625444l14718l59503l23300m07412l89874l95855l02800l52244k81205
$$ 18625444 18310726 17951223 17627923 17220511 16830637 16434782 16131982 15779738 15498533
6050A5498533l15360k96813l16049k03692j96696j43579j85778j15748p8857r5987
$$ 15498533 15183173 14886360 14570311 14366619 14169923 14026344 13840566 13724818 13645961 13549974
6040A3549974j56312j18850k05101k54196l20293m36241l83886l80271l15099
$$ 13549974 13393662 13274812 13069711 12815515 12495222 12058981 11675095 11294824 10979725
6031A0979725l66886k47346l18126k59112j93149k20228j65128j45368p9118o9449
$$ 10979725 10612839 10365493 10047367 9788255 9595106 9374878 9209750 9064382 8985264 8915815
6021H915815k8868J3465J4174K8062O6921J45138J57680K08795K24700K05031
$$ 8915815 8886947 8900412 8914586 8942648 9009569 9154707 9312387 9521182 9745882 9950913
6011I950913K12765K25952K58208K77444L27331L62451L66771L29851L97518M05552
$$ 9950913 10163678 10389630 10647838 10925282 11252613 11615064 11981835 12311686 12709204 13114756
6001A3114756L97432M25989L85356M17767M37585L32648K97217L11516K77486
$$ 13114756 13512188 13938177 14323533 14741300 15178885 15511533 15808750 16120266 16397752
5992A6397752J88911K26325K84627K83353K70088K72264L29261L52609L42199
$$ 16397752 16586663 16812988 17097615 17380968 17651056 17923320 18252581 18605190 18947389
5983A8947389L84626M10370M82858M69925M85017M80640L76063L38261M12363
$$ 18947389 19332015 19742385 20225243 20695168 21180185 21660825 22036888 22375149 22787512
5974B2787512M67825M45870M60229M37061M74702M40130N47281N92181P15750
$$ 22787512 23255337 23701207 24161436 24598497 25073199 25513329 26060610 26652791 27368541
5965B7368541P49623P88158O80005O72424M37609K16152j53053m56901p15541
$$ 27368541 28118164 28906322 29586327 30258751 30696360 30912512 30759459 30302558 29587017
5956B9587017q55355r79436j014601r38101j024160r90323r36634p69565p95712
$$ 29587017 28731662 27752226 26737625 25799524 24775364 23785041 22848407 22078842 21283130
5947B1283130o88182o32978o06499n11445n59066m35114l26079l67528j90116
$$ 21283130 20594948 19961970 19355471 18844026 18284960 17849846 17523767 17156239 16966123
5938A6966123j18143r8691j08256p7961k9143j0175o5309j17309j28713j85767
$$ 16966123 16847980 16749289 16641033 16563072 16533929 16523754 16458445 16341136 16212423 16026656
5928A6026656j13662k84028k76224j64438k38317k14860k16826k19113k25477
$$ 16026656 15912994 15628966 15352742 15188304 14949987 14735127 14518301 14299188 14073711
5919A4073711l08148k98054k74320l07971l31348k16364k56495j74762j26414
$$ 14073711 13765563 13467509 13193189 12885218 12553870 12337506 12081011 11906249 11779835
5910A1779835j90442j88874k31225k05155k17782k17472k57201l27840l20784
$$ 11779835 11589393 11400519 11169294 10964139 10746357 10528885 10271684 9943844 9623060
5901I623060l39784l75600l12573k18726k95169k88230k01822k66641k77863j79429
$$ 9623060 9283276 8907676 8595103 8376377 8081208 7792978 7591156 7324515 7046652 6867223
5891F867223j29885j97415j36295j36941j15783j32515R471j3620j07009q5394
$$ 6867223 6737338 6539923 6403628 6266687 6150904 6018389 6027860 6014240 5907231 5821837
5881E821837k9720O1532Q710l9089P2596k9345k4460K8891O4678J28782Q3833
$$ 5821837 5792117 5853649 5862359 5823270 5895866 5866521 5842061 5870952 5935630 6064412 6148245
5870F148245N5496J3757P1172N3411n6251R3781P9552N1456P0530m495J5449M6919
$$ 6148245 6203741 6217498 6288670 6342081 6285830 6379611 6459163 6510619 6581149 6576654 6592103 6639022
5858F639022J08014R0654L6144Q3881J38872Q5438J30552J08797l7087m087O7258
$$ 6639022 6747036 6837690 6873834 6957715 7096587 7182025 7312577 7421374 7384287 7380200 7447458
5847G447458J12794r7333r9237m0175P0210J2186R583Q7771N7826N6040P1092
$$ 7447458 7560252 7462919 7363682 7323507 7393717 7405903 7415486 7503257 7561083 7617123 7688215
5836G688215J56518J80055K86974K76751L55511M49178M81796N55501O18370P09447
$$ 7688215 7844733 8024788 8311762 8588513 8944024 9393202 9874998 10430499 11048869 11758316
5826A1758316R14772R53970J192061J188342J288628J354623J230971J040112
$$ 11758316 12673088 13627058 14819119 16007461 17296089 18650712 19881683 20921795
5818B0921795P65705M18979M2884l88573o18996p76896j028517j092717j063043
$$ 20921795 21687500 22106479 22149363 21760790 21141794 20364898 19336381 18243664 17180621
$$ [...]
##END NTUPLES=NMR SPECTRUM
##END=
