##TITLE=1H_CA 9410-1
 200.13MHz,DMSO-d6.
 8 sc
 
 17.12.2025
##JCAMPDX= 6.0         $$ Bruker NMR JCAMP-DX V2.0
##DATA TYPE= NMR SPECTRUM
##DATA CLASS= NTUPLES
##ORIGIN= UXNMR, Bruker Analytische Messtechnik GmbH
##OWNER= pz
$$ XWIN-NMR		Version 3.5
$$ Wed Dec 17 14:28:13 2025 Russian Standard Time (UT+4h)  she@DPX200
##.OBSERVE FREQUENCY= 200.1313
##.OBSERVE NUCLEUS= ^1H
##.ACQUISITION MODE= SIMULTANEOUS
##.ACQUISITION SCHEME= undefined
##.AVERAGES= 8
##.DIGITISER RES= 18
##SPECTROMETER/DATA SYSTEM= spect
##.PULSE SEQUENCE= zg30
##.SOLVENT NAME= DMSO
##.SHIFT REFERENCE= (INTERNAL, DMSO, 0, 15.5133)
##AUDIT TRAIL= $$ (NUMBER, WHEN, WHO, WHERE, WHAT)
$$ ##TITLE= Audit trail, XWIN-NMR		Version 3.5
$$ ##JCAMPDX= 5.01
$$ ##ORIGIN= Bruker BioSpin GmbH
$$ ##OWNER= she
$$ F:/spectra/data/she/nmr/H-C/1/pdata/1/auditp.txt
$$ ##AUDIT TRAIL=  $$ (NUMBER, WHEN, WHO, WHERE, WHAT)
(   1,<2025-12-17 14:26:20.70 +0400>,<she>,<DPX200>,
      <created by zg, POWCHK disabled, PULCHK disabled
       configuration hash MD5:
       00 E9 B6 7A A2 85 ED C7 34 08 36 98 17 FE 4E 26
       data hash MD5: 16K
       CC 3A DB 9B 55 16 87 72 FE 3C 6B 22 D5 7C 26 A8>)
(   2,<2025-12-17 14:26:24.43 +0400>,<she>,<DPX200>,
      <Start of raw data processing
       efp BC_mod = 2 LB = 0.25 FT_mod = 6 PKNL = 1 PHC0 = -3703.982 PHC1 = 8.59234 SI = 16K 
       data hash MD5: 16K
       2C 18 E6 44 8C 04 D1 23 9B D3 13 D1 78 2A B7 85>)
(   3,<2025-12-17 14:26:53.00 +0400>,<she>,<DPX200>,
      <pk PHC0 = -2.186672 PHC1 = 1 
       data hash MD5: 16K
       2B 69 2A 4B 3F E0 A3 AB FC A2 BC 15 51 66 10 45>)
(   4,<2025-12-17 14:26:58.48 +0400>,<she>,<DPX200>,
      <abs ABSG = 5 
       data hash MD5: 16K
       D2 4A B0 9A DB 31 B5 EF 00 2F 43 80 3D 64 DA 33>)
$$ ##END=
$$ 
$$ hash MD5
$$ 4B DF C1 0E 52 EA CA A7 07 4A B6 AE F8 60 25 79
##$RELAX= 
##$RELAX= 
##$RELAX= 
##$RELAX= 
##$RELAX= 
##$RELAX= 
$$ Bruker specific parameters
$$ --------------------------
##$DU= <F:/spectra>
##$EXPNO= 1
##$NAME= <H-C>
##$PROCNO= 1
##$TYPE= <nmr>
##$USER= <she>
##$AMP= (0..31)
100 100 100 100 100 100 100 100 100 100 100 100 100 100 100 100 100 100 
100 100 100 100 100 100 100 100 100 100 100 100 100 100 
##$AQSEQ= 0
##$AQ_mod= 1
##$AUNM= <au_zg>
##$AUTOPOS= <>
##$BF1= 200.13
##$BF2= 200.13
##$BF3= 200.13
##$BF4= 200.13
##$BF5= 200.13
##$BF6= 200.13
##$BF7= 200.13
##$BF8= 200.13
##$BYTORDA= 1
##$CFDGTYP= 0
##$CFRGTYP= 5
##$CHEMSTR= <none>
##$CNST= (0..31)
1 1 145 1 1 1 1 1 1 1 1 1 1 1 1 1 1 1 1 1 1 1 1 1 1 1 1 1 1 1 1 1 
##$CPDPRG= <>
##$CPDPRG1= <>
##$CPDPRG2= <>
##$CPDPRG3= <>
##$CPDPRG4= <mlev>
##$CPDPRG5= <mlev>
##$CPDPRG6= <mlev>
##$CPDPRG7= <mlev>
##$CPDPRG8= <mlev>
##$CPDPRGB= <>
##$CPDPRGT= <>
##$D= (0..31)
0 0.7 0 0 0 0 0 0 0 0 0 0.03 0 0 0 0 0 0 0 0 0 0 0 0 0 0 0 0 0 0 0 0 
##$DATE= 1765967180
##$DBL= (0..7)
120 120 120 120 120 120 120 120 
##$DBP= (0..7)
150 150 150 150 150 150 150 150 
##$DBP07= 0
##$DBPNAM0= <>
##$DBPNAM1= <>
##$DBPNAM2= <>
##$DBPNAM3= <>
##$DBPNAM4= <>
##$DBPNAM5= <>
$$ [...]
##$SUBNAM3= <"">
##$SUBNAM4= <"">
##$SUBNAM5= <"">
##$SUBNAM6= <"">
##$SUBNAM7= <"">
##$SUBNAM8= <"">
##$SUBNAM9= <"">
##$SW= 18.0517328524113
##$SWIBOX= (0..15)
0 0 2 0 0 0 0 0 0 0 0 0 0 0 0 0 
##$SW_h= 3612.71676300578
##$TD= 16384
##$TD0= 1
##$TE= 0
##$TE2= 300
##$TE3= 300
##$TEG= 300
##$TL= (0..7)
0 120 120 120 120 120 120 120 
##$TP= (0..7)
150 150 150 150 150 150 150 150 
##$TP07= 0
##$TPNAME0= <>
##$TPNAME1= <>
##$TPNAME2= <>
##$TPNAME3= <>
##$TPNAME4= <>
##$TPNAME5= <>
##$TPNAME6= <>
##$TPNAME7= <>
##$TPOAL= (0..7)
0.5 0.5 0.5 0.5 0.5 0.5 0.5 0.5 
##$TPOFFS= (0..7)
0 0 0 0 0 0 0 0 
##$TUNHIN= 0
##$TUNHOUT= 0
##$TUNXOUT= 0
##$USERA1= <user>
##$USERA2= <user>
##$USERA3= <user>
##$USERA4= <user>
##$USERA5= <user>
##$V9= 5
##$VALIST= <valist>
##$VCLIST= <CCCCCCCCCCCCCCC>
##$VD= 0
##$VDLIST= <DDDDDDDDDDDDDDD>
##$VPLIST= <PPPPPPPPPPPPPPP>
##$VTLIST= <TTTTTTTTTTTTTTT>
##$WBST= 1024
##$WBSW= 4
##$XGAIN= (0..3)
0 0 0 0 
##$XL= 0
##$YL= 0
##$YMAX_a= 512911
##$YMIN_a= -654981
##$ZGOPTNS= <>
##$ZL1= 120
##$ZL2= 120
##$ZL3= 120
##$ZL4= 120
##$ABSF1= 15.52212
##$ABSF2= -2.529729
##$ABSG= 5
##$ABSL= 3
##$ALPHA= 0
##$AQORDER= 0
##$ASSFAC= 0
##$ASSFACI= 0
##$ASSFACX= 0
##$ASSWID= 0
##$AUNMP= <proc_1d>
##$AZFE= 0.1
##$AZFW= 0.1
##$BCFW= 0
##$BC_mod= 2
##$BYTORDP= 0
##$COROFFS= 0
##$CY= -3
##$DATMOD= 1
##$DC= 0
##$DFILT= <>
##$DTYPP= 0
##$F1P= 0
##$F2P= 0
##$FCOR= 1
##$FTSIZE= 16384
##$FT_mod= 6
##$GAMMA= 0
##$GB= 0
##$INTBC= 1
##$INTSCL= 3.241238e-09
##$ISEN= 128
##$LB= 0.25
##$LEV0= 0
##$LPBIN= 0
##$MAXI= 10000
##$MC2= 0
##$MEAN= 0
##$ME_mod= 0
##$MI= 1.114404
##$NCOEF= 0
##$NC_proc= -6
##$NLEV= 6
##$NOISF1= 3.799351
##$NOISF2= 2.8
##$NSP= 0
##$NTH_PI= 0
##$NZP= 0
##$OFFSET= 15.51331
##$PC= 1
##$PHC0= -3706.169
##$PHC1= 9.59234
##$PH_mod= 1
##$PKNL= yes
##$PPARMOD= 0
##$PSCAL= 0
##$PSIGN= 0
##$REVERSE= no
##$SF= 200.130001679431
##$SI= 16384
##$SIGF1= 3
##$SIGF2= 2
##$SINO= 0.751879
##$SIOLD= 32768
##$SREGLST= <19F.Aceton>
##$SSB= 0
##$STSI= 16384
##$STSR= 0
##$SW_p= 3612.71676300578
##$SYMM= 0
##$S_DEV= 0
##$TDeff= 16384
##$TDoff= 0
##$TI= <>
##$TILT= no
##$TM1= 0
##$TM2= 0
##$TOPLEV= 0
##$USERP1= <user>
##$USERP2= <user>
##$USERP3= <user>
##$USERP4= <user>
##$USERP5= <user>
##$WDW= 1
##$XDIM= 16384
##$YMAX_p= 396023519
##$YMIN_p= -695496
$$ End of Bruker specific parameters
$$ ---------------------------------
##NTUPLES= NMR SPECTRUM
##VAR_NAME=  FREQUENCY,     SPECTRUM/REAL,   SPECTRUM/IMAG
##SYMBOL=    X,             R,               I
##VAR_TYPE=  INDEPENDENT,   DEPENDENT,       DEPENDENT
##VAR_FORM=  AFFN,          ASDF,            ASDF
##VAR_DIM=   16384,         16384,           16384
##UNITS=     HZ,            ARBITRARY UNITS, ARBITRARY UNITS
##FACTOR=    0.220516191357247, 1,           1
##FIRST=     3104.67884289657, 0,            0
##LAST=      -508.037920109213, 0,           0
##MIN=       -508.037920109213, -695496,     0
##MAX=       3104.67884289657, 396023519,    0
$$ Real data points
##PAGE= N=1
##DATA TABLE= (X++(R..R)), XYDATA
$$ [...]
6234A919797p7990K59280K4678j66310J08732N1738l7246m433l3867L6350J29249
$$ 1919797 1841807 2101087 2125765 1959455 2068187 2119925 2082679 2078246 2044379 2080729 2209978
6223B209978K38708J03445M1347P3377m8308P2186J07822j51889q3089q341L6024
$$ 2209978 2448686 2552131 2593478 2666855 2618547 2690733 2798555 2646666 2563577 2555236 2591260
6212B591260Q3701K84111j03734j79042J71625P2140K2399K00871j15707j27241
$$ 2591260 2674961 2959072 2855338 2676296 2847921 2920061 2942460 3143331 3027624 2900383
6202B900383K66120L7985J40311l3256j66320P8511J87532R3041j53092J164J28155
$$ 2900383 3166503 3204488 3344799 3311543 3145223 3223734 3411266 3504307 3351215 3352379 3480534
6191C480534J61168K15886M7184O870J45214J08393J53093j5676j2233j9733p3166
$$ 3480534 3641702 3857588 3904772 3911642 4056856 4165249 4318342 4302666 4290433 4270700 4197534
6180D197534J21884Q3647J01281J33670R7246O6987J19114o8585J34410L45723
$$ 4197534 4319418 4403065 4504346 4638016 4735262 4802249 4921363 4852778 4987188 5332911
6170E332911M3375N3508K09166j4029n3124J30196K61234J47809K15737k6804
$$ 5332911 5376286 5429794 5638960 5624931 5571807 5702003 5963237 6111046 6326783 6299979
6160F299979J55322L61692K21161k2293L7004J29832J50921L21938M8985J12233
$$ 6299979 6455301 6816993 7038154 7015861 7052865 7182697 7333618 7655556 7704541 7816774
6150G816774J17827M08888K33108K25715M24391J17208R2162M65830L78137L53008
$$ 7816774 7934601 8343489 8576597 8802312 9226703 9343911 9436073 9901903 10280040 10633048
6140A0633048M38117M89270M10967M64512N57077N65027N48943O56468P28350
$$ 10633048 11071165 11560435 11971402 12435914 12992991 13558018 14106961 14763429 15491779
6131A5491779Q30329R69785R92965J005594J243400J634850J619841K032540K642271
$$ 15491779 16322108 17291893 18284858 19290452 20533852 22168702 23788543 25821083 28463354
6122B8463354K991315L605485M732268N671512O386097O927077N731204L764984
$$ 28463354 31454669 35060154 39792422 45463934 51850031 58777108 64508312 68273296
6114F8273296J427380j213676l705998n478622n944442n236963m155254k987216
$$ 68273296 69700676 68487000 64781002 59302380 53357938 48120975 43965721 40978505
6106D0978505j927224j318784p81625k44291N8635N12745R52931J230659J445987
$$ 40978505 39051281 37732497 36950872 36706581 36765216 37277961 38230892 39461551 40907538
6097D0907538J810733K220441K783701L446528M246214N023392O309991Q324734
$$ 40907538 42718271 44938712 47722413 51168941 55415155 60438547 66748538 75073272
6089G5073272J0368574J3153611J6646267K0106285K1799681J8854776J2228400
$$ 75073272 85441846 98595457 115241724 135348009 157147690 176002466 188230866
6082A88230866M030167n099353j3221537j9869095k2744786k0208924j6140435
$$ 188230866 192261033 187161680 173940143 154071048 131326262 111117338 94976903
6075I4976903j2300038q950008o461385n027040l936635k639001j766121j096384
$$ 94976903 82676865 73726857 67265472 62238432 58301797 55662796 53896675 52800291
6067E2800291m24411K23351O74784J184710J929638K543135L224401M513027N838668
$$ 52800291 52375880 52599231 53274015 54458725 56388363 58931498 62155899 66668926 72507594
6058G2507594P441400R638250J2401755J5590997J9721633K1568515J9131067
$$ 72507594 79948994 89587244 101988999 117579996 137301629 158870144 178001211
6051A78001211J2761300M578063m781103j3170657k0299692k4160116k2239689
$$ 178001211 190762511 195340574 190559471 177388814 157089122 132929006 110689317
6044A10689317j8064384j3935318j0487212p866035o288564n028496l789820l196887
$$ 110689317 92624933 78689615 68202403 60336368 54047804 49019308 45229488 42032601
6036D2032601k379073j658558j350410r78608n45626k84725o9873N19822Q26462
$$ 42032601 39653528 37994970 36644560 35665952 35120326 34835601 34765728 35285550 36112012
6027C6112012J169565J962546K677714L386580M599203N672785O074840N529791
$$ 36112012 37281577 39244123 41921837 45308417 49907620 55580405 61655245 67185036
6019F7185036L627717J080666j636399m258897o519344p832012p593322o293379
$$ 67185036 70812753 71893419 70257020 65998123 59478779 51646767 44053445 37760066
6011C7760066m909148m043379l200942k569723k175500j584114j361873j280311
$$ 37760066 32850918 28807539 25606597 23036874 20861374 19277260 17915387 16635076
6003A6635076j308949q46022n51116n81102o17379n65014m27146m67956l08178
$$ 16635076 15326127 14480105 13928989 13347887 12730508 12165494 11738348 11270392 10962214
5994A0962214l12665m70935l48970j12264l01626m03638k26662k05361k99129
$$ 10962214 10649549 10178614 9829644 9717380 9415754 9012116 8785454 8580093 8280964
5985H280964j42825j15066m72991l29096P2686j32692j46696j15631k22057k57008
$$ 8280964 8138139 8023073 7550082 7220986 7293672 7160980 7014284 6898653 6676596 6419588
5975F419588R49j20453k75427Q5666N1687m64331N1j10472k51857r7880j4889
$$ 6419588 6420537 6300084 6024657 6110323 6162010 5697679 5697730 5587258 5335401 5237521 5222632
5964E222632o5708k21197n8351m6915k5586j2294j82350k26616R6191M4865j26350
$$ 5222632 5156924 4935727 4877376 4830461 4804875 4792581 4610231 4383615 4479806 4524671 4398321
5953D398321Q3883j83141k96368L6448J4806l75889M5763K85003j31663m7987
$$ 4398321 4482204 4299063 4002695 4039143 4053949 3678060 3723823 4008826 3877163 3829176
5943C829176K8562k31630k55280J57065j28959j0172J39899k17037o8263J80645
$$ 3829176 3857738 3626108 3370828 3527893 3398934 3388762 3528661 3311624 3243361 3424006
5933C424006j47983m727K8318j37832j39470K25201M8232j33565m0266j09497
$$ 3424006 3276023 3271296 3299614 3161782 3022312 3247513 3295745 3162180 3121914 3012417
5923C012417j04697O3272N2651k42021N4915l9881j71526r194J48444j54526k5374
$$ 3012417 2907720 2970992 3023643 2781622 2836537 2796656 2625130 2615936 2764380 2609854 2584480
5912B584480J05808K5318p2323K16596j77132j12479K77271r1002j39919J12024
$$ 2584480 2690288 2715606 2643283 2859879 2682747 2570268 2847539 2756537 2616618 2728642
5902B728642j48089n6936J93550L9653j02570L4693L3864j33095q8618l8956j11806
$$ 2728642 2580553 2523617 2717167 2756820 2654250 2688943 2722807 2589712 2501094 2462138 2350332
5891B350332m8781J17055j47229J4277J00568N8660j31835Q2262j74109k18720
$$ 2350332 2301551 2418606 2271377 2285654 2386222 2444882 2313047 2395309 2221200 2002480
5881B002480J48995Q2631l1003L4381r848j26285J02073J40658j45221q6750J39263
$$ 2002480 2151475 2234106 2203103 2237484 2227636 2101351 2203424 2344082 2198861 2112111 2251374
5870B251374r7092l7861J31336j5632j15241p558J42320j48397J12875K5543j94891
$$ 2251374 2154282 2116421 2247757 2232125 2116884 2109326 2251646 2103249 2216124 2241667 2046776
5859B046776J0539L28088p6442k68083M5306o7839l5748K61651N3739k41550m3668
$$ 2046776 2057315 2385403 2308961 2040878 2086184 2018345 1982597 2244248 2297987 2056437 2012769
5848B012769N3090P1781J26914K1306k72618k8629J84821J35749q2209j56587
$$ 2012769 2065859 2137640 2264554 2285860 2013242 1984613 2169434 2305183 2222974 2066387
5838B066387k04398J43447J37993R8141q0260l2510J37415q3329M6887k03549
$$ 2066387 1861989 2005436 2143429 2241570 2161310 2128800 2266215 2182886 2229773 2026224
5828B026224j0607N3591J8788K04307Q9108j73908p1332J37875l6673p3949o5342
$$ 2026224 2015617 2069208 2087996 2292303 2381411 2207503 2136171 2274046 2237373 2163424 2098082
5817B098082j9287R8582o7881P4623J08197O1058M0153r0319j02200J04821k05048
$$ 2098082 2078795 2177377 2109496 2184119 2292316 2353374 2393527 2303208 2201008 2305829 2100781
5806B100781O8896O5876Q1754N1948l5868N0863k41879K4811Q4870J4310M7877
$$ 2100781 2169677 2235553 2317307 2369255 2333387 2384250 2142371 2167182 2252052 2266362 2314239
5795B314239N8486p9982l9599J68404L3422p6995j16667j32847J23983L29676
$$ 2314239 2372725 2292743 2253144 2421548 2454970 2377975 2261308 2128461 2252444 2582120
5785B582120r4010j03753K20364l8011J48426K11497j13155j87561M1239O9077
$$ 2582120 2488110 2384357 2604721 2566710 2715136 2926633 2813478 2625917 2667156 2736233
5775B736233j421N1310k02749j74188J58328L3587l152J12997N4809j02944q944
$$ 2736233 2734812 2786122 2583373 2409185 2567513 2601100 2597948 2710945 2765754 2662810 2653866
5764B653866J66123j67837n0024K06931j78130R5559J67640M7012j64362K18885
$$ 2653866 2819989 2652152 2602128 2809059 2630929 2726488 2894128 2941140 2776778 2995663
5754B995663K09604r1899O2976J12595j5497K38189K43473J10969o541j06323
$$ 2995663 3205267 3113368 3176344 3288939 3273442 3511631 3755104 3866073 3859532 3753209
5744C753209p3195j64151j75791m0678r013j6072L7956O4149o5570k05924J78157
$$ 3753209 3680014 3515863 3340072 3299394 3290381 3274309 3312265 3376414 3310844 3104920 3283077
5733C283077J6862l5672J30697R4473r3515q8559J36800K1453J13664K05531r9295
$$ 3283077 3299939 3264267 3394964 3489437 3395922 3307363 3444163 3465616 3579280 3784811 3685516
5722C685516k14626K47055K02545p7868J21132K40156J7194J73683J83172j5280
$$ 3685516 3470890 3717945 3920490 3842622 3963754 4203910 4221104 4394787 4577959 4562679
5712D562679p0531n7871m566r8752l7852L233j47084N759j2780r4443m2046o194
$$ 4562679 4492148 4434277 4429711 4330959 4293107 4296340 4149256 4155015 4142235 4047792 4005746 3999552
5700C999552K401Q7794J6545j6540R0208p1313r8243M6925J99588K0472k2080
$$ 3999552 4001953 4089747 4106292 4089752 4179960 4108647 4010404 4057329 4256917 4277389 4255309
5689D255309J68813P3529J1565O0728N7671J2697K1285K17199n1172k2600q1852
$$ 4255309 4424122 4497651 4509216 4569944 4627615 4640312 4661597 4878796 4827624 4805024 4723172
5678D723172J8107o4769L3499J19140p3942N0658j1828K9845M5459O923p1108
$$ 4723172 4741279 4676510 4710009 4829149 4755207 4805865 4794037 4823882 4869341 4876264 4805156
5667D805156K6977J66912J27136Q179R5083J96684j28298N9412M7312k4103J70108
$$ 4805156 4832133 4999045 5126181 5134360 5229443 5426127 5297829 5357241 5404553 5380450 5550558
5656E550558J75714j7095k2140M954L1051j1317L5241J11366O379J49385J17220
$$ 5550558 5726272 5709177 5687037 5691991 5723042 5711725 5746966 5858332 5864711 6014096 6131316
5645F131316K417Q3631J36230j13039K9604J56991n1982P4172J17704J03909o8647
$$ 6131316 6133733 6217364 6353594 6240555 6270159 6427150 6375168 6449340 6567044 6670953 6602306
5634F602306N7286K8645n2475J35427K14283R4338P4360J24124J08324K1530m4906
$$ 6602306 6659592 6688237 6635762 6771189 6985472 7079810 7154170 7278294 7386618 7408148 7363242
5623G363242J26389J97127N6751K2748K09100m5584K439K84707r971n4542K26093
$$ 7363242 7489631 7686758 7743509 7766257 7975357 7929773 7932212 8216919 8206948 8152406 8378499
5612H378499J965m5982K23270J36420J24012J23706K12630J63843Q4390O1951
$$ 8378499 8380464 8334482 8557752 8694172 8818184 8941890 9154520 9318363 9402753 9464704
5602I464704L1698J92183N3015K37852n7600K7914L52471l6335j6331M09602K72737
$$ 9464704 9496402 9688585 9741600 9979452 9921852 9949766 10302237 10265902 10249571 10659173 10931910
5591A0931910j57878K00813J49494k7914L31751K90833N921K28917K58721K24855
$$ 10931910 10774032 10974845 11124339 11096425 11428176 11719009 11724930 11953847 12212568 12437423
5581A2437423l8001R8907J64763J23443J70147J26863J93747K01564M3897K05588
$$ 12437423 12399422 12498329 12663092 12786535 12956682 13083545 13277292 13478856 13522753 13728341
5571A3728341L07532K62868L69196J9889p8654K04408M63167K09171L341J23614
$$ 13728341 14035873 14298741 14667937 14687826 14609172 14813580 15276747 15485918 15489259 15612873
5561A5612873L07685K68819L25722L52742J94132J90240L76142J29335K34297
$$ 15612873 15920558 16189377 16515099 16867841 17061973 17252213 17628355 17757690 17991987
5552A7991987K05823K41578J79809M57479L68653J73523L87493L35187K30846
$$ 17991987 18197810 18439388 18619197 19076676 19445329 19618852 20006345 20341532 20572378
5543B0572378L32133M24967K87450J75023L93632M34334M85938M28141K17643
$$ 20572378 20904511 21329478 21616928 21791951 22185583 22619917 23105855 23533996 23751639
5534B3751639L40950M08973N86917M93029L16949L23130N37243N70206L78916
$$ 23751639 24092589 24501562 25088479 25581508 25898457 26221587 26758830 27329036 27707952
5525B7707952N86933N16265K92513P54649P29522N01852O07329Q35788M05291
$$ 27707952 28294885 28811150 29103663 29858312 30587834 31089686 31697015 32532803 32938094
5516C2938094M87522R42506P06718M83133R10987J044762N68458Q35502R51726
$$ 32938094 33425616 34368122 35074840 35557973 36468960 37513722 38082180 38917682 39869408
5507C9869408Q76630P50441J184428Q23086Q69965J213201J040663Q86672J324069
$$ 39869408 40746038 41496479 42680907 43503993 44373958 45587159 46627822 47514494 48838563
5498D8838563J415118J208757J229656J413853J405553J389705J635467J494122
$$ 48838563 50253681 51462438 52692094 54105947 55511500 56901205 58536672 60030794
5490F0030794J610768J593480J853241J777523J705577K050844K166146J994447
$$ 60030794 61641562 63235042 65088283 66865806 68571383 70622227 72788373 74782820
5482G4782820K421774K347761K219401K366274K674053K613926K841607K957541
$$ 74782820 77204594 79552355 81771756 84138030 86812083 89426009 92267616 95225157
5474I5225157K889665L027020L217443L303306L665430L709457L500585L758161
$$ 95225157 98114822 101141842 104359285 107662591 111328021 115037478 118538063 122296224
5466A22296224M027111L986848M161164M462549M514806M477907M552774M690960
$$ 122296224 126323335 130310183 134471347 138933896 143448702 147926609 152479383 157170343
5458A57170343M794512M980957M844191M647567M904048N093589M831314M844959
$$ 157170343 161964855 166945812 171790003 176437570 181341618 186435207 191266521 196111480
5450A96111480M494957M137357M157475L873878L335696L090363K859723K226337
$$ 196111480 200606437 204743794 208901269 212775147 216110843 219201206 222060929 224287266
5442B24287266J630762J404053Q03867k770l25230q53982j663760k023428k541775
$$ 224287266 225918028 227322081 228125948 228123178 227797948 226943966 225280206 223256778 220715003
5433B20715003l139229l323890l554355m089367m506090m486842m750410n044393
$$ 220715003 217575774 214251884 210697529 206608162 202102072 197615230 192864820 187820427
5425A87820427m963272n001571n158210m945749n018189n121714m844953m663707
$$ 187820427 182857155 177855584 172697374 167751625 162733436 157611722 152766769 148103062
5417A48103062m712199m699620m549681m382461m127327l988162l887530l845438
$$ 148103062 143390863 138691243 134141562 129759101 125631774 121643612 117756082 113910644
5409A13910644l726345l342086l271938l294980l250841l093197k912065k770166
$$ 113910644 110184299 106842213 103570275 100275295 97024454 93931257 91019192 88249026
5401H8249026k721262k538551k535951k494456j983731k170587k285057j901074
$$ 88249026 85527764 82989213 80453262 77958806 75975075 73804488 71519431 69618357
5393F9618357j783579k113619j669958j599867k019343j568132j222924j716122
$$ 69618357 67834778 65721159 64051201 62451334 60431991 58863859 57640935 55924813
5385E5924813j628218j191319j351550j516771j135519j074334j290207j023486
$$ 55924813 54296595 53105276 51753726 50236955 49101436 48027102 46736895 45713409
5377D5713409j039496j229630r25663q00693j133882r38530o82905j007842r89172
$$ 45713409 44673913 43444283 42518620 41717927 40584045 39645515 38962610 37954768 36965596
5368C6965596o13251q12657r14057n65940o63534q21414o92460p55956p07184
$$ 36965596 36352345 35539688 34625631 34059691 33396157 32574743 31882283 31126327 30419143
5359C0419143m94880m75542p29377n69480n12486m85372o19044n94945m69064
$$ 30419143 29924263 29448721 28719344 28149864 27637378 27152006 26532962 25938017 25468953
5350B5468953m96233n35532l09548k34928n16663n18544k80365m36072n04981
$$ 25468953 24972720 24437188 24127640 23892712 23376049 22857505 22577140 22141068 21636087
5341B1636087l63889m74046l76738k31398k60619m27050l21069k48684m26167
$$ 21636087 21272198 20798152 20421414 20190016 19929397 19502347 19181278 18932594 18506427
5332A8506427l20307j08983l75948m71486k19015k30898l43701k22203k58978
$$ 18506427 18186120 18077137 17701189 17229703 17010688 16779790 16436089 16213886 15954908
5323A5954908l29563j04800j39169k57877m27842l31724M0937j76870k22152k27271
$$ 15954908 15625345 15520545 15381376 15123499 14695657 14363933 14404870 14228000 14005848 13778577
5313A3778577k99512j73835K9173k11069l95885j28588J1913j54297J347l16850
$$ 13778577 13479065 13305230 13334403 13123334 12727449 12598861 12610774 12456477 12457824 12140974
5303A2140974k85216n1175O8428k97620l82967L867k67950k51193n7985j12050
$$ 12140974 11855758 11804583 11873011 11575391 11192424 11196291 10928341 10677148 10619163 10507113
5293A0507113l03090l9114m6713l82910p7666J16899n4624k42147j20675j3405
$$ 10507113 10204023 10164909 10118196 9735286 9657620 9774519 9719895 9477748 9357073 9343668
5283I343668k1115l5419k58442l27681l6195O6250k7740K9631l11992k79621J34235
$$ 9343668 9322553 9287134 9028692 8701011 8664816 8731066 8703326 8732957 8420965 8141344 8275579
5272H275579k0528k4579j64554k97670R6610r5338p3689k18993j83282r2011o2475
$$ 8275579 8255051 8230472 8065918 7768248 7864858 7769520 7695831 7476838 7293556 7201545 7139070
5261G139070J96657J2606k89755j21295L1331j9461P1725k06453k82656J405P3019
$$ 7139070 7335727 7348333 7058578 6937283 6968614 6949153 7020878 6814425 6531769 6533174 6606193
5250F606193L4522j52488k54967N256N3372K2861m4115j31185l73161J0902J31232
$$ 6606193 6640715 6488227 6233260 6238516 6291888 6314749 6270634 6139449 5766288 5777190 5908422
5239E908422O1874j34342J10O6233j91993Q8650k6114m1582M61J06211j08713
$$ 5908422 5970296 5835954 5836064 5902297 5710304 5798954 5772840 5731258 5731719 5837930 5729217
5228E729217j34693N3283L0336r5447o8481K93750R6711j09218Q1054j0140K1676
$$ 5729217 5594524 5647807 5678143 5582696 5514215 5807965 5904676 5795458 5876512 5866372 5888048
5217E888048J64062J2859p3533K37389O2052J11594M7590K56854Q1145J2179K21152
$$ 5888048 6052110 6064969 5991436 6228825 6290877 6402471 6450061 6706915 6788060 6800239 7021391
5206G021391L13571K46490M54313K71676K44887N36070O40739N35925P86999P32910
$$ 7021391 7334962 7581452 8035765 8307441 8552328 9088398 9729137 10265062 11052061 11784971
5196A1784971O15192Q20695N22896J12579l631j15153o38823o14877o70430j039901
$$ 11784971 12400163 13220858 13743754 13856333 13852702 13737549 13098726 12483849 11813419 10773518
5186A0773518j104504p05892o78633n19884l46677n88292n80368j39745l12685
$$ 10773518 9669014 8963122 8284489 7764605 7417928 6829636 6249268 6109523 5796838
5177E796838m15938k2617j31069m13977j27409q6152l49004L0503N1483j48171
$$ 5796838 5380900 5358283 5227214 4813237 4685828 4599676 4250672 4281175 4332658 4184487
5167D184487p241r2548l23626j76158L24745n4769j66422r1105k06019o6013L6565
$$ 4184487 4177246 4084698 3761072 3584914 3909659 3854890 3688468 3597363 3391344 3325331 3361896
5156C361896o5032j63795J04547P6312p8414M1561p7103j26461j3631M018j29038
$$ 3361896 3296864 3133069 3237616 3313928 3235514 3277075 3199972 3073511 3059880 3063898 2934860
5145B934860L5400M1681k20839J02195P3154k73760m9551J78688l2985k73355
$$ 2934860 2970260 3011941 2791102 2893297 2966451 2692691 2643140 2821828 2788843 2515488
5135B515488J08209J1632m2326J64732q8015j62347J34742o692q8486n2713J50022
$$ 2515488 2623697 2635329 2593003 2757735 2669720 2507373 2642115 2635423 2546937 2494224 2644246
5124B644246k11013k0191J31475j4844q4667J2947j24694j34595J76562P34j33531
$$ 2644246 2433233 2413042 2544517 2529673 2445006 2457953 2333259 2198664 2375226 2375960 2242429
5113B242429M6846Q9569m9525j22454m5769p7379K20338K45547k19091j55242
$$ 2242429 2289275 2378844 2329319 2206865 2161096 2083717 2304055 2549602 2330511 2175269
5103B175269j7753M9970J62660p5181j34752J28380J594k49903l6586J25209k73125
$$ 2175269 2157516 2207486 2370146 2294965 2160213 2288593 2290187 2040284 2003698 2128907 1855782
5092A855782J78585Q1178j2540R9743J67562l35113q9772q934j23845J18999R8124
$$ 1855782 2034367 2115545 2103005 2202748 2370310 2035197 1945425 1936491 1812646 1931645 2029769
5081B029769o8993m3432P0087N6372j37227J21305j02977j66419Q7119J27387
$$ 2029769 1960776 1917344 1987431 2043803 1906576 2027881 1924904 1758485 1845604 1972991
5071A972991j1299m894q8615r5084J9087J15299j04460J7522Q8908q4659J6267
$$ 1972991 1961692 1956798 1868183 1773099 1792186 1907485 1803025 1820547 1909455 1824796 1841063
5060A841063R4853J29014j78403r2415j19990P8695N0990J3462m2252n453K655
$$ 1841063 1935916 2064930 1886527 1794112 1674122 1752817 1803807 1817269 1775017 1769564 1772219
5049A772219J67750k5555j71645j59216Q5922J39123N7284m6662K0973R5807J65472
$$ 1772219 1939969 1914414 1742769 1583553 1669475 1808598 1865882 1819220 1840193 1936000 2101472
5038B101472j5414j80607r6907n2414q007P2795j83891m5583J79989M6945n8442
$$ 2101472 2086058 1905451 1808544 1756130 1748123 1820918 1637027 1591444 1771433 1818378 1759936
5027A759936N3907q8095k32139J34737N1866P3006L8024K2520j24911M5701L6576
$$ 1759936 1813843 1725748 1493609 1628346 1680212 1753218 1791242 1813762 1688851 1734552 1771128
5016A771128J78820R7761k22765j75114J55248R3753q0595P1656p0143l8981J61813
$$ 1771128 1949948 2047709 1824944 1649830 1805078 1898831 1818236 1889892 1819749 1780768 1942581
5005A942581J8279j62232n9948K3853K18828n5762j80795j52646K14576J70349
$$ 1942581 1960860 1798628 1738680 1762533 1981361 1925599 1744804 1592158 1806734 1977083
4995A977083r7339m3087N3463M2481N4086J17950r5078Q458J15999k65344l0430
$$ 1977083 1879744 1836657 1890120 1932601 1986687 2104637 2009559 2018017 2134016 1868672 1838242
4984A838242J62633r4478l9998K38327P54j57657K63905K3542j70463L3091J48659
$$ 1838242 2000875 1906397 1866399 2104726 2105480 1947823 2211728 2235270 2064807 2097898 2246557
4973B246557j58682N2949L79216p9606k61151K36858k7636o6763J12505j79887
$$ 2246557 2087875 2140824 2520040 2440434 2179283 2416141 2388505 2321742 2434247 2254360
4963B254360k7601K22544M9992j57120M3510r303J8505Q6724J64940P1112j4395
$$ 2254360 2226759 2449303 2499295 2342175 2385685 2376382 2394887 2481611 2646551 2717663 2703268
4952B703268L5831J07602J40945J69221R4024j53198j55033J75407L00283j07211
$$ 2703268 2739099 2846701 2987646 3156867 3250891 3097693 2942660 3118067 3418350 3311139
4942C311139J02010J70730J72138M24635M74947L79704M49020N18815N20740L93248
$$ 3311139 3413149 3583879 3756017 4180652 4655599 5035303 5484323 6003138 6523878 6917126
4932F917126n4511l82012m05874p28872n64844l73215l60772m57552l22343q1080
$$ 6917126 6862615 6480603 6074729 5345857 4781013 4407798 4047026 3589474 3267131 3186051
4922C186051j07199j49691j19662j15434r5392m4764Q6523N0072j73608O3429
$$ 3186051 3078852 2929161 2809499 2694065 2598673 2553909 2640432 2690504 2516896 2580325
4912B580325k7078m8652J56761j1467j33769J32209o926O4290N6172p2604m9555
$$ 2580325 2553247 2504595 2661356 2649889 2516120 2648329 2641403 2705693 2761865 2689261 2639706
4901B639706N7644l8762M5716O3511j46770P3361J92208j66659r3352n1465j27839
$$ 2639706 2697350 2658588 2704304 2767815 2621045 2694406 2886614 2719955 2626603 2575138 2447299
4890B447299j1180m5660K8523p9506j8725K01240m8910N9311Q1229Q213K293R7334
$$ 2447299 2436119 2390459 2418982 2339476 2320751 2521991 2473081 2532392 2613621 2621834 2624127 2721461
4878B721461o338k03595J41665m217k8426J4116p6541o1812J1007L1510R2843
$$ 2721461 2715123 2511528 2653193 2648976 2620550 2634666 2558125 2496313 2507320 2538830 2631673
4867B631673k4473o3799J07031j903k17023N2240J09502p2169N8628N7626R084
$$ 2631673 2607200 2543401 2650432 2648529 2431506 2483746 2593248 2521079 2579707 2637333 2646417
4856B646417m1276j8364R4154N7903j4255k4828r0092O4516j20229j95159K26617
$$ 2646417 2605141 2586777 2680931 2738834 2724579 2699751 2609659 2674175 2553946 2358787 2585404
4845B585404N1075j6974K60036J38964n1697p8615o189k4568J34982J15570j12399
$$ 2585404 2636479 2619505 2879541 3018505 2966808 2888193 2882004 2857436 2992418 3107988 2995589
4834B995589J06490J38410p8803J82716n6257j15058j1717J80474J6080j11768
$$ 2995589 3102079 3240489 3161686 3344402 3288145 3173087 3161370 3341844 3357924 3246156
4824C246156J40922m6421Q4052K56470J35812r5580J09739J34325L873N609J50860
$$ 3246156 3387078 3340657 3424709 3681179 3816991 3721411 3831150 3965475 3969348 3974957 4125817
4813D125817P3746m4498P2225Q2237L7078J01816M0475Q1899J86946K89825J35554
$$ 4125817 4199563 4155065 4227290 4309527 4346605 4448421 4488896 4570795 4757741 5047566 5183120
4802E183120M3620J92524J48919K96298L81719L54404M02063N82123O83542N20292
$$ 5183120 5226740 5419264 5568183 5864481 6246200 6600604 7002667 7584790 8268332 8788624
4792H788624L45968K93794k03056l91776l58708m54218n40325l83552l38258k54187
$$ 8788624 9134592 9428386 9225330 8833554 8474846 8020628 7480303 7096751 6758493 6504306
4782F504306J13072q9348o2261P7856k31429r0829M47740J7152k52065O1746L1228
$$ 6504306 6617378 6528030 6465769 6543625 6312196 6221367 6669107 6686259 6434194 6495940 6527168
4771F527168R0877J01709J91391k47j08599K58040J54676R8566L4535l0574Q7376
$$ 6527168 6618045 6719754 6911145 6910898 6802299 7060339 7215015 7313581 7348116 7317542 7404918
4760G404918L71207M1609K3852J68137L3143l1542J74324K12406N519J19358K17200
$$ 7404918 7776125 7817734 7841586 8009723 8042866 8011324 8185648 8398054 8403573 8522931 8740131
4749H740131j44634J31143L07811m4432J46166L59084R6449J74901K59462k4728
$$ 8740131 8595497 8726640 9034451 8990019 9136185 9495269 9591718 9766619 10026081 10001353
4739A0001353p4275K72072M63313J54451L45465L51727J02786M3355M81708L13409
$$ 10001353 9927078 10199150 10662463 10816914 11162379 11514106 11616892 11660247 12141955 12455364
4729A2455364L76096M09967K67571L61876M84191K80973K46683O91928O40734
$$ 12455364 12831460 13241427 13508998 13870874 14355065 14636038 14882721 15574649 16215383
4720A6215383M01889N15730O72145O34485O84322P98697P86093Q54144R90568
$$ 16215383 16617272 17133002 17805147 18439632 19123954 19922651 20708744 21562888 22553456
4711B2553456R73951R76925J151239J161645J275771J516003J503850J539763
$$ 22553456 23527407 24504332 25655571 26817216 28092987 29608990 31112840 32652603
4703C2652603J784271K080985K110338K151609K364968K564223K631148K702559
$$ 32652603 34436874 36517859 38628197 40779806 43144774 45708997 48340145 51042704
4695E1042704K433428K436550K645712K395828K582392K583674K321832K456946
$$ 51042704 53476132 55912682 58558394 60954222 63536614 66120288 68442120 70899066
4687G0899066K506963K517483K421260K113371J978560J949994J796084J738296
$$ 70899066 73406029 75923512 78344772 80458143 82436703 84386697 86182781 87921077
4679H7921077J705543J791519J876072K290702K718972K950654L560396L885141
$$ 87921077 89626620 91418139 93294211 95584913 98303885 101254539 104814935 108700076
4671A08700076M121315M436358M463800M092544M013114L622932L365276L239037
$$ 108700076 112821391 117257749 121721549 125814093 129827207 133450139 136815415 140054452
4663A40054452K839110K358102J774750J634313J214749L13445o15095j353195
$$ 140054452 142893562 145251664 147026414 148660727 149875476 150188921 149573826 148220631
4655A48220631k008892k208364k256740k569684k965775k642300k476996k421268
$$ 148220631 146211739 144003375 141746635 139176951 136211176 133568876 131091880 128670612
4647A28670612k387149k432623k178937j879579j792901j636785j682473j839131
$$ 128670612 126283463 123850840 121671903 119792324 117999423 116362638 114680165 112841034
4639A12841034k037913k153377k226296k646557k664871k725546k638895k684824
$$ 112841034 110803121 108649744 106423448 103776891 101112020 98386474 95747579 93062755
4631I3062755k648682k452906j823158j214197M8251O14282l27773j143471k143042
$$ 93062755 90414073 87961167 86138009 84923812 84972063 85586345 85258572 84115101 81972059
4622H1972059l363796m437258n619434n423068m084798k949056k266408j642230
$$ 81972059 78608263 74171005 68551571 63128503 59043705 56094649 53828241 52186011
4614E2186011j047095p25243o8706K56738P83953J229538J702318J794201J723801
$$ 52186011 51138916 50413673 50344967 50601705 51385658 52615196 54317514 56111715 57835516
4605E7835516J839141J593634J476697J804599J896435K304885K945772K865376
$$ 57835516 59674657 61268291 62744988 64549587 66446022 68750907 71696679 74562055
4597G4562055K285907J889077J093839M84386Q67180J357953J507090J716199
$$ 74562055 76847962 78737039 79830878 80315264 81182444 82540397 84047487 85763686
4589H5763686J402188J74136j142534j825562k745688k940403k175882j787155
$$ 85763686 87165874 87340010 86197476 84371914 81626226 78685823 76509941 74722786
4581G4722786j706439j595242k298762l198605l415672l609525l491238k916683
$$ 74722786 73016347 71421105 69122343 65923738 62508066 58898541 55407303 52490620
4573E2490620k450882k277554k120333k283270k486061k684166k269261k020772
$$ 52490620 50039738 47762184 45641851 43358581 40872520 38188354 35919093 33898321
4565C3898321j932587j379902j208457r33863m94973m82697l99944r1971j06545
$$ 33898321 31965734 30585832 29377375 28443512 27948539 27465842 27065898 26973927 26867382
4556B6867382j2187L87801J67992o861L25065M36802K46672L91259M26408M66416
$$ 26867382 26855195 27242996 27410988 27404127 27729192 28165994 28412666 28803925 29230333 29696749
4546B9696749O66322Q23931N80111O24885R64589J102443R23660J213174J271386
$$ 29696749 30363071 31187002 31767113 32391998 33356587 34459030 35382690 36595864 37867250
4537C7867250J244039J748735J853032J720204J987111K389034K309953K575738
$$ 37867250 39111289 40860024 42713056 44433260 46420371 48809405 51119358 53695096
4529E3695096K982727K855936K999947L671574L621948L408104L591761L483013
$$ 53695096 56677823 59533759 62533706 66205280 69827228 73235332 76827093 80310106
4521H0310106L399425L517488L269367L047312L012934L005451K673116K551497
$$ 80310106 83709531 87227019 90496386 93543698 96556632 99562083 102235199 104786696
4513A04786696K383038K030856K004344K093562K134249K116234K236490K381627
$$ 104786696 107169734 109200590 111204934 113298496 115432745 117548979 119785469 122167096
4505A22167096K798279K896192K768385K667839K617266K718992K693379K505203
$$ 122167096 124965375 127861567 130629952 133297791 135915057 138634049 141327428 143832631
4497A43832631J883179J464873J070131K57642o76745j464277k214925k451481
$$ 143832631 145715810 147180683 148250814 148508456 147831711 146367434 144152509 141701028
4489A41701028k445555l095143l422368l412536l961813m223710m080439m365677
$$ 141701028 139255473 136160330 132737962 129325426 125363613 121139903 117059464 112693787
4481A12693787m361335l640386l222308l203067k738511k195371k164993j878538
$$ 112693787 108332452 104692066 101469758 98266691 95528180 93332809 91167816 89289278
4473H9289278j441404j701062j609363j680074j975179k063240k192281k450262
$$ 89289278 87847874 86146812 84537449 82857375 80882196 78818956 76626675 74176413
4465G4176413k599137k619145k577310k569375k780621k852395k811174k756984
$$ 74176413 71577276 68958131 66380821 63811446 61030825 58178430 55367256 52610272
4457E2610272k954969k856815k775674k863943k401575k254339k245517j924443
$$ 52610272 49655303 46798488 44022814 41158871 38757296 36502957 34257440 32332997
4449C2332997j621806j676020j611358j362274j230372j254910j066711r10655
$$ 32332997 30711191 29035171 27423813 26061539 24831167 23576257 22509546 21598891
4441B1598891r37537j035417q76111n35681p01177n97769o26475n59856n93459
$$ 21598891 20661354 19625937 18749826 18214145 17512968 16915199 16288724 15728868 15135409
4432A5135409m27128m20881l92789m98909m90741l38767l54469k85182l21173
$$ 15135409 14708281 14287400 13894611 13395702 12904961 12566194 12211725 11926543 11605370
4423A1605370l92203l02853k75452k19095j98675k35638m22580k32050Q6032l41285
$$ 11605370 11213167 10910314 10634862 10415767 10217092 9981454 9558874 9326824 9412856 9071571
4413I071571k82122j3385k31123k62943m9444k70310j79592J3166k4791k39586
$$ 9071571 8789449 8776064 8544941 8281998 8232554 7962244 7782652 7795818 7771027 7531441
4403G531441j71925k48542j54102j17238j12403j11983r5463o2171j76517j46242
$$ 7531441 7359516 7110974 6956872 6839634 6727231 6615248 6519785 6457614 6281097 6134855
4393F134855j91137Q9414P651r2872j51841j3035j22432r844j60915j03649J46471
$$ 6134855 5943718 6033132 6040783 5947911 5796070 5783035 5660603 5650759 5489844 5386195 5532666
4382E532666n3386q7271r295N2086q029k29384j10162P9399m4173j69337P0288
$$ 5532666 5479280 5392009 5382714 5434800 5426771 5197387 5087225 5166624 5122451 4953114 5023402
4371E023402J234j88771j40811K5262j31123K5680J54841k06975j1121J27069
$$ 5023402 5024636 4835865 4695054 4720316 4589193 4614873 4769714 4562739 4551618 4678687
4361D678687P271l65153K7571j36827j29183J40534q0509k56537O355L4077r9505
$$ 4678687 4685958 4320805 4348376 4211549 4082366 4222900 4142391 3885854 3892209 3926286 3826781
4350C826781O7358L1274k19369j21776J85249L9200k04908l2582O9861j94953
$$ 3826781 3894139 3925413 3706044 3584268 3769517 3808717 3603809 3571227 3641088 3446135
4340C446135n4448L1340j32332M3401l2843j58108n6285k0747n6652j15559q5304
$$ 3446135 3391687 3423027 3290695 3334096 3301253 3143145 3086860 3066113 3009461 2893902 2808598
4329B808598P8731j24879R0150k32602n4164J56547j4255o3849n3894p5471J7370
$$ 2808598 2887329 2762450 2852600 2619998 2565834 2722381 2708126 2644277 2590383 2514912 2532282
4318B532282J52179r203M9809p7155j37965q6972N5171j23867j92745r146J62560
$$ 2532282 2684461 2675258 2725067 2647912 2509947 2422975 2478146 2354279 2161534 2152388 2314948
4307B314948l2555J03830M2688j19838j30414P2292M1414P6682J2490m3021l8177
$$ 2314948 2282393 2386223 2428911 2309073 2178659 2250951 2292365 2369047 2381537 2338516 2300339
4296B300339q3798j311Q0493Q220R5367J3466l5487m5290j02859o5734Q3518J06931
$$ 2300339 2216541 2215230 2295723 2303943 2399310 2412776 2377289 2331999 2229140 2163406 2246924 2353855
4284B353855j01570M9504l0632M3673M938p2129p5512N6896J33085L1475o8350
$$ 2353855 2252285 2301789 2271157 2314830 2319768 2247639 2172127 2229023 2362108 2393583 2325233
4273B325233r925O2184J5936n2544o6887j97307R5728J13007j72915l2751j04694
$$ 2325233 2315308 2377492 2393428 2340884 2273997 2076690 2172418 2285425 2112510 2079759 1975065
4262A975065j04723J17587J30723j67634O0725O4707J4143n8257r2576l5903j7228
$$ 1975065 1870342 1987929 2118652 1951018 2011743 2076450 2090593 2032336 1939760 1903857 1886629
4251A886629K2549R2163m9747j85210J4986J5067k6991M2037l8640m5995R7895
$$ 1886629 1909178 2001341 1951594 1766384 1781370 1796437 1769446 1811483 1772843 1726848 1824743
4240A824743O9979o3469j39004L1659j1108O2791J08514j45359n8134J99815J29834
$$ 1824743 1894722 1831253 1692249 1723908 1712800 1775591 1884105 1738746 1680612 1880427 2010261
4229B010261o6857N5278N3852J5154J2186k2398j24780l8223J18478j9125j32590
$$ 2010261 1943404 1998682 2052534 2067688 2079874 2057476 1932696 1894473 2012951 1993826 1861236
4218A861236J63960J02841N6167n7562K3954J83562o2474J18644J34663n4002
$$ 1861236 2025196 2128037 2184204 2126642 2150596 2334158 2271684 2390328 2524991 2470989
4208B470989K07354L33959q2667j24341L2427o842n91k89k43263l20108O4584
$$ 2470989 2678343 3012302 2929635 2805294 2837721 2830879 2830288 2829999 2586736 2266628 2331212
4197B331212K96450j21287k12940l5845j11040K3842O1012j98673q1301O71R3362
$$ 2331212 2627662 2506375 2293435 2257590 2146550 2170392 2231404 2032731 1951430 1952101 2045463
4186B045463r1158J50918J05639m6649Q9104j01460q5872J2352k14J30731O4159
$$ 2045463 1954305 2105223 2210862 2164213 2253317 2151857 2065985 2078337 2078123 2208854 2273013
4175B273013o2856o5457J64954j08496o4228M7725O474n3487N4876J40100j12720
$$ 2273013 2210157 2144700 2309654 2201158 2136930 2184655 2191129 2137642 2192518 2332618 2219898
4164B219898O2105L7774n9216K0937M3686N290R3190j40307K5999j03180j02763
$$ 2219898 2282003 2319777 2260561 2281498 2325184 2330474 2423664 2283357 2309356 2206176 2103413
4153B103413J922J21538j1009K5021M3777k3200K2200N7963p7717P1388J02547
$$ 2103413 2105335 2226873 2215864 2240885 2284662 2261462 2283662 2341625 2263908 2335296 2437843
4142B437843j54470L007O9895r5569L2046l3427J52307Q6700P1099L836J17332
$$ 2437843 2283373 2286380 2356275 2260706 2292752 2259325 2411632 2498332 2569431 2573267 2690599
4131B690599l5264j85120j1067p1677J47314l0614Q0586n0029M7412J45538p2328
$$ 2690599 2655335 2470215 2459148 2387471 2534785 2504171 2584757 2534728 2582140 2727678 2655350
4120B655350J19858J18012J04723p1741p2071L8397j09042J14437j03097m4617
$$ 2655350 2775208 2893220 2997943 2926202 2854131 2892528 2783486 2897923 2794826 2750209
4110B750209n7053J26530P171L5851N0466j01642q9584J66931m4122m0480J60399
$$ 2750209 2693156 2819686 2826857 2862708 2913174 2811532 2721948 2888879 2844757 2804277 2964676
4099B964676O2253M9456J5764O3657l7664J97028M6037j14610n4278r3199J78557
$$ 2964676 3026929 3076385 3092149 3155806 3118142 3315170 3361207 3246597 3192319 3099120 3277677
4088C277677J94766n8659j34843R9640J18550k5422Q2967p7685K4257K7430J89263
$$ 3277677 3472443 3413784 3278941 3378581 3497131 3471709 3554676 3476991 3501248 3528678 3717941
4077C717941K49738j33469j1836K0366K22195J56768j8853K06530Q7511J1523
$$ 3717941 3967679 3834210 3822374 3842740 4064935 4221703 4202850 4409380 4496891 4508414
4067D508414J71419K49975O4167J55146K24736J78315L16612M54202K06561K64654
$$ 4508414 4679833 4929808 4993975 5149121 5373857 5552172 5868784 6322986 6529547 6794201
4057F794201O07290O60299O32999P55340Q02507Q10921J004928R45653L22322
$$ 6794201 7401491 8061790 8694789 9450129 10252636 11063557 12068485 13014138 13336460
4048A3336460j38859r4041k88534p78315q10421q60483j104773m67764l37061
$$ 13336460 13197601 13103560 12815026 12036711 11226290 10365807 9261034 8793270 8456209
4039H456209o36889n52907l60888k92753j22135m4392j88855m23420j67997J92822
$$ 8456209 7819320 7266413 6905525 6612772 6490637 6446245 6257390 5833970 5665973 5858795
4029E858795k96890j53196L5088j78412j91544m620l2273k56718k8670j03180
$$ 5858795 5561905 5408709 5443797 5265385 5073841 5069221 5036948 4780230 4751560 4648380
4019D648380k42478J9629Q226k35594K3369l6525j66308J45261M072n0511n1545
$$ 4648380 4405902 4425531 4433757 4198163 4221532 4185007 4018699 4163960 4168032 4117521 4065976
4008D065976l3467r071M493J02268j74474k6695K16678j5717K16854P1430j88493
$$ 4065976 4032509 4023438 4027931 4130199 3955725 3929030 4145708 4129991 4346845 4418275 4229782
3997D229782M0595K42722j67561K4072J03343j55399l6654J66919O0031q0458
$$ 4229782 4270377 4513099 4345538 4369610 4472953 4317554 4280900 4447819 4507850 4427392
3987D427392J40403n9680J09652J44599J32363L7103q9526J56153M1138J76420
$$ 4427392 4567795 4508115 4617767 4762366 4894729 4931832 4842306 4998459 5039597 5216017
3977E216017M0024l1871R2039J82692K5674O3104o0037q3571K56371J78676r5333
$$ 5216017 5256041 5224170 5316209 5498901 5524575 5587679 5527642 5444071 5700442 5879118 5783785
3966E783785k1205J71101J20395Q5039N5306j6938o9246K69440K64564l3504M9462
$$ 5783785 5762580 5933681 6054076 6139115 6194421 6177483 6108237 6377677 6642241 6608737 6658199
3955F658199K12904J57092R5697Q4577m7065m0233L07769J75715J17847M0672
$$ 6658199 6871103 7028195 7123892 7208469 7161404 7121171 7428940 7604655 7722502 7763174
3945G763174K20170k2401Q5939K28087J44934J94962K65961K14020r4896J17676
$$ 7763174 7983344 7960943 8046882 8274969 8419903 8614865 8880826 9094846 8999950 9117626
3935I117626L12612J85076n6801K46097P9812K66864K89674K1669K06396L47119
$$ 9117626 9430238 9615314 9558513 9804610 9884422 10151286 10440960 10462629 10669025 11016144
3925A1016144K53381J11435L20628K64073K44056N01965J89727K10010L89904
$$ 11016144 11269525 11380960 11701588 11965661 12209717 12711682 12901409 13111419 13501323
3916A3501323K49420M86310M79139M24638J89416N42808O60601L97377P09021
$$ 13501323 13750743 14237053 14716192 15140830 15330246 15873054 16533655 16931032 17640053
3907A7640053N08004N23838Q27520P96077O14639R08154Q01157Q88354R95330
$$ 17640053 18148057 18671895 19499415 20295492 20910131 21818285 22619442 23507796 24503126
3898B4503126R41275Q24664P80475J237085R06081Q10841J071930J096075R60807
$$ 24503126 25444401 26269065 27049540 28286625 29192706 30003547 31075477 32171552 33132359
3889C3132359J077493J194325J080784J037210J230663J087987J255609J189331
$$ 33132359 34209852 35404177 36484961 37522171 38752834 39840821 41096430 42285761
3881D2285761J198963J213183J044047Q68589J062628R02297J030767J116298
$$ 42285761 43484724 44697907 45741954 46610543 47673171 48575468 49606235 50722533
3873E0722533J064985J352794J715507J655651J730971K102463K079203K466360
$$ 50722533 51787518 53140312 54855819 56511470 58242441 60344904 62424107 64890467
3865F4890467K665791K638995K788081L238756L196014L408627L704548L951676
$$ 64890467 67556258 70195253 72983334 76222090 79418104 82826731 86531279 90482955
3857I0482955M297530M485769M459152M582829M299270L947985L816472L611744
$$ 90482955 94780485 99266254 103725406 108308235 112607505 116555490 120371962 123983706
3849A23983706L479102L385193L547798L748895L723926L851130M497674M704520
$$ 123983706 127462808 130848001 134395799 138144694 141868620 145719750 150217424 154921944
3841A54921944N275797N927805O230787O634453P344810P597885P473560P292646
$$ 154921944 160197741 166125546 172356333 178990786 186335596 193933481 201407041 208699687
3833B08699687O636637N741182M855842M063679L294665L019168K728950K544176
$$ 208699687 215336324 221077506 225933348 229997027 233291692 236310860 239039810 241583986
3825B41583986K324824K375505K088870J697074J216187P92177M28517l16091
$$ 241583986 243908810 246284315 248373185 250070259 251286446 252078623 252507140 252191049
3817B52191049q17971j296786k040265k527247k925146l309819l692096l827897
$$ 252191049 251373078 250076292 248036027 245508780 242583634 239273815 235581719 231753822
3809B31753822l593663l485278l660459l877428m659507n574760o138067p185555
$$ 231753822 228160159 224674881 221014422 217136994 212477487 206902727 200764660 193579105
3801A93579105q038579p894070p822251p632414o664025o258321n663321m770709
$$ 193579105 185540526 177646456 169824205 162191791 155527766 149269445 143606124 138835415
3793A38835415m436126m138846l855485l813303l536906l494708l136693l353472
$$ 138835415 134399289 130260443 126404958 122591655 119054749 115560041 112423348 109069876
3785A09069876l446134l397766l677666l670114l975322l758069l845036l546979
$$ 109069876 105623742 102225976 98548310 94878196 90902874 87144805 83299769 79752790
3777G9752790l349878l377027k973725k927187k801227k503365k263847k324886
$$ 79752790 76402912 73025885 70052160 67124973 64323746 61820381 59556534 57231648
3769E7231648k297012k014598j852568j585495j376670j344963j201769r21276
$$ 57231648 54934636 52920038 51067470 49481975 48105305 46760342 45558573 44637297
3761D4637297r95717q24024p35706p50895q07640o16484j036473q94395q13097
$$ 44637297 43641580 42817556 42081850 41330955 40523315 39906831 38870358 37975963 37162866
3752C7162866j058756j030131r75007j155658j312099j025201j024371j217223
$$ 37162866 36104110 35073979 34098972 32943314 31631215 30606014 29581643 28364420
3744B8364420j155179r32097q80194q51274p42075q72929q00191m85220o53387
$$ 28364420 27209241 26277144 25396950 24545676 23803601 22930672 22130481 21645261 20991874
3735B0991874p03033o92165q70937n00987k99194o57428o81480m64836l44665
$$ 20991874 20288841 19596676 18725739 18224752 17925558 17268130 16586650 16121814 15777149
3726A5777149l18480l27948n16158l62900p7583J7007j50808l4147k4885j94326
$$ 15777149 15458669 15130721 14614563 14251663 14174080 14191087 14040279 14006132 13981247 13786921
3716A3786921m36151k48955n63832p92357l14898k16393n08315j51461j45257
$$ 13786921 13350770 13101815 12537983 11745626 11430728 11214335 10706020 10554559 10409302
3707A0409302l44042j80418j63098j57185k22762k59466k29247n9599l3733q4882
$$ 10409302 10065260 9884842 9721744 9564559 9341797 9082331 8853084 8793485 8759752 8674870
3697H674870o495j30979j37013r5989j22861L4793R9659j90815j61366P5599L1806
$$ 8674870 8668375 8537396 8400383 8304394 8181533 8216326 8315985 8125170 7963804 8039403 8071209
3686H071209O320R3920k08814k16675j45218q5203j87374k95644m1388j1007k52514
$$ 8071209 8077529 8171449 7962635 7745960 7600742 7515539 7328165 7032521 6991133 6980126 6727612
3675F727612j45033K3035j31235K8775J27046j26502k12073J2438l3808J10803
$$ 6727612 6582579 6605614 6474379 6503154 6630200 6503698 6291625 6304063 6270255 6381058
3665F381058P7968l13054j86113O7097j0941j05081l588k22665r4963p346P026
$$ 6381058 6459026 6145972 5959859 6026956 6016015 5910934 5907346 5684681 5589718 5582372 5589398
3654E589398m4781j14468n8365O4408m5088m5902n4058j92276j9424k886o6879
$$ 5589398 5544617 5430149 5371784 5436192 5391104 5345202 5291144 5098868 5079444 5076558 5009679
3643E009679j6640O6257p321N7513r8560l2037J59719N8025o5747O3799K6889
$$ 5009679 4993039 5059296 5051975 5109488 5010928 4978891 5138610 5196635 5130888 5194687 5221576
3632E221576j94643j55910R4366j38728r0575l2657m6005L9101q871m024j07921
$$ 5221576 5026933 4871023 4965389 4826661 4736086 4703429 4657424 4696525 4687654 4683630 4575709
3621D575709Q4570R2322n0273j32341j54645p4027N6911l8185m0570l6877l5816
$$ 4575709 4660279 4752601 4702328 4569987 4415342 4341315 4398226 4360041 4319471 4282594 4246778
3610D246778J29682J87118j31645j71296K89869K13304N4170K0621m0211p9581
$$ 4246778 4376460 4563578 4431933 4260637 4550506 4763810 4817980 4838601 4798390 4718809
3600D718809J82700m1800j48915k05997K03710L4731r4918R6128J40290N8485
$$ 4718809 4901509 4859709 4710794 4504797 4708507 4743238 4648320 4744448 4884738 4943223
3590D943223q2576l7144M0852m7927P0257R8575j30912J53697K19445n3591j76800
$$ 4943223 4860647 4823503 4864355 4816428 4886685 4985260 4854348 5008045 5227490 5173899 4997099
3579D997099J56631J17278J61490J67747J1264j12193K08926K33398n4564O2714
$$ 4997099 5153730 5271008 5432498 5600245 5611509 5499316 5708242 5941640 5887076 5949790
3569E949790M456j12454L1080K02972J22584O8305O4467J77575L6593J32348O0421
$$ 5949790 5954246 5841792 5872872 6075844 6198428 6266733 6331200 6508775 6545368 6677716 6738137
3558F738137k3670r7688J93952J83376M173R2360K3633K16743n6097O3097K33725
$$ 6738137 6714467 6616779 6810731 6994107 6998280 7090640 7114273 7331016 7274919 7338016 7571741
3547G571741R8100N9746J01580J11762J13254J35259K34721l5330Q553J94842
$$ 7571741 7669841 7729587 7831167 7942929 8056183 8191442 8426163 8390833 8399386 8594228
3537H594228R1766J78947K69781n9734n0006K71291K19063J31168p454N9071Q8750
$$ 8594228 8685994 8864941 9134722 9074988 9024982 9296273 9515336 9646504 9639050 9698121 9786871
3526I786871K51394O2302o8611J0872M15926L87006Q7782J37980K29289L67161
$$ 9786871 10038265 10100567 10031956 10042828 10458754 10845760 10933542 11071522 11300811 11667972
3516A1667972L25328K52677K17104J59993L40172M99221K43661J59255M22823
$$ 11667972 11993300 12245977 12463081 12623074 12963246 13462467 13706128 13865383 14288206
3507A4288206M17885L31532M12660K97543M81987N81767L74430L11287N51507
$$ 14288206 14706091 15037623 15450283 15747826 16229813 16811580 17186010 17497297 18048804
3498A8048804P68268N12611N87120P60741P34579R99828Q44603Q69887J148247
$$ 18048804 18817072 19329683 19916803 20677544 21412123 22411951 23256554 24126441 25274688
3489B5274688J329783J197421J380718J464995J525915J706462J721215J833776
$$ 25274688 26604471 27801892 29182610 30647605 32173520 33879982 35601197 37434973
3481C7434973K166676K496605K624199L136092L600434M130828N220749O204768
$$ 37434973 39601649 42098254 44722453 47858545 51458979 55589807 60810556 67015324
3473F7015324P369780Q929841J1786009J5201575J9173086K3049918K3822689
$$ 67015324 74385104 83314945 95100954 110302529 129475615 152525533 176348222
3466A76348222J9043740J1887531K836619o888843j5390026k1607495k2978902
$$ 176348222 195391962 207279493 210116112 203227269 187837243 166229748 143250846
3459A43250846j9426463j4526770j0793486p638351n036994l496777k504031j087777
$$ 143250846 123824383 109297613 98504127 90865776 85828782 82332005 79827974 78740197
3451G8740197l39661L72922J393544K266386K932448L929755M791421N931191
$$ 78740197 78400536 78773458 80167002 82433388 85365836 89295591 94087012 100018203
3443A00018203P720972R960128J2249830J5731052K0440480K7426543L6528786
$$ 100018203 107739175 117699303 129949133 145680185 166120665 193547208 230075994
3436B30075994M6451904M9446059L9906627K4643405N499530j4863536l3080964
$$ 230075994 276527898 325973957 365880584 390523989 396023519 381159983 348079019
3429C48079019m9312079n2685881m3720607l3690411k5054685j8240542j3497424
$$ 348079019 298766940 246081059 202360452 168670041 143615356 125374814 111877390
3422A11877390j0711100q222676o288325n036348l553539k365582j740917o69256
$$ 111877390 101166290 92943614 86655289 81618941 78065402 75699820 73958903 73289647
3414G3289647n7389L73357J172009K300687L182428M523336O630571Q434305J1426727
$$ 73289647 73232258 73605615 74777624 77078311 80260739 84784075 91414646 99848951 111275678
3405A11275678J5655146J9176748K0515262J7625379J0632175K380208o680407
$$ 111275678 126930824 146107572 166622834 184248213 194880388 197260596 190580189
3398A90580189j5132692k1956945k4557681k1920758j7447264j3489095j0421607
$$ 190580189 175447497 153490552 128932871 107012113 89564849 76075754 65654147
3391F5654147p879520o340877n089948m044592l552756l156938k357233j884717
$$ 65654147 57774627 51433750 46343802 42299210 38746454 35589516 33232283 31347566
3383C1347566j706917j477414j376315j423597r22810q47723j274650r76653q28833
$$ 31347566 29640649 28163235 26786920 25363323 24440513 23592790 22318140 21341487 20512654
3374B0512654o10177o62584o41751p73197o50157m21154j50659n56829q70939
$$ 20512654 19902477 19239893 18598142 17824945 17174788 16753634 16602975 16046146 15175207
3365A5175207o79652k09883k03504m20731l59591l71721l73393j41004k71785
$$ 15175207 14495555 14285672 14082168 13661437 13301846 12930125 12556732 12415728 12143943
3356A2143943n75537n03923K9845K6680m47173j81991k30405l30674o3733j51365
$$ 12143943 11568406 11064483 11094328 11121008 10673835 10491844 10261439 9930765 9867032 9715667
3346I715667m39449l02189k08032k57218j48971j85085k72372k27755K2973k4493
$$ 9715667 9276218 8974029 8765997 8508779 8359808 8174723 7902351 7674596 7697569 7673076
3336G673076k13786j17487J5479k13405p6652p4568k20237l67107N9104L0177
$$ 7673076 7459290 7341803 7357282 7143877 7067225 6992657 6772420 6405313 6464417 6494594
3326F494594k66914J0166m7011k76572p2339J0737j56256N115m0033M2100j36405
$$ 6494594 6227680 6237846 6190835 5914263 5841924 5852661 5696405 5701520 5661487 5703587 5567182
3315E567182m0680r7560M2927l6856R720j62826n7787J17062q8428j22608J48229
$$ 5567182 5526502 5428942 5471869 5435013 5444733 5281907 5224120 5341182 5252754 5130146 5278375
3304E278375q9844j00136J08672l09221l58704J09456j74958j96797l5623k99468
$$ 5278375 5188531 5088395 5197067 4887846 4529142 4638598 4463640 4266843 4231220 3931752
3294C931752k15925R6492l839L3330J7459l2063L1099o885k54216n7387J571q5187
$$ 3931752 3715827 3812319 3808480 3841810 3859269 3827206 3858305 3851420 3597204 3539817 3541388 3456201
3282C456201k47022j63707Q88o979N53P6256K3300j60602J41653N8330l06062
$$ 3456201 3209179 3045472 3046360 3039381 3039934 3116190 3139490 2978888 3120541 3178871 2872809
3271B872809j00597O8714j75610o7091N770r0380j48746j3207k4493K5794K8318
$$ 2872809 2772212 2840926 2665316 2598225 2603995 2513615 2364869 2351662 2327169 2352963 2381281
3260B381281M1164N3761J05895j11468k5962m9206k5897l2863k40092J8696J57803
$$ 2381281 2422445 2476206 2582101 2470633 2444671 2395465 2369568 2336705 2096613 2115309 2273112
3249B273112k01842j1621R0015O4771n4966o178J90351j26909q6416L9410J7889
$$ 2273112 2071270 2059649 2149664 2214435 2159469 2153291 2343642 2216733 2130317 2169727 2187616
3238B187616l0559k84994k28562j26770J73241J21620k50268k17914Q8816J30270
$$ 2187616 2157057 1872063 1643501 1516731 1689972 1811592 1561324 1343410 1432226 1562496
3228A562496n6950o8431N654J14605J31572p3573l03740K062J59650N876P111
$$ 1562496 1505546 1437115 1442769 1557374 1688946 1615373 1311633 1313695 1473345 1479221 1486332
3217A486332J21664j31536N637L3435r3585j50104J52460O5934o8928J11266p0652
$$ 1486332 1607996 1476460 1482097 1515532 1421947 1271843 1424303 1490237 1421309 1532575 1461923
3206A461923j17913N781j00921j92270J58125J50674K6351n2525J07132r7353
$$ 1461923 1344010 1349791 1248870 1056600 1214725 1365399 1391750 1339225 1446357 1349004
3196A349004M7851J04240k15182p1951N5741j44798j33748J53411L6406j9842
$$ 1349004 1396855 1501095 1285913 1213962 1269703 1124905 991157 1144568 1180974 1161132
3186A161132J05396N4203o7035O8295M9740J46379J6891J22533J33105j3015J8443
$$ 1161132 1266528 1320731 1253696 1321991 1371731 1518110 1535001 1657534 1790639 1777624 1796067
3175A796067k3333J37527P3142k69803j08335j68389j57364J89291R4973j97870
$$ 1796067 1772734 1910261 1983403 1713600 1605265 1436876 1279512 1468803 1563776 1365906
3165A365906p7875L2568j30041O1278J9336j52658J5876J85207j29640R6017J15229
$$ 1365906 1288031 1320599 1190558 1251836 1271172 1118514 1134390 1319597 1189957 1285974 1401203
3154A401203R9172n4154J90357J95828J35393J35580J76673J69459J17918J72215
$$ 1401203 1500375 1446221 1636578 1832406 1967799 2103379 2280052 2449511 2567429 2739644
3144B739644O2680k9314J8803j84838l61542k58950k63333j27928p180Q5860L0181
$$ 2739644 2802324 2773010 2791813 2606975 2245433 1986483 1723150 1595222 1588042 1673902 1704083
3133A704083j29424j38942L5501j16352m8665j5882j10499K8895J52625J98229
$$ 1704083 1574659 1435717 1471218 1354866 1306201 1290319 1179820 1208715 1361340 1559569
3123A559569J25307n0050m2011l5202Q5281j3157J26510m4277P8375J85065J74614
$$ 1559569 1684876 1634826 1592815 1557613 1642894 1629737 1756247 1711970 1790345 1975410 2150024
3112B150024O2726o0610r169m0009J7412N2293k52218l20275P3417J0265L845
$$ 2150024 2212750 2152140 2142971 2102962 2120374 2172667 1920449 1600174 1673591 1683856 1687701
3101A687701K5253r9579j52828K05228K85327n7520J4687J11417K6209L52134
$$ 1687701 1712954 1613375 1460547 1665775 1951102 1893582 1908269 2019686 2045895 2398029
3091B398029K00481o999k0296J62733K12265L02807L24604J65337J09785L60140
$$ 2398029 2598510 2591511 2571215 2733948 2946213 3249020 3573624 3738961 3848746 4208886
3081D208886N72816J78904J26786J20651k23560j31181L2900j89303m68617j60110
$$ 4208886 4781702 4960606 5087392 5208043 4984483 4853302 4886202 4696899 4228282 4068172
3071D068172l4138l22179k39717j62230j67928J06061l1133m11280j81703R7135
$$ 4068172 4034034 3711855 3472138 3309908 3141980 3248041 3216908 2805628 2623925 2721060
3061B721060n7510j24857q700l05397j53452O3713r7821k22157j191J09598N3065
$$ 2721060 2663550 2538693 2529993 2224596 2071144 2134857 2037036 1814879 1813688 1923286 1976351
3050A976351J16541j99967o2038L08761O8540m5795p4404m5677k66739J89593
$$ 1976351 2092892 1892925 1830887 2139648 2208188 2162393 2087989 2042312 1775573 1965166
3040A965166K33045l26828k11821J72180n5182l4615Q9644j29099q2207J12137
$$ 1965166 2198211 1871383 1659562 1831742 1776560 1741945 1831589 1702490 1620283 1732420
3030A732420o3568j12469j36632m5352m04886J5625L61667j03503q9489r994Q1814
$$ 1732420 1668852 1556383 1419751 1374399 969513 985138 1346805 1243302 1153813 1143819 1225633
3019A225633L2245m0874k35802j22590N9416K06128m8286l23569k10089Q5110
$$ 1225633 1257878 1217004 981202 858612 918028 1124156 1075870 752301 542212 627322
3009F27322L8633J25437K0847j64718J4694J95936M6736j47778L647p093j02274
$$ 627322 665955 791392 812239 647521 662215 858151 904887 757109 760756 753663 651389
2998F51389k1585J30988j05928o7830N4534j9975L4917P2678j60008k9304k5821
$$ 651389 629804 760792 654864 587034 641568 621593 656510 729188 569180 539876 514055
2987E14055O2291J01105j66096M7111r2832j12002j0309J96775j47025j19776
$$ 514055 576346 677451 511355 558466 465634 353632 343323 540098 393073 273297
2977B73297L01928O8335j01142K10496p1507k49813K2812K23607k72431K7757
$$ 273297 575225 643560 542418 752914 681407 431594 454406 678013 405582 433339
2967D33339M897k22572m7497K99731p95j74330l1644k9291l4657K38030O6016
$$ 433339 438236 215664 168167 467898 467103 292773 261129 231838 197181 435211 501227
2956E01227j62380n1290N4122J85507j78473j16949R6030m5210j27934J83699
$$ 501227 338847 287557 341679 527186 348713 231764 327794 282584 154650 338349
2946C38349l5345j29922r9771J10129J05465k0099p1117j7437M9476l1422n4645
$$ 338349 303004 173082 73311 183440 288905 268806 197689 180252 229728 198306 143661
2935A43661L6955M7944J01102j6152l2169M480j64595J7722K10414K7878J17704
$$ 143661 180616 228560 329662 313510 281341 285821 121226 138948 349362 377240 494944
2924D94944j24580j4044j33603m3903J14465J5868j27935M752J18705n8926r975
$$ 494944 370364 356320 222717 178814 293279 309147 181212 185964 304669 245743 235768
2913B35768J02665j56147q8859K10150K2582k2518l6024j41460r9271L22066k6902
$$ 235768 338433 182286 93427 303577 326159 303641 267617 126157 26886 348952 322050
2902C22050k04422J4847j6494J76691k7071o6314j21907P4797N9630j09844j8197
$$ 322050 117628 132475 115981 292672 265601 199287 77380 152177 211807 101963 83766
2891H3766N5881K7836J7505N1326J9117j69979L4733J07041J3148J12749j59464
$$ 83766 139647 167483 184988 236314 255431 85452 120185 227226 240374 353123 193659
2880A93659o7228J6431L2844J25190N3277j53452j62075L7067J41888K9176O0192
$$ 193659 126431 142862 175706 300896 354173 200721 38646 75713 217601 246777 306969
2869C06969j93072j22768N1951J16219J27475J83066j89422k21360K60080l5713
$$ 306969 113897 -8871 43080 159299 286774 469840 280418 59058 319138 283425
2859B83425k31943L3815k1354J06879J15212r5814j7612n8841j43523O8409J50827
$$ 283425 51482 85297 63943 170822 286034 190220 172608 113767 -29756 38653 189480
2848A89480K8205j0664k098J2715J58357l7923k34807Q9525k5206p3549J19676
$$ 189480 217685 207021 204923 217638 375995 338072 103265 192790 167584 94035 213711
2837B13711j7010m6237J05930n7824j08704J72784J13836j48865j40939r4220
$$ 213711 196701 150464 256394 198570 89866 262650 376486 227621 86682 -7538
2827g538K8443K26834N3655j97921q6557P2884j6537R1522L4475j84835Q0438
$$ -7538 20905 247739 301394 103473 16916 89800 73263 164785 199260 14425 94863
2816I4863K57201j50393k41754J60458N1189k33318N7446M8902j63911Q7721P3386
$$ 94863 352064 201671 -40083 120375 171564 -61754 -4308 44594 -119317 -31596 41790
2805D1790r6473o1919O9463J39859J01895P527j46979j04627K31046L0283r4506
$$ 41790 -54683 -116602 -47139 92720 194615 202142 55163 -49464 181582 211865 117359
2794A17359O7335j25456Q3542J95578l5080k09296q3629P6074O211R8202q3564
$$ 117359 184694 59238 142780 338358 303278 93982 10353 86427 92638 190840 107276
2783A07276m7124J3608J6210J9442M0302N9431L3669n9629N4961j41085j88985
$$ 107276 60152 73760 89970 109412 149714 209145 242814 183185 238146 97061 -91924
2772i1924J49913J20892j37512n1974M1811j7763P6894O0139l6186j47213Q6828
$$ -91924 57989 178881 41369 -10605 31206 13443 90337 150476 114290 -32923 53905
2761E3905M2512j09445N6695J57669n1830q0662R6492n6661j06184L3170Q2885
$$ 53905 96417 -13028 43667 201336 149506 68844 165336 108675 2491 35661 118546
2750A18546J34947p2090j67333J27545J0461j08827J10695p8755j43797Q3795
$$ 118546 253493 181403 14070 141615 152076 43249 153944 75189 -68608 15187
2740A5187R9858m6450j9071n4998M9147P1823M8511j58183j76036K79565J09966
$$ 15187 115045 68595 49524 -5474 43673 115496 164007 5824 -170212 109353 219319
2729B19319k01206J56792j1497o6457R6772M3765k06784j3712Q3109j14804P2189
$$ 219319 18113 174905 163408 96951 193723 237488 30704 16992 100101 -14703 57486
2718E7486p0311r0582R8981L9890L8409J06857n0687J5678K09519J34699l77364
$$ 57486 -12825 -103407 -4426 35464 73873 180730 130043 145721 355240 489939 112575
2707A12575q7702J49285n8055q7703O3637l8113P4278O3062p0753o4654p3204
$$ 112575 24873 174158 116103 28400 92037 53924 128202 191264 120511 55857 -17347
2696a7347R0309O0965p149j3387k46662J3513K29318L6681j16497j26252r15J92845
$$ -17347 72962 133927 126778 113391 -133271 -119758 109560 146241 29744 -96508 -97423 95422
2684I5422K49330l05132O2397J39044o9622k1532o6400k9372m3130R295j13461
$$ 95422 344752 39620 102017 241061 171439 149907 83507 54135 11005 20300 -93161
2673i3161Q8902M1042J19921k493j56054J11828p8520k9630K04626q2265k72466
$$ -93161 -4259 36783 156704 154211 -1843 109985 31465 1835 206461 124196 -148270
2662a48270J63893K73746j92873o8754Q3979n7920O2046J46048r800k57833P4294
$$ -148270 15623 289369 96496 27742 111721 53801 115847 261895 252095 -5738 68556
2651F8556L4624o8236O8279j3392j29767L9936J48667M3470j46855j02364L3370
$$ 68556 103180 34944 103223 89831 -39936 0 148667 192137 45282 -57082 -23712
2640b3712N0602J30914k0413j12921j8369J10874Q2886j60984j97267N4810j7335
$$ -23712 26890 157804 137391 24470 6101 116975 199861 38877 -158390 -103580 -120915
2629a20915N7678J50346p9078j98321J54734J08887j93189J29556R026j06405
$$ -120915 -63237 87109 8031 -190290 -35556 73331 -119858 9698 18724 -87681
2619h7681Q2527J52839l1987j39058o0117K59302n9914n1485l535o2257J62226
$$ -87681 -5154 147685 115698 -23360 -83477 175825 115911 64426 60891 -1366 160860
2608A60860j21839r0421J9781k7934J8548q19O5651R6111j224R9569k05982m9417
$$ 160860 39021 -51400 -31619 -59553 -41005 -41824 23827 119938 118714 218283 12301 -37116
2596c7116Q7795k3755m0028O2502l0487M0579R9755P0864l3657j31239j4881m7215
$$ -37116 50679 26924 -13104 49398 18911 59490 159245 230109 196452 65213 50332 3117
2584C117J1378N3255o2686Q8976J00502r5526Q7012j4124r4139P014N2939J31134
$$ 3117 14495 67750 5064 94040 194542 99016 186028 171904 77765 84779 137718 268852
2572B68852j46841M4849R0586j52270j5515R1982j28660Q562M3876n678K4054
$$ 268852 122011 166860 257446 105176 89661 181643 52983 61545 105421 99743 123797
2561A23797j14041m7862J26472p6375r0007j586J60647K6626j05209J18114M6630
$$ 123797 9756 -38106 88366 11991 -78016 -79602 81045 107671 2462 120576 167206
2550A67206n1636N2503q5267l08439K28875J96133k35799q5184q9646j83703K84833
$$ 167206 115570 168073 82806 -225633 3242 199375 -36424 -121608 -211254 -394957 -110124
2539a10124J68108p7209k04162M1503N2394J33372O1595j88849Q0814L69903o6811
$$ -110124 57984 -19225 -223387 -181884 -129490 3882 65477 -123372 -42558 327345 260534
2528B60534p4755k0571k61545J01070J01885j25855J3989J6221J22281o9007r6048
$$ 260534 185779 165208 -96337 4733 106618 -19237 -5248 10973 133254 64247 -31801
2517c1801O8148r6636K00048J06574k56361O1408J92897j64936j76937K58456
$$ -31801 36347 -60289 139759 246333 -10028 51380 244277 79341 -97596 160860
2507A60860p5067j01631K73720q5187l34806P675J40302K4522J17731K4517k69648
$$ 160860 85793 -15838 257882 172695 -162111 -154436 -14134 10388 128119 152636 -117012
2496a17012R9449J15191N2151J6561k19801q9120O0442J18754J08055J11514j52211
$$ -117012 -17563 97628 149779 166340 -53461 -142581 -82139 36615 144670 256184 103973
2485A03973l697N9932K9489q4253o5549k0506n8203J77687M2407l77371J7220
$$ 103973 100276 160208 189697 105444 39895 19389 -38814 138873 181280 -196091 -178871
2474a78871J42118L9524k1172m7051j982J8371J83224R3688j65322K1824J38041
$$ -178871 -36753 2771 -18401 -65452 -67434 -49063 134161 227849 62527 84351 222392
2463B22392O192q0771k9944j39043J51078M9835m5790l5847j34967j28832j5157
$$ 222392 228584 147813 117869 -21174 129904 179739 133949 98102 -36865 -165697 -180854
2452a80854K56304L8162j32442M4665J5290l31q0565R5673J069R6343r356j08802
$$ -180854 75450 113612 -18830 25835 41125 40794 -39771 55902 56971 153314 143958 35156
2440C5156l577O6374N1908K5977L7021j78238o9495K06392j19056j71861J083
$$ 35156 31579 97953 149861 175838 212859 34621 -34874 171518 52462 -119399 -118316
2429a18316n2023P6711K16805J1128k92965J31275K98084j34746l40J37931j57104
$$ -118316 -170339 -93628 123177 134305 -158660 -27385 270699 135953 135613 273544 116440
2418A16440L2002J49937k08129j75162Q5232m3632J211P1356o0251k0387n8023
$$ 116440 148442 298379 90250 -84912 320 -43312 -42101 29255 -30996 -51383 -109406
2407a09406K9072N2895q0343J10245R4742k6784j34514J74173k3442n3365q9555
$$ -109406 -80334 -27439 -107782 2463 97205 70421 -64093 110080 86638 33273 -56282
2396e6282J78989L1109n7785o1331j51619O0571L38257o112l02476K685Q323n9395
$$ -56282 122707 153816 96031 34700 -116919 -56348 281909 275797 -26679 -23994 -15671 -75066
2384g5066K13590k5230j62703M4358J79306k5715M9761r5137r2543K64159K515
$$ -75066 138524 113294 -49409 -5051 174255 148540 198301 103164 10621 274780 277295
2373B77295k01845J47876N4723j17363p5679N6618J13944J59707r6310j33426
$$ 277295 75450 223326 278049 160686 85007 141625 255569 415276 318966 185540
2363A85540J1117p3059k0112J58006j9337j08876R4000J62581k8471Q3274n2080
$$ 185540 196657 123598 103486 261492 242155 133279 227279 389860 361389 444663 392583
2352C92583j11334J22672m6549J1509K1514M8901l7310M455O7293L4696j35668
$$ 392583 281249 403921 357372 368881 390395 439296 401986 406441 473734 508430 372762
2341C72762J53726P6395j25167O7988K3801j15196J34867J42604P8183l1712Q8342
$$ 372762 526488 602883 477716 545704 569505 454309 589176 731780 809963 778251 866593
2330H66593n632K00983K02681j07732r5500J70722J3945K26003K32544P057J33274
$$ 866593 860961 1061944 1264625 1156893 1061393 1232115 1246060 1472063 1704607 1711664 1844938
2319A844938K61313L9143P0241K87494J70644L46804N41325N11520O78876R91864
$$ 1844938 2106251 2145394 2215635 2503129 2673773 3020577 3561902 4073422 4752298 5744162
2309E744162J515879J979021K069430J322967Q92167j37995q55112j542048k206504
$$ 5744162 7260041 9239062 11308492 12631459 13523626 13385631 12530519 10988471 8781967
2300H781967k164273j574369j095288p25924m57686m09297k97392k74881j00838
$$ 8781967 6617694 5043325 3948037 3222113 2764427 2355130 2057738 1782857 1682019
2291A682019k54063j1628R2535k14094k06796J29058R7671k31264k90527m5273
$$ 1682019 1427956 1416328 1508863 1294769 1087973 1217031 1314702 1083438 792911 747638
2281G47638m1042J3518j21402j03698j12812K72375N6409p9079j913j54330n3339
$$ 747638 706596 720114 598712 495014 382202 654577 710986 631907 629994 475664 422325
2270D22325K67492n222k89183p8043J11817n8091j03769J02535l351q359q542
$$ 422325 689817 684595 395412 317369 429186 371095 267326 369861 366510 358151 349609
2259C49609o4714K8736L5236j80630J09273J8705j50116n92l5656j44678j5721
$$ 349609 284895 313631 348867 168237 277510 296215 146099 145507 109851 -34827 -50548
2248e0548J86625N0949Q8681K1834j76901k6116L06860J03311l05397k5559J19846
$$ -50548 136077 187026 275707 297541 120640 94524 401384 504695 199298 173739 293585
2237B93585r7470j1560k4345j09395p0989K60808L7995l09487o4966J98657M5254
$$ 293585 196115 184555 160210 50815 -20174 240634 278629 -30858 -95824 102833 148087
2226A48087j01522r163R7036K7092j26019L5785M1642p0372O3856N8555j64831
$$ 148087 46565 37402 134438 161530 35511 71296 112938 42566 106422 164977 146
2215A46J20628J28706j60004M0537N717J17330j31980m1764O2859k47343P4872
$$ 146 120774 249480 89476 130013 135730 253060 121080 79316 142175 -105168 -30296
2204c0296J77095p7402r0622J01000R9955j3470J53952M4042k24379l4651P1637
$$ -30296 146799 69397 -21225 79775 179730 166260 320212 364254 139875 105224 176861
2193A76861m0826j74705J9648Q3324j04691O4540L0884j82811p1816J88042J2606
$$ 176861 136035 -38670 -19022 64302 -40389 24151 55035 -127776 -199592 -11550 1056
2182A056k26933J63947J33114K5836J12084j23577j14066J03736R008j10490J32598
$$ 1056 -225877 -61930 71184 97020 209104 85527 -28539 75197 84205 -26285 106313
2171A06313r0665J8493K28829K1782j97970M4046J00510j25031N9303j43919k37698
$$ 106313 15648 34141 262970 284752 86782 130828 231338 106307 165610 21691 -216007
2160b16007J66463K35065j11411j94103J03293L5833j12984K20624q3169k44164
$$ -216007 -49544 185521 74110 -119993 -16700 19133 -93851 126773 43604 -200560
2150b00560J88004J23638p0593j0037N6686k02879j4778K67662j68183j7674K22314
$$ -200560 -12556 111082 40489 30452 87138 -115741 -130519 137143 -31040 -48714 173600
2139A73600k4189M0896J57902k83406p7970L3386r4313j18737K12163P1407j27005
$$ 173600 149411 190307 348209 64803 -13167 20219 -74094 -192831 19332 90739 -36266
2128c6266K18571m9442k39419J20316J62554k39544o246J80771j10848j01726
$$ -36266 182305 132863 -106556 13760 176314 -63230 -69476 111295 447 -101279
2118a01279Q1589j10269k7311K26062J6734j50071P861P8434j1481J88758J14973
$$ -101279 -19690 -129959 -157270 68792 85526 -64545 -56684 21750 10269 199027 314000
2107C14000k09504O533J61316j0728j52836j2719j8425j29516P3121J18753j07641
$$ 314000 104496 111029 272345 261617 108781 96062 77637 -51879 21242 139995 32354
2096C2354o9484J8924p5653M0706K22014j50377j85675J32034J70374j14079p3519
$$ 32354 -37130 -18206 -93859 -53153 168861 18484 -167191 -35157 135217 21138 -52381
2085e2381k4837K8551O0087J01329k76902J0581J37150m3971l3643j38843Q2738
$$ -52381 -77218 -48667 11420 112749 -164153 -153572 -16422 -60393 -94036 -232879 -150141
2074a50141N3556J95927j55497j36114k0996R609j4905L7746N8503M2411k8910
$$ -150141 -96585 99342 -56155 -192269 -213265 -203656 -218561 -180815 -122312 -79901 -108811
2063a08811K9152K05807l8385j81253J72254J12621m5464j87002N6920j50912
$$ -108811 -79659 126148 87763 -93490 78764 191385 145921 -41081 15839 -135073
2053a35073R1775Q3944j67583o5351O8775n8742r2708L24373J6422j11413K4420
$$ -135073 -43298 40646 -126937 -192288 -123513 -182255 -274963 49410 65832 -45581 -21161
2042b1161R0261j75966N6647k186k21359J25979J74751q5582J8001J20585m0052
$$ -21161 69100 -106866 -50219 -52405 -273764 -147785 26966 -58616 -40615 79970 39918
2031C9918p9659q6471P2140J00119J5175q1585j6820n7969k9647J47491n669k03374
$$ 39918 -39741 -126212 -54072 46047 61222 -20363 -37183 -95152 -124799 22692 17023 -186351
2019a86351K13997J40777k10213J15018Q9173j83001K3490J18218l38914j68439
$$ -186351 27646 168423 -41790 73228 162401 -20600 2890 121108 -217806 -386245
2009c86245L75673J85708k84218j28178O0015J0304J02208J98032j88279q5990
$$ -386245 -10572 175136 -109082 -237260 -177245 -166941 -64733 133299 -54980 -140970
1999a40970L44625K8877l01344p7260P2216O2347N8951m1012n0829k5275Q6945
$$ -140970 203655 232532 -68812 -146072 -73856 -11509 47442 6430 -44399 -69674 17271
1988A7271R232j50602R409k9291Q0133Q9156M0010n9691n1230j06659N4397J01434
$$ 17271 26503 -124099 -114690 -143981 -63848 25308 65318 5627 -45603 -152262 -97865 3569
1976C569J9575j18873J42585J0971l5742K13384q8345k01389N2422J39288r870
$$ 3569 23144 -95729 46856 57827 22085 235469 147124 -54265 -1843 137445 127575
1965A27575r4417J2932k55648N4837Q655j03681J38583P7534J37258M7843m2532
$$ 127575 33158 46090 -209558 -154721 -146066 -249747 -111164 -33630 103628 151471 108939
1954A08939n8895J35076q1722o4712j97386J55008J06005l4133o0573n637l3659
$$ 108939 50044 185120 103398 38686 -158700 -3692 102313 68180 7607 1970 -31689
1943c1689Q4433Q2791j30025o3179O0624P7048N6757j14896p6597k5660J28382
$$ -31689 52744 135535 5510 -57669 2955 80003 136760 21864 -54733 -80393 47989
1932D7989L0232j95998N200J8708R8965J37543j25578j01564J50905j4229Q4870
$$ 47989 78221 -117777 -112577 -93869 5096 142639 17061 -84503 66402 52173 137043
1921A37043j08161p6940j03197O7202l9177j6838j71521P1625J06266P1956J6429
$$ 137043 28882 -48058 -151255 -84053 -123230 -140068 -311589 -239964 -133698 -61742 -45313
1910d5313j81086J77035J42073J61074j41069j24437K2685K3414N5852l8722j89274
$$ -45313 -226399 -49364 92709 253783 112714 -11723 10962 34376 90228 51506 -137768
1899a37768k1524J62797R4177K3369J085k30604j37436J79052o8780j18490J64165
$$ -137768 -159292 3505 97682 121051 122136 -108468 -245904 -66852 -135632 -254122 -89957
1888h9957L0003m5722J52563K6960q6851Q6267O8016j83565q8310K66371j33962
$$ -89957 -59954 -105676 46887 73847 -13004 73263 141279 -42286 -130596 135775 1813
1877A813k22257J82342J12666j65614r134j13556m8485K10754J82546j08229r3522
$$ 1813 -220444 -38102 74564 -91050 -100184 -213740 -262225 -51471 131075 22846 -70676
1866g0676N0160J55529P7656o71j79284j33604K18935J8716q7827j17612l2173
$$ -70676 -20516 135013 212669 211998 32714 -100890 118045 136761 48934 -68678 -100851
1855a00851P9432r3172J06708J03108p1562j42595K1694j7454j69399K09604N1100
$$ -100851 -21419 -114591 -7883 95225 23663 -118932 -97238 -114692 -284091 -74487 -23387
1844b3387k36748J02437K21869n2701n0409K0908p3820j41K63316N8774l96096
$$ -23387 -260135 -157698 64171 11470 -38939 -18031 -91851 -91992 171324 230098 -165998
1833a65998j8757K65535m9381p6730j01797j97058j2093M27561M9878l03193O9853
$$ -165998 -184755 80780 31399 -45331 -147128 -344186 -356279 71282 121160 -182033 -112180
1822a12180j6042j05105J60882K08186q2196j06461K49240M3923j83630M2691
$$ -112180 -128222 -233327 -72445 135741 53545 -52916 196324 240247 56617 99308
1812I9308j85746k05655J67019J24483p1324p7341Q2587l9862K3246Q7115q6315
$$ 99308 -86438 -292093 -125074 -591 -71915 -149256 -66669 -106531 -83285 3830 -82485
1801h2485k3441O5064L3391j80036Q8625P0881R912j563p5514p68l2585M0913
$$ -82485 -105926 -40862 -7471 -187507 -98882 -28001 -18089 -19652 -95166 -95934 -128519 -87606
1789h7606O7286N7097j3449j18178L4471m8691o4697L4057p0034l5257M8211J74801
$$ -87606 -20320 36777 23328 -94850 -60379 -109070 -173767 -139710 -209744 -245001 -196790 -21989
1777b1989L238M9455m9418L448L7925J05032J4380k18760j2612J40178q0445N026
$$ -21989 -18751 30704 -18714 -15266 22659 127691 142071 -76689 -89301 50877 -29568 -24542
1765b4542J02432o8677j54152K8979k8926K6206J72140j6880l9312J33306N5450
$$ -24542 77890 9213 -144939 -115960 -144886 -118680 53460 36580 -2732 130574 186024
1754A86024j58501j7831J07755O2819o6819j5956j04789j10714N6804O1712j8062
$$ 186024 27523 9692 117447 180266 113447 97491 -7298 -118012 -61208 504 -17558
1743a7558N9914r6756k05654J50222J50276j47871n2233P3777q3324J21465O2795
$$ -17558 42356 -54400 -260054 -109832 40444 -107427 -159660 -85883 -169207 -47742 15053
1732A5053k18201J17981J54594j93283M725J13693K6203l088J87578k70682r6189
$$ 15053 -203148 -85167 69427 -123856 -119131 -5438 20765 17677 205255 -65427 -161616
1721a61616P2626O5213k16521n6621J45666J68002J2584k58886n223K31237J20152
$$ -161616 -88990 -23777 -240298 -296919 -151253 16749 29333 -229553 -234776 -3539 116613
1710A16613j98184q2885j3537K9628K36325R5523l32594R5840J63912q7159J8689
$$ 116613 -81571 -164456 -177993 -148365 87960 183483 -149111 -53271 110641 23482 42171
1699D2171k3752k00684N4235J93281j28159k02365J54651J93600q5723J34984
$$ 42171 18419 -182265 -128030 65251 -62908 -265273 -110622 82978 -2745 132239
1689A32239L0338j47197l2512J30822k4393L2758P7398n8041L5075j38603j8215
$$ 132239 162577 15380 -17132 113690 89297 122055 199453 141412 176487 37884 19669
1678A9669m9546n065q0761r6783j5258q461J62603M2921k07750J94300J82709
$$ 19669 -29877 -34942 -115703 -212486 -227744 -236205 -73602 -30681 -238431 -44131 138578
1667A38578j07483n0559O5910o6490R2675k9655N6486j83350j17209K460J65266
$$ 138578 31095 -19464 46446 -20044 72631 42976 99462 -83888 -201097 -198637 -33371
1656c3371O8625p5738K6866n8976N4733J22362j04442j95990K464k5316P4300
$$ -33371 35254 -40484 -13618 -72594 -17861 104501 59 -195931 -193467 -218783 -144483
1645a44483J86418r2042j86944J83795L3618k213J90270j07869j79023K51388
$$ -144483 41935 -50107 -237051 -53256 -19638 -21851 168419 60550 -118473 132915
1635A32915P1415l39707l5447J57932k40386L675K32472k20735O3745J74649l518
$$ 132915 204330 -135377 -170824 -12892 -253278 -249603 -17131 -237866 -174121 528 -2990
1624b990O4000L4679r5627n5278O5831Q1693o8247N6937n0635j6784n9346J9535
$$ -2990 61010 95689 62 -55216 10615 92308 24061 80998 30363 13579 -45767 -26232
1612b6232l8792l4676o512j297j43540j49799K07815J93092N4272o8191j46369
$$ -26232 -65024 -99700 -106212 -107509 -251049 -400848 -193033 59 54331 -13860 -160229
1601a60229M9639J57209p2555p5622N0771Q6642P4500o5234j14019k0146J46870
$$ -160229 -110590 46619 -25936 -101558 -50787 35855 110355 45121 -68898 -89044 57826
1590E7826P5051k92614q0415L5416L5478M1182R2990j88954P194K85354N5263
$$ 57826 132877 -159737 -240152 -204736 -169258 -128076 -35086 -224040 -216846 68508 123771
1579A23771l22542J18803P9891k8067k78J16319k69023Q4164K99220j27431j60796
$$ 123771 -198771 -79968 -77 -28144 -28422 87897 -181126 -96962 202258 74827 -85969
1568h5969J28209j30836m9712k5848M1047N6449j5043m715m6140L3557L3065R1628
$$ -85969 42240 -88596 -138308 -164156 -123109 -66660 -81703 -86418 -132558 -99001 -65936 25692
1556B5692l1977o922K11808j2768j82692m8799L7606Q942Q8745J71868m7509o0793
$$ 25692 -6285 -13207 198601 185833 3141 -45658 -8052 890 89635 261503 213994 153201
1544A53201n0052k06860k76506O8216J0211L2122J51903J15066k1304N538J65811
$$ 153201 103149 -103711 -380217 -312001 -301790 -269668 -117765 -2699 -24003 -18465 147346
1533A47346p3148j59313J64669R9012k0869j31137m6109J39294J46106k0683k35023
$$ 147346 74198 -85115 79554 178566 157697 26560 -19549 119745 265851 245168 10145
1522A0145p8005J8451n6472J12686M60r1406j31460K17409J22517j08136j18513
$$ 10145 -67860 -49409 -105881 6805 7265 -84141 -215601 1808 124325 16189 -102324
1511a02324N3997j4936j6325L5748J01878N6956j51645j64714n6653J69940n9606
$$ -102324 -48327 -63263 -79588 -43840 58038 114994 -36651 -201365 -258018 -88078 -147684
1500a47684P1167J59741p3145O8992P432j24416j66486K52464J83021k79563M3652
$$ -147684 -76517 83224 10079 79071 86503 -37913 -204399 48065 231086 -48477 -4825
1489d825J01629j31166J38130J42852j84900j00700M8108L6648l0292p5037j32500
$$ -4825 96804 -34362 103768 246620 61720 -38980 9128 45776 15484 -59553 -192053
1478a92053P7387J16281k00608M3630P9473N9053o3136p3404P0334O4104O3517
$$ -192053 -114666 1615 -198993 -155363 -75890 -16837 -79973 -153377 -83043 -18939 44578
1467D4578j2059M4732j60023j48725K34533O4580j15771Q1659K1982q8793J3709
$$ 44578 32519 77251 -82772 -231497 3036 67616 -48155 33504 55486 -33307 -19598
1456a9598J07723j66103J2165J39371p4565o3652J35317k70024l8318L61617q2276
$$ -19598 88125 -77978 -65813 73558 -1007 -64659 70658 -199366 -237684 123933 41657
1445D1657j99409Q6429j20118M1638M33927p0356k82912Q545M4128m0335J46841
$$ 41657 -157752 -71323 -191441 -149803 284124 213768 -69144 -60599 -16471 -56806 90035
1434I0035j19347j81310j10325J74477K31768J85p0062j59568Q6360J15285j142
$$ 90035 -29312 -210622 -320947 -146470 85298 85483 15421 -144147 -57787 57498 56356
1423E6356J1121r1359k4334J37691l1790j22743j1504o7415M9540J11088J36667
$$ 56356 67477 -23882 -48216 89475 57685 -65058 -76562 -143977 -94437 16651 153318
1412A53318p7899j73910P7863o091K5340J42917l06997n5553L34393Q7669r0795
$$ 153318 75419 -98491 -20628 -26719 -1379 141538 -165459 -221012 113381 201050 110255
1401A10255r8516o4526L3655k3533N6657M9277q4813M4365J6118j4373j33472
$$ 110255 11739 -52787 -19132 -42665 13992 63269 -21544 22821 38939 24566 -108906
1390a08906r8475J2421j33267J01959J40201L729k16339R6545Q2718n9743M7836
$$ -108906 -207381 -194960 -328227 -226268 -86067 -82338 -298677 -202132 -119414 -179157 -131321
1379a31321l265J30792j2423k9361M0290o6612j9621o4550J54965J37651k32260
$$ -131321 -134586 -3794 -16217 -45578 -5288 -71900 -91521 -156071 -1106 136545 -95715
1368i5715L3681r2461J01870L3680N1058L2689j04851j02975J6352J720O2818
$$ -95715 -62034 -154495 -52625 -18945 32113 64802 -40049 -143024 -126672 -124952 -62134
1357f2134l6329r2908l2079J63602J43399l5208j55569Q2134J55880J50308j24475
$$ -62134 -98463 -191371 -223450 -59848 83551 48343 -107226 -25092 130788 281096 156621
1346A56621j89248p6691K5742J6139m3037j36497N1486J14433m1729P2180P349
$$ 156621 -32627 -109318 -83576 -67437 -110474 -246971 -195485 -81052 -122781 -50601 -43252
1335d3252j46435J13458J02632n900j10510Q3633K06437k93829Q250K05991j92381
$$ -43252 -189687 -76229 26403 20503 -90007 -6374 200063 -93766 -85516 120475 -71906
1324g1906j51415J98377j17920M2714J28043j03012q8499R3806K9116k2424K45096
$$ -71906 -223321 -24944 -142864 -100150 27893 -75119 -163618 -69812 -40696 -63120 181976
1313A81976K0008l46245J94192J29986k85903M5899J24520k63R2514L8733j78245
$$ 181976 201984 -144261 49931 179917 -105986 -60087 64433 64170 156684 195417 17172
1302A7172j18323O7969j40002P2976J21435j49251q3006j4511K6936M3464J9530
$$ 17172 -101151 -33182 -173184 -100208 21227 -128024 -211030 -225541 -198605 -155141 -135611
1291a35611J12924j512Q3347j87605q9642J79704J08744j19556o0169P7248N7051
$$ -135611 -22687 -24199 59148 -128457 -218099 -38395 70349 -49207 -109376 -32128 24923
1280B4923J3579M5030r4197p4758J12070l7819r853J10064j37877r7083K63615
$$ 24923 38502 83532 -10665 -85423 26647 -11172 -21025 89039 -48838 -145921 117694
1269A17694j22279j62474l9233P0429M1523R6619O8564j70702O4972J42212n4109
$$ 117694 -4585 -167059 -206292 -135863 -94340 2279 70843 -99859 -34887 107325 53216
1258E3216q515M7653J45230j83393j65962j3573K24750p3302j84722K0680O8597
$$ 53216 44701 92354 237584 54191 -111771 -125344 99406 26104 -158618 -137938 -69341
1247f9341p85K3787q9100P902K56684J0208M7466M831r3193r1087J61154m3761
$$ -69341 -70126 -46339 -135439 -127537 129147 139355 186821 191652 98459 7372 168526 124765
1235A24765r5929k0503j58132J8042M1144j91945N3529J69034p8597p2901R4616
$$ 124765 28836 8333 -149799 -131757 -90613 -282558 -229029 -59995 -138592 -211493 -116877
1224a16877k301K1241O1144r4316m8340J60193M2174o8414m2308J24606j31276
$$ -116877 -119178 -97937 -36793 -131109 -179449 -19256 22918 -45496 -87804 36802 -94474
1213i4474n6361l2406l9077J30864J15940O5420j95702j08091J21611O2225l0239
$$ -94474 -150835 -183241 -222318 -91454 24486 89906 -105796 -213887 -92276 -30051 -60290
1202f0290j44925L8435Q0446N2886J80793o8808j78680K37335O9197j56934M7504
$$ -60290 -205215 -166780 -86334 -33448 147345 78537 -100143 137192 206389 49455 96959
1191I6959p7003k02670J47155J60545j13973o0413K8474j6391n1141K87680j25779
$$ 96959 19956 -182714 -35559 124986 11013 -49400 -20926 -37317 -88458 199222 73443
1180G3443j58108J55061l1221m8600P9597j84342k06907K20112J98249p3796j07751
$$ 73443 -84665 70396 39175 -9425 70172 -114170 -321077 -100965 97284 23488 -84263
1169h4263K7794k306k9837R0169l2663m7216N7567j9866L4687j13583j48918K7474
$$ -84263 -56469 -58775 -88612 1557 -31106 -78322 -20755 -40621 -5934 -119517 -268435 -240961
1157b40961J30319J6748l7377n3782j3887K16733j1680p9718o9981Q8366o0714
$$ -240961 -110642 -93894 -131271 -185053 -198940 17793 6113 -73605 -143586 -55220 -115934
1146a15934l8781k5585J48694m5506j268L4946o8974L2098J15348J62534j42544
$$ -115934 -154715 -180300 -31606 -77112 -78380 -43434 -112408 -80310 35038 197572 55028
1135E5028k1915L7652j27160J06357K10507q3936k74286Q5972J23062K3331K0658
$$ 55028 33113 70765 -56395 49962 260469 176533 -97753 -11781 111281 134612 155270
1124A55270r9261j36713J06239J64816j11202j32892K5291q0568N472K34658k11766
$$ 155270 56009 -80704 25535 190351 79149 -53743 -28452 -109020 -103548 131110 -80656
1113h0656j30821J97435J53929p3199l5569j36240j1567K36724J25231j85598
$$ -80656 -211477 -14042 139887 66688 31119 -105121 -116688 120036 245267 59669
1103E9669m7303J3191J9115j2698q2827j51429M6366P4719M1606L0298r4550J05185
$$ 59669 12366 25557 44672 31974 -50853 -202282 -155916 -81197 -39591 -9293 -103843 1342
1091A342J21788j94283q618L3292m8690K9864q476p5801K18350J38246p7362j79998
$$ 1342 123130 -71153 -79771 -46479 -95169 -65305 -73781 -149582 68768 207014 129652 -50346
1079e0346q9818J30488J29969k840k0839r860j23233N8886r791n7408j43664J63000
$$ -50346 -140164 -9676 120293 117453 96614 86754 -36479 22407 12616 -44792 -188456 -25456
1067b5456R9155n5146l9555m6067r4906L03743K89274j60416j50811O7748J2014
$$ -25456 73699 18553 -21002 -67069 -161975 141768 431042 270626 119815 187563 199577
1056A99577p4453m7793p1803j53557O4247j0371p0182J7005n962J8092J16734
$$ 199577 125124 77331 5528 -148029 -83782 -94153 -164335 -147330 -153292 -135200 -18466
1045a8466N6950n3040k9815J10950K3113m0589r7261p7344M4471O0933k0662m8904
$$ -18466 38484 -14556 -44371 66579 89692 49103 -48158 -125502 -81031 -20098 -40760 -89664
1033h9664J32476P504o3414o3964q2693j5674J02896p3930n1967K8873J39142
$$ -89664 42812 50316 -13098 -77062 -159755 -175429 -72533 -146463 -198430 -169557 -30415
1022c0415Q2283m2579j35101O8580K5656q9409J21594J363j09803J45377N3740
$$ -30415 51868 9289 -125812 -57232 -31576 -120985 609 1972 -107831 37546 91286
1011I1286j36078M5496K2717r8969K02713j00061k26843J66406O9468p7906R4994
$$ 91286 -44792 704 23421 -75548 127165 27104 -199739 -33333 36135 -41771 53223
1000E3223M5752p1479O191m8249j12567K81380O9402k25695K3777J54165q4803
$$ 53223 98975 27496 33687 -14562 -127129 154251 223653 -2042 21735 175900 91097
989I1097l1943P4247j83219q423K45861j78560k28829R9510n0398J27446J60593
$$ 91097 59154 133401 -49818 -58241 187620 9060 -219769 -120259 -170657 -43211 117382
978A17382o1515j62996R0721Q0286j19784j05614K6938l3857J71172J5624k02185
$$ 117382 55867 -107129 -16408 63878 -55906 -161520 -134582 -168439 2733 18357 -183828
967a83828J52717M7206p1015m9296k4251j51638K25614J03779j23587j62567K06526
$$ -183828 -31111 16095 -54920 -104216 -128467 -280105 -54491 49288 -74299 -236866 -30340
956c0340K02718j05089M0121o6285j61220K4032K57002l42679r9704K67005j20563
$$ -30340 172378 67289 107410 41125 -120095 -96063 160939 -181740 -281444 -14439 -135002
945a35002j9656K59896j51543j38390K06664J1911j02526n6702J07911N815n1506
$$ -135002 -154658 105238 -46305 -184695 21969 33880 -68646 -125348 -17437 -11622 -63128
934f3128P1084k05789M862J63005J72418k1283N2367M5409j31206K2000k2457
$$ -63128 7956 -197833 -192971 -29966 142452 121169 173536 218945 87739 109739 87282
923H7282o0995j3159m2246j65064J09377J37866m9799O406j74510j28139J75733
$$ 87282 26287 13128 -29118 -194182 -84805 53061 3262 9668 -164842 -292981 -117248
912a17248J79996j11350L9105l69M1699J23557o9536k63893M5730K10320j78401
$$ -117248 62748 -48602 -9497 -9866 31833 155390 85854 -178039 -132309 78011 -100390
901a00390K4012J20677j13978j0813R6625j15275L4214R7769L150N3091p9346
$$ -100390 -76378 44299 -69679 -80492 16133 -99142 -64928 32841 35991 89082 9736
890I736M1972J17952N0942j61192N343l6703j3105K72254j41930j98281J18465
$$ 9736 51708 169660 220602 59410 64753 28050 14945 287199 145269 -53012 65453
879F5453R5552q5701J69306o5639k93409K87469J64420l25718o5415L0489k8987
$$ 65453 161005 75304 244610 178971 -114438 173031 337451 11733 -53682 -23193 -52180
868e2180J38308O3213k83714o8799K44185J60082l3759l35046j7169J18013O9316
$$ -52180 86128 149341 -134373 -203172 41013 201095 167336 -167710 -184879 -66866 2450
857B450J4138j06822j74970J22914J79865q0878l8611j3174P1847J85852P3929
$$ 2450 16588 -90234 -265204 -142290 37575 -43303 -81914 -95088 -23241 162611 236540
846B36540k03574m0904L3663m1309O6389j36554j37158J20841R4801L9344K935
$$ 236540 32966 -7938 25725 -15584 50805 -85749 -222907 -102066 -7265 32079 35014
835C5014j92382J67851K37742j53223j11213M8015j14974m825K14030j23487o6287
$$ 35014 -157368 10483 248225 95002 -16211 31804 -83170 -87995 126035 2548 -63739
824f3739J10657O751m343J67822j52039P4785J03785p0542j52672J62187r7819
$$ -63739 46918 53669 49326 217148 65109 139894 243679 173137 20465 182652 84833
813H4833j60412O6981p5924j01443J03336P7318o7567P9842q5923j41828R7868
$$ 84833 -75579 -8598 -84522 -185965 -82629 -5311 -72878 6964 -78959 -220787 -122919
802a22919J4998J6989M077Q8206r6146j5960J87489r8499m3333L0822K19797l7290
$$ -122919 -107921 -90932 -86855 1351 -94795 -110755 76734 -21765 -65098 -34276 185521 148231
790A48231o7799K4877r8265P6556J89908q5986q6212k446p7329k8364j02628J1221
$$ 148231 80432 105309 7044 83600 273508 187522 101310 98864 21535 -6829 -109457 -98236
778i8236Q5102P6914J687j2587m2655P2336P534m2383j9371L1600M9249l3440
$$ -98236 -13134 63780 65467 52880 10225 82561 90095 47712 28341 59941 109190 75750
766G5750j01680K8237K757n4382P2779J16668p3105j78704K5939O1303O864j12869
$$ 75750 -25930 2307 5064 -49318 23461 140129 67024 -111680 -85741 -24438 -17574 -130443
754a30443P4305l9624J20188J61317k08567k80968K58266n4971q1408K18498j1392
$$ -130443 -56138 -95762 24426 185743 -22824 -303792 -45526 -100497 -181905 36593 25201
743B5201j54844J08833J54003k60638r2378K65861r7399n7718M2089j02663O0180
$$ 25201 -129643 -20810 133193 -127445 -219823 46038 -51361 -109079 -66990 -169653 -109473
732a09473J58167k9788q0717P3406J4056m1851P131j15431n0971K1143J87811
$$ -109473 48694 18906 -61811 11595 25651 -16200 -9069 -124500 -175471 -154328 33483
721C3483o4742K2433n4130o335J88550J0775n0476M9816R778m0957M4989M792
$$ 33483 -31259 -8826 -62956 -69291 119259 130034 79558 129374 139152 98195 143184 147976
709A47976j37988q9086K09925m2232j49299L1645N7234l1345j00Q6907j75363
$$ 147976 9988 -79098 130827 88595 -60704 -29059 28175 -3170 -3270 83637 -91726
698i1726j7149L34130o0783j84454K7218Q0236j58908l3243k4379j00295J15275
$$ -91726 -108875 225255 164472 -19982 7236 87472 -71436 -104679 -129058 -229353 -114078
687a14078K77666j18430k00932J59131O6646j9809K4991k27706p909K82389m719
$$ -114078 163588 45158 -155774 3357 70003 50194 75185 -152521 -160430 121959 117240
676A17240k18110J2507J63034K5236J06659l5294k62343L8156K26470o4083j63609
$$ 117240 -100870 -88363 74671 99907 206566 171272 -91071 -52915 173555 109472 -54137
665e4137l9949J2088Q8048K4823j9983j36640P8106r6860J679J72203J7631M1028
$$ -54137 -94086 -81998 6050 30873 10890 -125750 -47644 -144504 -142825 29378 47009 88037
653H8037J40618j53137L9978J18257r9663o3822n1005j66771n8287K87935l9356
$$ 88037 228655 75518 115496 233753 134090 70268 19263 -147508 -205795 82140 42784
642D2784l38788J59187K49689r5592J7564J04917j29249l7660J21682N3895j29982
$$ 42784 -296004 -136817 112872 17280 34844 139761 10512 -27148 94534 148429 18447
631A8447J44K4988N1167N2029o6855m7440n1387J87261O2721j47980r6949J04831
$$ 18447 18591 43579 94746 146775 79920 32480 -18907 168354 231075 83095 -13854 90977
619I0977j7820J27091p1084j38559K2755O1980K3285J10834j78254j76025K17943
$$ 90977 73157 200248 129164 -9395 13360 75340 98625 209459 31205 -144820 73123
608G3123K48141j80113j8680K7364k04474N0923J20038k55294m3797L84883j07588
$$ 73123 321264 141151 122471 149835 -54639 -3716 116322 -138972 -182769 202114 94526
597I4526k5307J65325k86870j71552K82976M8018k29760Q5968M6958j29000R7117
$$ 94526 69219 234544 -52326 -223878 59098 107116 -122644 -36676 10282 -118718 -21601
586b1601M7820j36177Q9853J00969j42553J89799J0908J1569l5973j5671q3413
$$ -21601 26219 -109958 -20105 80864 -61689 128110 139018 150587 114614 98943 15530
575A5530m4095m5480J22059J6990j28975N6092j0508j2615j2028n6221j7360J99522
$$ 15530 -28565 -74045 48014 65004 -63971 -7879 -18387 -31002 -43030 -99251 -116611 82911
563H2911J53842j49270j50069L3227l6158K6321L7246L4809j3549M522j28513
$$ 82911 236753 87483 -62586 -29359 -65517 -39196 -1950 32859 19310 23832 -104681
552a04681J54705J53005j74703n472J08517r3167N8530R9097l0600j20004n403
$$ -104681 50024 203029 28326 22854 131371 38204 96734 195831 165231 45227 39824
541C9824J55002r1391p8964J14485j06487J5078J03291j18479j45329J10135J08646
$$ 39824 194826 103435 24471 138956 32469 47547 150838 32359 -112970 -2835 105811
530A05811m7268j68157J6405K9701R9199M1263p8516J02112o5098n0066K04565
$$ 105811 58543 -109614 -93209 -63508 35691 76954 -1562 100550 35452 -14614 189951
519A89951j23541p1044P1900j4168j32998m499l1332j1803L50957M6996k27531
$$ 189951 66410 -4634 67266 53098 -79900 -84399 -115731 -127534 223423 270419 42888
508D2888r2600J21534l2283j56613P8707J4819N797K02011r9773j23740M5301
$$ 42888 -49712 71822 39539 -117074 -38367 -23548 -17751 184260 84487 -39253 6048
497F048K6392m451P6030j12943q6541L3399P1334R4415N8661k45054o2367N0530
$$ 6048 32440 27989 104019 -8924 -95465 -62066 9268 103683 162344 -82710 -145077 -94547
485i4547J4097O5696m1527p4m0371p6311J91511K6409m6000P3694J20219J7397
$$ -94547 -80450 -14754 -56281 -56355 -96726 -173037 18474 44883 -1117 72577 192796 210193
473B10193k5531Q6233k28776J15593P5286k27014q7345J47015n173j80292J94269
$$ 210193 184662 270895 42119 157712 232998 5984 -81361 65654 60481 -119811 74458
462G4458K8428k9532P237M3440q0919p6232K5410O8658j3642m1058N6326N981
$$ 74458 102886 73354 80591 124031 43112 -33120 -7710 60948 47306 6248 62574 68555
450F8555O9877k2521r5189j25900M3803R1430N0720R3728o3335j4479o0296M2842
$$ 68555 138432 115911 20722 -105178 -61375 30055 80775 174503 111168 96689 36393 79235
438G9235j37014j18081J50820J70990n1361p9425j06100L7069K28290q4959j68954
$$ 79235 -57779 -175860 -25040 145950 94589 15164 -90936 -53867 174423 89464 -79490
427g9490p5768R0374m284J65860j6609j59556Q2814Q0722J44446q2375k36811
$$ -79490 -155258 -64884 -69168 96692 80083 -79473 3341 84063 228509 146134 -90677
416i0677K02015Q7167j51032M1268L2961p4969J16430J44022k29533k09891J19779
$$ -90677 111338 198505 47473 88741 121702 46733 163163 307185 77652 -132239 -12460
405a2460J8024q8715J30970p1864o6219J00520Q7072j28313P367R8413j23398
$$ -12460 5564 -83151 47819 -24045 -90264 10256 97328 -30985 -23618 74795 -48603
394d8603l2083O1109j8413O3161K0412O7647K9675j85040J61858M7329m2057k2394
$$ -48603 -80686 -19577 -37990 25171 45583 113230 142905 -42135 119723 167052 124995 102601
382A02601L1677j69167j68153J13861K52177o4649r1946j4309j60550O2003J98177
$$ 102601 134278 -34889 -203042 -89181 162996 98347 6401 -7908 -168458 -106455 91722
371I1722j50652p2465K57850J0971j14390J68905r0142j09942J05917L7639p0279
$$ 91722 -58930 -131395 126455 137426 23036 191941 101799 -8143 97774 135413 65134
360F5134l2282J28529m0672j07797m8347l5885l7444J14345J08386j91235m6100
$$ 65134 32852 161381 120709 12912 -35435 -71320 -108764 5581 113967 -77268 -123368
349a23368m609J18755K00750J4352k12746r462J22762l6837j91556m090J75102
$$ -123368 -127977 -9222 191528 205880 -6866 -16328 106434 69597 -121959 -126049 49053
338D9053Q5001r023n6420j67498R7387P4048M1894j50490j47123K27763m057R8947
$$ 49053 134054 125031 68611 -98887 -1500 72548 114442 -36048 -183171 44592 40535 139482
326A39482j80655J6251J70406R1638o380L3050j59126J05875l082j63781j54108
$$ 139482 -41173 -24922 145484 237122 230742 263792 104666 210541 207459 43678 -110430
315a10430K06740J1448o9124p275j08830k3059J18669N9353q221j9966l1064n5134
$$ -110430 96310 107758 38634 31359 -77471 -100530 18139 77492 69271 49305 18241 -36893
303c6893P7234J27017j84522j55995J20807l258m0913J71954r5754j74181l0114
$$ -36893 40341 167358 -17164 -173159 -52352 -55610 -96523 75431 -20323 -194504 -224618
292b24618K39561M893k418Q729k3203k9885J19761M467j85729o164K42570j44783
$$ -224618 14943 19836 17418 26147 2944 -26941 92820 97287 -88442 -94606 147964 3181
280C181M0392Q6297k42606L3955K51930J23824k49888j72090L9260J45078R0086
$$ 3181 43573 129870 -112736 -78781 173149 296973 47085 -125005 -85745 59333 149419
269A49419n0k14434N0964J78563j47098n5903O4109o1746o3517K29432M5611r3642
$$ 149419 149369 -65065 -14101 164462 17364 -38539 25570 -36176 -99693 129739 175350 81708
257H1708o7989o3541l535j759K6060n489o4934J30774K9574j13165Q462r793N62
$$ 81708 13719 -49822 -53357 -55116 -29056 -34545 -99479 31295 60869 -52296 -43834 -53627 -53065
$$ [...]
##END NTUPLES=NMR SPECTRUM
##END=
