##TITLE=31Pdec_43-2026-Bay
 CDCl3,24 sc
 28.4.2026
##JCAMPDX= 6.0         $$ Bruker NMR JCAMP-DX V2.0
##DATA TYPE= NMR SPECTRUM
##DATA CLASS= NTUPLES
##ORIGIN= UXNMR, Bruker Analytische Messtechnik GmbH
##OWNER= root
$$ XWIN-NMR		Version 3.5
$$ Tue Apr 28 14:27:28 2026 Russian Standard Time (UT+4h)  she@DPX200
##.OBSERVE FREQUENCY= 81.013821
##.OBSERVE NUCLEUS= ^31P
##.ACQUISITION MODE= SIMULTANEOUS
##.ACQUISITION SCHEME= undefined
##.AVERAGES= 24
##.DIGITISER RES= 17
##SPECTROMETER/DATA SYSTEM= spect
##.PULSE SEQUENCE= zgpg30
##.SOLVENT NAME= DMSO
##.SHIFT REFERENCE= (INTERNAL, DMSO, 0, 197.392)
##AUDIT TRAIL= $$ (NUMBER, WHEN, WHO, WHERE, WHAT)
$$ ##TITLE= Audit trail, XWIN-NMR		Version 3.5
$$ ##JCAMPDX= 5.01
$$ ##ORIGIN= Bruker BioSpin GmbH
$$ ##OWNER= she
$$ F:/spectra/data/she/nmr/P31/2/pdata/1/auditp.txt
$$ ##AUDIT TRAIL=  $$ (NUMBER, WHEN, WHO, WHERE, WHAT)
(   1,<2026-04-28 14:26:30.20 +0400>,<she>,<DPX200>,
      <created by zg, POWCHK disabled, PULCHK disabled
       configuration hash MD5:
       00 E9 B6 7A A2 85 ED C7 34 08 36 98 17 FE 4E 26
       data hash MD5: 32K
       E9 D3 54 A4 E6 45 05 BB 4B 23 A6 3B 83 48 30 8B>)
(   2,<2026-04-28 14:26:33.39 +0400>,<she>,<DPX200>,
      <Start of raw data processing
       efp BC_mod = 2 LB = 1.5 FT_mod = 6 PKNL = 1 PHC0 = 1412.684 PHC1 = 40.10049 SI = 64K 
       data hash MD5: 64K
       FE 69 E9 CB 82 6E 4C 24 C8 B8 D5 0E 68 24 4B 70>)
(   3,<2026-04-28 14:26:51.71 +0400>,<she>,<DPX200>,
      <pk PHC0 = 7.532248 PHC1 = 4 
       data hash MD5: 64K
       A5 16 B4 A7 93 5A B9 7E 39 A5 CC 3E 59 BD AC 42>)
(   4,<2026-04-28 14:26:55.71 +0400>,<she>,<DPX200>,
      <abs ABSG = 5 
       data hash MD5: 64K
       EA DB 09 52 E9 F7 A8 50 31 9C F3 CA 60 D1 D6 95>)
$$ ##END=
$$ 
$$ hash MD5
$$ 02 49 CB DF 4E 10 1E 58 FF 63 0B 31 94 42 5E DA
##$RELAX= 
##$RELAX= 
##$RELAX= 
##$RELAX= 
##$RELAX= 
##$RELAX= 
##$RELAX= 
##$RELAX= 
$$ Bruker specific parameters
$$ --------------------------
##$DU= <F:/spectra>
##$EXPNO= 2
##$NAME= <P31>
##$PROCNO= 1
##$TYPE= <nmr>
##$USER= <she>
##$AMP= (0..31)
100 100 100 100 100 100 100 100 100 100 100 100 100 100 100 100 100 100 
100 100 100 100 100 100 100 100 100 100 100 100 100 100 
##$AQSEQ= 0
##$AQ_mod= 1
##$AUNM= <au_zg>
##$AUTOPOS= <>
##$BF1= 81.014009
##$BF2= 200.13
##$BF3= 200.13
##$BF4= 200.13
##$BF5= 200.13
##$BF6= 200.13
##$BF7= 200.13
##$BF8= 200.13
##$BYTORDA= 1
##$CFDGTYP= 0
##$CFRGTYP= 5
##$CHEMSTR= <none>
##$CNST= (0..31)
1 1 145 1 1 1 1 1 1 1 1 1 1 1 1 1 1 1 1 1 1 1 1 1 1 1 1 1 1 1 1 1 
##$CPDPRG= <waltz16>
##$CPDPRG1= <>
##$CPDPRG2= <waltz16>
##$CPDPRG3= <>
##$CPDPRG4= <mlev>
##$CPDPRG5= <mlev>
##$CPDPRG6= <mlev>
##$CPDPRG7= <mlev>
##$CPDPRG8= <mlev>
##$CPDPRGB= <>
##$CPDPRGT= <>
##$D= (0..31)
0 1 0 0 0 0 0 0 0 0.06 0 0.03 2e-05 3e-06 0 0 0.0002 0 0 0 0 0 0 0 0 0 
0 0 0 0 0 0 
##$DATE= 1777371989
##$DBL= (0..7)
120 120 120 11 120 120 24 19 
##$DBP= (0..7)
150 150 150 150 150 150 150 150 
##$DBP07= 0
##$DBPNAM0= <>
##$DBPNAM1= <>
$$ [...]
##$SUBNAM3= <"">
##$SUBNAM4= <"">
##$SUBNAM5= <"">
##$SUBNAM6= <"">
##$SUBNAM7= <"">
##$SUBNAM8= <"">
##$SUBNAM9= <"">
##$SW= 400.765351723535
##$SWIBOX= (0..15)
0 1 3 0 0 0 0 0 0 0 0 0 0 0 0 0 
##$SW_h= 32467.5324675325
##$TD= 32768
##$TD0= 1
##$TE= 0
##$TE2= 300
##$TE3= 300
##$TEG= 300
##$TL= (0..7)
0 120 53 12 22 120 120 120 
##$TP= (0..7)
150 150 150 150 150 150 150 150 
##$TP07= 0
##$TPNAME0= <>
##$TPNAME1= <>
##$TPNAME2= <>
##$TPNAME3= <>
##$TPNAME4= <>
##$TPNAME5= <>
##$TPNAME6= <>
##$TPNAME7= <>
##$TPOAL= (0..7)
0.5 0.5 0.5 0.5 0.5 0.5 0.5 0.5 
##$TPOFFS= (0..7)
0 0 0 0 0 0 0 0 
##$TUNHIN= 0
##$TUNHOUT= 0
##$TUNXOUT= 0
##$USERA1= <user>
##$USERA2= <user>
##$USERA3= <user>
##$USERA4= <user>
##$USERA5= <user>
##$V9= 5
##$VALIST= <valist>
##$VCLIST= <CCCCCCCCCCCCCCC>
##$VD= 0
##$VDLIST= <DDDDDDDDDDDDDDD>
##$VPLIST= <PPPPPPPPPPPPPPP>
##$VTLIST= <TTTTTTTTTTTTTTT>
##$WBST= 1024
##$WBSW= 4
##$XGAIN= (0..3)
0 0 0 0 
##$XL= 0
##$YL= 0
##$YMAX_a= 12536
##$YMIN_a= -12527
##$ZGOPTNS= <>
##$ZL1= 120
##$ZL2= 120
##$ZL3= 120
##$ZL4= 120
##$ABSF1= 197.3918
##$ABSF2= -203.3724
##$ABSG= 5
##$ABSL= 3
##$ALPHA= 0
##$AQORDER= 0
##$ASSFAC= 0
##$ASSFACI= 0
##$ASSFACX= 0
##$ASSWID= 0
##$AUNMP= <proc_1d>
##$AZFE= 0.1
##$AZFW= 0.5
##$BCFW= 0
##$BC_mod= 2
##$BYTORDP= 0
##$COROFFS= 0
##$CY= -3
##$DATMOD= 1
##$DC= 0
##$DFILT= <>
##$DTYPP= 0
##$F1P= 0
##$F2P= 0
##$FCOR= 1
##$FTSIZE= 65536
##$FT_mod= 6
##$GAMMA= 0
##$GB= 0
##$INTBC= 1
##$INTSCL= 9.790993e-09
##$ISEN= 30
##$LB= 1.5
##$LEV0= 0
##$LPBIN= 0
##$MAXI= 10000
##$MC2= 0
##$MEAN= 0
##$ME_mod= 0
##$MI= 50
##$NCOEF= 0
##$NC_proc= -6
##$NLEV= 6
##$NOISF1= 182.463
##$NOISF2= 159.3651
##$NSP= 0
##$NTH_PI= 0
##$NZP= 0
##$OFFSET= 197.3918
##$PC= 4
##$PHC0= 1420.216
##$PHC1= 44.10049
##$PH_mod= 1
##$PKNL= yes
##$PPARMOD= 0
##$PSCAL= 0
##$PSIGN= 0
##$REVERSE= no
##$SF= 81.014063255964
##$SI= 65536
##$SIGF1= 159.3651
##$SIGF2= -187.1042
##$SINO= 113.3802
##$SIOLD= 16384
##$SREGLST= <1H.CDCl3>
##$SSB= 0
##$STSI= 65536
##$STSR= 0
##$SW_p= 32467.5324675325
##$SYMM= 0
##$S_DEV= 0
##$TDeff= 32768
##$TDoff= 0
##$TI= <>
##$TILT= no
##$TM1= 0
##$TM2= 0
##$TOPLEV= 0
##$USERP1= <user>
##$USERP2= <user>
##$USERP3= <user>
##$USERP4= <user>
##$USERP5= <user>
##$WDW= 1
##$XDIM= 65536
##$YMAX_p= 466861184
##$YMIN_p= -6704560
$$ End of Bruker specific parameters
$$ ---------------------------------
##NTUPLES= NMR SPECTRUM
##VAR_NAME=  FREQUENCY,     SPECTRUM/REAL,   SPECTRUM/IMAG
##SYMBOL=    X,             R,               I
##VAR_TYPE=  INDEPENDENT,   DEPENDENT,       DEPENDENT
##VAR_FORM=  AFFN,          ASDF,            ASDF
##VAR_DIM=   65536,         65536,           65536
##UNITS=     HZ,            ARBITRARY UNITS, ARBITRARY UNITS
##FACTOR=    0.49542278885378, 1,            1
##FIRST=     15991.5117654749, 0,            0
##LAST=      -16476.0207020576, 0,           0
##MIN=       -16476.0207020576, -6704560,    0
##MAX=       15991.5117654749, 466861184,    0
$$ Real data points
##PAGE= N=1
##DATA TABLE= (X++(R..R)), XYDATA
$$ [...]
$$ plain form
41306 -569396 -627285 -922200 -1223278 -1293783 -1026901 -519655 -98624 -75266 -345187 -438111
41296 -438111 -115174 336046 610771 882132 1408176 1870024 1635764 699340 -132314 -182170
41286 -182170 310406 590052 329694 -120264 -313485 -228089 -149551 -249590 -442015 -584690
41276 -584690 -654838 -685986 -670039 -637486 -742029 -1090524 -1504412 -1625701 -1298826 -713382
41266 -713382 -154762 224940 376445 315140 190979 186929 247110 119189 -217360 -420111
41256 -420111 -274898 -80069 -269202 -820646 -1339752 -1616011 -1782197 -1954860 -2019394 -1834470
41246 -1834470 -1454997 -1087902 -918895 -963533 -1015207 -834194 -490240 -378030 -743525 -1340672
41236 -1340672 -1726396 -1732223 -1462633 -1048448 -662920 -549203 -682462 -605529 -9939 690586
$$ packed form
41306e69396n7889k94915l01078p0505K66882N07246M21031K3358k69921r2924
41296d38111L22937M51220K74725K71361N26044M61848k34260r36424q31654m9856
41286a82170M92576K79646k60358m49958j93221Q5396P8538j00039j92425j42675
41276e84690p0148l1148J5947L2553j04543l48495m13888j21289L26875N85444
41266g13382N58620L79702J51505o1305j24161m050O0181j27921l36549k02751
41256d20111J45213J94829j89133n51444n19106k76259j66186j72663o4534J84924
41246a834470L79473L67095J69007m4638n1674J81013L43954J12210l65495n97147
41236a340672l85724n827K69590M14185L85528J13717j33259P6933N95590P00525
$$ plain form
41226 690586 838749 454346 137585 129003 92294 -126166 -198687 28179 220720 198598
41216 198598 281892 607424 682554 151154 -483871 -535519 -166264 -52504 -249969 -146084
41206 -146084 497540 1161513 1330850 1038688 502237 -197025 -812638 -847890 -180431 573285
41196 573285 731276 374782 139017 332164 651045 738485 661713 722018 999744 1227163
41186 1227163 1041858 313164 -714952 -1560903 -1840913 -1538979 -970169 -486011 -218155
41177 -218155 -83945 13035 47903 -37904 -166512 -141441 128525 497228 736333 774978
41167 774978 722940 700360 717997 699321 555456 256694 -121283 -445087 -645328 -742952
41157 -742952 -737453 -566014 -230403 133703 384752 475315 373196 46619 -362165 -538747
$$ packed form
41226F90586J48163l84403l16761q582l6709k18460p2521K26866J92541k2122
41216A98598Q3294L25532P5130n31400o35025n1648L69255J13760j97465J03885
41206a46084O43624O63973J69337k92162n36451o99262o15613l5252O67459P53716
41196E73285J57991l56494k35765J93147L18881Q7440p6772O0305K77726K27419
41186A227163j85305p28694j028116q45951k80010L01934N68810M84158K67856
41177b18155J34210R6980L4868q5807j28608K5071K69966L68703K39105L8645
41167G74978n2038k2580J7637j8676j43865k98762l77977l23804k00241r7624
41157g42952N499J71439L35611L64106K51049R0563j02119l26577m08784j76582
$$ plain form
41147 -538747 -363661 -122404 -129581 -298682 -357792 -336665 -459086 -621307 -426042 190961
41137 190961 776204 946259 796589 546576 154482 -429376 -938518 -1083958 -984123 -963758
41127 -963758 -1064994 -1087345 -989612 -879562 -663774 -120556 607725 959008 571838 -258565
41117 -258565 -906055 -1048190 -863350 -743287 -935419 -1356113 -1632345 -1402507 -683533 97142
41107 97142 490447 401975 70181 -220334 -342068 -340264 -342736 -421852 -512025 -520256 -517443 -684090
41095 -684090 -1000306 -1131074 -756990 52351 907314 1464332 1603033 1337228 760036 87542
41085 87542 -415347 -616145 -544899 -272551 97762 348024 281984 11161 -108503 62240
41075 62240 256931 229339 142414 281330 559000 635025 425470 137184 -147633 -497079
$$ packed form
41147e38747J75086K41257p177j69101n9110K1127j22421j62221J95265O17003
41137A90961N85243J70055j49670k50013l92094n83858n09142j45440R9835K0365
41127i63758j01236k2351R7733J10050K15788N43218P28281L51283l87170q30403
41117b58565o47490j42135J84840J20063j92132m20694k76232K29838P18974P80675
41107I7142L93305q8472l31794k90515j21734J804k472p9116r0173q231K813j66647
41095f84090l16216j30768L74084Q09341Q54963N57018J38701k65805n77192o72494
41085H7542n02889k00798P1246K72348L70313K50262o6040k70823j19664J70743
41075F2240J94691k7592q6925J38916K77670P6025k09555k88286k84817l49446
$$ plain form
41065 -497079 -717609 -422715 284914 680781 337051 -195366 -80828 680466 1329183 1385653
41055 1385653 1066268 706332 339338 -32112 -242795 -252741 -252638 -298738 -196617 81533
41045 81533 249157 184678 154277 291275 291844 12514 -56073 539304 1361632 1532281 908425
41034 908425 201960 -46648 3003 54933 127860 199731 -37296 -673826 -1222008 -1174166
41024 -1174166 -675397 -262691 -121351 24225 395528 901003 1357998 1660278 1712817 1467622
41014 1467622 1075688 804399 762609 858860 1013855 1212225 1346182 1263738 1050774 1009919
41004 1009919 1192888 1176347 573126 -352121 -902922 -800283 -488519 -453629 -539995 -257149
40994 -257149 396586 823374 580843 -99676 -698308 -1020614 -1198795 -1304433 -1269493 -1106528
$$ packed form
41065d97079k20530K94894P07629L95867l43730n32417J14538P61294O48717N6470
41055A385653l19385l59936l66994l71450k10683r946J03m6100J02121K78150
41045H1533J67624o4479l0401J36998N69k79330o8587N95377Q22328J70649o23856
41034I08425p06465k48608M9651N1930P2927P1871k37027o36530n48182M7842
41024a174166M98769M12706J41340J45576L71303N05475M56995L02280N2539k45195
41014A467622l91934k71289m1790R6251J54995J98370J33957q2444k12964m0855
41004A009919J82969j6541o03221r25247n50801J02639L11764L4890q6366K82846
40994b57149O53735M26788k42531o80519n98632l22306j78181j05638L4940J62965
$$ plain form
40984 -1106528 -932797 -784403 -602365 -379160 -150279 106591 389681 569535 565478 527372
40974 527372 607140 670962 542871 407054 551170 775951 587244 52634 -97755 524241
40964 524241 1354018 1615544 1251850 704658 151619 -488976 -1022907 -1060989 -643141 -311777
40954 -311777 -471413 -990693 -1482813 -1701404 -1624232 -1385959 -1164831 -990556 -736476 -417464
40944 -417464 -220441 53394 1197132 3604764 6206080 7175587 5906978 3662665 1992120
40935 1992120 1121632 342497 -589011 -1180178 -1124262 -787509 -664802 -801689 -913426 -783006
40925 -783006 -405348 52916 324628 234867 -75095 -228006 8752 503978 965989 1262331
40915 1262331 1453375 1572951 1507209 1152624 636802 258679 155657 131125 -70522 -388001
$$ packed form
40984a106528J73731J48394J82038K23205K28881K56870K83090J79854m057l8106
40974E27372P9768O3822j28091j35817J44116K24781j88707n34610j50389O21996
40964E24241Q29777K61526l63694n47192n53039o40595n33931l8082M17848L31364
40954c11777j59636n19280m92120k18591P7172K38273K21128J74275K54080L19012
40944d17464J97023K73835J143738K407632K601316R69507j268609k244313j670545
40935A992120q70488p79135r31508n91167N5916L36753J22707j36887j11737J30420
40925g83006L77658M58264K71712q9761l09962j52911K36758M95226M62011K96342
40915A262331J91044J19576o5742l54585n15822l78123j03022k4532k01647l17479
$$ plain form
40905 -388001 -508310 -290585 51201 211582 75885 -280610 -676128 -838936 -550926 79495
40895 79495 612949 667591 236930 -401647 -926594 -1077571 -768513 -258037 -25826 -292813
40885 -292813 -776115 -1046987 -990483 -790679 -641268 -631128 -747380 -829905 -701175 -488584
40875 -488584 -563957 -947783 -1083295 -563830 173493 354090 -84368 -477808 -435216 -283613
40865 -283613 -391560 -583369 -514912 -236572 -28783 67207 198011 316093 183324 -248032
40855 -248032 -679678 -740176 -328671 297514 722455 704505 362752 9590 -176774 -230180
40845 -230180 -203810 -74466 150896 398786 619918 761897 671063 249218 -265228 -430428
40835 -430428 -115905 320750 462010 245779 -101035 -309780 -185645 251936 648615 625578
$$ packed form
40905c88001j20309K17725L41786J60381j35697l56495l95518j62808K88010O30421
40895G9495N33454N4642m30661o38577n24947j50977L09058N10476K32211k66987
40885b92813m83302k70872N6504J99804J49411J0140j16252q2525J28730K12591
40875d88584p5373l83826j35512N19465P37323J80597m38458l93440M2592J51603
40865b83613j07947j91809O8457K78340K07789R5990J30804J18082j32769m31356
40855b48032m31646o0498M11505O26185M24941j7950l41753l53162j86364n3406
40845b30180K6370J29344K25362K47890K21132J41979r0834m21845n14446j65200
40835d30428L14523M36655J41260k16231l46814k08745J24135M37581L96679k3037
$$ plain form
40825 625578 319785 275870 653786 955847 792573 471226 422010 454026 135575 -390162
40815 -390162 -624397 -581176 -727709 -1075813 -1071148 -547536 -87519 -106183 -193553 165080
40805 165080 710555 837980 593751 612775 1152399 1751929 1913306 1670832 1348262 1100996
40795 1100996 899298 750062 737479 914452 1223838 1455915 1305500 648414 -191902 -630692
40785 -630692 -389395 221909 674704 778231 763952 889702 1105370 1150005 912484 610263
40775 610263 551151 731735 784992 414534 -205787 -615102 -601546 -355061 -77337 290520
40765 290520 798106 1187895 1175493 932298 936523 1293002 1538565 1302372 868811 772194
40755 772194 1006726 1038737 597103 54409 -122162 29014 150471 102335 9751 -59218
$$ packed form
40825F25578l05793m3915L77916L02061j63274l21347m9216L2016l18451n25737
40815c90162k34235M3221j46533l48104M665N23612M60017j8664q7370L58633
40805A65080N45475J27425k44229J9024N39624N99530J61377k42474l22570k47266
40795A100996k01698j49236j2583J76973L09386K32077j50415o57086q40316m38790
40785f30692K41297O11304M52795J03527j4279J25750K15668M4635k37521l02221
40775F10263n9112J80584N3257l70458o20321m09315J3556K46485K77724L67857
40765B90520N07586L89789j2402k43195M225L56479K45563k36193m33561r6617
40755G72194K34532L2011m41634n42694j76571J51176J21457m8136r2584o8969
$$ plain form
40745 -59218 -112213 -5309 415348 900866 905492 275405 -458120 -686250 -388744 38650
40735 38650 381437 680331 851831 680927 249356 -21271 53818 94440 -331012 -1054348
40725 -1054348 -1479817 -1327812 -889351 -522729 -226959 123452 386662 292509 -126028 -536569
40715 -536569 -757885 -943504 -1225204 -1411900 -1228406 -709809 -165102 162704 224660 49813
40705 49813 -276415 -564006 -680936 -755322 -986711 -1263662 -1248397 -886193 -520289 -390580
40695 -390580 -346749 -240721 -245614 -469429 -568923 -200893 332006 397012 -71435 -512150
40685 -512150 -605713 -647290 -881398 -1018139 -769563 -428315 -438792 -685553 -731531 -601159
40675 -601159 -762133 -1316186 -1728063 -1518704 -825581 -73832 557286 1067115 1316184 1147816
$$ packed form
40745e9218n2995J06904M20657M85518M626o30087p33525k28130K97506M27394
40735C8650L42787K98894J71500j70904m31571k70627P5089M0622m25452p23336
40725a054348m25469J52005M38461L66622K95770L50411K63210r4153m18537m10541
40715e36569k21316j85619k81700j86696J83494N18597N44707L27806O1956j74847
40705D9813l26228k87591j16930p4386k31389k76951J5265L62204L65904J29709
40695c90580M3831J06028m893k23815r9494L68030N32899O5006m68447m40715
40685e12150r3563m1577k34108j36741K48576L41248j0477k46761m5978J30372
40675f01159j60974n54053m11877K09359O93123P51749O31118N09829K49069j68368
$$ plain form
40665 1147816 726053 421995 342201 206932 -242728 -890225 -1377195 -1475223 -1237428 -854103
40655 -854103 -463224 -107523 192677 389619 447087 390677 272728 105936 -100930 -240870
40645 -240870 -141272 227295 619420 684472 308264 -224482 -441715 -119821 449421 686666
40635 686666 319734 -270923 -424136 68531 721748 879350 349920 -515568 -1200425 -1357551
40625 -1357551 -937152 -203733 401990 585127 415967 184208 95476 168767 305048 317179
40615 317179 -4034 -675922 -1430719 -1975677 -2257816 -2331563 -2139165 -1684394 -1268866 -1185859
40605 -1185859 -1253522 -1071708 -727021 -744566 -1233742 -1611314 -1421462 -934789 -584997 -294094
40595 -294094 153553 489781 366677 121997 409066 1127993 1449029 993769 321926 45454
$$ packed form
40665A147816m21763l04058p9794j35269m49660o47497m86970r8028K37795L83325
40655h54103L90879L55701L00200J96942N7468n6410j17949j66792k06866j39940
40645b40870R9598L68567L92125O5052l76208n32746k17233L21894N69242K37245
40635F86666l66932n90657j53213M92667O53217J57602n29430q65488o84857j57126
40625a357551M20399P33419O05723J83137j69160k31759q8732P3291J36281J2131
40615C17179l21213o71888p54797n44958k82139p3747J92398M54771M15528Q3007
40605a185859o7663J81814L44687j7545m89176l77572J89852M86673L49792K90903
40595b94094M47647L36228j23104k44680K87069P18927L21036m55260o71843k76472
$$ plain form
40585 45454 100542 215712 491828 1016763 1352977 1011989 222970 -310146 -323909 -205839
40575 -205839 -326913 -589125 -692329 -527440 -227815 -48549 -206434 -634208 -922190 -730797
40565 -730797 -227544 123677 154693 79819 16377 -212301 -684528 -1107963 -1144521 -824994
40555 -824994 -471306 -330712 -408827 -547782 -554552 -334603 22881 351803 602362 811676
40545 811676 904858 729052 330872 -12493 -139668 -198785 -376581 -606731 -704075 -662169
40535 -662169 -648449 -764256 -935584 -1014184 -926727 -762497 -711818 -832043 -924956 -820299
40525 -820299 -718012 -942862 -1339318 -1316204 -679425 -28407 3172 -413819 -632761 -453279
40515 -453279 -215919 -106497 66007 347717 433951 198777 18601 282843 857486 1297583
$$ packed form
40585D5454N5088J15170K76116N24935L36214l40988p89019n33116j3763J18070
40575b05839j21074k62212j03204J64889K99625J79266j57885m27774k87982J91393
40565g30797N03253L51221L1016p4874o3442k28678m72227m23435l6558L19527
40555h24994L53688J40594p8115j38955o770K19949L57484L28922K50559K09314
40545H11676R3182j75806l98180l43365j27175n9117j77796k30150r7344M1906
40535f62169J3720j15807j71328p8600Q7457J64230N0679j20225r2913J04657
40525h20299J02287k24850l96456K3114O36779O51018L1579m16991k18942J79482
40515d53279K37360J09422J72504K81710Q6234k35174j80176K64242N74643M40097
$$ plain form
40505 1297583 1376962 1162025 764502 317349 75561 242424 715073 1207688 1578401 1826224
40495 1826224 1835943 1435436 768215 314961 341872 502804 253413 -379110 -712136 -209690
40485 -209690 814482 1502965 1399625 862292 507159 487712 477196 178079 -389409 -1017167
40475 -1017167 -1482155 -1616722 -1440743 -1231557 -1238695 -1314956 -1079317 -482371 76962 274260
40465 274260 162390 -188307 -917997 -1879987 -2287699 -1469713 102250 1139962 1019048
40456 1019048 429840 335104 764107 1034040 803406 363692 24682 -233839 -432528 -400116
40446 -400116 -131608 16149 -214342 -548602 -521312 -117777 239565 277899 111335 -124056
40436 -124056 -509005 -1044768 -1404705 -1277872 -856386 -708461 -1134806 -1804326 -2071309 -1590049
$$ packed form
40505A297583P9379k14937l97523m47153k41788J66863M72649M92615L70713K47823
40495A826224R719m00507o67221m53254K6911J60932k49391o32523l33026N02446
40485b09690J024172O88483j03340n37333l55133j9447j0516k99117n67488o27758
40475a017167m64988j34567J75979K09186p138p6261K35639N96946N59333J97298
40465B74260j11870l50697p29690r61990m07712Q17986J571963J037712j20914
40456A019048n89208r4736M29003K69933k30634m39714l39010k58521j98689L2412
40446d00116K68508J47757k30491l34260K7290M03535L57342L8334j66564k35391
40436a24056l84949n35763l59937J26833M21486J47925m26345o69520k66983M81260
$$ plain form
40426 -1590049 -636159 115461 177457 -306421 -743123 -748928 -500077 -350454 -320139 -212359
40416 -212359 -85883 -243231 -734986 -1205717 -1327183 -1114478 -717656 -196529 328619 578254
40406 578254 418596 90343 -97771 -154659 -261789 -397729 -386960 -233188 -120167 -109754
40396 -109754 -89116 -3239 99103 242030 487922 696247 579339 96536 -415843 -621249
40386 -621249 -520301 -306234 -62987 218191 427135 349753 -65789 -552879 -704154 -330573
40376 -330573 339144 832347 839038 451365 21371 -148247 16724 336156 463650 183054
40366 183054 -248512 -252932 351741 970317 880989 142962 -515300 -637921 -423608 -155905
40356 -155905 209886 678397 918457 711131 364678 283189 361131 223571 -110750 -276358
$$ packed form
40426a590049R53890P51620O1996m83878m36702n805K48851J49623L0315J07780
40416b12359J26476j57348m91755m70731j21466K12705L96822N21127N25148K49635
40406E78254j59658l28253j88114n6888j07130j35940J0769J53772J13021J0413
40396a09754K0638Q5877J02342J42927K45892K08325j16908m82803n12379k05406
40386f21249J00948K14067K43247K81178K08944p7382m15542m87090j51275L73581
40376c30573O69717M93203O691l87673m29994j69618J64971L19432J27494k80596
40366A83054m31566m420O04673O18576q9328p38027o58262j22621K14313K67703
40356a55905L65791M68511K40060k07326l46453q1489P7942j37560l34321j65608
$$ plain form
40346 -276358 -210342 -284395 -713998 -1232225 -1503928 -1546710 -1537853 -1443387 -1092162 -505862 70745
40335 70745 455086 688811 887669 1032193 988487 732359 477544 492100 791294 1115570
40325 1115570 1236410 1153894 942823 593350 153128 -144685 -124225 71005 201152 315491
40315 315491 607829 936629 877895 350688 -169924 -261505 -81629 -33112 -145652 -122974
40305 -122974 130107 385609 478487 494474 516146 456144 251321 -3239 -247511 -582982
40295 -582982 -1036363 -1373857 -1378662 -1193880 -1123882 -1156337 -991109 -565985 -206711 -102232
40285 -102232 40267 521027 1062692 1103981 611162 187564 290793 673423 761689 345868
40275 345868 -281510 -695329 -684691 -374520 -135662 -242014 -517663 -489096 13072 607347
$$ packed form
40346b76358O6016p4053m29603n18227k71703m2782Q857R4466L51225N86300N76607
40335G0745L84341K33725J98858J44524m3706k56128k54815J4556K99194L24276
40325A115570J20840q2516k11071l49473m40222k97813K0460J95230J30147J14339
40315C15491K92338L28800n8734n27207n20612r1581J79876M8517j12540K2678
40305a22974K53081K55502R2878J5987K1672o0002k04823k54560k44272l35471
40295e82982m53381l37494m805J84782O9998l2455J65228M25124L59274J04479
40285a02232J42499M80760N41665M1289m92819m23598J03229L82630Q8266m15821
40275C45868o27378m13819J0638L10171K38858j06352k75649K8567N02168N94275
$$ plain form
40265 607347 839109 669547 325465 -57822 -380072 -426930 -151946 51004 -241103 -853252
40255 -853252 -1158637 -840438 -182732 398847 794958 1120237 1448998 1688916 1581771 939501
40245 939501 73441 -260082 257979 890513 661606 -304307 -905439 -555265 152928 458066
40235 458066 376400 249903 12274 -509871 -1009111 -1029420 -649350 -347692 -398161 -797344
40225 -797344 -1505152 -2292173 -2624915 -2228669 -1553300 -1169607 -940792 -386686 339575 566348
40215 566348 159832 -248272 -197652 60807 125559 -8213 -146242 -150407 156717 842768
40205 842768 1471748 1406379 712687 204521 323645 559469 335765 -126043 -328691 -351004
40195 -351004 -549500 -801280 -731239 -449015 -377375 -485617 -368571 -47076 -21652 -450480
$$ packed form
40265F07347K31762j69562l44082l83287l22250m6858K74984K02950k92107o12149
40255h53252l05385L18199O57706N81579L96111L25279L28761K39918j07145o42270
40245I39501q66060l33523N18061O32534k28907r65913o01132L50174P08193L05138
40235D58066q1666j26497k37629n22145m99240k0309L80070L01658n0469l99183
40225g97344p07808p87021l32742L96246O75369L83693K28815N54106P26261K26773
40215E66348m06516m08104N0620K58459O4752j33772j38029m165L07124O86051
40205H42768O28980o5369o93692n08166J19124K35824k23704m61808k02648k2313
40195c51004j98496k51780P0041K82224P1640j08242J17046L21495K5424m28828
$$ plain form
40185 -450480 -882958 -972376 -910189 -936706 -918872 -701674 -454714 -331756 -130141 337633
40175 337633 792860 810549 441462 144253 171834 361303 504413 590555 623174 489682
40165 489682 165288 -141339 -218100 -135156 -152616 -371449 -598569 -583070 -302955 39453
40155 39453 257584 323276 266790 57380 -313723 -702848 -919465 -958514 -969717 -961568 -727006
40144 -727006 -193714 312110 376117 21730 -295678 -245919 26532 188746 163089 118714
40134 118714 134684 85905 -128158 -406831 -571860 -579236 -532028 -514870 -479924 -328244 -104582
40123 -104582 -53243 -369782 -877759 -1105541 -802401 -249109 113525 229742 336436 429948
40113 429948 237858 -207735 -412597 -98763 308750 237460 -240004 -591455 -642659 -721757
$$ packed form
40185d50480m32478q9418O2187k6517J7834K17198K46960J22958K01615M67774
40175C37633M55227J7689l69087k97209K7581J89469J43110Q6142L2619j33492
40165D89682l24394l06627p6761Q2944j7460k18833k27120J5499K80115L42408
40155C9453K18131O5692n6486k09410l71103l89125k16617l9049j1203Q149K34562
40144g27006N33292N05824O4007l54387l17408M9759K72451J62214k5657m4375
40134A18714J5970m8779k14063k78673j65029p376M7208J7158L4946J51680K23662
40123a04582N1339l16539n07977k27782L03140N53292L62634J16217J06694R3512
40113D29948j92090m45593k04862L13834M07513p1290m77464l51451n1204p9098
$$ plain form
40103 -721757 -1000539 -1169924 -915903 -371046 75151 172058 -83063 -471027 -599830 -224275
40093 -224275 353178 486846 -51825 -786666 -1157346 -1122915 -953413 -755781 -513151 -336163
40083 -336163 -325867 -346786 -231470 -53384 73396 261610 593219 797367 577361 105908
40073 105908 -220622 -383265 -620381 -814148 -589128 -74574 42350 -541514 -1259198 -1449817
40063 -1449817 -1207831 -1083051 -1261726 -1482722 -1571288 -1607992 -1613131 -1440240 -1049791 -653470
40053 -653470 -513728 -711897 -1102595 -1404797 -1407380 -1194985 -1077181 -1174847 -1215316 -919798
40043 -919798 -453419 -223432 -302612 -365539 -224556 -115649 -303212 -634359 -714247 -424360
40033 -424360 -49221 117712 127969 249865 555259 759123 549270 46786 -195681 235163
$$ packed form
40103g21757k78782j69385K54021N44857M46197R6907k55121l87964j28803L75555
40093b24275N77453J33668n38671p34841l70680L4431J69502J97632K42630J76988
40083c36163J0296k0919J15316J78086J26780J88214L31609K04148k20006m71453
40073A05908l26530j62643k37116j93767K25020N14554J16924n83864p17684j90619
40063a449817K41986J24780j78675k20996q8566l6704n139J72891L90449L96321
40053f53470J39742j98169l90698l02202k583K12395J17804r7666m0469K95518
40043i19798M66379K29987p9180o2927J40983J08907j87563l31147p9888K89887
40033d24360L75139J66933J0257J21896L05394K03864k09853n02484k42467M30844
$$ plain form
40023 235163 1099608 1713639 1691876 1328581 1151255 1242734 1195506 684643 -134325 -836982
40013 -836982 -1129178 -929756 -271759 637755 1360234 1512633 1155151 709086 472221 409647
40003 409647 429879 589860 902171 1168965 1183090 949879 599579 259391 101233 250714
39993 250714 495018 391438 -98902 -422474 -208907 119744 -11411 -400336 -419945 -110535
39983 -110535 -149927 -709841 -1131896 -971666 -643456 -651848 -812466 -723297 -498089 -481538
39973 -481538 -626078 -707763 -843024 -1211955 -1511334 -1288671 -686378 -287772 -305476 -457948
39963 -457948 -576469 -755366 -899237 -720157 -298997 -100996 -251784 -303439 29269 352908
39953 352908 151620 -464478 -906746 -800539 -267930 298020 504709 172748 -482549 -984358
$$ packed form
40023B35163Q64445O14031k1763l63295j77326R1479m7228n10863q18968p02657
40013h36982k92196J99422O57997R09514P22479J52399l57482m46065k36865o2574
40003D09647K0232J59981L12311K66794J4125k33211l50300l40188j58158J49481
39993B50714K44304j03580m90340l23572K13567L28651j31155l88925j9609L09410
39983a10535l9392n59914m22055J60230L28210q392j60618Q9169K25208J6551
39973d81538j44540q1685j35261l68931k99379K22663O02293L98606j7704j52472
39963d57948j18521j78897j43871J79080M21160J98001j50788n1655L32708L23639
39953C52908k01288o16098m42268J06207N32609N65950K06689l31961o55297n01809
$$ plain form
39943 -984358 -1079852 -983753 -1015246 -1166934 -1215877 -1108626 -1006600 -1020121 -1097776 -1165359 -1232612
39932 -1232612 -1350648 -1535344 -1737707 -1885315 -1979132 -2087404 -2149362 -1899370 -1210851 -447285
39922 -447285 -158831 -411314 -747317 -864184 -921710 -1025884 -887261 -355564 97574 -52508
39912 -52508 -542487 -597961 1322 654568 804431 589631 454342 507846 555754 509489
39902 509489 465896 500293 599680 712989 698350 331779 -421228 -1195197 -1491790 -1174007
39892 -1174007 -557344 -22890 294488 422705 379116 227365 171454 377338 701798 779257
39882 779257 457280 29942 -66558 272233 742909 976597 847173 480740 110379 -54502
39872 -54502 47698 259951 338407 209808 19758 -118760 -300460 -629567 -933412 -861813
$$ packed form
39943i84358r5494R6099l1493j51688m8943J07251J02026j3521p7655o7583o7253
39932a232612j18036j84696k02363j47608r3817j08272o1958K49992O88519P63566
39922d47285K88454k52483l36003j16867n7526j04174J38623N31697M53138j50082
39912e2508m89979n5474N99283O53246J49863k14800j35289N3504M7908m6265
39902E09489m3593L4397R9387J13309j4639l66571p53007p73969k96593L17783
39892a174007O16663N34454L17378J28217m3589j51751n5911K05884L24460P7459
39882G79257l21977m27338r6500L38791M70676K33688j29424l66433l70361j64881
39872e4502J02200K12253P8456j28599j90050j38518j81700l29107l03845P1599
$$ plain form
39862 -861813 -301239 451357 1001988 1242452 1315761 1291163 1078030 704857 472266 626251
39852 626251 965346 1017206 630863 167096 16679 155308 327375 448764 574816 620673
39842 620673 433434 109664 -51975 53932 238963 357128 497140 760113 1066015 1288627
39832 1288627 1404781 1411480 1261220 979639 698328 482869 278897 113865 185754 622350
39822 622350 1258132 1748372 1839807 1523078 1048886 783243 857490 956414 676955 107775
39812 107775 -227138 -54893 326010 511285 453944 319980 215668 253024 560571 990294
39802 990294 1119275 803218 432724 369412 445950 338337 99427 -55033 -162850 -278356
39792 -278356 -136599 425960 988573 1069037 901833 1030989 1288476 956588 -31289 -826378
$$ packed form
39862h61813N60574P52596N50631K40464P3309k4598k13133l73173k32591J53985
39852F26251L39095N1860l86343m63767j50417J38629J72067J21389J26052M5857
39842F20673j87239l23770j61639J05907J85031J18165J40012K62973L05902K22612
39832A288627J16154O699j50260k81581k81311k15459k03972j65032P1889M36596
39822F22350O35782M90240R1435l16729m74192k65643P4247R8924k79459n69180
39812A07775l34913J72245L80903J85275n7341j33964j04312L7356L07547M29723
39802I90294J28981l16057l70494o3312P6538j07613k38910j54460j07817j15506
39792b78356J41757N62559N62613Q0464j67204J29156K57487l31888r87877p95089
$$ plain form
39782 -826378 -786632 -192955 388538 821046 1160563 1287470 1175429 1078676 1086854 908459
39772 908459 441263 112946 236515 433907 186191 -365626 -668998 -550105 -255658 74800
39762 74800 441448 632806 404494 -11609 -87519 256082 531693 409592 158292 202269
39752 202269 563013 932909 1074033 949942 606976 108927 -431503 -827470 -848959 -371268
39742 -371268 410205 1005927 1042712 624024 152932 -142529 -341251 -542533 -675682 -649240
39732 -649240 -527255 -451173 -433951 -299361 132755 771954 1235753 1237510 960579 842613
39722 842613 989479 1080622 913818 691327 589879 412000 -36290 -535486 -794771 -947325
39712 -947325 -1273916 -1625963 -1598913 -1167309 -669557 -228154 317414 918830 1291014 1439249
$$ packed form
39782h26378L9746N93677N81493M32508L39517J26907j12041r6753Q178j78395
39772I08459m67196l28317J23569J97392k47716n51817l03372J18893K94447L30458
39762G4800L66648J91358k28312m16103p5910L43601K75611j22101k51300M3977
39752B02269L60744L69896J41124j24091l42966m98049n40430l95967k1489M77691
39742c71268P81473N95722L6785m18688m71092k95461j98722k01282j33149K6442
39732f49240J21985P6082J7222J34590M32116O39199M63799J757k76931j17966
39722H42613J46866R1143j66804k22491j01448j77879m48290m99196k59285j52554
39712i47325l26591l52047K7050M31604M97752M41403N45568O01416L72184J48235
$$ plain form
39702 1439249 1680314 1991269 1870100 1109272 240930 -139446 -127802 -212664 -514536 -741750
39692 -741750 -720891 -552070 -306591 55825 446715 619444 457910 111481 -212206 -449025
39682 -449025 -622464 -692672 -540075 -96996 509466 967895 1005165 635525 159997 -89314
39672 -89314 4212 282212 433624 260622 -84211 -235918 -104535 -32776 -241916 -350755
39662 -350755 131213 941363 1230588 678629 -58014 -219005 176832 591120 709260 567674
39652 567674 244781 -170987 -472229 -525216 -457510 -423465 -364035 -228138 -186873 -325338
39642 -325338 -360964 -35690 403306 505892 248033 -39457 -223198 -396384 -456293 -160879
39632 -160879 381436 756434 850050 967233 1250180 1433057 1348812 1248691 1359071 1483843
$$ packed form
39702A439249K41065L10955j21169p60828q68342l80376J1644q4862l01872k27214
39692g41750K0859J68821K45479L62416L90890J72729j61534l46429l23687k36819
39682d49025j73439p0208J52597M43079O06462M58429L7270l69640m75528k49311
39672h9314R3526K78000J51412j73002l44833j51707J31383P1759k09140j08839
39662c50755M81968Q10150K89225n51959p36643j60991L95837M14288J18140j41586
39652E67674l22893m15768l01242n2987O7706L4045N9430J35897M1265j38465
39642c25338l5626L25274M38996J02586k57859k87490j83741j73186n9909K95414
39632a60879N42315L74998R3616J17183K82947J82877q4245j00121J10380J24772
$$ plain form
39622 1483843 1367931 1184235 1294513 1657996 1804785 1391009 579252 -146118 -439074
39613 -439074 -378263 -333096 -512739 -706275 -618327 -389184 -483445 -1010657 -1488378 -1461137
39603 -1461137 -1073693 -772566 -660798 -485052 -159866 60395 3217 -83144 221930 993804
39593 993804 1793583 2034101 1513628 588596 -180985 -512663 -498695 -342564 -178829 -123056
39583 -123056 -266623 -527174 -656741 -501064 -158899 163124 347881 401278 421936 541850
39573 541850 734406 702036 197997 -521188 -865001 -624578 -218346 -93069 -212386 -342313
39563 -342313 -487742 -712102 -804732 -543222 -138619 -31422 -315074 -678336 -833929 -703107
39553 -703107 -301317 193867 356902 -89048 -811159 -1197613 -1142581 -1086967 -1263166 -1382172
$$ packed form
39622A483843j15912j83696J10278L63483J46789m13776q11757p25370k92956
39613d39074O0811M5167j79643j93536Q7948K29143r4261n27212m77721K7241
39603a461137L87444L01127J11768J75746L25186K20261n7178q6361L05074P71874
39593I93804P99779K40518n20473r25032p69581l31678J3968J56131J63735N5773
39583a23056j43567k60551j29567J55677L42165L22023J84757N3397K0658J19914
39573E41850J92556l2370n04039p19185l43813K40423M06232J25277j19317j29927
39563c42313j45429k24360r2630K61510M04603J07197k83652l63262j55593J30822
39553g03107M01790M95184J63035m45950p22111l86454N5032N5614j76199j19006
$$ plain form
39543 -1382172 -1197957 -904955 -730029 -534756 -142726 242330 289927 20403 -267550 -401144
39533 -401144 -415005 -366844 -310325 -337390 -438362 -434902 -242454 -67007 -141385 -400211 -626490
39522 -626490 -787556 -996950 -1255644 -1457038 -1548681 -1491014 -1205448 -800256 -662507 -991179
39512 -991179 -1378350 -1254415 -684008 -285422 -349139 -503154 -375669 -126599 -52784 -36615
39502 -36615 233531 692403 922394 710044 313973 165453 462958 1048832 1552937 1670857
39492 1670857 1407377 1048553 858420 861110 943923 1041535 1124776 1126810 1013705 859508 745303
39481 745303 653164 552386 499437 538365 590168 573575 561910 675657 874007 1002866 1014740
39470 1014740 985486 919130 696754 280885 -122305 -188548 219635 865437 1280372 1168660
$$ packed form
39543a382172J84215K93002J74926J95273L92030L85056M7597k69524k87953j33594
39533d01144j3861M8161N6519k7065j00972L460J92448J75447p4378k58826k26279
39522f26490j61066k09394k58694k01394r1643N7667K85566M05192J37749l28672
39512i91179l87171J23935N70407L98586o3717j54015J27485K49070P3815J6169
39502c6615K70146M58872K29991k12350l96071j48520K97505N85874N04105J17920
39492A670857k63480l58824j90133K690Q2813R7612Q3241K034j13105j54197j14205
39481G45303r2139j00778n2949L8928N1803j6593j1665J13747J98350J28859J1874
39470A014740k9254o6356k22376m15869m03190o6243M08183O45802M14935j11712
$$ plain form
39460 1168660 679454 207472 -34682 -87327 62295 535557 1197755 1582136 1453427 1176915
39450 1176915 1175923 1256743 942736 348512 149112 613808 1212818 1395996 1295055 1339878
39440 1339878 1556311 1642283 1500817 1297108 1108949 863448 554948 255439 -9277 -153224
39430 -153224 51366 624930 1078267 885274 249459 -46118 335036 829572 776631 311516
39420 311516 99758 392592 763263 762742 477980 309857 424287 614366 625285 446390
39410 446390 253006 159606 120869 72284 83183 294200 718472 1177017 1449468 1442041 1202952
39399 1202952 851637 549160 482725 768094 1311102 1800915 1922799 1631332 1189226 884634
39389 884634 736885 561602 291329 61787 -73762 -316381 -827000 -1384527 -1576512 -1302205
$$ packed form
39460A168660m89206m71982k42154n2645J49622M73262O62198L84381j28709k76512
39450A176915r92Q0820l14007n94224j99400M64696N99010J83178j00941M4823
39440A339878K16433Q5972j41466k03709j88159k45501l08500k99509k64716j43947
39430a53224K04590N73564M53337j92993o35815k95577L81154M94536n2941m65115
39420C11516k11758K92834L70671n21k84762j68123J14430J90079J0919j78895
39410D46390j93384r3400l8737m8585J0899K11017M24272M58545K72451p427k39089
39399A202952l51315l02477o6435K85369N43008M89813J21884k91467m42106l04592
39389H84634j47749j75283k70273k29542j35549k42619n10619n57527j91985K74307
$$ plain form
39379 -1302205 -861445 -531453 -287296 -6852 281036 492776 648598 761923 718246 473758
39369 473758 276350 441918 917319 1287175 1268985 1024707 905497 1049832 1354475 1710401
39359 1710401 2085345 2415900 2601933 2653150 2715794 2886926 3091922 3213672 3247988 3218689
39349 3218689 3009673 2450657 1590220 744609 208418 -1188 -71245 -156093 -263552 -291914
39339 -291914 -134594 165804 350888 183397 -198643 -362103 -127297 187040 258365 253752
39329 253752 501665 857829 860677 495127 305252 594478 948544 833820 349248 45224
39319 45224 192761 562446 822139 865264 799140 840631 1169048 1673080 1912339 1560335
39309 1560335 852023 384580 502789 1060616 1705701 2140155 2144834 1671862 1001393 554875
$$ packed form
39379a302205M40760L29992K44157K80444K87888K11740J55822J13325m3677k44488
39369D73758j97408J65568M75401L69856j8190k44278j19210J44335L04643L55926
39359A710401L74944L30555J86033N1217O2644J71132K04996J21750L4316k9299
39349C218689k09016n59016q60437q45611n36191k09606p0057q4848j07459k8362
39339b91914J57320L00398J85084j67491l82040j63460K34806L14337P1325m613
39329B53752K47913L56164K848l65550j89875K89226L54066j14724m84572l04024
39319D5224J47537L69685K59693M3125o6124M1491L28417N04032K39259l52004
39309A560335p08312m67443J18209N57827O45085M34454M679m72972o70469m46518
$$ plain form
39299 554875 427848 293694 -113587 -594395 -720260 -387374 9117 -36079 -599210 -1173443
39289 -1173443 -1129023 -420245 263389 228238 -421060 -954501 -931996 -588360 -254563 155055
39279 155055 785040 1315068 1265131 724879 333529 463796 774568 718218 209776 -419822
39269 -419822 -922214 -1286595 -1478199 -1356344 -963536 -659988 -752396 -1087839 -1247476 -1129440
39259 -1129440 -1084122 -1369866 -1709132 -1615091 -1041488 -449754 -247495 -389071 -563131 -570022
39249 -570022 -444838 -366773 -502029 -793424 -899530 -555167 -18459 129400 -258225 -652543
39239 -652543 -577429 -262752 -233717 -504426 -637556 -482957 -348667 -420164 -516022 -561464
39229 -561464 -817258 -1359402 -1739401 -1538317 -957744 -454275 -53337 460150 843373 551722
$$ packed form
39299E54875j27027j34154m07281m80808j25865L32886L96491m5196n63131n74233
39289a173443M4420P08778O83634l5151o49298n33441K2505L43636L33797M09618
39279A55055O29985N30028m9937n40252l91350J30267L10772n6350n08442o29598
39269d19822n02392l64381j91604J21855L92808L03548r2408l35443j59637J18036
39259a129440M5318k85744l39266R4041N73603N91734K02259j41576j74060o891
39249e70022J25184P8065j35256k91395j06106L44363N36708J47859l87625l94318
39239f52543P5114L14677K9035k70709j33130J54599J34290p1497r5858m5442
39229e61464k55794n42144l79999K01084N80573N03469M00938N13487L83223k91651
$$ plain form
39219 551722 -314628 -846193 -435746 392701 670631 171162 -553030 -1072896 -1437118 -1648624
39209 -1648624 -1384912 -486815 656232 1495929 1867147 1916465 1732436 1345285 937819
39200 937819 725565 658204 496768 179790 -104517 -195156 -81494 245488 798981 1375588
39190 1375588 1575319 1214790 586024 142468 -3333 -137673 -537301 -1119620 -1524927
39181 -1524927 -1497182 -1140652 -774871 -565024 -407718 -232526 -254357 -726421 -1503302 -2080160
39171 -2080160 -2103369 -1675959 -1138480 -734669 -537748 -505354 -498357 -376643 -156244 32043
39161 32043 151396 262823 319047 196548 -4055 40122 439463 911228 1194403 1381134
39151 1381134 1615942 1725337 1455034 898907 377043 15532 -251997 -398705 -369799 -347852
$$ packed form
39219E51722q66350n31565M10447Q28447K77930m99469p24192n19866l64222k11506
39209a648624K63712Q98097J143047Q39697L71218M9318j84029l87151m07466
39200I37819k12254o7361j61436l16978k84307r0639J13662L26982N53493N76607
39190A375588J99731l60529o28766m43556j45801j34340l99628n82319m05307
39181a524927K7745L56530L65781K09847J57306J75192k1831m72064p76881n76858
39171b080160k3209M27410N37479M03811J96921L2394O997J21714K20399J88287
39161C2043J19353J11427N6224j22499k00603M4177L99341M71765K83175J86731
39151A381134K34808J09395k70303n56127n21864l61511k67529j46708K8906K1947
$$ plain form
39141 -347852 -581698 -970924 -1166719 -1076036 -908172 -726556 -383368 18708 65101 -344428
39131 -344428 -704185 -554199 -126720 9864 -273044 -645939 -953165 -1413743 -2130129 -2762693
39121 -2762693 -2893309 -2526828 -2046301 -1759398 -1651477 -1564151 -1451824 -1360112 -1223410 -855900
39111 -855900 -225995 363988 516087 147343 -426159 -789128 -731979 -341148 55341 92347
39101 92347 -274006 -630971 -557444 -197891 -103561 -463043 -850103 -899068 -854615 -1116962
39091 -1116962 -1516664 -1494756 -912228 -236927 123536 291537 580996 1001563 1324126 1441885
39081 1441885 1420140 1284319 999210 657337 482082 558589 692885 662386 533427 558673
39071 558673 741719 702758 141750 -675705 -1133682 -980075 -600907 -483480 -594767 -472355
$$ packed form
39141c47852k33846l89226j95795R0683J67864J81616L43188M02076M6393m09529
39131c44428l59757J49986M27479J36584k82908l72895l07226m60578p16386o32564
39121b762693j30616L66481M80527K86903J07921Q7326J12327R1712J36702L67510
39111h55900O29905N89983J52099l68744n73502l62969N7149L90831L96489L7006
39101I2347l66353l56965P3527L59553R4330l59482l87060m8965M4453k62347
39091a116962l99702K1908N82528O75301L60463J68001K89459M20567L22563J17759
39081A441885k1745j35821k85109l41873j75255P6507J34296l0499j28959K5246
39071E58673J83046l8961n61008q17455m57977J53607L79168J17427j11287J22412
$$ plain form
39061 -472355 156314 1026913 1616660 1666469 1392896 1199640 1193647 1063638 524285 -227914
39051 -227914 -726783 -862660 -977049 -1253963 -1367565 -951332 -121600 744242 1481633 2042763
39041 2042763 2176853 1690020 928465 509279 544970 576474 323368 16871 -155288 -425042
39031 -425042 -951958 -1367033 -1237357 -738203 -425712 -473185 -556362 -453852 -340421 -403926
39021 -403926 -529024 -539123 -498019 -547020 -594725 -416788 -33540 226130 106424 -262603
39011 -262603 -535745 -558076 -470982 -442944 -459559 -433374 -361143 -245602 4288 398040 659758
39000 659758 435245 -271504 -1050308 -1502970 -1547385 -1306607 -925923 -572230 -397306 -376525
38990 -376525 -334370 -201315 -60885 105035 428841 780554 720402 115808 -477284 -445546
$$ packed form
39061d72355O28669Q70599N89747M9809k73573j93256n993j30009n39353p52199
39051b27914m98869j35877j14389k76914j13602M16233Q29732Q65842P37391N61130
39041B042763J34090m86833p61555m19186L5691L1504k53106l06497j72159k69754
39031d25042n26916m15075J29676M99154L12491m7473q3177J02510J13431o3505
39021d03926j25098j0099M1104m9001m7705J77937L83248K59670j19706l69027
39011b62603k73142k2331Q7094K8038j6615K6185P2231J15541K49890L93752K61718
39000F59758k24513p06749p78804m52662m4415K40778L80684L53693J74924K0781
38990c76525M2155J33055J40430J65920L23806L51713o0152o04594n93092L1738
$$ plain form
38980 -445546 48184 310533 119478 -12662 345727 923268 1155581 892233 445965 157658
38970 157658 138099 276648 311250 36175 -393718 -541364 -261720 5350 -197353 -634687
38960 -634687 -613392 81934 853221 1015623 587341 169423 216806 635975 1027676 1143308
38950 1143308 1082804 1125662 1390801 1676810 1702257 1489308 1365202 1527597 1767221 1748929
38940 1748929 1436613 1062951 769115 493589 196185 -30221 -116148 -101736 -10071 192021
38930 192021 434662 532959 459552 465620 756992 1161537 1309772 1088966 738674 520232
38920 520232 460237 430958 341030 207738 126416 184134 358115 546265 751786 1116764
38910 1116764 1635365 1961198 1731244 1029799 300011 -160594 -345796 -227659 297895
$$ packed form
38980d45546M93730K62349j91055j32140L58389N77541K32313k63348m46268k88307
38970A57658j9559J38549L4602k75075m29893j47646K79644K67070k02703m37334
38960f34687K1295O95326P71287J62402m28282m17918M7383M19169L91701J15632
38950A143308o0504M2858K65139K86009K5447k12949j24106J62395K39624j8292
38940A748929l12316l73662k93836k75526k97404k26406q5927J4412R1665K02092
38930A92021K42641R8297p3407O068K91372M04545J48235k20806l50292k18442
38920E20232n9995k9279q9928j33292q1322N7718J73981J88150K05521L64978
38910A116764N18601L25833k29954p01445p29788m60605j85202J18137N25554
$$ plain form
38901 297895 1020542 1355059 973922 282339 -33366 208016 618809 841892 896887 954097
38891 954097 1061676 1171223 1238709 1228545 1150283 1124762 1283281 1565285 1728672 1597922
38881 1597922 1222271 782957 427818 194187 16671 -173826 -298552 -152702 303230
38872 303230 746656 759096 272241 -398364 -930257 -1226494 -1298847 -1156607 -877991 -602059
38862 -602059 -364124 -95470 151209 177056 -36429 -165079 89643 571883 819312 610163
38852 610163 188383 -60015 -3484 193443 297100 208261 13432 -109864 -75781 2886
38842 2886 -57830 -270734 -450616 -466952 -404779 -366159 -231931 156201 605762 662393 214604
38831 214604 -256161 -265725 47212 208150 149337 211957 441020 416702 -33684 -446806
$$ packed form
38901B97895P22647L34517l81137o91583l15705K41382M10793K23083N4995N7210
38891I54097J07579J09547O7486j0164p8262k5521J58519K82004J63387j30750
38881A597922l75651m39314l55139k33631j77516j90497j24726J45850M55932
38872C03230M43426J2440m86855o70605n31893k96237p2353J42240K78616K75932
38862f02059K37935K68654K46679K5847k13485j28650K54722M82240K47429k09149
38852F10163m21780k48398N6531J96927J03657q8839j94829j23296L4083P8667
38842B886o0716k12904j79882j6336O2173L8620J34228L88132M49561N6631m47789
38831B14604m70765r564L12937J60938n8813O2620K29063k4318m50386m13122
$$ plain form
38821 -446806 -384499 -111517 -198296 -699208 -1154618 -1246725 -1042574 -712766 -429698 -461222
38811 -461222 -935523 -1537465 -1823923 -1794267 -1747770 -1664197 -1252305 -616987 -291008 -464302
38801 -464302 -730823 -795288 -875075 -1122838 -1210011 -894311 -525784 -506564 -635312 -512110
38791 -512110 -280617 -389819 -810017 -1051457 -871235 -455990 31103 579088 1016405 1067443
38781 1067443 804386 634373 744612 914738 958414 997539 1178109 1418748 1584586 1684369
38771 1684369 1780806 1869907 1896915 1756612 1332441 723541 317178 355397 541410 425907
38761 425907 87295 -1106 265781 497227 498005 566263 922122 1292545 1300517 907067 285483
38750 285483 -356967 -655741 -251590 634388 1209062 1027822 531442 338381 443521 565673
$$ packed form
38821d46806O2307K72982q6779n00912m55410r2107K04151L29808K83068l1524
38811d61222m74301o01942k86458K9656M6497Q3573M11892O35318L25979j73294
38801d64302k66521o4465p9787k47763q7173L15700L68527J9220j28748J23202
38791e12110K31493j09202m20198k41440J80222M15245M87093N47985M37317N1038
38781A067443k63057j70013J10239J70126M3676L9125J80570K40639J65838R9783
38771A684369R6437Q9101K7008j40303m24171o08900m06363L8219J86013j15503
38761D25907l38612q8401K66887K31446P78O8258L55859L70423P972l93450o21584
38750B85483o42450k98774M04151Q85978N74674j81240m96380j93061J05140J22152
$$ plain form
38740 565673 844815 1544475 2322211 2510495 2077416 1674302 1674122 1736160 1459573 948098
38730 948098 497641 144029 -191191 -392651 -269061 176499 775765 1367854 1826354 2042854
38720 2042854 1977839 1650408 1103206 525592 312833 697101 1333651 1612658 1444810 1350327
38710 1350327 1631812 1886362 1618803 961275 383224 -34758 -546860 -1098120 -1269105
38701 -1269105 -928911 -497392 -373132 -427043 -291344 88220 455757 666565 833965 1070545
38691 1070545 1290934 1322932 1092454 654056 130014 -330621 -600441 -648029 -549049 -396549
38681 -396549 -223419 -32243 143060 263834 365584 549842 867722 1236762 1501892 1576468
38671 1576468 1511116 1424499 1377128 1333225 1266343 1277096 1523992 1988946 2379493 2366192 1910763
$$ packed form
38740E65673K79142O99660P77736J88284m33079m03114j80O2038k76587n11475
38730I48098m50457l53612l35220k01460J23590M45560N99266N92089M58500K16500
38720B042854o5015l27431n47202n77614k12759L84268O36550K79007j67848r4483
38710A350327K81485K54550k67559o57528n78051m17982n12102n51260j70985
38701a269105L40194M31519J24260n3911J35699L79564L67537K10808J67400K36580
38691A070545K20389L1998k30478m38398n24042m60635k69820m7588R8980J52500
38681c96549J73130J91176J75303J20774J01750J84258L17880L69040K65130P4576
38671A576468o5352q6617m7371m3903o6882J0753K46896M64954L90547j3301m55429
$$ plain form
38660 1910763 1284607 787609 554356 611506 937301 1373931 1631663 1544839 1272096 1103842
38650 1103842 1088566 978641 573127 20323 -285863 -104049 380863 717048 661303 450363
38640 450363 482960 762171 875967 614528 337738 466249 788196 671300 -18162 -602578
38630 -602578 -401377 418128 1085145 1177805 1002550 1022112 1236662 1322392 1179048 1043490
38620 1043490 1083420 1166360 1147652 1151772 1345361 1585355 1581107 1337257 1109164 916691 486759
38609 486759 -194496 -662018 -565900 -168134 80135 183230 422267 753242 877421 809897
38599 809897 855874 1018567 961686 667016 608427 1051310 1634540 1929563 2006119 2104700
38589 2104700 2119542 1842739 1468992 1396856 1653248 1913591 2006408 2030937 2040195 1962905 1800935
$$ packed form
38660A910763o26156m96998k33253N7150L25795M36630K57732q6824k72743j68254
38650A103842j5276j09925m05514n52804l06186J81814M84912L36185n5745k10940
38640D50363L2597K79211J13796k61439k76790J28511L21947j16896o89462n84416
38630f02578K01201Q19505O67017R2660j75255J9562K14550Q5730j43344j35558
38620A043490L9930Q2940j8708M120J93589K39994m248k43850k28093j92473m29932
38609D86759o81255m67522R6118L97766K48269J03095K39037L30975J24179o7524
38599H09897M5977J62693n6881k94670n8589M42883N83230K95023P6556R8581
38589B104700J4842k76803l73747p2136K56392K60343R2817K4529R258p7290j61970
$$ plain form
38578 1800935 1578130 1156935 470896 -116628 -130716 294611 465920 40373 -534243 -695941
38568 -695941 -479863 -247700 -59611 255009 604912 685507 488137 353378 443561 494797
38558 494797 240275 -162763 -316904 -65233 365854 634357 592835 406368 454649 1031329
38548 1031329 2008101 2838404 3035384 2659473 2229366 2145563 2328624 2464128 2444966 2425272
38538 2425272 2521421 2654215 2714341 2734043 2817100 2990291 3195751 3355201 3373522 3167019
38528 3167019 2798367 2521457 2546214 2759123 2811796 2526538 2096952 1816901 1723427 1646770
38518 1646770 1560479 1680090 2126556 2649187 2892856 2914613 3186493 3955779 4797225 5051913
38508 5051913 4639966 4148755 4071254 4252476 4266418 4099594 4149158 4613148 5196977 5515412
$$ packed form
38578A800935k22805m21195o86039n87524j4088M25327J71309m25547n74616j61698
38568f95941K16078K32163J88089L14620L49903Q0595j97370j34759R0183N1236
38558D94797k54522m03038j54141K51671M31087K68503m1522j86467M8281N76680
38548A031329R76772Q30303J96980l75911m30107q3803J83061J35504j9162j9694
38538B425272R6149J32794O0126J9702Q3057J73191K05460J59450J8321k06503
38528C167019l68652k76910K4757K12909N2673k85258m29586k80051r3474p6657
38518A646770q6291J19611M46466N22631K43669K1757K71880P69286Q41446K54688
38508E051913m11947m91211p7501J81222J3942j66824M9564M63990N83829L18435
$$ plain form
38498 5515412 5579133 5730523 6186309 6787205 7205352 7311133 7279674 7360501 7625787 7996784
38488 7996784 8431289 8932002 9386581 9607540 9612020 9659140 9856568 9922383 9575332 9015708
38478 9015708 8703276 8711723 8647428 8243753 7685982 7223003 6799000 6302043 5892711 5763309
38468 5763309 5755312 5573945 5282397 5193776 5278378 5098012 4473079 3852847 3766953 4169830
38458 4169830 4628658 4960448 5312360 5716081 5992721 6135558 6363869 6644268 6571147 6022517
38448 6022517 5593079 5934318 6853079 7558998 7751403 7926779 8495825 9119998 9248067
38439 9248067 8951429 8823199 9227442 10001949 10792002 11338362 11486583 11250127 10917570
38430 10917570 10853437 11126675 11503576 11823475 12199833 12820004 13711520 14747315 15757260
$$ packed form
38498E515412O3721J51390M55786O00896M18147J05781l1459Q0827K65286L70997
38488G996784M34505N00713M54579K20959M480M7120J97428O5815l47051n59624
38478I015708l12432Q447o4295m03675n57771m62979m24003m96957m09332j29402
38468E763309p997j81367k91548q8621Q4602j80366o24933o20232q5894M02877
38458D169830M58828L31790L51912M03721K76640J42837K28311K80399p3121n48630
38448F022517m29438L41239R18761P05919J92405J75376N69046O24173J28069
38439I248067k96638j28230M04243P74507P90053N46360J48221k36456l32557
38430A0917570o4133K73238L76901L19899L76358O20171Q91516J035795J009945
$$ plain form
38421 15757260 16628083 17417846 18354500 19588889 20996289 22386298 23833929 25554955
38413 25554955 27484056 29293560 30919060 32785014 35343831 38596268 42241915 46130063
38405 46130063 50347380 54964591 59940579 65310369 71321349 78299184 86413392 95639463
38397 95639463 105984250 117694734 131126154 146417918 163523995 182673625 204532386
38390 204532386 229623803 257771134 288429385 321323078 356105851 391201289 423387074
38383 423387074 448759939 463980047 466861184 456740484 435011754 405031243 370829864
38376 370829864 335639116 301499807 269696718 240971741 215427874 192735959 172565320
38369 172565320 154667829 138731921 124530631 112148919 101695766 92800323 84755218
$$ packed form
38421A5757260Q70823P89763R36654J234389J407400J390009J447631J721026
38413B5554955J929101J809504J625500J865954K558817L252437L645647L888148
38405D6130063M217317M617211M975988N369790O010980O977835Q114208R226071
38397I5639463J0344787J1710484J3431420J5291764J7106077J9149630K1858761
38390B04532386K5091417K8147331L0658251L2893693L4782773L5095438L2185785
38383D23387074K5372865J5220108K881137j0120700k1728730k9980511l4201379
38376C70829864l5190748l4139309l1803089k8724977k5543867k2691915k0170639
38369A72565320j7897491j5935908j4201290j2381712j0453153q895443q045105
$$ plain form
38362 84755218 77218645 70459764 64812095 60149771 56024541 52102137 48314960 44724776
38354 44724776 41386528 38322984 35570144 33207490 31261581 29569426 27896557 26261306
38346 26261306 24929956 23949284 22937052 21579642 20099344 18906737 17999700 17093164
38338 17093164 16158994 15363054 14589172 13587003 12592717 12209477 12524223 12881419 12759911
38329 12759911 12380496 12153742 11997087 11608180 11056596 10632862 10312216 9802029 9032523
38320 9032523 8259725 7733361 7510752 7510793 7528489 7314084 6864641 6502517 6429544 6371519 5969120
38309 5969120 5383270 5140651 5412048 5796303 5865155 5628406 5376277 5295638 5348607 5376978
38299 5376978 5244791 4963287 4687574 4528527 4448031 4444266 4685474 5233886 5756216 5819891
$$ packed form
38362H4755218p536573o758881n647669m662324m125230l922404l787177l590184
38354D4724776l338248l063544k752840k362654j945909j692155j672869j635251
38346B6261306j331350r80672j012232j357410j480298j192607r07037r06536
38338A7093164r34170p95940p73882j002169r94286l83240L14746L57196j21508
38329A2759911l79415k26754j56655l88907n51584m23734l20646n10187p69506
38320I032523p72798n26364k22609M1J7696k14405m49443l62124p2973n8025m02399
38309E969120n85850k42619K71397L84255O8852k36749k52129q0639N2969K8371
38299E376978j32187k81504k75713j59047q0496l765K41208N48412N22330O3675
$$ plain form
38289 5819891 5459847 5153887 5208446 5461815 5660731 5822807 6070684 6353890 6540102 6633003
38279 6633003 6727850 6858680 7022743 7251952 7541178 7806342 8016169 8247064 8493816 8556496
38269 8556496 8263334 7698331 7056173 6388710 5692175 5144846 4984009 5136760 5219411 4971614
38259 4971614 4482126 3909810 3239513 2512690 2083395 2298960 2944225 3320232 2998124
38250 2998124 2289005 1823785 1830153 2002524 1975665 1720615 1501240 1599112 2057813 2559163
38240 2559163 2606675 2023512 1247239 918473 1171716 1565629 1732535 1786375 1964053 2190142
38230 2190142 2260858 2215415 2189618 2056014 1588836 933187 519874 465370 429148 205707
38220 205707 100981 443844 973879 1091577 654709 176685 154554 469556 624646 405615
$$ packed form
38289E819891l60044l05960N4559K53369J98916J62076K47877K83206J86212R2901
38279F633003R4847J30830J64063K29209K89226K65164K09827K30895K46752O2680
38269H556496k93162n65003o42158o67463o96535n47329j60837J52751Q2651k47797
38259D971614m89488n72316o70297p26823m29295K15565O45265L76007l22108
38250B998124p09119m65220O368J72371k6859k55050k19375R7872M58701N01350
38240B559163M7512n83163p76273l28766K53243L93913J66906N3840J77678K26089
38230B190142P0716m5443k5797j33604m67178o55649m13313n4504l6222k23441
38220B05707j04726L42863N30035J17698m36868m78024k2131L15002J55090k19031
$$ plain form
38210 405615 83204 13437 255964 628305 953080 1139782 1149469 1024936 891864 806439
38200 806439 669948 426234 245292 304274 458236 407181 184481 150631 417206 629726
38190 629726 521113 351036 483705 785227 838056 611859 485422 612834 687802 464973
38180 464973 194891 327764 932799 1564390 1658873 1046792 160227 -294146 4832 689398
38170 689398 1174917 1315886 1361023 1375399 1106947 504660 3514 69104 660220 1323065
38160 1323065 1656266 1528567 1015768 357041 -84572 -25966 494310 1105339 1369136 1143335
38150 1143335 756699 729332 1185395 1658874 1679130 1399074 1310057 1432081 1255293 555776
38140 555776 -202663 -492168 -355043 -157832 -60152 -34847 -120084 -298979 -335780 -59599
$$ packed form
38210D05615l22411o9767K42527L72341L24775J86702R687j24533j33072q5425
38200H06439j36491k43714j80942N8982J53962n1055k22700l3850K66575K12520
38190F29726j08613j70077J32669L01522N2829k26197j26437J27412P4968k22829
38180D64973k70082J32873O05035O31591R4483o12081q86565m54373K98978O84566
38170F89398M85519J40969M5137J4376k68452o02287n01146O5590N91116O62845
38160A323065L33201j27699n12799o58727m41613N8606N20276O11029K63797k25801
38150A143335l86636k7367M56063M73479K0256k80056q9017J22024j76788o99517
38140E55776p58439k89505J37125J97211R7680K5305q5237j78895l6801K76181
$$ plain form
38130 -59599 344880 596314 685260 742684 783850 869905 1246007 1951926 2558253 2708871
38120 2708871 2660319 2786376 2824887 2285641 1449335 1160241 1556057 1791904 1280712 490839
38110 490839 123172 140135 146493 218798 686636 1365237 1656354 1342029 773118 300608
38100 300608 -36648 -253208 -258029 -43655 244146 473259 547886 309555 -302244 -1003701
38090 -1003701 -1376689 -1355485 -1240015 -1206642 -1103006 -797923 -440880 -236051 -183107 -177246
38080 -177246 -178557 -161666 -75568 28026 366 -146957 -160049 146913 656522 1150127 1557807
38069 1557807 1837551 1810132 1387967 851273 589243 582506 420166 -128407 -809674 -1241100
38059 -1241100 -1347798 -1298003 -1167929 -873103 -392384 93915 325132 175417 -240954 -649380
$$ packed form
38130e9599M04479K51434Q8946N7424M1166Q6055L76102P05919O06327J50618
38120B708871m8552J26057L8511n39246q36306k89094L95816K35847n11192p89873
38110D90839l67667J6963O358P2305M67838O78601K91117l14325n68911m72510
38100C00608l37256k16560m821K14374K87801K29113P4627k38331o11799p01457
38090a003701l72988K1204J15470L3373J03636L05083L57043K04829N2944N861
38080a77246j311J6891Q6098J03594k7660j47323j3092L06962N09609M93605M07680
38069A557807K79744k7419m22165n36694k62030o737j62340n48573o81267m31426
38059a241100j06698M9795J30074K94826M80719M86299K31217j49715m16371m08426
$$ plain form
38049 -649380 -824710 -742428 -503814 -153498 319011 802495 1061649 1002672 801738 651488
38039 651488 532493 424018 589539 1317593 2365310 3001442 2781271 2066397 1593887
38030 1593887 1708273 2217216 2811232 3306604 3558262 3503313 3358583 3465027 3798033 3888895
38020 3888895 3416195 2663108 2164228 2064838 2086626 1999424 1810720 1530396 1098025 632098
38010 632098 455944 701715 1084597 1242924 1151988 1035572 1011022 1019206 997709 907946 666479
37999 666479 285815 44961 249579 776821 1111158 954889 609278 586554 966858 1312382
37989 1312382 1176975 578839 -22766 -162639 188332 589078 589307 213325 -132321 -210910
37979 -210910 -186943 -239988 -243084 -59024 78844 -163530 -674325 -1002014 -1019208 -1105179 -1544648
$$ packed form
38049f49380j75330Q2282K38614L50316M72509M83484K59154n8977k00934j50250
38039F51488j18995j08475J65521P28054J047717O36132k20171p14874m72510
38030A593887J14386N08943N94016M95372K51658n4949j44730J06444L33006R0862
38020C888895m72700p53087m98880r9390K1788q7202j88704k80324m32371m65927
38010F32098j76154K45771L82882J58327r0936j16416k4550Q184k1497q9763k41467
37999F66479l80664k40854K04618N27242L34337j56269l45611k2724L80304L45524
37989A312382j35407n98136o01605j39873L50971M00746K29l75982l45646p8589
37979b10910K3967n3045l096J84060J37868k42374n10795l27689j7194q5971m39469
$$ plain form
37968 -1544648 -2074478 -2250787 -2038431 -1775607 -1679807 -1646722 -1508666 -1274779 -1058206 -881283
37958 -881283 -627869 -183894 385699 842456 1021610 1033805 1102957 1237771 1245140 1068191
37948 1068191 865547 678696 296218 -366910 -989463 -1199062 -1051414 -905399 -967463 -1242203
37938 -1242203 -1781003 -2573190 -3213658 -3123322 -2260251 -1289459 -846265 -873541 -887272 -663091
37928 -663091 -378382 -214677 -140693 -92114 -105277 -182724 -200712 -80234 40909 -44453 -291683
37917 -291683 -371209 -66421 371041 461148 135113 -92040 218642 773497 872923 348245
37907 348245 -211266 -280963 -82789 -171717 -604604 -903263 -751687 -351397 -42381 108431
37897 108431 215078 320814 422330 587763 864269 1155672 1343791 1447703 1498354 1338438
$$ packed form
37968a544648n29830j76309K12356K62824R5800L3085J38056K33887K16573J76923
37958h81283K53414M43975N69593M56757J79154J2195O9152J34814P369j76949
37948A068191k02644j86851l82478o63128o22553k09599J47648J46015o2064k74740
37938a242203n38800p92187o40468R0336Q63071R70792M43194k7276j3731K24181
37928f63091K84709J63705P3984M8579j3163p7447j7988J20478J21143q5362k47230
37917b91683p9526L04788M37462R0107l26035k27153L10682N54855R9426n24678
37907C48245n59511o9697J98174q8928m32887k98659J51576M00290L09016J50812
37897A08431J06647J05736J01516J65433K76506K91403J88119J03912N0651j59916
$$ plain form
37887 1338438 788553 35093 -382402 -102592 671717 1431319 1875884 2034622 2009756 1836350
37877 1836350 1571965 1300431 1004474 619301 260991 200719 512989 933684 1201185 1367886
37867 1367886 1600621 1826220 1807881 1489669 1029364 530004 -16762 -507026 -688957 -455370
37857 -455370 -22670 288474 382868 452977 756503 1325960 1857585 1960262 1595402 1149756
37847 1149756 929769 751253 302403 -219512 -249689 335663 978239 1178505 1106239 1194238
37837 1194238 1413221 1321911 711017 -140668 -827896 -1173946 -1217744 -1074109 -881576 -771207
37827 -771207 -820165 -1030799 -1291006 -1349266 -994489 -356661 143109 291658 359862 671914
37817 671914 1064405 1084634 667434 273820 279941 500763 481995 108269 -251115 -166972
$$ packed form
37887A338438n49885p53460m17495K79810P74309P59602M44565J58738k4866j73406
37877A836350k64385k71534k95957l85173l58310o0272L12270M20695K67501J66701
37867A367886K32735K25599j8339l18212m60305m99360n46766m90264j81931K33587
37857d55370M32700L11144R4394P0109L03526N69457N31625J02677l64860m45646
37847A149756k19987j78516m48850n21915l0177N85352O42576K00266p2266Q7999
37837A194238K18983r1310o10894q51685o87228l46050m3798J43635J92533J10369
37827g71207m8958k10634k60207n8260L54777O37828M99770J48549O8204L12052
37817F71914L92491K0229m17200l93614O121K20822j8768l73726l59384Q4143
$$ plain form
37807 -166972 370130 898506 909148 349901 -306687 -529800 -225505 264121 559600 539642
37797 539642 317340 77571 -54862 -84221 -95796 -104184 -9457 227718 448497 442950 183569
37786 183569 -179006 -482852 -617046 -510551 -209083 83205 172825 68278 -66538 -68119
37776 -68119 182634 707132 1275914 1489833 1243612 972960 1177923 1797613 2325816 2447340
37766 2447340 2243742 1841555 1238840 510997 -156419 -703533 -1157720 -1333858 -957959
37757 -957959 -198269 319072 224166 -192303 -481869 -593149 -658332 -571395 -170303 373509
37747 373509 740998 913695 1072963 1154635 908995 405898 93747 238729 586782 723064
37737 723064 553118 270624 7177 -284346 -626984 -852925 -721138 -195048 451568 873951
$$ packed form
37807a66972N37102N28376J0642n59247o56588k23113L04295M89626K95479j9958
37797E39642k22302k39769j32433k9359j1575q388R4727K37175K20779n547k59381
37786A83569l62575l03846j34194J06495L01468K92288Q9620j04547j34816j581
37776f8119K50753N24498N68782K13919k46221k70652K04963O19690N28203J21524
37766B447340k03598m02187o02715p27843o67416n47114m54187j76138L75899
37757i57959P59690N17341r4906m16469k89566j11280o5183Q6937M01092N43812
37747C73509L67489J72697J59268Q1672k45640n03097l12151J44982L48053J36282
37737G23064j69946k82494k63447k91523l42638k25941J31787N26090O46616M22383
$$ plain form
37727 873951 998107 1035025 1132720 1131936 745518 -102946 -1181883 -2091201 -2435611 -2014387
37717 -2014387 -1008161 73473 750454 861042 490280 -205137 -966742 -1408324 -1280982
37708 -1280982 -751595 -252951 -60406 -110475 -170177 -74929 117357 110092 -341405 -972316
37698 -972316 -1056934 -212593 984702 1555357 1240049 683878 484212 502297 297690 -163336
37688 -163336 -578700 -850088 -1162209 -1576588 -1865185 -1816826 -1522544 -1273436 -1261452 -1420619
37678 -1420619 -1505619 -1300767 -791697 -179719 235785 206525 -303559 -991936 -1358313 -1182463
37668 -1182463 -830608 -845612 -1226188 -1417605 -1106620 -660873 -529978 -544284 -230581 358822
37658 358822 634685 296956 -279438 -597697 -571566 -320806 160970 793043 1145119 825375
$$ packed form
37727H73951J24156L6918R7695p84l86418q48464j078937r09318l44410M21224
37717b014387J006226J081634O76981J10588l70762o95417p61605m41582J27342
37708a280982N29387M98644J92545n0069n9702R5248J92286p265m51497o30911
37698i72316q4618Q44341J197295N70655l15308n56171j99666J8085k04607m61026
37688a63336m15364k71388l12121m14379k88597M8359K94282K49108J1984j59167
37678a420619q5000K04852N09070O11978M15504k9260n10084o88377l66377J75850
37668a182463L51855j5004l80576j91417L10985M45747J30895j4306L13703N89403
37658C58822K75863l37729n76394l18259K6131K50760M81776O32073L52076l19744
$$ plain form
37648 825375 47588 -558254 -694449 -640502 -742192 -990975 -1203168 -1306096 -1267779 -977592
37638 -977592 -416874 191479 594935 781983 903385 1032857 1142729 1200755 1149988 917896
37628 917896 586527 388113 350749 156806 -366815 -815549 -663735 -49735 359930 295461
37618 295461 175010 348154 557031 432640 94544 -136108 -294020 -578611 -812250 -592156
37608 -592156 61137 650046 846501 837834 952551 1253395 1605052 1871039 1915628 1649682
37598 1649682 1222636 958884 928787 766762 149154 -652597 -970823 -527491 197504 511708
37588 511708 285916 -5940 29102 240298 262353 62965 -106107 -170039 -291704 -476454
37578 -476454 -475468 -171828 273852 774821 1417983 2004549 1939051 986225 -183533 -681056
$$ packed form
37648H25375p77787o05842j36195N3947j01690k48783k12193j02928L8317K90187
37638i77592N60718O08353M03456J87048J21402J29472J09872N8026n0767k32092
37628I17896l31369j98414l7364j93943n23621m48734J51814O14000M09665o4469
37618B95461j20451J73144K08877j24391l38096k30652j57912k84591k33639K20094
37608e92156O53293N88909J96455q667J14717L00844L51657K65987M4589k65946
37598A649682m27046k63752l0097j62025o17608q01751l18226M43332P24995L14204
37588E11708k25792k91856L5042K11196K2055j99388j69072o3932j21665j84750
37578d76454R86L03640M45680N00969O43162N86566o5498r52826j169758m97523
$$ plain form
37568 -681056 -421797 -10296 167463 163731 -70027 -735368 -1601790 -1993153 -1605604 -892026
37558 -892026 -431561 -333226 -435555 -627059 -719920 -460555 18113 164106 -227412 -604635
37548 -604635 -418422 61707 165762 -209506 -561373 -543623 -271380 48944 325564 438558
37538 438558 309682 132052 178464 387892 485485 481330 652401 1010334 1208185 1075054
37528 1075054 848469 719075 515418 79777 -340158 -380324 -82898 142155 16925 -346680
37518 -346680 -671612 -838147 -930014 -1018591 -985096 -652403 -100968 316364 396132 339543
37508 339543 375861 336608 -20597 -390407 -155246 661642 1208007 862810 64575 -325767
37498 -325767 -176396 -86100 -376225 -639620 -390287 274004 871312 1111967 1051224 863582
$$ packed form
37568f81056K59259M11501J77759l732k33758o65341q66422l91363L87549P13578
37558h92026M60465R8335j02329j91504r2861K59365M78668J45993l91518l77223
37548f04635J86213M80129J04055l75268l51867J7750K72243L20324K76620J12994
37538D38558j28876j77630M6412K09428R7593m155J71071L57933J97851j33131
37528A075054k26585j29394k03657m35641m19935m0166K97426K25053j25230l63605
37518c46680l24932j66535r1867q8577L3495L32693N51435M17332P9768n6589
37508C39543L6318l9253l57205l69810K35161Q16888N46365l45197p98235l90342
37498c25767J49371R0296k90125k63395K49333O64291N97308K40655o0743j87642
$$ plain form
37488 863582 700826 667259 724163 669079 382316 44440 -80196 -43874 -157385 -483998
37478 -483998 -662136 -415569 -27831 -17314 -431361 -784099 -708765 -355436 -47915 139955
37468 139955 276762 319734 244638 234307 427367 607524 470063 122424 -22626 170157
37458 170157 429330 541869 565636 493605 121245 -524704 -969731 -829282 -355545 -136101
37448 -136101 -380017 -780794 -970605 -819347 -369790 205152 599608 632925 531729 663354
37438 663354 951675 898566 321572 -271572 -311591 88786 371689 348666 336691 487770
37428 487770 466477 16955 -522545 -632515 -327830 -73488 -101852 -240844 -401735 -749591
37418 -749591 -1242508 -1472190 -1271066 -1096225 -1396326 -1881555 -1919003 -1482843 -1155856 -1219251
$$ packed form
37488H63582j62756l3567N6904n5084k86763l37876j24636L6322j13511l26613
37478d83998j78138K46567L87738J0517m14047l52738P5334L53329L07521J87870
37468A39955J36807M2972p5096j0331J93060J80157j37461l47639j45050J92783
37458A70157K59173J12539K3767p2031l72360o45949m45027J40449M73737K19444
37448a36101k43916m00777j89811J51258M49557N74942L94456L3317j01196J31625
37438F63354K88321n3109n76994n93144m0019M00377K82903k3023j1975J51079
37428D87770k1293m49522n39500j09970L04685K54342k8364j38992j60891l47856
37418g49591m92917k29682K01124J74841l00101m85229l7448M36160L26987o3395
$$ plain form
37408 -1219251 -1310379 -1092000 -724430 -444736 -146649 303105 708607 863860 932301 1141554
37398 1141554 1346674 1283209 1059814 1002906 1159018 1340808 1527822 1795806 1964772 1816445
37388 1816445 1634188 1984803 2851269 3477809 3289561 2565094 1966883 1763967 1775415 1763363
37378 1763363 1592926 1243351 896929 780145 756610 450024 -2571 160339 1211341
37369 1211341 2197062 2040444 1084542 668740 1233096 1787814 1469885 701084 322787
37360 322787 381499 469618 656540 1212061 1753148 1585757 820565 325797 514285 938939
37350 938939 1230012 1640163 2312538 2714396 2351698 1584732 1171083 1293457 1546257 1653235
37340 1653235 1688703 1725366 1737824 1792425 1932403 1942387 1609043 1141759 940642 1014573 1051601
$$ packed form
37408a219251r1128K18379L67570K79694K98087M49754M05502J55253O8441K09253
37398A141554K05120o3465k23395n6908J56112J81790J87014K67984J68966j48327
37388A816445j82257L50615Q66466O26540j88248p24467n98211k02916J1448j2052
37378A763363j70437l49575l46422j16784k3535l06586m52595J62910J051002
37369A211341R85721j56618r55902m15802N64356N54718l17929p68801l78297
37360C22787N8712Q8119J86922N55521N41087j67391p65192m94768J88488M24654
37350I38939K91073M10151O72375M01858l62698p66966m13649J22374K52800J06978
37340A653235L5468L6663J2458N4601J39978R984l33344m67284k01117P3931L7028
$$ plain form
37329 1051601 1015853 1197457 1652590 2092229 2413453 2828870 3302337 3383691 2901337 2356747
37319 2356747 2243349 2350575 2191419 1822485 1711429 1937046 2057312 1795320 1416451
37310 1416451 1308487 1501411 1725782 1722121 1411369 967020 790353 1203572 2058214 2805880
37300 2805880 3047332 2857073 2475998 1886535 921392 -275602 -1157899 -1268687 -729413
37291 -729413 -118595 107215 -40272 -297884 -518214 -687048 -728184 -549180 -267725 -137203
37281 -137203 -169988 -47906 474814 1250535 1936208 2343255 2459788 2310167 1992455 1730022
37271 1730022 1673310 1712573 1651622 1493705 1395176 1419159 1514367 1665632 1865442 1975048
37261 1975048 1817109 1415907 983803 654051 368987 65743 -138904 -16250 524994
$$ packed form
37329A051601l5748J81604M55133M39639L21224M15417M73467Q1354m82354n44590
37319B356747j13398J07226j59156l68934j11056K25617J20266k61992l78869
37310A416451j07964J92924K24371l661l10752m44349j76667M13219Q54642P47666
37300B805880K41452j90259l81075n89463r65143j196994q82297j10788N39274
37291g29413O10818K25810j47487k57612k20330j68834m1136J79004K81455J30522
37281a37203l2785J22082N22720P75721O85673M07047J16533j49621l17712k62433
37271A730022n6712L9263o0951j57917r8529K3983R5208J51265J99810J09606
37261A975048j57939m01202m32104l29752k85064l03244k04647J22654N41244
$$ plain form
37252 524994 1250426 1709564 1653747 1336241 1234125 1478047 1792214 2003475 2238515 2481247
37242 2481247 2373985 1790715 1244528 1276963 1688864 1846385 1561248 1172412 906994 711551
37232 711551 637694 807593 988750 791766 364544 298771 712302 1030261 893170 668763
37222 668763 734016 829258 574226 143988 -83110 -176794 -419209 -700758 -696844 -472558
37212 -472558 -407504 -621987 -908415 -1123164 -1232908 -1093528 -631838 -170711 -121509 -382214
37202 -382214 -466440 -200165 160978 494173 954023 1428609 1373771 504003 -676514 -1342555
37192 -1342555 -1166818 -468562 256645 721814 890622 867158 751212 540616 227025 -27749
37182 -27749 16604 352611 658362 654008 397228 146639 72061 198498 500507 904078
$$ packed form
37252E24994P25432M59138n5817l17506j02116K43922L14167K11261K35040K42732
37242B481247j07262n83270n46187L2435M11901J57521k85137l88836k65418j95443
37232G11551p3857J69899J81157j96984m27222o5773M13531L17959j37091k24407
37222F68763O5253R5242k55032m30238k27098r3684k42415k81549L914K24286
37212d72558O5054k14483k86428k14749j09744J39380M61690M61127M9202k60705
37202c82214q4226K66275L61143L33195M59850M74586n4838q69768j180517o66041
37192a342555J75737O98256P25207M65169J68808k3464j15946k10596l13591k54774
37182b7749M4353L36007L05751m354k56780k50589p4578J26437L02009M03571
$$ plain form
37172 904078 1253727 1399334 1316648 1104106 891483 771782 768817 825703 834926 701939 423134
37161 423134 167131 234654 759456 1409381 1619820 1271054 891315 939146 1115153 771253
37151 771253 -119293 -859209 -926346 -551967 -267171 -239145 -277144 -235192 -163042 -185874 -382120
37140 -382120 -672639 -774599 -441258 194163 718034 934204 1018031 1108540 1064511 793644
37130 793644 528950 534124 744878 923108 970095 882573 631648 347372 401232 967203
37120 967203 1633282 1783691 1308887 667194 321521 386517 734055 1106623 1148300 666943
37110 666943 -70160 -568755 -690829 -755927 -1002468 -1216258 -1030795 -404779 345909 877650
37100 877650 1078518 1082348 1085727 1095022 875126 261545 -516011 -997826 -982394 -665026 -279846
$$ packed form
37172I04078L49649J45607q2686k12542k12623j19701k965N6886R223j32987k78805
37161D23134k56003O7523N24802O49925K10439l48766l79739M7831J76007l43900
37151G71253q90546p39916o7137L74379K84796K8026l7999M1952P2150k2832j96246
37140c82120k90519j01960L33341O35421N23871K16170Q3827R0509m4029k70867
37130G93644k64694N174K10754J78230M6987q7522k50925k84276N3860N65971
37120I67203O66079J50409m74804o41693l45673O4996L47538L72568M1677m81357
37110F66943p37103m98595j22074o5098k46541k13790J85463O26016P50688N31741
37100H77650K00868L830L379R295k19896o13581p77556m81815J5432L17368L85180
$$ plain form
37089 -279846 160571 679898 1118391 1280404 1186263 1018179 879908 742148 589940 500586
37079 500586 545981 661199 644949 341346 -131556 -392222 -145634 492933 1133045 1537076
37069 1537076 1754235 1838123 1672960 1218009 755728 677734 1037106 1453430 1495408 1100796
37059 1100796 614295 453470 736411 1198468 1445486 1274631 764899 129431 -453159
37050 -453159 -896117 -1180297 -1296074 -1202213 -884509 -464859 -144754 30680 239692 607636
37040 607636 980504 1118613 1001992 773844 520408 345106 511237 1143262 1832269 1959518
37030 1959518 1491617 1057093 1085777 1269502 1121291 704956 454180 521772 698531 825517
37020 825517 904064 872357 637213 324334 182346 208382 145004 -99692 -279797 -151731
$$ packed form
37089b79846M40417N19327M38493J62013r4141j68084j38271j37760j52208q9354
37079E00586M5395J15218j6250l03603m72902k60666K46588O38567O40112M04031
37069A537076K17159Q3888j65163m54951m62281p7994L59372M16324M1978l94612
37059A100796m86501j60825K82941M62057K47018j70855n09732o35468n82590
37050d53159m42958k84180j15777R3861L17704M19650L20105J75434K09012L67944
37040F07636L72868J38109j16621k28148k53436j75302J66131O32025O89007J27249
37030A959518m67901m34524K8684J83725j48211m16335k50776O7592J76759J26986
37020H25517P8547l1707k35144l12879j41988K6036o3378k44696j80105J28066
$$ plain form
37010 -151731 192875 422601 288861 -168350 -638366 -791681 -626197 -487067 -592725 -669699
37000 -669699 -319085 342695 756411 645452 308861 96203 -40172 -260058 -428431 -326845
36990 -326845 -96026 -115808 -468932 -800928 -766564 -434851 -182462 -291806 -710507 -1153292
36980 -1153292 -1399058 -1477320 -1540195 -1587354 -1441762 -1044896 -650627 -607787 -991945 -1515807
36970 -1515807 -1750926 -1416627 -594056 234417 487098 11092 -717821 -1053071 -804351
36961 -804351 -304557 53443 142973 3689 -312079 -678029 -871134 -793707 -641460 -694086
36951 -694086 -960313 -1151761 -1008834 -560348 -67879 186545 60588 -357573 -745433 -743604
36941 -743604 -281670 326299 697746 753296 691081 669263 676727 690221 752502 839526 833229
$$ packed form
37010a51731L44606K29726j33740m57211m70016j53315J65484J39130j05658p6974
37000f69699L50614O61780M13716j10959l36591k12658j36375k19886j68373J01586
36990c26845K30819j9782l53124l31996L4364L31713K52389j09344m18701m42785
36980a153292k45766p8262o2875m7159J45592L96866L94269M2840l84158n23862
36970a515807k35119L34299Q22571Q28473K52681m76006p28913l35250K48720
36961h04351M99794L58000Q9530j39284l15768l65950j93105P7427J52247n2626
36951f94086k66227j91448J42927M48486M92469K54424j25957m18161l87860J829
36941g43604M61934O07969L71447N5550o2215k1818P464J3494O2281Q7024o297
$$ plain form
36930 833229 714651 613902 564200 400138 68224 -145850 51526 508024 757856 562241
36920 562241 98228 -333646 -548789 -475769 -192341 36791 20511 -62874 95564 424332
36910 424332 555728 451207 514880 932063 1321659 1318378 1131404 1161599 1339884 1264537
36900 1264537 849675 446802 374055 635937 1070915 1496442 1712943 1583996 1127475 441025
36890 441025 -334532 -885708 -843587 -287556 129152 -94418 -664580 -949965 -853626 -747522
36880 -747522 -708719 -414111 216386 841094 1231154 1452474 1422584 862565 -98892 -806846
36870 -806846 -861730 -584097 -426275 -373149 -258606 -229252 -457212 -736941 -812989 -820708 -954460
36859 -954460 -971516 -541319 93944 344678 90583 -212510 -225751 -79797 -9959 -57473
$$ packed form
36930H33229j18578j00749m9702j64062l31914k14074J97376M56498K49832j95615
36920E62241m64013m31874k15143P3020K83428K29132j6280q3385J58438L28768
36910D24332J31396j04521O3673M17183L89596l281j86974L0195J78285p5347
36900A264537m14862m02873p2747K61882M34978M25527K16501j28947m56521o86450
36890D41025p75557n51176M2121N56031M16708k23570n70162k85385R6339J06104
36880g47522L8803K94608O30497O24708L90060K21320k9890n60019r61457p07954
36870h06846n4884K77633J57822N3126J14543K9354k27960k79729p6048p719j33752
36859i54460j7056M30197O35263K50734k54095l03093j3241J45954O9838m7514
$$ plain form
36849 -57473 -211017 -482830 -739611 -757112 -543110 -359741 -362766 -461358 -576169 -760758
36839 -760758 -983166 -1047173 -861015 -589808 -416989 -300333 -74128 296579 627929 642590
36829 642590 219965 -404859 -783398 -709560 -411437 -159592 99706 472125 713942 505054
36819 505054 -17800 -457148 -801851 -1346403 -1950374 -1991928 -1276947 -452916 -172137 -272587
36809 -272587 -195926 120893 250503 -8472 -375091 -516937 -402502 -204755 -74058 -8718
36799 -8718 186757 751954 1653069 2510241 2959320 2964685 2679655 2204220 1643180 1174092
36789 1174092 814658 315433 -438653 -1084663 -1154895 -685913 -142688 180468 349031 425440
36779 425440 297269 -46212 -362090 -425032 -283585 -154589 -183966 -350127 -484342 -375344
$$ packed form
36849e7473j53544k71813k56781j7501K14002J83369l025r8592j14811j84589
36839g60758k22408o4007J86158K71207J72819J16656K26205L70707L31350J4661
36829F42590m22625o24824l78539P3838K98123K51845K59298L72419K41817k08888
36819E05054n22854m39348l44703n44552o03971m1554P14981Q24031K80779j00450
36809b72587P6661L16819J29610k58975l66619j41846J14435J97747J30697O5340
36799h718J95475N65197R01115Q57172M49079N365k85030m75435n61040m69088
36789A174092l59434m99225p54086o46010p0232M68982N43225L23156J68563P6409
36779D25440j28171l43481l15878o2942J41447J28996k9377j66161j34215J08998
$$ plain form
36769 -375344 19893 460683 626217 426878 34491 -324240 -495205 -429499 -252044 -200134
36759 -200134 -328579 -404772 -289769 -238963 -523970 -921126 -983321 -741104 -667311 -916387
36749 -916387 -1078324 -826208 -362933 -14104 207791 355986 265126 -85620 -216323 356063
36739 356063 1359096 1940508 1634666 825193 185018 -46114 -83936 -126344 -117485 6469
36729 6469 24747 -407461 -1256528 -1961161 -1997195 -1483947 -947818 -567625 -86228 480755
36719 480755 607965 55653 -568111 -547713 -57649 148653 -147756 -474738 -570878 -727551
36709 -727551 -1065761 -1158974 -771447 -437633 -770695 -1529474 -1946231 -1812106 -1657053 -1859852
36699 -1859852 -2134236 -2068400 -1732435 -1466573 -1365306 -1300324 -1281944 -1439689 -1658204 -1535890
$$ packed form
36769c75344L95237M40790J65534j99339l92387l58731j70965O5706J77455N1910
36759b00134j28445p6193J15003N0806k85007l97156o2195K42217P3793k49076
36749i16387j61937K52116M63275L48829K21895J48195r0860l50746j30703N72386
36739C56063J003033N81412l05842q09473o40175k31132l7822m2408Q859J23954
36729F469J8278m32208q49067p04633l6034N13248N36129L80193M81397N66983
36719D80755J27210n52312o23764K0398M90064K06302k96409l26982r6140j56673
36709g27551l38210r3213L87527L33814l33062p58779m16757J34125J55053k02799
36699a859852k74384O5836L35965K65862J01267O4982J8380j57745k18515J22314
$$ plain form
36689 -1535890 -818882 283679 1305478 1923208 2084999 1898964 1556338 1280144 1152049
36680 1152049 986749 551925 -47403 -379145 -175886 330711 700429 783069 750625 729499
36670 729499 644603 438962 225850 130072 110973 17773 -268335 -759296 -1287993 -1496792
36660 -1496792 -1102338 -274290 419222 577032 344477 113827 16873 -96708 -312986 -534586
36650 -534586 -668492 -721206 -704323 -608806 -478275 -388672 -382443 -508645 -803738 -1083418 -954075
36639 -954075 -341359 144632 -176981 -1083105 -1579209 -1149458 -393559 -146945 -425132 -674413
36629 -674413 -710027 -813316 -1031254 -986092 -480518 163958 541792 604049 508222 326013
36619 326013 99126 -39678 -19034 22434 -104216 -421942 -818961 -1166920 -1316452 -1120056
$$ packed form
36689a535890P17008J102561J021799O17730J61791j86035l42626k76194j28095
36680A152049j65300m34824n99328l31742K03259N06597L69718Q2640l2444k1126
36670G29499q4896k05641k13112r5778j9099r3200k86108m90961n28697k08799
36660a496792L94454Q28048O93512J57810k32555k30650r6954j13581k16278k21600
36650e34586j33906n2714J6883R5517J30531Q9603O229j26202k95093k79680J29343
36639i54075O12716M85991l21613r06124m96104M29751P55899K46614k78187k49281
36629f74413l5614j03289k17938M5162N05574O44476L77834O2257r5827j82209
36619C26013k26887j38804K0644M1468j26650l17726l97019l47959j49532J96396
$$ plain form
36609 -1120056 -590574 49152 559537 842105 875335 663325 343751 175286 250235 311893
36599 311893 13076 -674441 -1398098 -1735560 -1522906 -946872 -370421 -23963 133938 198533
36589 198533 64883 -401626 -983800 -1192842 -808361 -102267 536241 921786 949535 531054
36579 531054 -126412 -509354 -365107 -24664 124205 203601 531036 1007459 1272760 1301060
36569 1301060 1371354 1556770 1725384 1970404 2493598 3038477 3013281 2347573 1723712 1702225
36559 1702225 2034630 2138749 1897681 1629966 1513830 1417223 1199956 897368 634645 532004
36549 532004 644210 871628 992817 865611 532056 121178 -221131 -341578 -251917 -288949
36539 -288949 -798051 -1588824 -2030167 -1814653 -1307077 -975951 -836467 -706922 -672239 -917657
$$ packed form
36609a120056N29482O39726N10385K82568L3230k12010l19574j68465P4949O1658
36599C11893k98817o87517p23657l37462K12654N76034N76451L46458J57901O4595
36589A98533j33650m66509n82174k09042L84481P06094O38508L85545K7749m18481
36579E31054o57466l82942J44247L40443J48869P9396L27435M76423K65301K8300
36569A301060P0294J85416J68614K45020N23194N44879k5196o65708o23861k1487
36559A702225L32405J04119k41068k67715j16136r6607k17267l02588k62723j02641
36549E32004J12206K27418J21189j27206l33555m10878l42309j20447Q9661l7032
36539b88949n09102p90773m41343K15514N07576L31126J39484J29545L4683k45418
$$ plain form
36529 -917657 -1307268 -1495051 -1361274 -1071473 -807910 -671067 -713135 -834119 -772863 -413979
36519 -413979 46316 430536 846665 1366161 1694048 1532956 1096456 859086 907349 921604
36509 921604 704451 331425 -139333 -668845 -971705 -702824 13502 617236 765733 639775
36499 639775 548095 551521 539174 370700 -96093 -806360 -1333102 -1274731 -854294 -703834
36489 -703834 -985941 -1190667 -933784 -462228 -142297 65843 295582 374254 156954 -66488
36479 -66488 60620 416147 632915 688032 847093 1158663 1404712 1466443 1373828 1068880
36469 1068880 485802 -173729 -585973 -704227 -715164 -668245 -503815 -400088 -665038 -1214502
36459 -1214502 -1540760 -1327644 -780580 -235351 218539 552322 573129 172808 -392491 -733951
$$ packed form
36529i17657l89611j87783J33777K89801K63563J36843m2068j20984O1256L58884
36519d13979M60295L84220M16129N19496L27887j61092m36500k37370M8263J4255
36509I21604k17153l73026m70758n29512l02860K68881P16326O03734J48497j25958
36499F39775r1680L426j2347j68474m66793p10267n26742N8371M20437J50460
36489g03834k82107k04726K56883M71556L19931K08140K29739P8672k17300k23442
36479f6488J27108L55527K16768N5117J59061L11570K46049O1731r2615l04948
36469A068880n83078o59531m12244j18254j0937M6919J64430J03727k64950n49464
36459a214502l26258K13116N47064N45229M53890L33783K0807m00321n65299l41460
$$ plain form
36449 -733951 -735422 -550918 -334707 -165382 -115298 -183285 -230544 -161879 -96098 -181205 -323832
36438 -323832 -311660 -154583 -82735 -220372 -484803 -815059 -1241621 -1645109 -1700937 -1254520
36428 -1254520 -594922 -151727 -9766 85509 311011 576085 742571 813128 832442 777226
36418 777226 647897 538003 497175 426055 232205 14153 -51129 29282 51907 -121045
36408 -121045 -391345 -546550 -480538 -258562 -9184 200492 365121 424283 214036 -359190
36398 -359190 -1101165 -1632203 -1778959 -1738310 -1748899 -1733443 -1444471 -896351 -450475 -445100
36388 -445100 -860927 -1360156 -1559425 -1288736 -712471 -217219 -91731 -292116 -547017 -648743
36378 -648743 -609389 -618770 -886034 -1383673 -1703524 -1401038 -613436 -51608 -139269 -459482
$$ packed form
36449g33951j471J84504K16211J69325N0084o7987m7259O8665O5781q5107j42627
36438c23832J2172J57077P1848j37637k64431l30256m26562m03488n5828M46417
36428a254520O59598M43195J41961R5275K25502K65074J66486P0557J9314n5216
36418G77226j29329j09894m0828p1120j93850k18052o5282Q0411K2625j72952
36408a21045k70300j55205O6012K21976K49378K09676J64629N9162k10247n73226
36398c59190p41975n31038j46756M0649j0589J5456K88972N48120M45876N375
36388d45100m15827m99229j99269K70689N76265M95252J25488k00385k54901j01726
36378f48743L9354r381k67264m97639l19851L02486P87602N61828q7661l20213
$$ plain form
36368 -459482 -406931 -79460 8423 -121298 59727 611741 914140 634552 261823 338237
36358 338237 710696 944503 1001862 1049727 995187 718094 459790 474721 533739 266593
36348 266593 -200602 -440113 -388588 -328783 -344198 -291117 -210341 -262031 -325856 -180091 -23890
36337 -23890 -273115 -839936 -1182693 -1122636 -1026446 -1070954 -956745 -585377 -404876 -697116
36327 -697116 -1027456 -870894 -408714 -203896 -343033 -416219 -239081 -124505 -395869 -947053
36317 -947053 -1366026 -1334796 -891606 -386371 -133858 -80830 49535 280105 324249 106501
36307 106501 -7874 249634 586640 559341 211854 -78758 -216993 -392790 -538748 -275521
36297 -275521 489483 1294408 1641100 1517969 1234217 962975 670222 359109 149117 125389
$$ packed form
36368d59482N2551L27471Q7883j29721J81025N52014L02399k79588l72729P6414
36358C38237L72459K33807N7359M7865n4540k77093k58304J4931N9018k67146
36348B66593m67195k39511N1525N9805j5415N3081Q0776n1690o3825J45765J56201
36337b3890k49225n66821l42757O0057R6190m4508J14209L71368J80501k92240
36327f97116l30340J56562M62180K04818j39137p3186J77138J14576k71364n51184
36317i47053m18973L1230M43190N05235K52513N3028J30365K30570M4144k17748
36307A06501j14375K57508L37006k7299l47487k90612j38235j75797j45958K63227
36297b75521P65004Q04925L46692j23131k83752k71242k92753l11113k09992k3728
$$ plain form
36287 125389 260303 501266 829023 1181416 1389709 1290765 926304 548745 349210 241971
36277 241971 44913 -180506 -188055 17109 56282 -336387 -886391 -1072413 -772631 -407926
36267 -407926 -449532 -925046 -1394885 -1314879 -485651 722721 1638094 1898199 1742433 1597999
36257 1597999 1515869 1232250 704038 292327 347361 801521 1259808 1382971 1135872 747444
36247 747444 458537 275575 27078 -294847 -417311 -180645 115481 44780 -358284 -680727
36237 -680727 -771087 -898672 -1189455 -1316345 -985525 -417055 -58895 -54084 -266672 -606627
36227 -606627 -980659 -1087336 -680419 -15470 328175 110697 -379032 -809865 -1138785 -1377129
36217 -1377129 -1393715 -1152633 -872118 -722615 -585333 -328150 -101852 -97671 -197104 -168032
$$ packed form
36287A25389J34914K40963L27757L52393K08293r8944l64461l77559j99535j07239
36277B41971j97058k25419p549K05164L9173l92669n50004j86022K99782L64705
36267d07926m1606m75514m69839Q0006Q29228J208372R15373K60105j55766j44434
36257A597999q2130k83619n28212m11711N5034M54160M58287J23163k47099l88428
36247G47444k88907j82962k48497l21925j22464K36666K96126p0701m03064l22443
36237f80727r0360j27585k90783j26890L30820N68470L58160M811k12588l39955
36227f06627l74032j06677M06917O64949L43645k17478m89729m30833l28920k38344
36217a377129j6586K41082K80515J49503J37282K57183K26298M181r9433K9072
$$ plain form
36207 -168032 -71132 -141897 -360108 -484747 -472269 -498753 -567134 -472192 -216143 -87676 -224708
36196 -224708 -453135 -663235 -942756 -1185113 -1034302 -495317 -136847 -296277 -510167 -233425
36186 -233425 252833 276541 -144614 -366048 -152312 68979 12366 -96626 -67138 8219
36176 8219 216218 846497 1674304 1898198 1220472 417658 345841 860945 1236654 1201174
36166 1201174 972257 642280 191656 -125451 -52073 162475 106886 -86912 10467 295491
36156 295491 216782 -326239 -843824 -1093363 -1392115 -1906541 -2250888 -2097318 -1679883 -1355254
36146 -1355254 -1083352 -699720 -356084 -309263 -503439 -685006 -751257 -718634 -525443 -137515
36136 -137515 266703 423244 202058 -394038 -1241642 -1979454 -2152798 -1717898 -1202671 -1116953
$$ packed form
36207a68032R6900p0765k18211j24639J2478k6484o8381R4942K56049J28467j37032
36196b24708k28427k10100k79521k42357J50811N38985L58470j59430k13890K76742
36186b33425M86258K3708m21155k21434K13736K21291n6613j08992K9488P5357
36176H219K07999O30279Q27807K23894o77726q02814p1817N15104L75709l5480
36166A201174k28917l29977m50624l17107P3378K14548n5589j93798R7379K85024
36156B95491p8709n43021n17585k49539k98752n14426l44347J53570M17435L24629
36146a355254K71902L83632L43636M6821j94176j81567o6251L2623J93191L87928
36136a37515M04218J56541k21186n96096q47604p37812j73344M34900N15227Q5718
$$ plain form
36126 -1116953 -1365447 -1488280 -1321820 -1123700 -1120192 -1221202 -1209361 -1012056 -726872 -477736
36116 -477736 -296831 -153599 -108779 -332768 -807411 -1103857 -762887 86296 824263 1136447
36106 1136447 1321495 1629124 1720004 1154553 131934 -672871 -861195 -564959 -102422
36097 -102422 274391 404964 324099 254116 233639 -52673 -731651 -1273923 -1090086 -464174
36087 -464174 -278821 -788281 -1306407 -1290270 -1087074 -1217407 -1455149 -1200373 -480130 29877
36077 29877 -64851 -424070 -527705 -301690 -36688 54251 11332 -3349 129221 384713
36067 384713 573359 469934 39666 -476005 -731420 -551976 -86591 277212 216187 -216134
36057 -216134 -609690 -623175 -347742 -120776 -34128 137040 471449 659632 445124 99664
$$ packed form
36126a116953k48494j22833J66460J98120L508j01010J1841J97305K85184K49136
36116d77736J80905J43232M4820k23989m74643k96446L40970Q49183P37967L12184
36106A136447J85048L07629R0880n65451j022619q04805j88324K96236M62537
36097a02422L76813J30573q0865o9983k0477k86312o78978n42272J83837O25912
36087d64174J85353n09460n18126J6137K03196j30333k37742K54776P20243N10007
36077B9877r4728l59219j03635K26015K65002R0939m2919j4681J32570K55492
36067C84713J88646j03425m30268n15671k55415J79444M65385L63803o1025m32321
36057b16134l93556j3485K75433K26966Q6648J71168L34409J88183k14508l45460
$$ plain form
36047 99664 127688 570057 954380 965370 801348 737703 701698 534935 368706 379724 384365
36036 384365 93023 -333840 -412560 -17487 456264 658137 646253 617153 631983 712277
36026 712277 857000 850464 421286 -264146 -650722 -509914 -198313 -5139 258153 678229
36016 678229 770749 134246 -797423 -1255881 -1130211 -853265 -542147 10359 580490 564257
36006 564257 -65170 -559336 -435443 -129827 -266110 -752376 -1007162 -745467 -172471 360418
35996 360418 595249 478748 272109 331495 599281 606081 186952 -157707 72674 672167
35986 672167 1062330 1062516 899117 662968 266650 -132475 -177362 129556 301814 -31342
35976 -31342 -639286 -943425 -625424 78688 601540 572107 199227 44125 322233 619094
$$ packed form
36047I9664K8024M42369L84323J0990j64022o3645l6005j66763j66229J1018M641
36036C84365k91342m26863p8720L95073M73751K01873j1884k9100J4830Q0294
36026G12277J44723o536m29178o85432l86576J40808L11601J93174K63292M20076
36016F78229R2520o36503r31669m58458J25670K76946L11118N52506N70131j6233
36006E64257o29427m94166J23893L05616j36283m86266k54786K61695N72996N32889
35996C60418K34831j16501k06639N9386K67786O800m19129l44659K30381N99493
35986F72167L90163J86j63399k36149l96318l99125m4887L06918J72258l33156
35976c1342o07944l04139L18001P04112N22852k9433l72880j55102K78108K96861
$$ plain form
35966 619094 490108 109940 -18953 161337 240701 58228 -56437 107640 241061 -11147
35956 -11147 -498789 -802410 -806638 -735781 -763028 -882589 -1087600 -1380988 -1618442 -1598970 -1355179
35945 -1355179 -1143073 -1079819 -983976 -681830 -310592 -151988 -247653 -363098 -333793 -273651
35935 -273651 -352756 -492015 -440055 -131563 197294 318012 303736 379838 544188 509748
35925 509748 69193 -602399 -1093262 -1151875 -881296 -587881 -506288 -640556 -790272 -725687
35915 -725687 -405208 -44346 82231 -64335 -232600 -146890 223263 688797 1050098 1194411
35905 1194411 1068703 724164 389950 331502 561491 807293 827817 647469 426415 264359
35895 264359 234704 431713 811167 1130569 1244810 1325058 1553333 1735075 1519142 930852
$$ packed form
35966F19094j28986l80168j28893J80290P9364j82473j14665J64077J33421k52208
35956a1147m87642l03621m228P0857k7247j19561k05011k93388k37454J9472K43791
35945a355179K12106O3254R5843L02146L71238J58604r5665j15445K9305O0142
35935b73651p9105j39259N1960L08492L28857J20718j4276P6102J64350l4440
35925E09748m40555o71592m90863n8613K70579K93415Q1593j34268j49716O4585
35915g25687L20479L60862J26577j46566j68265Q5710L70153M65534L61301J44313
35905A194411j25708l44539l34214n8448K29989K45802K0524j80348k21054j62056
35895B64359k9655J97009L79454L19402J14241Q0248K28275J81742k15933n88290
$$ plain form
35885 930852 362118 61031 -30533 52758 375649 761150 801644 421300 75569 143607
35875 143607 430818 545327 474755 462551 554127 628061 700929 839847 913990 803778 745855
35864 745855 1068260 1621016 1858477 1508536 815316 95292 -578685 -1163369 -1471967 -1402931
35854 -1402931 -1117718 -846630 -691801 -694430 -862495 -1016127 -846750 -317852 168973 222945
35844 222945 -16848 -24762 445845 1001123 1014098 375395 -272103 -184122 604040 1241268
35834 1241268 1000952 49168 -894564 -1407316 -1542821 -1363062 -799680 -24003 504957
35825 504957 558623 397830 339276 333702 159430 -207529 -624365 -993568 -1254381 -1329555
35815 -1329555 -1265066 -1275767 -1466050 -1617936 -1426913 -871855 -232069 176996 202010 -84145
$$ packed form
35885I30852n68734l01087r1564Q3291L22891L85501M0494l80344l45731O8038
35875A43607K87211J14509p0572j2204R1576P3934P2868J38918P4143j10212n7923
35864G45855L22405N52756K37461l49941o93220p20024o73977n84684l08598O9036
35854a402931K85213K71088J54829k629j68065j53632J69377N28898M86825N3972
35844B22945k39793p914M70607N55278J2975o38703o47498Q7981P88162O37228
35834A241268k40316r51784r43732n12752j35505J79759N63382P75677N28960
35825E04957N3666j60793n8554n574j74272l66959m16836l69203k60813p5174
35815a329555O4489j0701j90283j51886J91023N55058O39786M09065K5014k86155
$$ plain form
35805 -84145 -403308 -461594 -222518 70838 165279 -21148 -454719 -1010223 -1424744 -1473998
35795 -1473998 -1257284 -1084022 -1052943 -1018737 -977331 -1089035 -1240226 -1053657 -532822 -208414
35785 -208414 -338851 -457062 -142319 227451 84893 -320226 -232000 458274 1083370 1218998
35775 1218998 1163480 1278034 1437748 1367184 1074206 720907 408740 264249 415100 735240
35765 735240 923009 937985 1014073 1136681 927378 251020 -456385 -737521 -666542 -578691
35755 -578691 -556315 -500398 -452831 -494170 -498378 -323226 -119957 -149147 -380173 -546577 -521332
35744 -521332 -383761 -188149 71827 301746 351942 236884 131501 139237 192855 177973
35734 177973 68051 -27065 85824 457900 792613 697888 264497 106188 574512 1191700
$$ packed form
35805h4145l19163n8286K39076K93356R4441j86427m33571n55504m14521m9254
35795a473998K16714J73262L1079L4206M1406j11704j51191J86569N20835L24408
35785b08414j30437j18211L14743L69770j42558m05119Q8226O90274O25096J35628
35775A218998n5518J14554J59714p0564k92978l53299l12167j44491J50851L20140
35765G35240J87769J4976P6088J22608k09303o76358p07405k81136P0979Q7851
35755e78691K2376N5917M7567m1339m208J75152K03269k9190k31026j66404K5245
35744e21332J37571J95612K59976K29919N0196j15058j05383P736N3618j4882
35734A77973j09922r5116J12889L72076L34713r4725m33391j58309M68324O17188
$$ plain form
35724 1191700 1214305 571936 -164027 -614318 -891600 -1057647 -825855 -54780 831003 1234205
35714 1234205 1027488 586653 328222 391757 635660 760572 547543 139588 -22953 286079
35704 286079 742291 832445 452184 -75408 -491832 -817995 -1059647 -1016659 -566640 54104
35694 54104 471220 595197 648934 820922 1054119 1157469 973492 452820 -257961 -782658
35684 -782658 -763923 -230644 417674 836512 973276 859767 484451 49337 20318 559070
35674 559070 1121545 1058818 498259 141140 227277 281385 12747 -151000 204630 699731
35664 699731 628941 -50729 -705898 -878060 -691313 -438964 -173094 213856 760392 1344054
35654 1344054 1666290 1407557 609349 -197970 -504387 -371928 -224589 -224177 -203540 -117217
$$ packed form
35724A191700K2605o42369p35963m50291k77282j66047K31792P71075Q85783M03202
35714A234205k06717m40835k58431O3535K43903J24912k13029m07955j62541L09032
35704B86079M56212R0154l80261n27592m16424l26163k41652M2988M50019O20744
35694E4104M17116J23977N3737J71988K33197J03350j83977n20672p10781n24697
35684g82658J8735N33279O48318M18838J36764j13509l75316m35114k9019N38752
35674E59070N62475o2727n60559l57119Q6137N4108k68638j63747L55630M95101
35664F99731p0790o79670o55169j72162J86747K52349K65870L86950N46536N83662
35654A344054L22236k58733p98208q07319l06417J32459J47339M12K0637Q6323
$$ plain form
35644 -117217 -115443 -150257 51998 495086 754061 489368 -143534 -726315 -969315 -775605
35634 -775605 -204055 474743 909471 984813 830595 498356 -75440 -728504 -1059382 -912348
35624 -912348 -565451 -290148 -58284 150004 132680 -186366 -546166 -767441 -1035289 -1439830
35614 -1439830 -1599476 -1185105 -549930 -351937 -710894 -1188660 -1472795 -1621735 -1712242 -1698904
35604 -1698904 -1620144 -1566990 -1461488 -1199826 -954121 -980689 -1207294 -1377873 -1491148 -1662703
35594 -1662703 -1675847 -1209419 -467053 1056 121022 323367 678144 698187 220040 -220716
35584 -220716 -253592 -258503 -612512 -951609 -797511 -445000 -519674 -968405 -1213945 -1127124
35574 -1127124 -1116679 -1311040 -1367529 -1183141 -1146735 -1466786 -1762428 -1593255 -1026513 -448841
$$ packed form
35644a17217J774l4814K02255M43088K58975k64693o32902n82781k43000J93710
35634g75605N71550O78798M34728P5342j54218l32239n73796o53064l30878J47034
35624i12348L46897K75303K31864K08288j7324l19046l59800k21275k67848m04541
35614a439830j59646M14371O35175J97993l58957m77766k84135j48940r0507J3338
35604a698904P8760N3154J05502K61662K45705k6568k26605j70579j13275j71555
35594a662703j3144M66428P42366M68109J19966K02345L54777K0043m78147m40756
35584b20716l2876m911l54009l39097J54098L52511p4674m48731k45540Q6821
35574a127124J0445j94361n6489J84388L6406l20051k95642J69173N66742N77672
$$ plain form
35564 -448841 -121038 -113687 -392822 -751362 -872357 -645648 -268311 48464 251410 258783
35554 258783 -87873 -703770 -1148463 -1077224 -671104 -436695 -669729 -1219261 -1664853 -1657939
35544 -1657939 -1232969 -827475 -826284 -1092858 -1216725 -1211405 -1532577 -2253257 -2707176 -2322855
35534 -2322855 -1449711 -893482 -875147 -954717 -842501 -727081 -771443 -786656 -567879 -196838
35524 -196838 150902 422533 583796 555686 383395 245910 199582 143004 117260 358872
35514 358872 916823 1492438 1836059 2037250 2211052 2172108 1727569 1099689 716172 682945
35504 682945 776190 875660 1065278 1315246 1408658 1272352 1109481 1079613 1053221 817820
35494 817820 383019 -34428 -225188 -114444 207768 502204 527540 257933 -98872 -319622
$$ packed form
35564d48841L27803P351k79135l58540j20995K26709L77337L16775K02946P373
35554B58783l46656o15897m44693P1239M06120K34409k33034n49532m45592O914
35544a657939M24970M05494J191k66574j23867N320l21172p20680m53919L84321
35534b322855Q73144N56229J8335p9570J12216J15420m4362j5213K18777L71041
35524a96838L47740K71631J61263k8110j72291j37485m6328n6578k5744K41612
35514C58872N57951N75615L43621K01191J73802l8944m44539o27880l83517l3227
35504F82945R3245R9470J89618K49968R3412j36306j62871k9868k6392k35401
35494H17820m34801m17447j90760J10744L22212K94436K5336k69607l56805k20750
$$ plain form
35484 -319622 -317920 -98818 268751 590656 638964 407342 137985 1075 -100556 -290317
35474 -290317 -454019 -412240 -242540 -203062 -377207 -611075 -811602 -1095842 -1554194 -1994488
35464 -1994488 -2038126 -1468328 -482993 380169 648829 362082 77071 297594 906590 1310939
$$ packed form
35484c19622J702K19102L67569L21905M8308k31622k69357j36910j01631j89761
35474b90317j63702M1779J69700L9478j74145k33868k00527k84240m58352m40294
35464a994488m3638N69798R85335Q63162K68660k86747k85011K20523O08996M04349
$$ [...]
##END NTUPLES=NMR SPECTRUM
##END=
