##TITLE=31Pdec_42-2026-Bay
 CDCl3,24 sc
 28.4.2026
##JCAMPDX= 6.0         $$ Bruker NMR JCAMP-DX V2.0
##DATA TYPE= NMR SPECTRUM
##DATA CLASS= NTUPLES
##ORIGIN= UXNMR, Bruker Analytische Messtechnik GmbH
##OWNER= root
$$ XWIN-NMR		Version 3.5
$$ Tue Apr 28 14:41:19 2026 Russian Standard Time (UT+4h)  she@DPX200
##.OBSERVE FREQUENCY= 81.013821
##.OBSERVE NUCLEUS= ^31P
##.ACQUISITION MODE= SIMULTANEOUS
##.ACQUISITION SCHEME= undefined
##.AVERAGES= 24
##.DIGITISER RES= 17
##SPECTROMETER/DATA SYSTEM= spect
##.PULSE SEQUENCE= zgpg30
##.SOLVENT NAME= DMSO
##.SHIFT REFERENCE= (INTERNAL, DMSO, 0, 197.392)
##AUDIT TRAIL= $$ (NUMBER, WHEN, WHO, WHERE, WHAT)
$$ ##TITLE= Audit trail, XWIN-NMR		Version 3.5
$$ ##JCAMPDX= 5.01
$$ ##ORIGIN= Bruker BioSpin GmbH
$$ ##OWNER= she
$$ F:/spectra/data/she/nmr/P31/2/pdata/1/auditp.txt
$$ ##AUDIT TRAIL=  $$ (NUMBER, WHEN, WHO, WHERE, WHAT)
(   1,<2026-04-28 14:40:07.50 +0400>,<she>,<DPX200>,
      <created by zg, POWCHK disabled, PULCHK disabled
       configuration hash MD5:
       00 E9 B6 7A A2 85 ED C7 34 08 36 98 17 FE 4E 26
       data hash MD5: 32K
       E3 FC 04 2E 86 E7 D7 27 3B BA 20 E5 E2 8E 43 DF>)
(   2,<2026-04-28 14:40:10.62 +0400>,<she>,<DPX200>,
      <Start of raw data processing
       efp BC_mod = 2 LB = 1.5 FT_mod = 6 PKNL = 1 PHC0 = 1416.235 PHC1 = 54.50049 SI = 64K 
       data hash MD5: 64K
       31 F2 7A 0F DD 22 EC E4 54 1D 9C A4 0E 17 C4 2C>)
(   3,<2026-04-28 14:40:31.18 +0400>,<she>,<DPX200>,
      <pk PHC0 = 2.181838 PHC1 = 0 
       data hash MD5: 64K
       80 0D 87 9E D2 ED 83 02 14 A2 04 21 4B CA D0 89>)
(   4,<2026-04-28 14:40:36.65 +0400>,<she>,<DPX200>,
      <abs ABSG = 5 
       data hash MD5: 64K
       92 52 9D 37 65 52 49 A2 19 5D B6 71 80 1A EE F9>)
$$ ##END=
$$ 
$$ hash MD5
$$ 79 69 62 6F A0 C7 7B 66 E1 74 41 53 79 A7 B4 32
##$RELAX= 
##$RELAX= 
##$RELAX= 
##$RELAX= 
##$RELAX= 
##$RELAX= 
##$RELAX= 
##$RELAX= 
$$ Bruker specific parameters
$$ --------------------------
##$DU= <F:/spectra>
##$EXPNO= 2
##$NAME= <P31>
##$PROCNO= 1
##$TYPE= <nmr>
##$USER= <she>
##$AMP= (0..31)
100 100 100 100 100 100 100 100 100 100 100 100 100 100 100 100 100 100 
100 100 100 100 100 100 100 100 100 100 100 100 100 100 
##$AQSEQ= 0
##$AQ_mod= 1
##$AUNM= <au_zg>
##$AUTOPOS= <>
##$BF1= 81.014009
##$BF2= 200.13
##$BF3= 200.13
##$BF4= 200.13
##$BF5= 200.13
##$BF6= 200.13
##$BF7= 200.13
##$BF8= 200.13
##$BYTORDA= 1
##$CFDGTYP= 0
##$CFRGTYP= 5
##$CHEMSTR= <none>
##$CNST= (0..31)
1 1 145 1 1 1 1 1 1 1 1 1 1 1 1 1 1 1 1 1 1 1 1 1 1 1 1 1 1 1 1 1 
##$CPDPRG= <waltz16>
##$CPDPRG1= <>
##$CPDPRG2= <waltz16>
##$CPDPRG3= <>
##$CPDPRG4= <mlev>
##$CPDPRG5= <mlev>
##$CPDPRG6= <mlev>
##$CPDPRG7= <mlev>
##$CPDPRG8= <mlev>
##$CPDPRGB= <>
##$CPDPRGT= <>
##$D= (0..31)
0 1 0 0 0 0 0 0 0 0.06 0 0.03 2e-05 3e-06 0 0 0.0002 0 0 0 0 0 0 0 0 0 
0 0 0 0 0 0 
##$DATE= 1777372806
##$DBL= (0..7)
120 120 120 11 120 120 24 19 
##$DBP= (0..7)
150 150 150 150 150 150 150 150 
##$DBP07= 0
##$DBPNAM0= <>
##$DBPNAM1= <>
$$ [...]
##$SUBNAM3= <"">
##$SUBNAM4= <"">
##$SUBNAM5= <"">
##$SUBNAM6= <"">
##$SUBNAM7= <"">
##$SUBNAM8= <"">
##$SUBNAM9= <"">
##$SW= 400.765351723535
##$SWIBOX= (0..15)
0 1 3 0 0 0 0 0 0 0 0 0 0 0 0 0 
##$SW_h= 32467.5324675325
##$TD= 32768
##$TD0= 1
##$TE= 0
##$TE2= 300
##$TE3= 300
##$TEG= 300
##$TL= (0..7)
0 120 53 12 22 120 120 120 
##$TP= (0..7)
150 150 150 150 150 150 150 150 
##$TP07= 0
##$TPNAME0= <>
##$TPNAME1= <>
##$TPNAME2= <>
##$TPNAME3= <>
##$TPNAME4= <>
##$TPNAME5= <>
##$TPNAME6= <>
##$TPNAME7= <>
##$TPOAL= (0..7)
0.5 0.5 0.5 0.5 0.5 0.5 0.5 0.5 
##$TPOFFS= (0..7)
0 0 0 0 0 0 0 0 
##$TUNHIN= 0
##$TUNHOUT= 0
##$TUNXOUT= 0
##$USERA1= <user>
##$USERA2= <user>
##$USERA3= <user>
##$USERA4= <user>
##$USERA5= <user>
##$V9= 5
##$VALIST= <valist>
##$VCLIST= <CCCCCCCCCCCCCCC>
##$VD= 0
##$VDLIST= <DDDDDDDDDDDDDDD>
##$VPLIST= <PPPPPPPPPPPPPPP>
##$VTLIST= <TTTTTTTTTTTTTTT>
##$WBST= 1024
##$WBSW= 4
##$XGAIN= (0..3)
0 0 0 0 
##$XL= 0
##$YL= 0
##$YMAX_a= 17677
##$YMIN_a= -9487
##$ZGOPTNS= <>
##$ZL1= 120
##$ZL2= 120
##$ZL3= 120
##$ZL4= 120
##$ABSF1= 197.3918
##$ABSF2= -203.3724
##$ABSG= 5
##$ABSL= 3
##$ALPHA= 0
##$AQORDER= 0
##$ASSFAC= 0
##$ASSFACI= 0
##$ASSFACX= 0
##$ASSWID= 0
##$AUNMP= <proc_1d>
##$AZFE= 0.1
##$AZFW= 0.5
##$BCFW= 0
##$BC_mod= 2
##$BYTORDP= 0
##$COROFFS= 0
##$CY= -3
##$DATMOD= 1
##$DC= 0
##$DFILT= <>
##$DTYPP= 0
##$F1P= 0
##$F2P= 0
##$FCOR= 1
##$FTSIZE= 65536
##$FT_mod= 6
##$GAMMA= 0
##$GB= 0
##$INTBC= 1
##$INTSCL= 9.790993e-09
##$ISEN= 30
##$LB= 1.5
##$LEV0= 0
##$LPBIN= 0
##$MAXI= 10000
##$MC2= 0
##$MEAN= 0
##$ME_mod= 0
##$MI= 50
##$NCOEF= 0
##$NC_proc= -5
##$NLEV= 6
##$NOISF1= 182.463
##$NOISF2= 159.3651
##$NSP= 0
##$NTH_PI= 0
##$NZP= 0
##$OFFSET= 197.3918
##$PC= 4
##$PHC0= 1418.417
##$PHC1= 54.50049
##$PH_mod= 1
##$PKNL= yes
##$PPARMOD= 0
##$PSCAL= 0
##$PSIGN= 0
##$REVERSE= no
##$SF= 81.014063255964
##$SI= 65536
##$SIGF1= 159.3651
##$SIGF2= -187.1042
##$SINO= 113.3802
##$SIOLD= 16384
##$SREGLST= <1H.CDCl3>
##$SSB= 0
##$STSI= 65536
##$STSR= 0
##$SW_p= 32467.5324675325
##$SYMM= 0
##$S_DEV= 0
##$TDeff= 32768
##$TDoff= 0
##$TI= <>
##$TILT= no
##$TM1= 0
##$TM2= 0
##$TOPLEV= 0
##$USERP1= <user>
##$USERP2= <user>
##$USERP3= <user>
##$USERP4= <user>
##$USERP5= <user>
##$WDW= 1
##$XDIM= 65536
##$YMAX_p= 316438630
##$YMIN_p= -2448450
$$ End of Bruker specific parameters
$$ ---------------------------------
##NTUPLES= NMR SPECTRUM
##VAR_NAME=  FREQUENCY,     SPECTRUM/REAL,   SPECTRUM/IMAG
##SYMBOL=    X,             R,               I
##VAR_TYPE=  INDEPENDENT,   DEPENDENT,       DEPENDENT
##VAR_FORM=  AFFN,          ASDF,            ASDF
##VAR_DIM=   65536,         65536,           65536
##UNITS=     HZ,            ARBITRARY UNITS, ARBITRARY UNITS
##FACTOR=    0.49542278885378, 1,            1
##FIRST=     15991.5117654749, 0,            0
##LAST=      -16476.0207020576, 0,           0
##MIN=       -16476.0207020576, -2448450,    0
##MAX=       15991.5117654749, 316438630,    0
$$ Real data points
##PAGE= N=1
##DATA TABLE= (X++(R..R)), XYDATA
$$ [...]
41074D41596m5095n4042j62662k11924j08868J4986J6198l0352J4032P4105l5784
41063h7810k65849l27768q3189K55606L89533K60113M9354l6766O1143K06984
41053D21351J75217r5706l74725l93127j89652k1255L1792J18925K61260K41086
41043A75166l1714l06722l21670j39622J5901P7359J03327J03120Q3298J20967
41033a20590K11066J98997M8784j3567J40241K37608j9774m25364m93794j61794
41023c98187J31838J00196m1643o459J23224R9225p8345j92424j33239Q629J12819
41012b74366J43302J25888J18339J75468K65989K55628M8463k62471m39587l16710
41002a60057K7163L14748L24324J13435n5513k6643R8083J54295J28417P4700
$$ y = [441596, 396501, 342459, 179797, -32127, -140995, -126009, -109811, -140163, -126131, -52026, -87810, -353659, -681427, -764616, -509010, -119477, 140636, 189990, 153224, 214367, 421351, 596568, 500862, 126137, -266990, -456642, -477897, -446105, -327180, -65920, 175166, 143452, -163270, -484940, -624562, -608661, -531302, -427975, -324855, -241557, -120590, 90476, 289473, 338257, 324690, 464931, 702539, 682765, 257401, -236393, -398187, -266349, -166153, -207796, -214255, -91031, 8194, -70151, -262575, -395814, -387185, -274366, -131064, -5176, 113163, 288631, 554620, 810248, 858711, 596240, 156653, -160057, -132894, 181854, 506178, 619613, 564100, 537457, 635540, 789835, 918252, 992952]
40992I92952l9938k34940l61900k63279l5230P7592K0642m7839m6233m0986k7996
40981g155Q8815K48021K29300J797j79538j57917j09282k18071l47407k66768
40971g18205l9275P9666L2346l841P3397J67605J70533R5362J1064k3232L3897
40960a20683J45387J73215M4270j03413r0571K5961K9145j16100k08923j42908
40950c64620o7678j06331j17093O0990K61304J61122k13528m32372k23659J35454
40940i06411K07561K5125J9516L29757N38090K75012j95924l16224j0202K47217
40930B13517J34256j16794j46716J8873J09770M4257m4696r4620j58241k02330
40920b42724j01564J36919L21256L01837J33522k5786q3383m9756P282J0986o5670
$$ y = [992952, 953014, 718074, 356174, 92895, 57665, 135257, 155899, 108060, 61827, 20841, -7155, 81660, 329681, 558981, 560778, 381240, 223323, 114041, -104030, -451437, -718205, -757480, -677814, -645468, -649309, -575912, -408307, -237774, -142412, -131348, -154580, -120683, 24704, 197919, 242189, 138776, 48205, 74166, 103311, -12789, -221712, -364620, -432298, -538629, -655722, -594732, -333428, -172306, -385834, -818206, -1041865, -906411, -698850, -673725, -654209, -324452, 213638, 488650, 292726, -23498, -33700, 213517, 347773, 230979, 84263, 103136, 212906, 257163, 212467, 117847, -40394, -242724, -344288, -207369, 113887, 415724, 549246, 523460, 440077, 390321, 397603, 408589, 342919]
40909C42919j64164j94273j25643o277Q4850Q3318j0417r3252m3677J03880J55442
40898A32706Q761j81405k01970o7356L4794K8127J0139M2061M8461l0084j19723
40887b95489j18541l4238M3785N8987L4799L5193Q8789J38299R7923j2172n7419
40876b0084K4929J15119Q1269k6738p9927p8196r0117o5222P7414K15584J31390
40865B85421j32212k77313j71248p509M3628P7139J93290K53847J26078l0234
40855C60887J1493J64312J49191p7030k78044k90155j77490m9125M9794O3703
40845g2464l2280j03982N355J89959J74742n9680k06946q8412Q2074M3074j32147
40834b00707j97172r6962M1677J42274J88452J24194l7559j16992n444J08282
$$ y = [342919, 178755, -15518, -141161, -147438, -62588, 20730, 10313, -82939, -126616, -22736, 132706, 141467, -39938, -241908, -309264, -274470, -246343, -236204, -194143, -145682, -175766, -295489, -414030, -448268, -404483, -345496, -310697, -275504, -186715, -48416, 49507, 37335, -20084, 4845, 119964, 201233, 174495, 94568, 16372, -73745, -138967, -61553, 154031, 285421, 153209, -124104, -295352, -302861, -259233, -182094, 11196, 265043, 391121, 360887, 372380, 536692, 685883, 608853, 330809, 40654, -136836, -185961, -136167, -72464, -104744, -208726, -203371, -13412, 161330, 101650, -105296, -193708, -111634, -68560, -200707, -397879, -494841, -453164, -310890, -122438, 1756, -35803, -152795, -158239, -49957]
40824d9957O673j67394j07647J31699J83059m0182j88193k8872K14995K71373
40814B25554K15500K01166J05092k17258n43465n32229k34428P52M4646O0683
40804f73987J18108J15107Q6150J96526L65026K72673j15996l84690k11377J97441
40794c5019M21903L38479J10899j06366k33385k17041j27931j38787k29402j30307
40784c46957K23697M38323J71673l10432m68308k27214L2538J21334J94166K57981
40774H6801N1093m12840o35605k69323L47608O03212L59119J779j03294O2356
40764I0906K91741L56828J50246j81630l14631j31889O7466m3802l32152l85339
40754d32256j29489P6786J5921p1744P7446K94525K45816k2618j49180j5297R9090
$$ y = [-49957, -43284, -210678, -318325, -186626, -3567, -43749, -231942, -260814, -45819, 225554, 441054, 642220, 747312, 530054, -13411, -545640, -780068, -779316, -734670, -673987, -555879, -440772, -354622, -158096, 206930, 479603, 363607, -21083, -232460, -35019, 386884, 725363, 836262, 729896, 496511, 279470, 151539, 12752, -216650, -346957, -123260, 315063, 486736, 176304, -292004, -519218, -486680, -365346, -171180, 86801, 137894, -274946, -910551, -1179874, -832266, -229054, 130065, 131844, 28550, 90906, 382647, 739475, 889721, 708091, 393460, 261571, 329037, 285235, -46917, -432256, -561745, -484959, -469038, -540782, -463336, -168811, 77005, 54387, -94793, -110090, -11000]
40743a1000j4799j72910j18604O4113J02120l2410j10282k9522N5428K9210j332
40732b39988P4745J65528J30195J72r7823j30760j32883q9984M754O6767M1401
40721b07876K6061J10900J80182O2660j76681k99009k17603o0944O7783J73070
40711c41457K05833O3955j84844l01203j87959j8801L9805N0061J28821K19633
40701c26156J85053J4145j81381k83083j98293Q9263M01657M48059J66390j35135
40691A80519j31841J16772K78351J83699k0481j21080p7331P688L9403J3395j3145
40680D55949j6480n7881j83205k85355j89685Q6821K96545K56336N8370r9988
40670C21427j65737j92273j73030o7274P6367J58230J47690O9631o2925k04528
$$ y = [-11000, -25799, -198709, -317313, -253200, -151080, -183490, -293772, -323294, -267866, -238656, -239988, -165243, 285, 130480, 130652, 32829, -97931, -230814, -320798, -316044, -249277, -207876, -181815, -70915, 109267, 171927, -4754, -303763, -521366, -582310, -514527, -341457, -135624, -71669, -256513, -557716, -745675, -764476, -724671, -674610, -545789, -326156, -141103, -126958, -308339, -591422, -789715, -700452, -298795, 149264, 315654, 180519, 48678, 165450, 443801, 627500, 607019, 485939, 408608, 416296, 455699, 469094, 455949, 439469, 381588, 198383, -86972, -276657, -189836, 106709, 363045, 421415, 321427, 155690, -36583, -209613, -276887, -200520, -42290, 105400, 175031, 112106, -92422]
40660i2422k40009j05298J02558K20511J72521j5007k39642l09318o6624L57831
40650b14899N79174L99977O9175p3638n2640j22337l07502l65740j77131R0930
40640a74631K36982K45908K21117K41320L01351K98604J20463j61969k96350j83383
40630H49412o4993j77734l68381l28755r5973J3099q9725j74576j14643m2022
40620e94291l1175K3776J17711O0707j55990k37950l2090J82294R3229j63922
40610g37701j99683P7144L57258L49527J12488n4585M1272K73295L32771J03106
40600F54892j81059k54855j88596k18024l09041k17790L1133J14266n0540j23814
40590g43428J06924L56461K86445K3599p9282K5151J10773P9402J6798m1510j18103
$$ y = [-92422, -332431, -437729, -335171, -114660, 57861, 42854, -196788, -506106, -572730, -214899, 364275, 764252, 833427, 759789, 707149, 584812, 277310, -88430, -265561, -174631, 62351, 308259, 529376, 770696, 1072047, 1370651, 1491114, 1329145, 1032795, 849412, 784419, 606685, 238304, -90451, -186424, -173325, -263050, -437626, -552269, -594291, -625466, -601690, -483979, -423272, -579262, -817212, -849302, -667008, -573779, -737701, -937384, -860240, -502982, -153455, -40967, -95552, -54280, 219015, 551786, 654892, 473833, 218978, 30382, -187642, -496683, -714473, -683340, -569074, -619614, -743428, -636504, -280043, 6402, 30001, -49281, -24130, 86643, 166045, 182843, 141333, 23230]
40579B3230j50883q2997m930M676M9495J97131K51626L4143k48753k52895j9382
40568a99539J04614J6321m5244L9821Q9490j9807j42437j38565q1218n2123K2755
40557d05932J79892K67542J54942n9388j92362k07232j79586j42075p3681L7456
40547f20424J93566L65946M35094K72926n7735l05333k97450j03581J10462K58394
40537B51865L07006K23502N0367q0728j08076j16534j72398j97069j16572k9574
40527A1789p5879j96833j87349J2641K12880K03964Q864j55200j22896O9756K65962
40516D7699L46792K79346Q0614j67502k95467j80956N3046J15293r0796l11512
40506a23443k74493n2080Q0026M9414K7127R5966J24996K6454p0538j0772J58456
$$ y = [23230, -127653, -210650, -215580, -210904, -161409, 35722, 287348, 321491, 72738, -180157, -199539, -94925, -78604, -123848, -84027, 5463, -14344, -156781, -295346, -376564, -428687, -405932, -226040, 41502, 196444, 137056, -55306, -262538, -442124, -584199, -657880, -620424, -426858, -60912, 374182, 647108, 589373, 284040, -13410, -116991, -6529, 251865, 558871, 782373, 832740, 752012, 643936, 527402, 355004, 157935, 41363, 11789, -64090, -260923, -448272, -435631, -222751, -18787, -9923, -165123, -288019, -218263, 47699, 394491, 673837, 754451, 586949, 291482, 110526, 163572, 278865, 188069, -123443, -397936, -450016, -369990, -320576, -293449, -197483, -72487, -46033, -116571, -127343, 31113]
40495C1113K57709J94898L4960r7310j30235r2158o6946q8217j08742j03516j24475
40484b92919j81915j71583l7106R3560Q2814l608l3276m2742j04739p3143K17416
40473e47241N43324M64039l4405m33769l61930m5177J08070O6512N7228J30372
40463e2977J51878R4758N6813N5178K2823m2454r5384j37257j46362k5448K09713
40452I1281L12428R5409k43301l16314l5739K96825L71110J61114j39104k97865
40442B95844j84390J04181K70337J32707j15404j44675M6939J37876l2829k31475
40432B79111j79561O0808J98422Q6503j55554l19656k87905q0922J63006K69683
40422C3935J72629j6868j29203j21270r3777j21361j30645q069J97013K78558
$$ y = [31113, 288822, 483720, 518680, 421370, 291135, 198977, 132031, 43814, -64928, -168444, -292919, -474834, -646417, -683523, -589963, -507149, -510757, -544033, -586775, -691514, -764657, -547241, -3917, 460122, 425717, -8052, -369982, -415159, -307089, -240577, -183349, -52977, 98901, 193659, 250472, 305650, 328473, 286019, 190635, 53378, -92984, -118432, 91281, 403709, 499118, 255817, -60497, -96236, 200589, 571699, 732813, 593709, 295844, 111454, 215635, 485972, 618679, 503275, 358600, 405539, 543415, 510586, 279111, 99550, 160358, 358780, 445283, 289729, -29927, -317832, -398754, -235748, 33935, 206564, 189696, 60493, -60777, -154554, -275915, -406560, -414629, -217616, 60942]
40412F0942J34193p0920j14005l0026m8145k13703k81698p9821K10344K99706
40402a33133J83565Q3864Q4418O2625k1128j0929J72256L24549J79589k39012
40392F86664o14688o69075m09452n9619J63393J81709N2939q6764j07819l283
40382h65995P4300k2942k16993k55146m1916K02893K33568J10872O8511J28289
40372e84559Q4271j27703k82807j71753J21573L38905L20926J05810j22504j49350
40362d67191P2305L14477L10135R7243n1619k7640K6468L0634O9854J24968L0287
40351E29921j83574k38724o0070O2554m5404j59152r2011l6668j52717j95252
40341e71097L6849K32097L9207k82517k45444N5074J28873m6808k3290K76647
$$ y = [60942, 195135, 124215, 10210, -19816, -67961, -281664, -563362, -643183, -432839, -133133, 50432, 134296, 218714, 281339, 260211, 249282, 421538, 746087, 925676, 686664, 71976, -597099, -1006551, -1066170, -902777, -721068, -668129, -754893, -862712, -865995, -791695, -814637, -1031630, -1286776, -1328692, -1125799, -892231, -781359, -712848, -584559, -500288, -627991, -910798, -1082551, -960978, -622073, -301147, -195337, -317841, -467191, -394886, -80409, 229726, 326969, 275350, 247710, 274178, 304812, 374666, 499634, 529921, 346347, 107623, 47553, 110107, 64703, -94449, -186460, -223128, -375845, -571097, -534248, -302151, -262944, -545461, -790905, -735831, -606958, -653766, -677056, -400409]
40331d00409L89922J08320j72914j10132J13910K06255J82989J24703m6109k70399
40321A26136k41598J13936M08256L42161J39212J15312J54915q138k70086l36092
40311E44014k31869k29045l63418l94329k06841M3330J80112J82636J26760J09433
40301b39217J83796K55280J43147j46944l57640l10768j37061m5096n2362q8197
40291g95062j40924j36353P3160L89793M27443O6609k36402n5527L47129M08052
40281C47918J11166n9156P8917J89763M3836j52294j87661j68539k07424j61533
40271a65007O7312K58736J73686o5468j49214q570J51964J62836L8712j24259
40261C40728k29570j84483K6285K55847K92041P9867k01925l14624j91649J5629
$$ y = [-400409, -10487, 97833, -75081, -185213, -71303, 134952, 317941, 442644, 396535, 126136, -115462, -1526, 406730, 748891, 888103, 1003415, 1158330, 1150192, 880106, 544014, 312145, 83100, -280318, -674647, -881488, -838158, -658046, -475410, -348650, -239217, -55421, 199859, 343006, 196062, -161578, -472346, -609407, -654503, -706865, -795062, -935986, -1072339, -999179, -609386, -181943, -115334, -351736, -407263, -60134, 347918, 459084, 399928, 478845, 668608, 712444, 560150, 372489, 203950, -3474, -165007, -97695, 161041, 334727, 269259, 120045, 111475, 263439, 426275, 464987, 340728, 111158, -73325, -47040, 208807, 500848, 580715, 378790, 64166, -127483, -111854]
40251a11854J11830N0392o4706j33772j46877j17985l3942Q1550J34985O5147
40241a65232p1266j65469j57640m6167J22766K39699K03125N6333l9948j2739
40231c6538M9885N9057K4915l3023j09444j13273M5791K15112J05704k46910m18758
40220d57482j75062J78551K60753J41247R4335R6189l6448k00602j39395Q2583
40210a55331J60110N1947k041N5421K8920j14508j59894m1650M1592K234J4065
40199a19135J73396L13071K76716J20292n3101k10483k73192j47616N8244J10301
40189B48493J318l6825Q2407J92819J93474J56919P6220j39311l50490k68106
40179A56918M2743J56188o2683k39565j30603j1231j27258k22422k7533J81068
$$ y = [-111854, -24, 50368, -14338, -148110, -294987, -412972, -446914, -365364, -230379, -165232, -236498, -401967, -559607, -605774, -483008, -243309, -40184, 16149, -23799, -36538, 13347, 72404, 97319, 64296, -45148, -158421, -112630, 102482, 208186, -38724, -457482, -632544, -453993, -193240, -51993, 42342, 138531, 102083, -98519, -237914, -155331, 4779, 56726, 54685, 110106, 139026, 24518, -135376, -177026, -135434, -133200, -119135, 54261, 367332, 644048, 764340, 711239, 500756, 227564, 79948, 138192, 248493, 249811, 212986, 295393, 488212, 681686, 838605, 914825, 775514, 425024, 156918, 199661, 355849, 293166, 53601, -77002, -88233, -215491, -437913, -465446, -284378]
40169b84378K1681k87681k27214J80823L85613J36752k00059k21001L4528K91883
40159a69053M00787L50939J73756l1624j26165p9114L352K2701k3683q3962r6910
40148C41024l0136O0313P6838L2369K7644K9857j16875l58415l73897m6292K74238
40137h3332K43487J5854n7559P872k9697j15462O470K48152K25214j14094l63262
40126a6357k61064j1635J27147J83079K24935J49506n4572j47107q249R1902j11201
40115A66384m18036m22709r9554J90844K31115J72923J99523K34526J19214q7698
40105B86532j61008j7126J66605J76920K3775j04929j08311p4656r4543j00256
40095f997J0295J75270K20201P4684j59126l23921l17425j41969O9361J41898
$$ y = [-284378, -262697, -550378, -777592, -596769, -211156, -74404, -274463, -495464, -460936, -169053, 231734, 582673, 756429, 724805, 598640, 519526, 522878, 545579, 521896, 437934, 341024, 310888, 371201, 448039, 480408, 508052, 537909, 421034, 62619, -311278, -357570, -83332, 160155, 176009, 118450, 126322, 96625, -18837, -12367, 235785, 460999, 346905, -16357, -277421, -289056, -161909, 21170, 246105, 395611, 341039, 193932, 185683, 277585, 166384, -251652, -674361, -773915, -583071, -351956, -179033, 20490, 255016, 374230, 286532, 125524, 108398, 275003, 451923, 475698, 370769, 262458, 187802, 93259, -6997, 3298, 178568, 398769, 473453, 314327, -9594, -327019, -468988, -399627, -257729]
40085b57729O4432K0429J17387K08049J25250m0129r5572o2504r1388j52940r7481
40074b62196K6667K2609q8186o6821J26222K30811J03632o0406o3763J360l3152
40063f3223j31606j75277j78468j99574j85400p2126Q4960K19803L54215M57319
40053A10623L70434M3531k89342l57784j88342l3733m9771j79175k76813k28663
40043a079035k4054J93827K43105J39662Q1930J31412J09311o7793j83352n1690
40033e06677J58662J83564O4925P701q056j34030k75112j83319Q6948J94799M3218
40022c67377o0027J01012L06042K42956m1144k52720k56835j55559n5587M3551
40012d95688J50554K14284J79313N8356n2004l5606J12050K39406K16207J22879
$$ y = [-257729, -193297, -172868, -55481, 152568, 277818, 237689, 142117, 79613, -11775, -164715, -262196, -235529, -212920, -301106, -367927, -241705, -10894, 92738, 32332, -31431, -30071, -63223, -194829, -370106, -548574, -748148, -933548, -1005674, -920714, -700911, -346696, 110623, 481057, 524588, 235246, -122538, -310880, -344613, -394384, -573559, -850372, -1079035, -1103089, -909262, -666157, -526495, -444565, -313153, -203842, -271635, -454987, -506677, -348015, -164451, -99526, -91825, -99881, -233911, -509023, -692342, -605394, -410595, -367377, -427404, -326392, -20350, 222606, 181462, -71258, -328093, -483652, -539239, -495688, -345134, -130850, 48463, 106819, 54815, 19209, 131259, 370665, 586872, 709751]
40002G09751J21820J63987L2709k80473m80590l70305j32303l7070n5657R927
39992c18204J53809J97352J20853P9159R2397J534k12431l28212k16006m1576
39982d71325J4976M7695K27581M55532M52894J52828k06510l77954l25802j51246
39972a81331K9433J03029J8708j09928r3300Q2182K12844J53870R426m4723j2075
39961A68135k4683j18953j93642j62250m8450N5216O3900k7884j06260l6672J46153
39950b85390K40520J41600j0549m6839l443L406N332Q6250J63122J00940j8869
39939C76080o122R6991P1971p5519r6023N3093P9256j63929l82914k71429K1384
39928b97161J35024K7396m2042N3412J82294K08362J14680q6091l33391m50507
$$ y = [709751, 831571, 995558, 1028267, 747794, 267204, -103101, -235404, -272474, -328131, -318204, -164395, 32957, 153810, 232969, 325366, 326900, 114469, -213743, -429749, -471325, -456349, -408654, -181073, 274459, 727353, 880181, 673671, 295717, -30085, -181331, -151898, -48869, -30161, -140089, -233389, -151207, 61637, 215507, 224933, 180210, 168135, 143452, 24499, -169143, -331393, -379843, -324627, -260727, -288611, -394871, -431543, -285390, -44870, 96730, 86181, 39342, 35899, 39305, 44637, 130887, 294009, 394949, 376080, 369958, 466949, 538920, 463401, 367378, 420471, 499727, 335798, -47116, -318545, -297161, -162137, -134741, -176783, -123371, 58923, 267285, 381965, 295874, -37517, -488024]
39918d88024l23776j12076m6109o8175N8244L13624M20070L03704K15622K82019
39908E55123K67640j7936l57164m15240j92198O0935K11370K74636K13753n943
39898E94976k30570k50934r1758N7238J47853K60329L29131J86818r4702k20045
39888F88336j16609o4821k36706l91225k52838L8948J39761J1674p1694L4806
39878b20368J79856J86574O1092r6177k01921j87404m6930R1686R0309m569l5994
39867a83846J8822N7435P7264J61148K33283J02577j78374k75921l9776K39961
39857B12573K26680j5120j74883j31482q412P9008J02196L0233j26980k44826
39847e1013k25604j41413q3509J0939J91800K94248J58588n1613m0505J69031
$$ y = [-488024, -811800, -923876, -969985, -1038160, -979916, -666292, -246222, 57482, 273104, 555123, 822763, 804827, 447663, 32423, -159775, -98840, 112530, 387166, 600919, 594976, 364406, 113472, 21714, 78952, 226805, 487134, 816265, 1003083, 908381, 688336, 571727, 506906, 270200, -121025, -373863, -334915, -195154, -183480, -255174, -220368, -40512, 146062, 207154, 110977, -90944, -278348, -325278, -233592, -143283, -147852, -183846, -165024, -107589, -30325, 130823, 364106, 466683, 288309, 12388, -27388, 212573, 439253, 424133, 249250, 117768, 109356, 188364, 290560, 320793, 193813, -51013, -276617, -418030, -501539, -490600, -298800, -4552, 154036, 102423, 61918, 230949]
39837B30949K76479J73289N7358N5641M8630n2159j43378j56938j85618k54888
39827D9365k16586k5112J03642k977j82836j46689J35376M17174M63591K38121
39817H33069j03832l08513k10635P5040K37571J16906j33650k80387k64916j64372
39807b03719n7666k3261j14337k31190j67494J07337L57520L78760K34305Q8304
39797C68559k0019j03014j07768l9100l5362j43982j81043j1138J88196J70656
39787H5985L26o4238K8567R9436O2131J1877M85l7185j08426j20899n6817j8745
39775a17503n9631j09643j08670q8170q7148q8692o7782k5604L3002R7829J44299
39764d77713J74455K24369K85740K93071K38584J93685J52075j0k47274l49235
$$ y = [230949, 507428, 680717, 738075, 793716, 842346, 790187, 646809, 489871, 304253, 49365, -167221, -192333, -88691, -91668, -274504, -421193, -285817, 131357, 594948, 833069, 729237, 420724, 210089, 285129, 522700, 639606, 505956, 225569, -39347, -203719, -261385, -284646, -398983, -630173, -797667, -690330, -332810, 45950, 280255, 368559, 348540, 245526, 137758, 98658, 63296, -80686, -261729, -272867, -84671, 85985, 86311, 22073, 50640, 150076, 212207, 224084, 224569, 187384, 78958, -41941, -98758, -117503, -177134, -286777, -395447, -483617, -570765, -659457, -727239, -752843, -719841, -622012, -477713, -303258, -78889, 206851, 499922, 738506, 932191, 1084266, 1084256, 836982, 487747]
39754D87747j58246J09698J40752m4629j61252q8715J9473K6482l4435j04679
39744A92196j72450j73006k7623J72651K15854O2417q3814o7330J7141O986p6836
39733F6186q0723M6504J76783J59399K438j29313j03599K5406J08166J07675R5904
39722D74826O0136r3139k90761k80158k705K31927J41551j34209k59707j69164
39712c21403m9975J6460J05958K03881J89722O6163k8836m1331l7321l4901J3675
39701H2092R1637J34631J41158J23405L0081j29302k03695j19948l2614n6775
39691F0670n0147Q4921J24783r7188k77629p6257K26501P6368m31892o09108k01670
39680a170648K62131L24991J99538K34811L22746K21013M8839M0033R8528k773
$$ y = [487747, 329501, 439199, 579951, 535322, 374070, 285355, 304828, 331310, 296875, 192196, 19746, -153260, -180883, -8232, 207622, 270039, 186225, 118895, 136036, 143022, 66186, -14537, 31967, 208750, 368149, 370587, 241274, 137675, 163081, 271247, 378922, 474826, 534962, 441823, 151062, -129096, -131801, 100126, 241677, 107468, -152239, -321403, -371378, -354918, -248960, -45079, 144643, 210806, 181970, 140639, 103318, 68417, 82092, 173729, 308360, 449518, 572923, 603004, 473702, 270007, 150059, 117445, 60670, 10523, 95444, 220227, 123039, -154590, -230847, -4346, 72022, -359870, -968978, -1170648, -908517, -583526, -383988, -149177, 173569, 394582, 443421, 483454, 581982, 579209]
39670E79209j94262k36411j15191n597K9248M0393J0603j02564k36187l02580
39660e33339k93028j95539J7932K24674K09852K3597K735K55008M19052J89390
39650C20334j98962l22854j77529p9721j30895j47145m2783N8349P9314P8473
39640e63419P6426K1551o3116q2313k1541M3976P3694P8042N6091K5778N2719
39629c02112J43598J86576J02269k6376p3274l5566N066L33n2692j20513j13419
39618b86110J9182J54095J20924k2973n5582N1184R6482J7784j3221N3217L0966
39607A65948j25123j84109o5724l5403k27921l39665j10918K12873K67105J35950
39597c06987J37404K66353K70550J26463L4509L7247M554p2594r2319p6140j12982
$$ y = [579209, 384947, 148536, 33345, 27748, 56996, 97389, 107992, 5428, -230759, -533339, -826367, -1021906, -1003974, -779300, -569448, -545851, -543116, -288108, 130944, 320334, 121372, -201482, -379011, -458732, -589627, -736772, -779555, -721206, -641892, -563419, -486993, -465442, -528558, -610871, -632412, -588436, -514742, -436700, -380609, -354831, -302112, -158514, 28062, 130331, 103955, 30681, -4885, 181, 514, -52178, -172691, -286110, -266928, -112833, 8091, -14882, -70464, -19280, 77202, 94986, 81765, 134982, 165948, 40825, -143284, -209008, -244411, -472332, -811997, -922915, -710042, -442937, -306987, -169583, 96770, 367320, 493783, 528292, 565539, 570093, 497499, 405180, 329040, 216058]
39586B16058j54709j20518q7975j32531j29944J6849J34215N6031n0054L1114
39576b21464J47585L6640j77824j70328L0679J11572J1006n0090j5406k3875k3677
39565c45182J84591M93432N21171J79463j81687k82757k09152j15461K916J23585
39555C70919J09736m3476j34139m9283Q2386J16892O2004m1245j84888k82919
39545E987k06817K207J41987J22870O7922J02930J91799K10721Q9096j08237j88597
39534D31868k9873J76172R0643k58854m28730k14326L051j24731l17715j41347
39524h13842K37748L18360P2005r9944p7134q7550j41428j6453J94715J35852
39514b77671j48805j90484J44013M20052L22932O9189n1039p1117q6872k5589
$$ y = [216058, 61349, -59169, -147144, -279675, -409619, -392770, -258555, -202524, -252578, -221464, -73879, -37239, -215063, -385391, -354712, -243140, -232134, -282224, -297630, -321505, -345182, -160591, 332841, 854012, 1033475, 851788, 569031, 359879, 244418, 247334, 370919, 480655, 437179, 303040, 253757, 336143, 453035, 515039, 473794, 288906, 5987, -200830, -198623, -56636, 66234, 134156, 237086, 428885, 639606, 728702, 620465, 431868, 401995, 578167, 668810, 409956, -18774, -233100, -230049, -354780, -672495, -813842, -576094, -257734, -185729, -285673, -362807, -450357, -591785, -608238, -413523, -277671, -426476, -616960, -472947, -52895, 270037, 339226, 288187, 217070, 130198, 104609]
39504A04609J14355J58865O7923J4807L5266m4288k21148k41214l4245J47033
39494A01963J45734R6855R4215K8726j24608k06961j63789j09981o5698L1282
39484a72262O9795p2725j69299N8264L36939J49377l49393m20658J33775O62139
39474B25952O96178N55577N85725N14735N5637m49440n35168l13185j67341j42103
39464A026567j02328j32879l04635l62503j08645J78046J42389p4812r1557R5747
39454B65390J65263L695j81082k05737r3263L6288P9600K2441k1252M4534J17454
39443B33331N4190m6580M097J25259J06767K1318P5022J45565k7802k83524k45733
39432A61910j8995k3771j93381p5014K77515L32215N6161j5201J91166J27272
$$ y = [104609, 218964, 377829, 445752, 460559, 495825, 451537, 230389, -10825, -45070, 101963, 247697, 344552, 438767, 467493, 342885, 135924, -27865, -137846, -203544, -172262, -102467, -175192, -344491, -286227, 50712, 200089, -149304, -569962, -436187, 225952, 922130, 1477707, 2063432, 2578167, 2633804, 2184364, 1649196, 1336011, 1168670, 1026567, 924239, 791360, 486725, 124222, 15577, 193623, 336012, 261200, 169643, 265390, 430653, 434348, 253266, 47529, -45734, -9446, 70154, 92595, 71343, 115877, 233331, 287521, 240941, 245038, 370297, 477064, 498382, 573404, 718969, 691167, 407643, 161910, 142915, 119144, -74237, -149251, 128264, 460479, 516640, 501439, 692605, 819877]
39422H19877k87914m01293K4058L53496J82762l9328N2099R7141j74956l62546
39412B63396j66321O0903M0206L9344J73227Q7207k33210k50975J08142K15722
39402C37641q1689j36156K32615L53524M9214K8394M15030L64379k41272l37266
39392I84414L55207O72584J78053M3818P20487Q56915j24326o19774L70332J371442
39382D809152J218349J245554K478925L227402K124515R44232J383696J871620
39374A9303445J082704J439178M769579Q132953R798066J5298917K8509208L8793707
39366A27127757K8945706j191346k9615299l6526269k5564468j4076423j0042854
39359C9056804q260896m421202j416553j664598k543859j876654j443233k573244
$$ y = [819877, 531963, 130670, 154728, 508224, 690986, 651658, 703757, 800898, 625942, 263396, 97075, 157978, 198184, 237528, 410755, 497962, 264752, 13777, 121919, 337641, 255952, 119796, 352411, 705935, 755149, 783543, 1198573, 1562952, 1321680, 984414, 1339621, 2012205, 2190258, 2234076, 2954563, 3811478, 3687152, 3067378, 3437710, 4809152, 6027501, 7273055, 9751980, 12979382, 15103897, 16048129, 17431825, 19303445, 20386149, 21825327, 26594906, 34727859, 44525925, 59824842, 88334050, 127127757, 156073463, 154882117, 125266818, 88740549, 63176081, 49099658, 39056804, 30795908, 26374706, 24958153, 23293555, 20749696, 18873042, 17429809, 14856565]
39351A4856565l276627k109394q15471r52564j313006o69622o2280m62001q19901
39342D375699k47612K10139l23717q19305l26514K46864o6882m91890q1305M82478
39332B957955K12918m11749m65079j74488j70997k18861O7413K40938r2481l57520
39322A588049m4899K73520o684l89556k27968Q8695n5352l34274j73231J44662
39312H62962R4975n3334J69317M33317J98320k48525k97090p1361q1315k60036
39302G47230k05613O952M8116L679J04481J62693m8624k47537j22188N7746n4611
39291D52324k09178m7419J78697O7815j64250q7196J48259J26678n5422l3389
39281C76919R9853K973k30157k53801j11042p1557o1194J29110K86707O4510l41167
$$ y = [14856565, 11579938, 9470544, 8655073, 7702509, 6389503, 5719881, 5657601, 5195600, 4375699, 4128087, 4338226, 4014509, 3195204, 2868690, 3115554, 3048672, 2556782, 2475477, 2957955, 3170873, 2759124, 2294045, 2119557, 1948560, 1729699, 1797112, 2038050, 1945569, 1588049, 1543150, 1816670, 1809986, 1420430, 1192462, 1281157, 1225805, 891531, 718300, 862962, 957937, 904603, 1073920, 1507237, 1705557, 1457032, 1159942, 1088581, 1007266, 747230, 541617, 548569, 596685, 600364, 704845, 867538, 818914, 571377, 449189, 506935, 452324, 243146, 195727, 374424, 442239, 277989, 190793, 339052, 465730, 410308, 376919, 476772, 479745, 249588, -4213, -115255, -186812, -248006, -118896, 167811, 232321, -108846]
39270a08846m09720p9030K37104L03866K33672J20081m467N1712M31726Q67889
39260A643987R28097N56606N3475l44904n59991n38330l51966k49021l16711l15031
39250E06211j02080Q0707L7938k6824O7062R4595j22598k78166q3300J57193J4125
39239C44863l32633l99630j76080j2816M0368J82800L16124J65458j36723j68729
39229a76998R7515K49693Q3285j57815k13146q9378J01272K54610K39790L5825
39219D24653j48004j29439j4767K4558M0313J04394N9229j96541m03301k81874
39209e20779K8063K13962K41024K07908L3505k99002m58054j87208K15431K97964
39199b27186J08125j3190l9273j45069k19101m5752K01011J96097L9780N5496
$$ y = [-108846, -518566, -597596, -360492, -56626, 177046, 297127, 292660, 344372, 776098, 1643987, 2572084, 3128690, 3182165, 2837261, 2277270, 1738940, 1386974, 1137953, 821242, 506211, 404131, 484838, 522776, 495952, 563014, 657609, 535011, 256845, 173545, 330738, 344863, 12230, -387400, -563480, -576296, -535928, -353128, -37004, 128454, -8269, -176998, -79483, 170210, 253495, 95680, -117466, -206844, -105572, 149038, 388828, 424653, 276649, 147210, 132443, 157001, 197314, 301708, 360937, 164396, -238905, -520779, -492716, -278754, -37730, 170178, 203683, -95319, -553373, -740581, -525150, -227186, -119061, -132251, -171524, -316593, -535694, -581446, -380435, -184338, -144558, -89062]
39189h9062J76317J02790p5438j6639K21896K69901R9117K26j2843j63636l48521
39178A64108k52905O656J6124j72000r5748K66508M22270K32707J16754K22418
39168I26892J47477k36289m08817n5368L38454K35392j15662j24786K17702M00414
39158A325409J73166j88938l34441k23119o9017o7053j72843j44739J04956K96481
39148F99862J50214j42441j69170M8854R3794j47165l03066j46651P5246J12270
39138B71747O8850P6969K4144j32884j48772J22515M09131L74025O7062k09490
39128I23297k97387k50805j76599j58127k01893j93783o1887M6053j5327p1830
39118d58288J09418L18171J45517k66664l00269J76296N20366K68850j77648k18824
$$ y = [-89062, 87255, 190045, 114607, 97968, 319864, 589765, 688882, 689108, 676265, 512629, 164108, -88797, -82141, -66017, -238017, -333765, -67257, 355013, 587720, 704474, 926892, 1074369, 838080, 429263, 373895, 712349, 947741, 832079, 707293, 924995, 1325409, 1498575, 1309637, 975196, 752077, 683060, 616007, 443164, 298425, 403381, 699862, 850076, 707635, 538465, 587319, 681113, 533948, 230882, 84231, 159477, 271747, 340597, 417566, 441710, 308826, 160054, 282569, 691700, 1065725, 1132787, 923297, 625910, 375105, 198506, 40379, -161514, -355297, -417184, -371131, -386458, -458288, -348870, -30699, 114818, -151846, -452115, -275819, 244547, 513397, 335749, 116925]
39108A16925O5274J70470l5982k58175k89841j63055O2916K93070L13549N1557
39098C26708j96527j01126K31700L99534K30559p3175k56413k60816j84752j41181
39088b5489j40289p2716J13439K52501J63810k3925k9562J09359P6016j75792
39078B47352l19495k07449q8272j10143o7218J26655J81129m3832k05650m6701
39068e33624J34803J7355j44636K4991L06404K12017j88816l76198j93831J7428
39058g24107N5410P8712J65313J51482O352n5917M6477J27443Q0706M6593J25462
39047A03926K05087J80863J10328N8363j405o1651n5128q045k9117r7576n2855
39036C52790J40841K89000K04256o9090l23556l96102k81835j06770M606N4737
$$ y = [116925, 182199, 352669, 316687, 58512, -231329, -394384, -331468, -38398, 275151, 326708, 130181, 29055, 260755, 660289, 890848, 817673, 561260, 300444, 115692, -25489, -165778, -238494, -125055, 127446, 291256, 267331, 237769, 347128, 423144, 247352, -72143, -279592, -367864, -478007, -545225, -418570, -237441, -281273, -486923, -533624, -398821, -381466, -526102, -501111, -194707, 17310, -171506, -547704, -741535, -724107, -668697, -589985, -424672, -273190, -266838, -322755, -276278, -148835, -68129, -21536, 103926, 309013, 489876, 600204, 658567, 657162, 595511, 540383, 532338, 503221, 405645, 352790, 493631, 782631, 986887, 917797, 594241, 198139, -83696, -190466, -185860, -131123]
39026a31123J15689J57509Q6171k2690L4543K09605J49611k64892o09564m56628
39016g31769J116K41974J59991Q4135J46491J16377r3849k12940n7325J63698
39006a82101J84430N2686l1691l0492j9808J0080J11113K27449K49373J69704
38996G40743P8703L8602L2943P876p6100j97036k60417j87287k8234O4470J756
38985B16019j37006j79963m1707J64966K20294N0751j47496j40453K8751J21421
38975A55577P8672P7378J69701J52758o6793k57635k21020j12047j47930k22720
38965c94059j22688O1599R4753L6470J34508L40086L30593L7935k19421k19790
38955G9986j27010j63229k63984k29767l5291J71461K65728K32057J33581N7052
$$ y = [-131123, -15434, 142075, 228246, 205556, 240099, 449704, 599315, 334423, -275141, -731769, -730653, -488679, -328688, -244553, -98062, 18315, -75534, -288474, -345799, -182101, 2329, 55015, 23324, -7168, -26976, -16896, 94217, 321666, 571039, 740743, 819446, 858048, 890991, 898867, 822767, 625731, 365314, 178027, 149793, 214263, 216019, 79013, -100950, -142657, 22309, 242603, 293354, 145858, 5405, 34156, 155577, 234249, 311627, 481328, 634086, 567293, 309658, 88638, -23409, -171339, -394059, -516747, -455148, -360395, -323925, -189417, 150669, 481262, 519197, 299776, 79986, -47024, -210253, -474237, -704004, -739295, -567834, -302106, -70049, 63532, 120584]
38945A20584K9253j2883r7841j22196n100J25142P8408r9613j74845o1917Q5366
38934a35642J31555J07176O3973k2791j38159j72073o2203J13036K33564K45195
38924C63631J56464K1750p1269q4183p8567j05812j09514m3553J314o3088j43280
38913a56107j02780j893L692o1429m4092N4679Q9834M5720N0838J11761Q0766
38902G0989p1331j76514j17316L9868J91284K85093K55977Q6895n4059K1725K04768
38891G37379K02464O626o9138Q7263J67175o5645l71576l96206j99224j03669
38881d551j68920j60752J708J06650J6307j05159o6413M7203K9293r9362j11368
38870e15364O7459K22229J58289j6711p6640k8005n4926j58263j24175Q9714K12886
$$ y = [120584, 149837, 136954, 39113, -83083, -88183, 36959, 115367, 15754, -159091, -221008, -135642, -4087, 103089, 167062, 144271, 6112, -165961, -228164, -115128, 118436, 363631, 520095, 541845, 470576, 386393, 307826, 202014, 92500, 48947, 50261, -12827, -156107, -258887, -260780, -257088, -318517, -362609, -307930, -218096, -172376, -121538, -9777, 70989, -342, -176856, -294172, -254304, -63020, 222073, 478050, 564945, 510886, 532611, 737379, 939843, 946469, 877331, 964594, 1131769, 1066124, 694548, 298342, 99118, -4551, -173471, -334223, -332515, -225865, -209558, -314717, -381130, -333927, -304634, -403996, -515364, -447905, -225676, -67387, -84098, -160738, -188743, -243669, -401932, -526107, -436393, -223507]
38859b23507O0251j59199j43927O4511J83536J02401m6661j42880j70125j14220
38849e89820K0596J35759J55412J50299J83212J54215J583r4959K3099J72000
38839C11396Q9343j01906p2964J40544J79782k0222j08665Q3518K55776J35544
38829H92146j09690j99215j69766k01296k44907j24598J18856K48157J43246q5774
38819B67159k62225k92301j89290m3518N3813R4452J25688J56816J73628K09659
38809B93881K82518K97193J60718m1352j46640j54156j75668j94571r6596P8836
38799C04163J54018Q5967L022l1425p0152j07525q3908m2079m0938K7840K45777
38788D44760L65012P9747m22009o09557l59807j07268j37520k02333l8523J79262
$$ y = [-223507, -163256, -322455, -466382, -401871, -218335, -115934, -162595, -305475, -475600, -589820, -569224, -433465, -278053, -127754, 55458, 209673, 211256, 116297, 139396, 311396, 400739, 298833, 225869, 366413, 546195, 525973, 417308, 500826, 756602, 892146, 782456, 583241, 413475, 212179, -32728, -157326, -38470, 209687, 352933, 267159, 4934, -287367, -476657, -520175, -466362, -371910, -246222, -89406, 84222, 293881, 576399, 873592, 1034310, 992958, 846318, 692162, 516494, 321923, 225327, 304163, 458181, 544148, 547170, 515745, 445593, 338068, 254160, 212081, 171143, 198983, 444760, 809772, 889519, 467510, -142047, -501854, -609122, -746642, -948975, -987498, -808236]
38778h08236J95169J10091J34901J95626J14168l4857n0806O9776J79495K02710
38768C08037J26411n7632k40037k27030m2881L2654j08428k01378l0030K22387
38758b17927K75831J53017K8120q3659k19050k62198j16912R0125K04566K57625
38748A09538K90039J99344j9084j37847n1651J990j53104k93074j79495l941p2303
38737c09588k84279l27200j86267n3122Q6764L34602M99484L15087m6120j43817
38727a14456O8515J98382N0331j20456p1022Q5585J22510K752j62633k43613j31499
38716c15604J47234L52439K76324M8476l0388P6657J31002K0655j03122j12191
38706D91482o8737n9645p5497r4356j13447r2303k2810j7440j48350k57715j39871
$$ y = [-808236, -613067, -502976, -368075, -172449, -58281, -93138, -143944, -74168, 105327, 308037, 434448, 376816, 136779, -90251, -133132, -100478, -208906, -410284, -440314, -217927, 57904, 210921, 239041, 155382, -63668, -325866, -442778, -352653, -148087, 109538, 399577, 598921, 579837, 441990, 390339, 392329, 239225, -53849, -233344, -237285, -309588, -593867, -921067, -1107334, -1160456, -1073692, -739090, -239606, 75481, 29361, -114456, -45941, 152441, 202772, 82316, 11294, 96879, 219389, 222141, 59508, -184105, -315604, -168370, 184069, 460393, 508869, 478481, 555138, 686140, 706795, 603673, 491482, 422745, 363100, 287603, 193247, 79800, -12503, -35313, -52753, -201103, -458818, -598689]
38695e98689J34746K97331K44371J07047k269q5240j24565p9951j2825k2620p1844
38684b14508m4387N6439J24850J08331M791j87582l57714k70767J17603M82345
38674a80599M98880K49628K7347q6648j64743j46175L6801J89124Q3522j41285
38664C65852j75780l3323K4213m1652m4741K8650K5037k9213J3652P4354l0355
38653A76694j75889q2730J63891K12863L8770n2202N013k1279j24731l4673J96044
38642C01771J57116k13665m51637k92221m0371J6682L5374J75376K40140Q7437
38632A6002n2143r65M6846l6493M382L04735M82107J89783k82716m26782k44115
38621F41j01793j08402r9321m8328m1316J2485K19887L79317K21594j23052k76283
$$ y = [-598689, -463943, -166612, 77759, 184806, 182537, 97297, -27268, -107219, -120044, -142664, -214508, -258895, -202456, -77606, 30725, 35516, -152066, -509780, -780547, -662944, -180599, 318281, 567909, 595256, 508608, 343865, 197690, 234491, 423615, 507137, 365852, 190072, 156749, 180962, 139310, 94569, 123219, 148256, 119043, 132695, 207049, 176694, 805, -81925, 81966, 294829, 333599, 281397, 286410, 265131, 140400, 105727, 301771, 458887, 245222, -206415, -498636, -539007, -522325, -486951, -311575, -71435, 16002, -36141, -37106, 9740, -26753, -22371, 282364, 764471, 954254, 671538, 244756, 641, -101152, -209554, -308875, -357203, -398519, -386034, -166147, 213170, 434764, 311712, 35429]
38610C5429j47345K9432J00519R3081J909j71548k44614o9088J46190Q8542j37017
38599b74510j27519J79523L84464K20363q2717j67109q279J53797J55922L8584
38589D72519o1676n5603J0810Q443q1746j07911J2007J12179K8428r2534M03K12686
38577D58005J85265j40938l68995j97430J38030J95338o9651k88105k13594j9722
38567c21797O617j20794j49402J1564J61378J27307K2218L1910Q7075j8022k35090
38556c97036k63658P648L06117L31735J14781j07059j98428j74021q1045J6733
38546d44233M2447J4312M6669J46315J47604k3680j69847p8606J49910K31234
38536F2125R8438j6913Q0349K77554K85845l313l52551m18902j64583P8918M3823
$$ y = [35429, -111916, -82484, 18035, 111116, 113025, -58523, -303137, -372225, -226035, -137493, -274510, -402029, -222506, 161958, 382321, 299604, 132495, 124216, 278013, 433935, 472519, 410843, 355240, 366050, 374493, 292747, 184836, 196843, 309022, 337450, 244916, 245319, 458005, 643270, 502332, 133337, -64093, 73937, 269275, 199624, -88481, -302075, -321797, -315180, -435974, -585376, -573812, -412434, -285127, -262909, -230999, -143924, -161946, -397036, -660694, -653046, -346929, -15194, 99587, -7472, -205900, -379921, -460966, -444233, -401786, -387474, -340805, -194490, -46886, -70566, -240413, -319019, -169109, 62125, 160563, 143650, 223999, 501553, 787398, 784085, 431534, 12632, -151951, -73033, -29210]
38525b9210j16016r1253Q8865J37309K9695N2469K63761L15306P132l39004l38791
38514a9737r5766K2838n3488j00156k1679O0147Q1173J05090J31701P6469m6252
38503A40340j05427l6370Q6211J51256R9330m5606j57671j04789O0496J16166
38493B03936l6583k25821k54104j45756l0325O4904J55986J78077Q9546j0266
38483a0406k3973j6045q4099j69943j47885k5918O7924M5614o8603j57168q1465
38472f71967J44147K62309N2623k98070l65080o4531K35132K56994J39757R1624
38462b17062P2359J4019K7034J50982J94168N6748o5295j7060P1451Q7231J37475
38451E12050K21383R5527k44892l80192j21958R4483q1983k80047m4002L14891
$$ y = [-29210, -145226, -236479, -147614, -10305, 19390, 71859, 335620, 650926, 658058, 319054, -19737, -115503, -92665, -146153, -246309, -267988, -207841, -126668, -21578, 110123, 186592, 140340, 34913, -1457, 84754, 236010, 335340, 289734, 132063, 27274, 87770, 203936, 167353, -58468, -312572, -458328, -488653, -423749, -267763, -89686, -140, -10406, -34379, -50424, -134523, -304466, -452351, -478269, -410345, -364731, -433334, -590502, -671967, -527820, -265511, -212888, -510958, -876038, -940569, -705437, -448443, -308686, -217062, -144703, -130684, -103650, 47332, 241500, 298248, 232953, 215893, 287344, 374575, 512050, 733433, 828960, 584068, 203876, 81918, 176401, 94418, -185629, -229631, 85260]
38441H5260K08465j99597k46146J15830K74635J9105j59683M2937K79098K09065
38431F28969J4795l3034j1990n6841o0402M4597O7525r9286k30966j22201P3524
38420B14690J01356j3457o4355J9384J38432J91807J56276Q0084M1319L5568m4395
38409H56709k00272k33649o1755M7884j36269l60062k25503J42862K56257L2839
38399A19041j23327m3815k6505k04105k46196M1733L09165J94799j12423k09614
38389c01247p9967O449l0879n9072m0565m9623n8758L4223K03087L03646K60354
38378A87648J21223k6263j03634o2873O7488J94010K33282J37075r7141l44125
38368C06690l76905j42418Q1557J8896j99826k21180Q374K00975J83808Q7240
$$ y = [85260, 293725, 94128, -152018, -36188, 238447, 257552, 97869, 140806, 419904, 628969, 643764, 610730, 598740, 541899, 481497, 526094, 593619, 494333, 263367, 141166, 214690, 316046, 302589, 238234, 257618, 396050, 587857, 744133, 824217, 865536, 901104, 856709, 656437, 422788, 361033, 408917, 272648, -87414, -312917, -170055, 86202, 119041, -4286, -48101, -74606, -278711, -524907, -483174, -174009, 20790, -91633, -301247, -381214, -374765, -405644, -464716, -505281, -554904, -613662, -579439, -376352, -72706, 187648, 308871, 282608, 178974, 116101, 183589, 377599, 610881, 747956, 650815, 306690, -70215, -212633, -131076, -112180, -312006, -533186, -524812, -323837, -140029, -52789]
38358e2789O0819R7088J71916K80737L01641R8153k06727l26806k08289o5271
38348A50472k0374k133L285p3599j39605r663K30896K74814O3336j26639j25177
38337B25613n3339J366J22675K72367K25239n1808k76372k57489j38138r8270
38327b8156r8080n2508k281J5949M6468Q0444N9852L8927J02020J45557L2753
38316C40945q9482P491J64560R729l90560n33569k11212K22090M15203L99963
38306C35158K88017N5502k05068k54293j08286p5499k38482l01084j02047J26877
38296d79205J73443J24435R2478M5656J7451R5237J35954p4429l48470k83875
38286e01325N4625K07761J02736J07242K42298R4218l29876m55812j08532J70092
$$ y = [-52789, 8030, 105118, 277034, 557771, 859412, 957565, 750838, 424032, 215743, 150472, 130098, 127965, 131250, 57651, -81954, -91617, 139279, 414093, 477429, 350790, 225613, 172274, 173640, 296315, 568682, 793921, 742113, 465741, 208252, 70114, -28156, -126236, -178744, -181025, -165076, -118608, -38164, 21688, 60615, 162635, 308192, 340945, 251463, 258954, 423514, 433243, 42683, -490886, -702098, -480008, -64805, 335158, 623175, 678677, 473609, 219316, 111030, 35531, -202951, -504035, -606082, -479205, -305762, -181327, -88849, -43193, -25742, 69495, 205449, 131020, -217450, -501325, -446700, -238939, -136203, -28961, 213337, 307555, -22321, -478133, -586665, -416573]
38276d16573Q2968M0237K76135L50306K5667j85698N5186K41126n9952l70940
38266C8462j59084J76144K9013l00081j48601L20994M26306J20036p3680l7006
38256C92503j03293k82361k47235q012J05984N8138P7494J31936J2075j89064
38246e1835k24401j56056j57755q6778K04776M00376J59724k19994k05942J28223
38236b09662K81082J36312j6327p2849j26337q6309J30305K46673L3609j93281
38226A23216o6982J55548N0378j81012r1900J58443J08412j34032j29702L6418
38216B8787k5744j71005K0819L37845K12995k22005l01229K3245J39221j17345
38206g4416k46634m4241J14993O3037P6759K11393J75048l2070r4905m2942j73860
$$ y = [-416573, -333605, -293368, -17233, 333073, 358740, 173042, 228228, 469354, 409402, 38462, -120622, 55522, 84535, -215546, -364147, -43153, 383153, 503189, 429509, 392503, 289210, 6849, -240386, -248398, -142414, -84276, -6782, 125154, 137229, -51835, -276236, -432292, -590047, -676825, -472049, -71673, 88051, -131943, -337885, -209662, 71420, 207732, 191405, 118556, -7781, -94090, 36215, 282888, 316497, 123216, 56234, 211782, 262160, 81148, -10752, 147691, 256103, 122071, -7631, 28787, 3043, -167962, -147143, 190702, 403697, 181692, -119537, -96292, 42929, -74416, -321050, -365291, -250298, -187261, -110502, 100891, 275939, 243869, 148964, 106022, -67838]
38195f7838l23939n0295M40881M46041o9377l61010j00488K17562K37945K09596
38185E79078K55599P1340l39010m49804q1311K54773J88209j7446o8033n7787
38175C35608n5480O0640J70848k809k58461j03658L23795L63550k0157j27608
38165F86268K54741N17410L90930L96760P16632O60068j40113r29183r25378m46245
38155A181890k42245l61967l82471k39777j60204j45136o2493N2203J48737K81750
38145G0287L52238J53655j67346k11156o757R924j96528j81163J15974K09314
38135A48442k5791j05548J43196K47597j5801k10844p3255M1409j04865k14093
38125a69553j04285k9440o6661M3807K24329O8691k84879k23168K13171L03781
$$ y = [-67838, -391777, -442072, -1191, 444850, 375473, 14463, -86025, 131537, 369482, 579078, 834677, 906017, 567007, 117203, 35892, 290665, 478874, 461428, 393395, 335608, 280128, 340768, 511616, 508807, 250346, 146688, 470483, 834033, 813876, 686268, 941009, 1458419, 1849349, 2246109, 2962741, 3622809, 3482696, 2553513, 1628135, 1181890, 939645, 577678, 195207, -44570, -204774, -349910, -412403, -360200, -211463, 70287, 422525, 576180, 408834, 197678, 190921, 200845, 4317, -176846, -60872, 148442, 122651, 17103, 160299, 407896, 392095, 181251, 107996, 149405, 44540, -169553, -273838, -303278, -369939, -326132, -101803, -33112, -317991, -541159, -327988, -24207]
38115b4207m2115r7095K97292M04501J7209j15537K43049K99067k28943m58793
38105B94428L4592L56742q3487m65427o3725M44837K77427o8134J11549L76896
38095A215698P7188l62909k72686M8837N6131J2796K66562L69009l8479l62453
38085A009694r3935K17181N416k67434q7671J16455o9775j74852J12189J79431
38075I46699k55871l97928J23314L84529j22860m25335J10100M96422j0530m44476
38065D04064K7850N20606K39049O8042O68923Q93163m4772p79362k03075L85886
38055B180374k42212p75603J57570J208609P43352r8638K96523Q66005J66872
38046D502852m64173N25263J537633P38965j37685J044952K527741K030983J522318
$$ y = [-24207, -66322, -163417, 133875, 538376, 555585, 440048, 683097, 982164, 753221, 294428, 329020, 685762, 602275, 136848, 73123, 517960, 795387, 727253, 838802, 1215698, 1292886, 929977, 657291, 706128, 762259, 775055, 1041617, 1410626, 1372147, 1009694, 915759, 1132940, 1138356, 870922, 783251, 899706, 829931, 655079, 767268, 946699, 690828, 292900, 416214, 800743, 677883, 252548, 362648, 859070, 848540, 404064, 431914, 952520, 1191569, 1259611, 1928534, 2821697, 2776925, 1997563, 1794488, 2180374, 1938162, 1162559, 1320129, 2528738, 3272090, 3173452, 3469975, 4335980, 4502852, 4038679, 4563942, 6101575, 6840540, 6702855, 7747807, 10275548, 12306531, 13828849]
38037A3828849L426070N163809L523077J299412K588728M816997L794622L175793
38029D1617357Q565470J5766920J8459094K4922263M7935654P4627787O8616228
38022C00510773J5927857m7906948p4945927n8614138l1885695j9977925j7553857
38015F5554140j1870240m906905l807771n899937m879428k268607k809148m982361
38007B4129743m479096k260839j935771k846967k089121m01429m26661j520389
37999H169470j277450j87401l08757j106906o99170L34472J46728p78216o87505
37990C605265O1475p7007p16881m09811M24467L33621l57254k94476K48115O1418
37980B878932n08424k77579L63864J98332m02136j94083M79046L09651m68543
$$ y = [13828849, 17254919, 22418728, 25941805, 27241217, 29829945, 34646942, 38441564, 41617357, 50182827, 65949747, 84408841, 109331104, 157266758, 231894545, 300510773, 316438630, 268531682, 193585755, 134971617, 103085922, 83107997, 65554140, 53683900, 48776995, 44969224, 39069287, 34189859, 31921252, 29112104, 24129743, 19650647, 17389808, 15454037, 12607070, 10517949, 10116520, 9689859, 8169470, 6892020, 6704619, 6395862, 5288956, 4589786, 4924258, 5070986, 4292770, 3605265, 3666740, 3589733, 2872852, 2463041, 2887508, 3221129, 2863875, 2569399, 2817514, 2878932, 2370508, 2092929, 2456793, 2655125, 2252989, 2058906, 2537952, 2847603, 2379060]
37971B379060n18122J18625K26207k49321k52533K40596K23884l38131m73455
37962A356810q2655r692k97732j47938M03741M70504n289j71036R8595M0631m39086
37951A216853n40373m8703L21602K15821L6271l4243k28021l79652p3471L95362
37941H81446L40844p7504q9743K84877K87255j56080l04415K7448J82701j02430
37931A274399l09331j73039o5061j48421j07858J12333J84408J03997J69793K56524
37921A297744p63l51435k28252J52536L7878n19591o67903j83203K19905J59746
37911h3338O9973J86997J35834j65301k06949J43580L18642O7168r8476J39781
37901E07911L49570J61203j40364k34305k51103k79967j00902K40122K86352n2064
$$ y = [2379060, 1860938, 1979563, 2205770, 1956449, 1703916, 1944512, 2168396, 1830265, 1356810, 1274155, 1264463, 966731, 818793, 1222534, 1693038, 1687749, 1516713, 1615308, 1655939, 1216853, 676480, 627777, 949379, 1165200, 1201471, 1167228, 939207, 559555, 486084, 881446, 1222290, 1144786, 1055043, 1339920, 1627175, 1471095, 1166680, 1194128, 1376829, 1274399, 965068, 792029, 726968, 578547, 470689, 583022, 767430, 871427, 1041220, 1297744, 1296981, 945546, 717294, 869830, 907708, 388117, -279786, -462989, -243084, -83338, -13365, 173632, 309466, 144165, -62784, 80796, 399438, 466606, 368130, 507911, 857481, 1018684, 878320, 644015, 392912, 112945, 12043, 252165, 538517, 486453]
37891D86453k52765l7707K16720K52579L87033P98952J049233P68369K31075j67989
37881C731953m44909o55570n88006k43642o9823k84673m83726l21658o4545m3758
37871E31643p9201Q6068K46579J23259j03416j24613k9736o1330j49373j06745
37861C33135j7068l9150o6212O4231K33574K28082P2617p2895j57767j85041j25941
37850B67565m2219n3368q1787O1705K57215J40970k74725m90992k40158J17997
37840c37797J68836n10r9474j00633r5069k1985J43455K23330J32760O0855J20755
37829A94523J30626j9834j20142j5818J02005O0544K1399J29663J78479l0885
37819F30560k85097k82040j19451r1934j85409j37105J09194L18329K87409M9971
$$ y = [486453, 233688, 195981, 412701, 665280, 1052313, 1851265, 2900498, 3668867, 3899942, 3731953, 3287044, 2631474, 2043468, 1799826, 1730003, 1445330, 961604, 639946, 575401, 531643, 452442, 538510, 785089, 908348, 804932, 680319, 650583, 589253, 439880, 333135, 316067, 276917, 210705, 274936, 508510, 736592, 809209, 736314, 578547, 393506, 267565, 225346, 171978, 90191, 151896, 409111, 550081, 275356, -215636, -455794, -337797, -168961, -169471, -268945, -369578, -464647, -486632, -343177, -119847, 12913, 73768, 194523, 325149, 305315, 185173, 169355, 271360, 331904, 353303, 482966, 661445, 630560, 345463, 63423, -56028, -147962, -333371, -470476, -361282, -42953, 244456, 294427]
37809B94427j90411k18405j613K17841J84906p532n9457M4988K9513j59435k44884
37798a10062j32887r5190k63022l67765k08735K7935J53995K71509M22216L70682
37788F8676N2560j63191j5300K07097J27111j47710k83363k32945j18416R4293
37778d11188M06357N46013L18626l0741j62391j10422o8886P253K04814L30698
37768A030133K06893M9365J29690K76801J47765j97201m21084m42165m21420l77453
37758a8676k27898p1915l8724o746J48264K19020j971k61253j87197Q0788J13423
37747b52885r5302j68950j0929J19412J47953K54143L95890L09512L3580r0340
37737F42084j3141n0214k53972k61824M1316K40209N4351j78357m6852K66622
$$ y = [294427, 104016, -114389, -116002, 101839, 286745, 279213, 219756, 264744, 294257, 134822, -110062, -242949, -338139, -601161, -968926, -1177661, -1149726, -995731, -724222, -302006, 68676, 121236, -41955, -57255, 149842, 276953, 129243, -154120, -387065, -505481, -411188, -4831, 541182, 859808, 829067, 666676, 556254, 487368, 494621, 699435, 1030133, 1237026, 1286391, 1416081, 1692882, 1840647, 1643446, 1222362, 780197, 358777, -18676, -246574, -318489, -357213, -363959, -215695, 3325, 1354, -259899, -447096, -366308, -252885, -348187, -517137, -528066, -408654, -260701, -6558, 389332, 698844, 732424, 642084, 628943, 578729, 324757, 62933, 104249, 344458, 398809, 220452, 173600, 440222]
37727D40222K78430o5045l50232k92137k9869J63196K05570J85190J66473J12540
37717H14338k6102j93432k51272j47126R18M1537m8979j90369k84230k23275L1743
37706d76249K95938K80051P540j20403J15458L81326K74789o1821k00992j07756
37696C87881q5255j54525k7280K79256L35873l0274m09561l80097n4055J83142
37686D5105J94401J06391K2269l8750n0930k1051l0044j18594k15395k37844j62887
37675e07329Q922K12228K57273K1953k90374l28533o7482J51467J17543J1184
37665d13148N5381J79671K08455J61072J52426J47102K4225j87520l06507k11416
37655a90259K2663J81342J00116j37839k27804J1161L57910M24409J43053j77175
$$ y = [440222, 718652, 653607, 303375, 11238, -18631, 144565, 350135, 535325, 701798, 814338, 788236, 594804, 343532, 196406, 197324, 238861, 189882, -487, -284717, -507992, -476249, -180311, 99740, 107280, -13123, 102335, 483661, 758450, 696629, 495637, 387881, 302626, 148101, 120821, 400077, 735950, 705676, 296115, -83982, -138037, 45105, 239506, 345897, 368166, 329416, 278486, 257435, 227391, 108797, -106598, -344442, -507329, -498407, -286179, -28906, -6953, -297327, -625860, -693342, -541875, -424332, -413148, -357767, -178096, 30359, 191431, 343857, 490959, 515184, 327664, 21157, -190259, -167596, 13746, 113862, -23977, -251781, -240620, 117290, 541699, 684752, 507577]
37645E07577k71228j76433n8837r980n4849j50334j45606M4459K24822J31978
37635D1569j40509k37175r0126q532j23833j47102J17278L88761L34879Q5173
37625B20383q230R4072J59062J02429L7123p960j09823k27309k15536o1592R2486
37614G5105J51723J35094P4574n640n0108m4343p3887j92637l02021k78642j40541
37603f51323K6073J99353L52769L74122K11509j937j21892j82515k57879k68835
37593c20555j25801N7178J17675J14679J99503L03261K33699M1104j7395R9189
37583G02537J28396p0760k73375k21209J463J09332J3856j01416o3538P4278J24299
37572D23863N085j50264j38510O9033K76723K88141J13652r9296k56918l41663
$$ y = [507577, 236349, 59916, 1079, -8901, -63750, -214084, -359690, -315231, -90409, 41569, -98940, -336115, -426241, -434773, -558606, -705708, -588430, -199669, 135210, 220383, 212153, 306225, 465287, 567716, 604839, 596879, 487056, 259747, 44211, -17381, 75105, 226828, 361922, 436496, 430856, 380748, 336405, 262518, 69881, -232140, -510782, -651323, -625250, -425897, -73128, 300994, 512503, 510566, 388674, 206159, -51720, -320555, -446356, -389178, -271503, -156824, 42679, 345940, 579639, 620743, 603348, 702537, 830933, 760173, 486798, 265589, 267052, 376384, 390240, 288824, 225286, 299564, 423863, 428948, 278684, 140174, 209207, 485930, 774071, 887723, 788427, 531509, 189846]
37562A89846l26340k09235q9539n8170m3074P8067K34926K26312L9270j03549
37552f1486q4883p3088k23165l67613k15034K07847N16237M03827m407k92705
37542a94470j90209J73751M24353L21986k0456k95066l27274j85983l484J72134
37532a24718K91586K25754o3244l47287l37264p8188O6010r2330k84330j72783
37522i16794J37393K42081L4018j52345n5700J48975J77023Q1097J07670K58241
37512F1659L00480J65338L2105k553n6897j88784k47748j33264J2206K2955n0101
37501h4604p6484o5753p6726m7651Q5218K06139J64347K6149k0917L9821O5421
37490B14960J8339J846M0299M4875J6134N8279J45513J02200r2787j97557m2932
$$ y = [189846, -136494, -345729, -435268, -493438, -536512, -458445, -223519, 2793, 42063, -61486, -146369, -219457, -442622, -810235, -1025269, -817422, -301185, 102642, 98235, -194470, -384679, -210928, 213425, 535411, 514955, 219889, -107385, -293368, -296852, -124718, 166868, 392622, 329378, -17909, -355173, -433361, -367351, -459681, -744011, -916794, -779401, -537320, -503302, -655647, -711347, -562372, -385349, -304252, -196582, 61659, 362139, 527477, 559582, 557029, 500132, 311348, 63600, -69664, -57458, -34503, -84604, -161088, -226841, -303567, -351218, -266000, -59861, 104486, 130635, 109718, 149539, 214960, 233299, 235145, 275444, 320319, 336453, 394732, 540245, 642445, 549658, 352101, 309169]
37479C09169J98245K41719O0523j41248k15164j60349k1975J17337J12863p8467
37469D22653k50099j66482Q5288J85981M2438q8716j0498J28021J03160l7742
37459D14004j05471q2115p0550m6995P3178J86184R8702j25330j96535l1110J18213
37448B32175O1010n6647k8587Q5323J05410L0065k4470m8762r0210q6103L0647
37437B09851J37923O3127j33921k37445k02339j79912k25808k10081n0934J58709
37427f70830L00600L40867K68845R9080m7388m6357K4735j9832j56139j56954
37417f3373K8915J57082O2562q5927p5638J1131l8294k06087k77447j65694j736
37406f54506Q0353Q5980Q1546Q9047Q2971L8992k0898l3038J6072L1300n5714
$$ y = [309169, 507414, 749133, 809656, 668408, 453244, 292895, 270920, 388257, 501120, 422653, 172554, 6072, 91360, 277341, 319779, 231063, 220565, 348586, 451746, 414004, 308533, 226418, 155868, 108873, 182051, 368235, 466937, 341607, 145072, 113962, 232175, 293185, 236538, 207951, 293274, 398684, 428749, 404279, 355517, 265307, 179204, 209851, 347774, 410901, 276980, 39535, -162804, -342716, -568524, -778605, -829539, -670830, -370230, -29363, 239482, 338562, 291174, 244817, 269552, 249720, 93581, -63373, -34458, 122624, 185186, 99259, 23621, 34752, -3542, -209629, -487076, -652770, -654506, -574153, -488173, -406627, -317580, -234609, -195617, -216515, -249553, -233481, -202181, -257895]
37395b57895j23347k056K16499K35378j3575k31093j78021m611M1185J0718Q7819
37384b18999J92637Q8740j75741k70952o5143J86096K21363J05247M6084O9660
37374A78992N1874k4385l1335Q3885J78307Q7167j31210k22909m7201K21941L01836
37363F46962J59599J4584j1420m6106j92940l09579k24034k3980P1416L7179L0589
37352A52270J01665J30191N9042k651L5303J00419P6473j9804n5293M8317J93140
37341H19072J78045o7007l40569l69553j61743p354p1713j76973j19628n394m3760
37330c66577j56404p6911K13648M30476L76367J50329o5243k02377k39192j43518
37320g9402K6433J26190J11960R2002J32511J51067P2358l8829q0135m6353M459
$$ y = [-257895, -381242, -383298, -166799, 68579, 55004, -176089, -354110, -358721, -317536, -306818, -218999, -26362, 62378, -113363, -384315, -449458, -263362, -41999, 63248, 109332, 178992, 230866, 206481, 175146, 259031, 437338, 524505, 393295, 170386, 123185, 345126, 646962, 806561, 821145, 809725, 763619, 570679, 261100, 37066, 13086, 84502, 121681, 152270, 253935, 384126, 443168, 440517, 475820, 576239, 652712, 632908, 577615, 625932, 819072, 997117, 930110, 589541, 219988, 58245, 50891, -20822, -197795, -317423, -322817, -366577, -522981, -599892, -386244, 44232, 420599, 570928, 505685, 303308, 64116, -79402, -52969, 73221, 185181, 277183, 409694, 560761, 633119, 594290, 514155, 467802, 472261]
37309D72261L1317N960q4242j82149j88929q6682L0193N9281l6256k29226l99564
37298f08036l42902K8981M85748O44836L94133J4067j67359j02708M2050J28182
37288E16992J22776N3516j2837j9037q219q7212k51107l41125k38028j0257J81562
37277i2976K34421J16131j43897l94959m13789j32803K44403M50652M21850K78082
37267E67115J17258n0559j97260k35020j18217P2345J83258J20060o8387k23744
37257A66849k06580q082K52102M14769L69063J16929j96391l64108l05861j54454
37247H4236r7827j65442k28993j70818J4628K34084L40200K35059J3719q5795
37237A73051J9668J25483M5863q6798m5310R2225N8391j43104k21176o3662J01295
$$ y = [472261, 503578, 509538, 425296, 243147, 54218, -32464, -2271, 57010, 20754, -208472, -608036, -950938, -921957, -436209, 208627, 602760, 616827, 449468, 346760, 388810, 516992, 639768, 693284, 680447, 661410, 653191, 565979, 314872, -26253, -264281, -274538, -92976, 141445, 257576, 113679, -281280, -695069, -827872, -583469, -132817, 289033, 567115, 684373, 633814, 436554, 201534, 83317, 155662, 338920, 458980, 390593, 166849, -39731, -47813, 204289, 619058, 988121, 1105050, 908659, 544551, 238690, 84236, -13591, -179033, -408026, -578844, -564216, -330132, 10068, 245127, 258846, 173051, 192719, 318202, 364065, 277267, 231957, 324182, 382573, 239469, 18293, -45369, 55926]
37226E5926Q7974n053m9898r7015j76120j59597j3552N4656q5597k29699j30200
37215g48175J22243K49296J80007O0903j5094n5849l6178N3996R6065o768j26744
37204b26298p4591Q8678J29651K893r8118n7660J4117m574o9544p5623l256R9418
37192b74907J77548J70455L8831j71080l41791l67508j99571J21447M14525M43648
37182A1597J82966q8266j09124K2491J9219j50507k25748o4508J50093J84499
37172f7288L8153j33269k08637j30462Q9060K89217K51955j16j50285R527K61941
37161B49796K53381j894j58556n4157Q3956J3899j79363k64930k07598j35618
37151d01084q2800J8494J35422J45945O0674L1538J01409J41975R9244Q6398J31676
$$ y = [55926, 143900, 138847, 88949, -8066, -184186, -343783, -357335, -302679, -388276, -617975, -748175, -625932, -376636, -196629, -135726, -150820, -206669, -242847, -188851, -92786, -99554, -226298, -300889, -212211, -82560, -79667, -177785, -235445, -221328, -225902, -295446, -371069, -374325, -274907, -97359, 73096, 111927, -59153, -400944, -768452, -968023, -846576, -432051, 11597, 194563, 106297, -2827, 19664, 38883, -111624, -337372, -401880, -251787, -67288, -29135, -162404, -371041, -501503, -412443, -123226, 128729, 128613, -21672, -12145, 249796, 503177, 501283, 342727, 288570, 372526, 386425, 207062, -57868, -265466, -401084, -483884, -465390, -329968, -184023, -123349, -91811, 9598, 151573, 250817, 337215, 468891]
37140D68891O7323j56730k69999m7055K87316L20038K2485k48714k69298j39294
37130C4963K3575K18479L36041J72418j88051l37481q8205K32133K47394L5482
37120F86748q7946n8309l4376m5032J4869J11071Q1922q7386k26052k17715j15112
37109B2682k6027j1606o4023q7699K3150K00356K20833K3242j53089j00962N2810
37098I9667P6215m718j8251J7437m4291j69320j83674q1080k1809m5822l7387
37087d13033L1404N4661m814o6841p9776m2553P1904K36877K95649J65263J2976
37076B61717M105J0379j47406l15923k33035j5930P076j12142j1089L05739L89688
37065A43179P6708k22185j81746l7628r8028k03704o2292J98917K37596N2542
$$ y = [468891, 536214, 379484, 109485, 62430, 349746, 669784, 692269, 443555, 174257, 34963, 58538, 277017, 613058, 785476, 597425, 259944, 171739, 403872, 651266, 686748, 598802, 540493, 506117, 461085, 475954, 587025, 668947, 581561, 355509, 137794, 22682, -3345, -14951, -78974, -166673, -143523, 56833, 277666, 300908, 147819, 46857, 99667, 175882, 171164, 152913, 170350, 126059, -43261, -226935, -308015, -329824, -375646, -413033, -381629, -326968, -331782, -398623, -478399, -520952, -449048, -212171, 83478, 248741, 261717, 265822, 276201, 128795, -187128, -420163, -436093, -429017, -541159, -552248, -246509, 143179, 219887, -2298, -184044, -221672, -319700, -523404, -585696, -386779, -149183, -96641]
37055i6641n8074K3925J39784J62709J14195J9901j08601j83907j26317N554J09344
37044A872J78088K16240J50328j7344j09829j9007Q3849j5269k38932l28754k00583
37033b99341J903J24645J02892n7460k28708k02768M2664K41478J78527j3805
37023a09973r3245o7277o7134l6870J34146K92065J86199r7716k14890o1837J22625
37012a3907J64940J47734J56461J38608P8253M0071j2394j72702l26831k35195
37002c4962N3746J92166M1735j29026r8648j1736m4086p2527M7508J52180M5413
36991A41763j09066l4891J63554J42545j11756k48052j06645N7682J2451j16783
36981b09198j17118l2084j3466j7643R3104K42860J98254o4338k66752j76795
$$ y = [-96641, -154715, -130790, 8994, 171703, 285898, 305799, 197198, 13291, -113026, -107472, 1872, 179960, 396200, 546528, 529184, 419355, 400348, 484197, 468928, 229996, -98758, -299341, -297438, -172793, -69901, -127361, -356069, -558837, -516173, -274695, -96168, -109973, -203218, -270495, -337629, -374499, -240353, 51712, 237911, 140195, -74695, -136532, -13907, 151033, 298767, 455228, 593836, 672089, 712160, 699766, 527064, 200233, -34962, 18784, 210950, 252685, 123659, 25011, 13275, -30811, -103338, -55830, 96350, 141763, 32697, -2194, 161360, 303905, 192149, -55903, -162548, -104866, -92415, -209198, -326316, -358400, -371866, -389509, -296405, -53545, 144709, 80371, -186381, -363176]
36971c63176J04078K95967K76286J45937K7145o3081j34700j50745r8560n1895
36961a2744p0248p9334M0700K46996L25823J51547j24335k34391j11888N4518
36951A86644Q6262K3698Q455N1167M0453m7956r8392m7374J0830J090K2947J72670
36939D10494K92827J20163l01538n75232m20617k4749K15794J75385N3032L2979
36929b1462R3389J38255J29950N0743j09369k56033k14589M6019L03470L14842
36919D75215J14950l5251P704R5752J1047k21551l45078j88057J17868K86851
36909C19450J95134k0117j59312j73487j49191j46038j21658j9799J14477J52806
36899g735L7764j05692q2630J17379K56184J26207j57145k70414q6394J75107
$$ y = [-363176, -259098, 36869, 313155, 459092, 486237, 423156, 288456, 137711, 39151, -12744, -82992, -162326, -121626, 125370, 451193, 602740, 478405, 244014, 132126, 186644, 272906, 296604, 305059, 356226, 396679, 348723, 250331, 202957, 213787, 214877, 237824, 410494, 703321, 823484, 521946, -53286, -473903, -498652, -282858, -107473, -54441, -21462, 71927, 210182, 340132, 390875, 281506, 25473, -189116, -143097, 160373, 475215, 590165, 554914, 562618, 658370, 669417, 447866, 102788, -85269, 32599, 319450, 514584, 494467, 335155, 161668, 12477, -133561, -255219, -275018, -160541, -7735, 30029, -75663, -158293, -40914, 215270, 341477, 184332, -86082, -172476, 2631]
36889B631K46769J36010N1904R2494J30189R589k22499l38807j94157O6493J47550
36878A28166j8950j61934n5709J22163M9315k05050k28118J09784M19863L48210
36868E07740O1811o2670Q978L3230o0902j20920r2544p8605r6518n1656M7489
36857I5433R3667R4781J39307J63110K8265j57820j18973J24703J96732q2666
36847E76539l85421l36251l7510J34212P5689m25K8679O1934M2920P6219J93258
36836D29843K25860N2322j75954k15066o3985M3320k5984j33475j01210J8322
36826E3993M4798k6642j8396J11738J50719n1398l05368l10952o7091J51800J87194
36815g9605J46529J49768J43329M8572p4412j27733j31434j68088k36809k50933
$$ y = [2631, 249400, 385410, 437314, 529808, 659997, 669586, 447087, 108280, -85877, -19384, 128166, 109216, -52718, -108427, 13736, 63051, -141999, -370117, -260333, 159530, 507740, 569551, 506881, 515859, 549089, 488187, 367267, 274723, 196118, 99600, 47944, 95433, 189100, 283881, 423188, 586298, 614563, 456743, 337770, 462473, 659205, 576539, 191118, -145133, -182643, -48431, 27258, 26833, 55512, 117446, 160366, 236585, 429843, 655703, 708025, 532071, 317005, 253020, 296340, 270356, 136881, 35671, 53993, 98791, 72149, 53753, 165491, 316210, 264812, -40556, -351508, -418599, -266799, -79605, 66924, 216692, 360021, 408593, 334181, 206448, 75014, -93074, -329883, -580816]
36805e80816j47256N0604K41920L02812J90566J7198m4959M1531J35269Q8823
36795B95692q8216k53848k72220j23910P3438J60907R8316J471k1977l754n152
36784a39253K7791J58929K84504K39050M7600j05714j45038j55143j72727j27734
36774h7735j9754M1837K1423N962K8744J9982k7164k6024K2096N851q4767j20693
36762b20242o5672m4508j13873j66728j28437m1719Q5756K72299L65530J70291
36752A12697j50442j75143J30297K78292O245k78780j63102P6699n5942m13781
36742f32960m12919L4849L95933L19168L1360j34481j23503K3973K81891M34857
36732B18168K06284k42654l72851l5403K54043R0714j98239j10162K12764K41688
$$ y = [-580816, -728072, -677468, -435548, -132736, 57830, 75028, 30069, 71600, 206869, 295692, 207476, -46372, -318592, -442502, -369064, -208157, -109841, -108370, -130347, -134101, -139253, -111462, 47467, 331971, 571021, 618621, 512907, 367869, 212726, 39999, -87735, -107489, -65652, -44229, -38267, -9523, 10459, -16705, -42729, -20633, -14782, -99549, -220242, -285914, -330422, -444295, -611023, -739460, -781179, -695423, -423124, -57594, 112697, -37745, -212888, -82591, 195701, 201946, -76834, -239936, -163237, -219179, -632960, -1045879, -1011030, -615097, -295929, -264569, -399050, -522553, -498580, -216689, 218168, 424452, 181798, -191053, -226456, 27587, 118301, -79938, -190100, 22664, 264352]
36722B64352o4344k15816m228J88940M0594k11967j91895J7690M8288j46774k32486
36711e07646l1029K07893J95638K5158L134J88153L18438J78155j51566m34089
36701g761n13955l69340q1675J66070J89100L272j57404j06313R6087K66146L04962
36690b10811K11764L0408j15702p9434R6646J69329K8292j31764j30915q4590
36680b16777j36521j39015O7705K43671M7131l43893l85229L2480M07509L68179
36670e4760J40046P3747J24509R2026L4493R0021J27101o1091l59010m57871k96058
36659e46847q2518N2303J54449K32198K05146Q0166k7894o9566r1400r3043j2814
36648a99820J31053K20235J81682O2977l9249o3100k1239l059p5105j47973o4589
$$ y = [264352, 200008, -15808, -20036, 168904, 209498, -2469, -194364, -176674, -128386, -275160, -507646, -538675, -330782, -135144, -109986, -106852, 81301, 399739, 577894, 426328, -7761, -521716, -891056, -972731, -806661, -617561, -614289, -771693, -878006, -781919, -515773, -210811, 953, 31361, -84341, -163775, -67129, 102200, 130492, -1272, -132187, -216777, -353298, -492313, -424608, -180937, -133806, -477699, -862928, -830448, -422939, -54760, 85286, 159033, 283542, 375568, 410061, 500082, 627183, 566092, 207082, -250789, -546847, -629365, -577062, -422613, -190415, 14731, 94897, 67003, -2563, -93963, -187006, -199820, -68767, 151468, 333150, 396127, 356878, 293778, 272539, 269480, 194375, 46402, -18187]
36637a8187J24895J56805n8475k43241j44952N8382J5119k59062m08024k60988
36627a037728k3633Q1513Q5573J08036J53619J78250J86306J71856R7217q792
36617g783n5288k9090k246J7813R5365J99328J92327L3619j50752k36517k02384
36606a45608n8438J48794K49608Q9275j98085k85924j05628M2804n5510k25309
36596e44021k22159j04236m2838J8575K09157L85127K86677j3621j51824K0225
36586a58938K61157L23479K37107J24194r723j59934k13738j32426q2117j98189
36576i128l35644k47992N3443L06026L33249K02176M4775j01860k23436k45689
36566b24080j31081K0598P3323K4645j2806J3441K8260l8964j28494j18462J1444
$$ y = [-18187, 106708, 263513, 205038, -38203, -183155, -124773, -109654, -368716, -776740, -1037728, -1061361, -979848, -894275, -786239, -632620, -454370, -268064, -96208, 1009, -7783, -63071, -92161, -94407, -76594, 18771, 218099, 410426, 444045, 293293, 56776, -145608, -204046, -55252, 194356, 283631, 85546, -200378, -306006, -263202, -318712, -544021, -766180, -870416, -913254, -894679, -685522, -300395, -13718, -27339, -179163, -158938, 102219, 425698, 662805, 786999, 777276, 617342, 403604, 271178, 189061, -9128, -344772, -592764, -539321, -233295, 99954, 302130, 346905, 245045, 21609, -224080, -355161, -334563, -261240, -236595, -249401, -235960, -207700, -246664, -375158, -493620, -482176]
36555d82176J50688J95352J58225J18096J06551Q8240K5330q6690k30297l57782
36545c14463l77226k16320O7494K88095K91778J08968p7555j04015M4248K39412
36535d9584L14175J84057q1501l03836l43501k17399n8292K9065M1689K1200j7053
36524d80980o6435q3116j7501J08418K03393K06803J53231J11044Q7577L9717
36514B62151l9084j03541j32563j50986j47988n5738J19302K16277R3893j39394
36504g7671k10370k3854K12450K65792J51489L1042m0430j12329j59466q8473
36494e1820Q0340J95076J65020M8249p4146j82851k45924j92325k3927J48022
36484a34286K31570K24383J27564p2502k77964k95042q7867J19863J30855L7742
$$ y = [-482176, -331488, -136136, 22089, 140185, 246736, 334976, 360306, 273616, 43319, -314463, -691689, -908009, -840515, -552420, -260642, -151674, -229229, -333244, -288996, -49584, 264591, 448648, 367147, 63311, -280190, -497589, -555881, -526816, -485127, -463927, -480980, -547415, -630531, -648032, -539614, -336221, -129418, 23813, 134857, 222434, 262151, 223067, 119526, -13037, -164023, -312011, -367749, -248447, -32170, 61723, -77671, -288041, -311895, -99445, 166347, 317836, 348878, 308448, 196119, 36653, -51820, 28520, 223596, 388616, 436865, 362719, 179868, -66056, -258381, -282308, -134286, 97284, 321667, 449231, 376729, 98765, -196277, -284144, -164281, -33426, 4316]
36474D316M1420J19151P9955j05865k48571k15179q0622K9064R3608J52866K16813
36463H6956K58555K24149O2608j67096k68848j23056J14416J87904Q1403j0614
36453D46377k8878j16322k93891l34280r7442K14630L11378J78781K9267M448
36443C14068Q6882K11016K97111K38702J1030k37797l22450k22676o8086K8242
36433C36042L9324q884m9704j3216O5545M2390j46702l61644m12735k74967p2365
36422h56916P2531R8700J4430o6584k29J85958K84470J98310Q9076J03976J27790
36411B51512j021j82541k05246r0226k5020l1741K7761J61487K35996K35439K59948
36400F36348K71342J26347j14062k04567j05425o2042j99768l19667k30332k8120
$$ y = [4316, 45736, 164887, 244842, 138977, -109594, -324773, -405395, -376331, -282723, -129857, 86956, 345511, 569660, 632268, 465172, 196324, 73268, 187684, 375588, 456991, 446377, 417499, 301177, 7286, -326994, -424436, -209806, 101572, 280353, 309620, 314068, 400950, 611966, 909077, 1147779, 1158809, 921012, 598562, 375886, 307800, 336042, 375366, 366482, 316778, 303562, 369107, 411497, 264795, -96849, -509584, -784551, -856916, -784385, -685685, -671255, -737839, -738068, -552110, -267640, -69330, 19746, 123722, 251512, 250491, 67950, -137296, -227522, -252542, -284283, -256522, -95035, 140961, 376400, 636348, 907690, 1034037, 919975, 715408, 609983, 547941, 348173, 28506, -201826, -229946]
36390b29946J05729J53138J40113j552k52203l78414k14313P3559K13114J93360
36380a97415J89979K29841J67656l9811k41112k82447j59138K2240J37474J22679
36370e0054L1028k3301j2365o721k4679j2814j0425j27953k76936j73738K16124
36359d71834M88713L13239p3584j94031O371J70076J03641l6365j08272j56684
36349D1270j74477m9254J53554J72962n0426k40202j88985l2327L9857Q0655J88979
36338e8394K50202J27809n4915q5429J302P556q3980r9153K5506J48809J35230
36327C14543j4956k35601m26093m27735j58461K04255L48871J89731l8466r0394
36317c34306K6511J53721J98691J54510K5887j33912j86689m9923J47795J78419
$$ y = [-229946, -124217, 28921, 169034, 167482, -84721, -463135, -677448, -603889, -390775, -197415, -7436, 222405, 390061, 350250, 109138, -173309, -332447, -310207, -172733, -50054, -19026, -42327, -54692, -61413, -86092, -98906, -109331, -237284, -514220, -687958, -471834, 16879, 330118, 256534, 62503, 68874, 238950, 342591, 306226, 197954, 41270, -133207, -182461, -28907, 144055, 93629, -146573, -335558, -367885, -328028, -247373, -58394, 191808, 319617, 264702, 179273, 180575, 188131, 104151, 4998, 30504, 179313, 314543, 299587, 63986, -362107, -789842, -948303, -744048, -395177, -205446, -243912, -334306, -307795, -154074, 44617, 199127, 225014, 91102, -95587, -145510, 2285, 180704]
36307A80704L128j51049o2256J95368L11857R7634k79497m60678k82181O1371
36297c85599K54023J95606M4966k4249j778M0566R4088J85095K57280K00534J1370
36286H71902j67709k14397j64966j28084j19898p7598j1118k1702j31269j91551
36276c56390m9828K35777M28834L58794P9640k08274l40923k90600j36472K7216
36266b52226J53182K23228K02899P1979r4158j54806p0553K5058l673j05987j23003
36255a28060j6715R4939J21700R7289P2365K8990m6010r5233o7605m263J3943
36244G1340k3981m0657N0148K43999M03698L55992R4334j60657k05446j18526
36234F70244j39781l05082l86766k33178K6501K01161K76739L08851K42156J4194
$$ y = [180704, 183832, 32783, -29473, 165895, 477752, 575386, 295889, -164789, -446970, -385599, -131576, 64030, 108996, 84747, 82969, 123535, 217623, 402718, 659998, 860532, 871902, 704193, 489796, 324830, 196746, 76848, -750, -11868, -33570, -164839, -356390, -406218, -170441, 258393, 617187, 696827, 488553, 147630, -142970, -279442, -252226, -99044, 124184, 327083, 399062, 304904, 150098, 79545, 104603, 100930, -5057, -128060, -144775, -49836, 71864, 169153, 241518, 270508, 224498, 129265, 61660, 57397, 71340, 47359, 6702, 56850, 300849, 704547, 1060539, 1154873, 994216, 788770, 670244, 530463, 225381, -161385, -394563, -368062, -166901, 109838, 418689, 660845, 675039]
36224F75039k61643l85900k92948p1150J48272K17869K8554k99899m17200j43608
36214h02614K31646K92183N2423j03464R01J34263P4176q5802j60447j44982j10879
36203f22596l7093Q9901J67070J19643K7609j5689l6274n6264L946J58676K49482
36192D8411J73904P6561J18416J88512P9551j41244j98490k0835J59643J46021
36182F30450K205j12741j53845j57280j37756j01295p0034m1988J074L0083O142
36171a04985r086R9335L01132L84807J98034j43179l57373k82782k5114J55172
36161B15961Q8315j46571l02760k19317K3402K10840K08898M9550j27081j74903
36151a73666o4712N2450O161j30296j01476J23639K31021K8870j96923q6593K20051
$$ y = [675039, 413396, 27496, -265452, -336602, -188330, 29539, 58093, -241806, -659006, -802614, -570968, -278785, -226362, -329826, -328925, -194662, -120486, -206288, -366735, -511717, -622596, -659689, -569788, -402718, -283075, -255466, -271155, -307429, -363693, -359747, -201071, 48411, 222315, 298876, 417292, 605804, 685355, 544111, 345621, 324786, 484429, 630450, 632655, 519914, 366069, 208789, 71033, -30262, -100296, -142284, -141210, -111127, -104985, -114071, -14736, 286396, 671203, 869237, 726058, 368685, 85903, 60789, 215961, 304276, 157705, -145055, -364372, -340970, -130130, 78768, 128318, 1237, -173666, -238378, -185928, -179767, -310063, -411539, -287900, -56879, -28009, -224932, -311525, -91474]
36140i1474K93928R1198k4236Q0476J20426n5124j85478p2614P8602N2901r526
36129B79079N8251R0296q6365k53171j31503J11968J24495l5231k2103J68095
36119C03811J81160q3255l02504k59027j31404j22524j46006n2002J14906K48522
36109b48323L40080L62467K11416r5632l45603l74861k28918j2868K13610L30347
36099A51715J98566q1766k05114q2931J6706r6923k30219j38150Q1946J79131
36089b07039J27219M9424n4927k15648k65674k9534L34029M75316L10713P8146
36079F02025l5655o6063p7756n6381k2572l7830o5224j2589P4430N7238n0477
36068C09146r0443l1469j2803p2937o2424Q8294K19285J72505P269j26233j83363
$$ y = [-91474, 202454, 293652, 269416, 349892, 470318, 415194, 229716, 157102, 235704, 288605, 279079, 337330, 427626, 341261, 88090, -43413, 68555, 193050, 157819, 135716, 303811, 484971, 401716, 99212, -159815, -291219, -413743, -559749, -611751, -496845, -248323, 91757, 454224, 665640, 570008, 224405, -150456, -379374, -392242, -178632, 151715, 350281, 268515, 63401, -19530, -2824, -99747, -329966, -468116, -386170, -207039, -79820, -30396, -85323, -300971, -566645, -596179, -262150, 213166, 523879, 602025, 566370, 500307, 422551, 366170, 343598, 305768, 240544, 227955, 302385, 359623, 309146, 218703, 187234, 174431, 101494, 39070, 127364, 346649, 519154, 526423, 400190, 216827]
36057B16827j85862j21083k103P4828M6005k2892m0368j2618M489p230m7565j10972
36045b08544j29776k0504J51793J91539M2511j00159o1063P3863J32784J36290
36035B08734J99702K56626J27478j53288l17959k23722l2033M8413K3418P829
36025A45198Q484l2978p3908j9739R0201J05390j0524j14102q9974o307J4627
36014A6368j6545r210L0188Q982p5917j05412j2954J15001J59695J02965n620
36003B07541j22271j93041j59035n1510O118l0233m8526L3025J19209J07086P7339
35992e4298J29881J38586p0749l44908l13774P0117L97483L41376P3474m8542
35982C18646R743K1686o8742p9581O1627J67347O3806j57033k56758j30354J05522
$$ y = [216827, 30965, -90118, -92221, -17393, 28612, 5720, -34648, -47266, -42777, -50007, -97572, -208544, -338320, -358824, -207031, -15492, 27019, -73140, -134203, -60340, 72444, 208734, 408436, 665062, 792540, 639252, 321293, 97571, 65538, 113951, 137369, 145198, 153682, 120704, 46796, 27057, 117258, 222648, 212124, 98022, 8048, 1741, 16368, -177, -9387, 20801, 29783, -46134, -151546, -164500, -49499, 110196, 213161, 207541, 85270, -107771, -266806, -318316, -312198, -342431, -390957, -357932, -238723, -131637, -54298, 75583, 214169, 143420, -201488, -515262, -445145, -47662, 293714, 367188, 318646, 328389, 350075, 281333, 201752, 263379, 430726, 494532, 337499, 80741, -49613, 55909]
35971E5909K53457K16477O0882p8484j44570j74723j76635q7725Q1880J74659
35961A81127P9233p3913o8420P9080J38430K5591m9744J01772L35658L35685K8249
35950A112748l21860m31550k87486q0669L4352L9822q471m1300k97J01018J46398
35939B62705M3041j20441j62067p6848o4377k04351k76690p4629K40893L38940
35929i3824J95086Q8626J28896R9134j29369l24322k30799L4274J60831Q0938
35919I471p580K4790R6434Q5649j2680r7786m9406J39435K66263J00010k50710
35908C03890l54792k3316L50478K81553j41398m03301k67105K6759K15533K84250
35898B72551K51482O0592k07399l26646k53144j85935k07250j57734J8364J24740
$$ y = [55909, 309366, 525843, 586725, 508241, 363671, 188948, 12313, -75412, 6468, 181127, 260360, 186447, 118027, 197107, 335537, 361128, 311384, 413156, 748814, 1084499, 1112748, 790888, 359338, 71852, -8817, 25535, 65357, 56886, 15586, 15289, 116307, 262705, 305746, 185305, 23238, -53610, -117987, -322338, -599028, -673657, -432764, -93824, 101262, 189888, 318784, 417918, 288549, -35773, -266572, -232298, -71467, 9471, 1891, 26681, 123115, 208764, 196084, 98298, 48892, 188327, 454590, 554600, 303890, -50902, -74218, 276260, 557813, 416415, 13114, -253991, -227232, -11699, 272551, 524033, 584625, 377226, 50580, -202564, -388499, -595749, -753483, -735119, -610379]
35888f10379O7527L8684J46313J79416m400j53868k912K63690K68145o834k52403
35877f7021k86502j61516N2181K75816L30370J47491l8779j4936M6914r9814k74340
35866i0136j37302J60620J49330j56717k18458J52612M62939L08082n4917k10302
35856C65751j82610j70588j09061P9046J48617q9116l38003k37381K7646K7109
35846d78590j99153k52721o7950N4466L6455Q5150J71580K6975k56659k03742
35836a084189K75703O28008M40298J7318j46585n8954k1017p3996o7005k3155
35826a13574l1877K6742K56845M15893K18643j50433k50292m3132Q1944o1679
35816C49080k24713j85945o4776l7196o1709n2113o1824j24338j22964J1352J45318
$$ y = [-610379, -542852, -504168, -357855, -178439, -182839, -336707, -339619, -75929, 192216, 185382, -67021, -353523, -515039, -462858, -187042, 143328, 290819, 252040, 237104, 284018, 184204, -90136, -227438, -66818, 82512, -74205, -292663, -140051, 322888, 630970, 576053, 365751, 183141, 12553, -96508, -17462, 131155, 42039, -295964, -533345, -505699, -478590, -677743, -930464, -998414, -943948, -907493, -822343, -650763, -623788, -880447, -1084189, -808486, -180478, 259820, 277138, 130553, 71599, 50582, -23414, -90419, -113574, -145451, -118709, 138136, 554029, 772672, 622239, 371947, 328815, 410759, 349080, 124367, -61578, -126354, -163550, -225259, -277372, -339196, -463534, -586498, -575146, -429828]
35805d29828J43656P7990Q9423J69071K13968J94305J37884M3282p4114j34610
35795D31027r8847m0678k5253p448N0966O7047l1316j40412r8018P0186J62446
35784C39700O3314j16803j91634j11918J2177O4322N2306O8617J39624J71980
35774D91685Q3894o8493j62693j56463q5119J7282Q3481j0083k56433l83986j52874
35763e99802K40539L46822R1025j07002L6280K53930J83809n1712o4134J76686
35753E06441L10852J33664j57102k86848k15144o7577L4960J7617j17916k51777
35743i2830k48624j15691L6528J49679K09534J55352k0889j37944p804K55493
35733A82804L34097J36491q9202j21314l2832j3076j06264k26559k87246k28030
$$ y = [-429828, -286172, -208182, -118759, 50312, 264280, 458585, 596469, 639751, 565637, 431027, 332180, 291502, 266249, 258801, 309767, 376814, 345498, 205086, 107068, 177254, 339700, 403014, 286211, 94577, -17341, -5164, 59158, 111464, 180081, 319705, 491685, 575579, 507086, 344393, 187930, 102811, 120093, 203574, 193491, -62942, -446928, -599802, -359263, -12441, 78584, -28418, 7862, 261792, 445601, 393889, 329755, 506441, 817293, 950957, 793855, 507007, 291863, 224286, 259246, 276863, 158947, -92830, -341454, -457145, -420617, -270938, -61404, 93948, 73059, -64885, -72689, 182804, 516901, 653392, 564190, 442876, 410044, 396968, 290704, 64145, -223101, -451131]
35723d51131m1144J58656K10514J09036J2489K1424Q8230J60271K31086K20503
35713G19934K4559k44516l03058r6350P6361j1324j90478k00767r9848j02685
35703d28172j72170q3176J69821L25405K24455q067j69650j67689P737K89095
35693a2411M76925L82103Q2817j35596j53695j45567k54227l43290k30308j3112
35683c46361N1247o8294j26613L9413K78068L32751J66704l9446j52594k07698
35673g2823k53451k18481k8890K17249L22816K32191Q6648J7105j1971r3163j94440
35662B790j81495n853J93941K04725l8712l39287l94974j28308J91995K57153
35652b38025R6374k869P4823J39578M2706q2736p1546j3944q5080k28026k43010
$$ y = [-451131, -492275, -333619, -123105, -14069, -1580, 19844, 108074, 268345, 499431, 719934, 744493, 499977, 196919, 100569, 176930, 165606, -24872, -225639, -325487, -428172, -600342, -683518, -513697, -188292, 36163, 28096, -141554, -309243, -301506, -12411, 464514, 846617, 929434, 793838, 640143, 494576, 240349, -102941, -333249, -346361, -295114, -363408, -490021, -450608, -172540, 160211, 326915, 287469, 134875, -72823, -326274, -544755, -573645, -356396, -33580, 198611, 285259, 302364, 290393, 197230, 2790, -178705, -184558, 9383, 214108, 175396, -163891, -558865, -687173, -495178, -238025, -141651, -144520, -69697, 69881, 112587, 29851, -41695, -55639, -140719, -368745, -611755]
35641f11755j13226n316J9581O2200J48494J62994P1225J1522P5729J49058P0672
35630D1178j45544l33006l43483j45348J70182M27484M75918L09988M9374j90267
35620C16476l39624l27285j31589R9377J33583o0020k30536j47594J05185K50478
35610c31549J69670R443m8599k547K9359P60j9519J2487K4591n6114j51132j11388
35598d74538M8808J39206P1765J985P5034J70965Q6629j24833k21139j35921l5735
35587c97774n598O7432K24733K91452J38302r6205j98219j51240o8163K0039J38959
35576c6282K27396J93724O8804l9767j05811j69928k11440j71324p8700k5991
35566c49319k7585j9046P786j5828j06020j74693j39471k1171R1771J34412J12963
$$ y = [-611755, -724981, -730297, -710716, -648516, -500022, -337028, -265803, -254281, -178552, -29494, 41178, -104366, -437372, -780855, -926203, -756021, -328537, 147381, 457369, 506743, 316476, -23148, -350433, -482022, -382645, -249062, -309082, -539618, -687212, -582027, -331549, -161879, -152436, -201035, -203582, -174223, -173463, -192982, -180495, -155904, -212018, -363150, -474538, -425730, -286524, -214759, -212774, -137740, 33225, 119854, -4979, -226118, -362039, -397774, -403372, -335940, -111207, 180245, 318547, 222342, 24123, -127117, -195280, -175241, -36282, 191114, 384838, 453642, 413875, 308064, 138136, -73304, -244628, -323328, -349319, -376904, -395950, -388164, -403992, -510012, -684705, -824176, -845347, -753576, -619164, -506201]
35555e06201Q9819J14571J58168J52140J02066Q6715J13249P9537m3706j07023
35545B39335J0419J72837J39695q2371k17134q0011J83234K86659J39313q0999
35535G10977j45224j7058J16076O1243j34231k27382j08143L2525k4411k00242
35525F4130k57730j93744k31461m00255m06751o5221L68373N05315L30209J63266
35515a23869J75336J84939j3895l10757l92912j30652K60072M51886L50485J57056
35505F07689Q3529Q1187m7013k95057l91260j72332J33901J73175o5429k44660
35495a36270j37759J05448K09327J22380J0242J1125J12934K09878J91597L0446
35485G29348j51106j74281m0111K9679r8318k33623j19320J56942K60506J11830
$$ y = [-506201, -416382, -301811, -143643, 8497, 110563, 197278, 310527, 390064, 346358, 239335, 249754, 422591, 562286, 479915, 262781, 182770, 366004, 652663, 791976, 710977, 565753, 548695, 664771, 726014, 591783, 364401, 256258, 288783, 264372, 64130, -193600, -387344, -618805, -1019060, -1425811, -1491032, -1122659, -617344, -287135, -123869, 51467, 236406, 222511, -88246, -481158, -611810, -351738, 100148, 450633, 607689, 691218, 772405, 725392, 430335, 39075, -133257, 644, 173819, 108390, -136270, -274029, -168581, 40746, 163126, 173368, 184493, 297427, 507305, 698902, 729348, 578242, 403961, 363850, 393529, 295211, 61588, -57732, 99210, 359716, 471546]
35475D71546L875J22973K33504M7892k97094m07006j67290J49273K63699J37732
35465E59104j22649l52373l31146P483L39402K37538k12097m16250o8355L99082
35455C9739M27394R4600j11770n9728l9538j55499j57860M8971J86940P1041p8828
35444B65462k3891J04008O9139n8355o3692J3504m2387k35848l40624k34154j5717
35433e62555J79645K71235J78027r1620l07637k12413J24952L53689K72181K4851
35423B30355j52785j82317r7700M0860J27243R1949N4035J88268L96218L60171
35413A056297J5316l03919l35677k33107k28987k32289n6294J67811J67836m517
35403A2470n8080M5697N7094j04028k24190j93273j70247k29201j72370J11172
$$ y = [471546, 475421, 598394, 831898, 879790, 582696, 175690, 8400, 157673, 421372, 559104, 436455, 84082, -247064, -239581, 99821, 337359, 125262, -290988, -359343, 39739, 467133, 561733, 449963, 390235, 350697, 195198, 37338, 86309, 273249, 344290, 265462, 241571, 345579, 414718, 356363, 292671, 306175, 263788, 27940, -312684, -546838, -562555, -382910, -111675, 66352, -25268, -332905, -545318, -420366, -66677, 205504, 230355, 77570, -104747, -202447, -161587, -34344, 57605, 111640, 299908, 696126, 1056297, 1071613, 767694, 432017, 198910, -30077, -262366, -318660, -150849, 16987, 12470, -45610, 87, 57181, -46847, -271037, -464310, -634557, -863758, -1036128, -924956]
35393i24956L75678L45565J16730n348O7208J58236J17421l1413j71183j82414
35383a34476k3821J74448K05190O8144N091J28125K14441O8586j17138n1579J59823
35372F96834J57754j03918l03451k71759j98876k32355k16813p289K36155K83014
35362C9296J61804M4616l8676j53961k47134k01237n8453J1422m4273j02254n6206
35351f45056N5705J36916J53722J39488J29351J17865P5132N542l4920k2847l0518
35340H0380j15019j80147r2912O8509P3579j03467j96846m0137J56953J12440
35330b36667j05381k00728j03761l3697j17931k02023j09791J01318K48774K57704
35320e02183J83212R2512K6282K4393R5408J68000J35966k8896k30040l31538
$$ y = [-924956, -549278, -203713, -86983, -92331, -25123, 133113, 250534, 219121, 47938, -134476, -158297, 16151, 221341, 289485, 294576, 422701, 637142, 705728, 588590, 537011, 696834, 854588, 750670, 447219, 175460, -23416, -255771, -472584, -479873, -243718, 39296, 201100, 245716, 207040, 53079, -194055, -395292, -453745, -442323, -486596, -588850, -645056, -589351, -452435, -298713, -159225, -29874, 87991, 163123, 168665, 133745, 110898, 80380, -34639, -214786, -307698, -239189, -165610, -269077, -465923, -506060, -349107, -236667, -342048, -542776, -646537, -680234, -798165, -1000188, -1109979, -1008661, -759887, -502183, -318971, -226459, -200177, -175784, -80376, 87624, 223590, 194694, -35346, -366884]
35310c66884k93273k00121j34501n7000J14267L25321M05478K97661J49206J04198
35300C44352J19881Q5076J0467k8349m7189j00132j33927o1133N6664O9529k5207
35289B90032p8753m0650m1488j64882k81839k09856M8934L12837M10954L07426
35279E52715Q1269j51119k97545l13547k01871k6280Q5233L6536r8799j27516
35269d60924R774J39756J09869K0502M5451J24220N6036j40960k14288n6195J29259
35258b37500J25465j6872j09923q8446j5497N9321J21105J38568R6409L8035Q610
35247A19275k924k1697l8864l9105k1393K4961R7406J27841M5677r0977j29797
35236G0403j9614J26242J91025J78989J47747J17748Q6225M2724m9363j95961
$$ y = [-366884, -660157, -860278, -994779, -1051779, -937512, -612191, -206713, 90948, 240154, 344352, 464233, 549309, 559776, 531427, 484238, 384106, 250179, 189046, 245710, 315239, 290032, 211279, 170629, 129141, -35741, -317580, -527436, -478502, -165665, 245289, 552715, 633984, 482865, 185320, -128227, -330098, -356378, -271145, -234609, -333408, -460924, -451150, -311394, -201525, -181023, -135572, -11352, 44684, -96276, -310564, -366759, -237500, -112035, -128907, -238830, -327276, -342773, -283452, -162347, -23779, 72630, 110665, 119275, 116351, 94654, 55790, 16685, -4708, 20253, 117659, 245500, 291177, 200200, 70403, 50789, 177031, 368056, 547045, 694792, 812540, 898765, 941489, 892126, 696165]
35226F96165l01300k70140j66774j24524j14190K803J84182K07231J9841j51674
35216a8380j49057r7135j33993j63044n9544Q5244J37517J53817K14759K01063
35206A71247m191k33913k43018r2592l4441q5172k9534J71149K90140K01435N9592
35195A70702L1154P3638P5650L0201k3166p7329j06308o9598j7329n2770j49442
35184a14597j55026k6527Q9910P8084J0041R436P4850J16205P8614k4168j25258
35173A1564j33745l3068N5213J2318r6051j16002n0714k5299k4687R6056L02314
35162b101L38822J05911j53156j84499m1834Q5288J62996K32658K09568Q715k28087
35151E34281k71291j22447J3107L3273J4988O905m0341j19809j40454r8302j01087
$$ y = [696165, 394865, 124725, -42049, -166573, -280763, -277960, -93778, 113453, 133294, -18380, -167437, -264572, -398565, -561609, -621153, -535909, -398392, -244575, -29816, 171247, 167056, -66857, -309875, -402467, -436908, -522080, -551614, -380465, -90325, 111110, 170702, 201856, 275494, 351144, 381345, 358179, 280850, 174542, 104944, 87615, 34845, -114597, -269623, -296150, -206240, -128156, -118115, -108679, -33829, 82376, 160990, 136822, 11564, -122181, -155249, -100036, -87718, -183769, -299771, -350485, -375784, -400471, -304415, -2101, 336721, 442632, 289476, 104977, 63143, 148431, 311427, 544085, 753653, 762368, 534281, 262990, 140543, 153650, 186923, 201911, 208816, 168475, 48666, -91788, -190090, -291177]
35140b91177j62637j40822K5899J67681J04503p8363j32451J0473J49890R8942
35130b48062p3091j63889j20196p1285r8272j11562j6617J14758J48899R0090
35120e49227M4035L0698j0654m8490K6638J82735K24132P0018j02587r9895L8923
35109a93674J45127J45104N7530j02461k60883k45411K007K57554K63153Q2806
35099A50852l933P2135R6417n6305k24208k23698j03928r019M9416J33127K07445
35088H8301J86285Q4766q40k7614k2718n692J6785J5475j9717l8688r083P062
35076B74322n7292j44928j35958k3181P4056P4003J9137j5537j6675p950l95N28
35064D0130r300q723K3685M7791m055j05379j32664m0046M5238o460j21520j12225
$$ y = [-291177, -453814, -594636, -568737, -401056, -296553, -374916, -507367, -496894, -347004, -248062, -321153, -485042, -605238, -676523, -774795, -886357, -902974, -788216, -639317, -549227, -505192, -474494, -485148, -533638, -507000, -324265, -100133, -30115, -132702, -232597, -193674, -48547, 96557, 154087, 51626, -209257, -454668, -452661, -195107, 68046, 150852, 146919, 219054, 315471, 259166, 34958, -188740, -292668, -301687, -252271, -119144, 88301, 274586, 359352, 358512, 330898, 308180, 302488, 319273, 334748, 315031, 276343, 267260, 274322, 217030, 72102, -63856, -87037, -12981, 61022, 80159, 64622, 47947, 39997, 39602, 40130, 30830, 22107, 45792, 93583, 89528, -15851, -148515, -188561, -143323, -149783, -271303, -383528]
35052c83528M5370J59977Q9032o7569j18714l6291N1793O9100O1164O6053M8462
35041a5151O709K9904J62184K87466K55379Q1495q5377j73563k40733l04465k64812
35030b60964p4230J29939J82415J07418M7536K9563l1353j07529m3856J64313
35020A43252K72000J06348j58328k31573j12097m2556j04456j06625P8420K86217
35010A30602K74644J7355l10293n08310m38508r2623L08858M33843K03379q1526
35000f2579j27839k9204n5701j87603j43553J45636L82859L12538N8965q0342
34990B13177l0627K4501o5254k23279k52861p8652J51434K27045J25174J3584
34980A04242k1997j02620k88229l55983r2907K86547L33190j4386l16955k38846
$$ y = [-383528, -338158, -178181, -89149, -156718, -275432, -311723, -259930, -190830, -129666, -63613, -15151, -8442, 21462, 183646, 471112, 726491, 807986, 722609, 549046, 308313, 3848, -260964, -335194, -205255, -22840, 84578, 132114, 161677, 130324, 22795, -21061, 143252, 415252, 521600, 363272, 131699, 19602, -22954, -127410, -234035, -155615, 130602, 405246, 422601, 112308, -396002, -834510, -927133, -618275, -184432, 18947, -62579, -190418, -219622, -275323, -462926, -606479, -460843, -77984, 234554, 293519, 213177, 182550, 207051, 141797, -81482, -334343, -412995, -261561, -34516, 90658, 104242, 82245, -20375, -308604, -664587, -757494, -470947, -137757, -152143, -469098, -707944]
34970g07944L0744J26785K4025l0392O8643J88504K04940J39202O8746L6147L3803
34959A83203J0832n7173q2033L7315K03268J89210j1530j26389j5144R8254r438
34948D20375j99219k21414j19866q6439q5800L1743J71662J27829k939N7601K55155
34937C48688K40124l0699j72337N579J76727L4622k15863k16362k2719M3004p3344
34926A17420j35612m3576N1611M6145J7896L4867N7561P3350J34150K07699J59185
$$ y = [-707944, -677200, -550415, -526390, -556782, -488139, -299635, -94695, 44507, 113253, 149400, 183203, 194035, 136862, 54829, 92144, 295412, 484622, 473092, 346703, 331559, 429813, 420375, 221156, -258, -120124, -206563, -292363, -260620, -88958, 38871, 35932, 93533, 348688, 588812, 558113, 385776, 391355, 568082, 602704, 386841, 170479, 147760, 190764, 117420, -18192, -61768, -10157, 35988, 53884, 88751, 146312, 219662, 353812, 561511, 720696]
$$ [...]
##END NTUPLES=NMR SPECTRUM
##END=
