##TITLE=31Pdec_41-2026-Bay
 DMSO-d6,24 sc
 27.4.2026
##JCAMPDX= 6.0         $$ Bruker NMR JCAMP-DX V2.0
##DATA TYPE= NMR SPECTRUM
##DATA CLASS= NTUPLES
##ORIGIN= UXNMR, Bruker Analytische Messtechnik GmbH
##OWNER= root
$$ XWIN-NMR		Version 3.5
$$ Mon Apr 27 14:29:56 2026 Russian Standard Time (UT+4h)  she@DPX200
##.OBSERVE FREQUENCY= 81.013821
##.OBSERVE NUCLEUS= ^31P
##.ACQUISITION MODE= SIMULTANEOUS
##.ACQUISITION SCHEME= undefined
##.AVERAGES= 24
##.DIGITISER RES= 17
##SPECTROMETER/DATA SYSTEM= spect
##.PULSE SEQUENCE= zgpg30
##.SOLVENT NAME= DMSO
##.SHIFT REFERENCE= (INTERNAL, DMSO, 0, 197.392)
##AUDIT TRAIL= $$ (NUMBER, WHEN, WHO, WHERE, WHAT)
$$ ##TITLE= Audit trail, XWIN-NMR		Version 3.5
$$ ##JCAMPDX= 5.01
$$ ##ORIGIN= Bruker BioSpin GmbH
$$ ##OWNER= she
$$ F:/spectra/data/she/nmr/P31/2/pdata/1/auditp.txt
$$ ##AUDIT TRAIL=  $$ (NUMBER, WHEN, WHO, WHERE, WHAT)
(   1,<2026-04-27 14:27:43.18 +0400>,<she>,<DPX200>,
      <created by zg, POWCHK disabled, PULCHK disabled
       configuration hash MD5:
       00 E9 B6 7A A2 85 ED C7 34 08 36 98 17 FE 4E 26
       data hash MD5: 32K
       C8 CA BB 01 0E E6 16 08 8D 53 C8 BA E6 20 05 BA>)
(   2,<2026-04-27 14:27:55.64 +0400>,<she>,<DPX200>,
      <Start of raw data processing
       efp BC_mod = 2 LB = 1.5 FT_mod = 6 PKNL = 1 PHC0 = 1294.25 PHC1 = 402.5004 SI = 64K 
       data hash MD5: 64K
       F1 1A 2A 02 AA 94 B1 93 F0 A3 A8 21 A6 C3 57 B8>)
(   3,<2026-04-27 14:28:35.43 +0400>,<she>,<DPX200>,
      <pk PHC0 = 164.4604 PHC1 = -487.7999 
       data hash MD5: 64K
       13 05 8F 6B 9E FC 82 50 7E 01 8D 39 7F 2F C6 3F>)
$$ ##END=
$$ 
$$ hash MD5
$$ 9A FF 96 72 26 80 47 F6 50 06 F0 A2 16 07 7E 70
##$RELAX= 
##$RELAX= 
##$RELAX= 
##$RELAX= 
##$RELAX= 
##$RELAX= 
##$RELAX= 
##$RELAX= 
$$ Bruker specific parameters
$$ --------------------------
##$DU= <F:/spectra>
##$EXPNO= 2
##$NAME= <P31>
##$PROCNO= 1
##$TYPE= <nmr>
##$USER= <she>
##$AMP= (0..31)
100 100 100 100 100 100 100 100 100 100 100 100 100 100 100 100 100 100 
100 100 100 100 100 100 100 100 100 100 100 100 100 100 
##$AQSEQ= 0
##$AQ_mod= 1
##$AUNM= <au_zg>
##$AUTOPOS= <>
##$BF1= 81.014009
##$BF2= 200.13
##$BF3= 200.13
##$BF4= 200.13
##$BF5= 200.13
##$BF6= 200.13
##$BF7= 200.13
##$BF8= 200.13
##$BYTORDA= 1
##$CFDGTYP= 0
##$CFRGTYP= 5
##$CHEMSTR= <none>
##$CNST= (0..31)
1 1 145 1 1 1 1 1 1 1 1 1 1 1 1 1 1 1 1 1 1 1 1 1 1 1 1 1 1 1 1 1 
##$CPDPRG= <waltz16>
##$CPDPRG1= <>
##$CPDPRG2= <waltz16>
##$CPDPRG3= <>
##$CPDPRG4= <mlev>
##$CPDPRG5= <mlev>
##$CPDPRG6= <mlev>
##$CPDPRG7= <mlev>
##$CPDPRG8= <mlev>
##$CPDPRGB= <>
##$CPDPRGT= <>
##$D= (0..31)
0 1 0 0 0 0 0 0 0 0.06 0 0.03 2e-05 3e-06 0 0 0.0002 0 0 0 0 0 0 0 0 0 
0 0 0 0 0 0 
##$DATE= 1777285662
##$DBL= (0..7)
120 120 120 11 120 120 24 19 
##$DBP= (0..7)
150 150 150 150 150 150 150 150 
##$DBP07= 0
##$DBPNAM0= <>
##$DBPNAM1= <>
##$DBPNAM2= <>
##$DBPNAM3= <>
##$DBPNAM4= <>
##$DBPNAM5= <>
##$DBPNAM6= <>
##$DBPNAM7= <>
##$DBPOAL= (0..7)
0.5 0.5 0.5 0.5 0.5 0.5 0.5 0.5 
##$DBPOFFS= (0..7)
$$ [...]
##$SUBNAM2= <"">
##$SUBNAM3= <"">
##$SUBNAM4= <"">
##$SUBNAM5= <"">
##$SUBNAM6= <"">
##$SUBNAM7= <"">
##$SUBNAM8= <"">
##$SUBNAM9= <"">
##$SW= 400.765351723535
##$SWIBOX= (0..15)
0 1 3 0 0 0 0 0 0 0 0 0 0 0 0 0 
##$SW_h= 32467.5324675325
##$TD= 32768
##$TD0= 1
##$TE= 0
##$TE2= 300
##$TE3= 300
##$TEG= 300
##$TL= (0..7)
0 120 53 12 22 120 120 120 
##$TP= (0..7)
150 150 150 150 150 150 150 150 
##$TP07= 0
##$TPNAME0= <>
##$TPNAME1= <>
##$TPNAME2= <>
##$TPNAME3= <>
##$TPNAME4= <>
##$TPNAME5= <>
##$TPNAME6= <>
##$TPNAME7= <>
##$TPOAL= (0..7)
0.5 0.5 0.5 0.5 0.5 0.5 0.5 0.5 
##$TPOFFS= (0..7)
0 0 0 0 0 0 0 0 
##$TUNHIN= 0
##$TUNHOUT= 0
##$TUNXOUT= 0
##$USERA1= <user>
##$USERA2= <user>
##$USERA3= <user>
##$USERA4= <user>
##$USERA5= <user>
##$V9= 5
##$VALIST= <valist>
##$VCLIST= <CCCCCCCCCCCCCCC>
##$VD= 0
##$VDLIST= <DDDDDDDDDDDDDDD>
##$VPLIST= <PPPPPPPPPPPPPPP>
##$VTLIST= <TTTTTTTTTTTTTTT>
##$WBST= 1024
##$WBSW= 4
##$XGAIN= (0..3)
0 0 0 0 
##$XL= 0
##$YL= 0
##$YMAX_a= 8902
##$YMIN_a= -9242
##$ZGOPTNS= <>
##$ZL1= 120
##$ZL2= 120
##$ZL3= 120
##$ZL4= 120
##$ABSF1= 0
##$ABSF2= 0
##$ABSG= 0
##$ABSL= 0
##$ALPHA= 0
##$AQORDER= 0
##$ASSFAC= 0
##$ASSFACI= 0
##$ASSFACX= 0
##$ASSWID= 0
##$AUNMP= <proc_1d>
##$AZFE= 0.1
##$AZFW= 0.5
##$BCFW= 0
##$BC_mod= 2
##$BYTORDP= 0
##$COROFFS= 0
##$CY= -3
##$DATMOD= 1
##$DC= 0
##$DFILT= <>
##$DTYPP= 0
##$F1P= 0
##$F2P= 0
##$FCOR= 1
##$FTSIZE= 65536
##$FT_mod= 6
##$GAMMA= 0
##$GB= 0
##$INTBC= 1
##$INTSCL= 9.790993e-09
##$ISEN= 30
##$LB= 1.5
##$LEV0= 0
##$LPBIN= 0
##$MAXI= 10000
##$MC2= 0
##$MEAN= 0
##$ME_mod= 0
##$MI= 50
##$NCOEF= 0
##$NC_proc= -5
##$NLEV= 6
##$NOISF1= 182.463
##$NOISF2= 159.3651
##$NSP= 0
##$NTH_PI= 0
##$NZP= 0
##$OFFSET= 197.3918
##$PC= 4
##$PHC0= 1458.71
##$PHC1= -85.2995
##$PH_mod= 1
##$PKNL= yes
##$PPARMOD= 0
##$PSCAL= 0
##$PSIGN= 0
##$REVERSE= no
##$SF= 81.014063255964
##$SI= 65536
##$SIGF1= 159.3651
##$SIGF2= -187.1042
##$SINO= 113.3802
##$SIOLD= 16384
##$SREGLST= <1H.CDCl3>
##$SSB= 0
##$STSI= 65536
##$STSR= 0
##$SW_p= 32467.5324675325
##$SYMM= 0
##$S_DEV= 0
##$TDeff= 32768
##$TDoff= 0
##$TI= <>
##$TILT= no
##$TM1= 0
##$TM2= 0
##$TOPLEV= 0
##$USERP1= <user>
##$USERP2= <user>
##$USERP3= <user>
##$USERP4= <user>
##$USERP5= <user>
##$WDW= 1
##$XDIM= 65536
##$YMAX_p= 419934652
##$YMIN_p= -7838911
$$ End of Bruker specific parameters
$$ ---------------------------------
##NTUPLES= NMR SPECTRUM
##VAR_NAME=  FREQUENCY,     SPECTRUM/REAL,   SPECTRUM/IMAG
##SYMBOL=    X,             R,               I
##VAR_TYPE=  INDEPENDENT,   DEPENDENT,       DEPENDENT
##VAR_FORM=  AFFN,          ASDF,            ASDF
##VAR_DIM=   65536,         65536,           65536
##UNITS=     HZ,            ARBITRARY UNITS, ARBITRARY UNITS
##FACTOR=    0.49542278885378, 1,            1
##FIRST=     15991.5117654749, 0,            0
##LAST=      -16476.0207020576, 0,           0
##MIN=       -16476.0207020576, -7838911,    0
##MAX=       15991.5117654749, 419934652,    0
$$ Real data points
##PAGE= N=1
##DATA TABLE= (X++(R..R)), XYDATA
$$ [...]
40766b21894J71330J06896m738q6146j17892k9445K11889M22807L34265m1470
40756G45602l55575l38776j25920k7713j05820j72179j38481j19258j66745j47170
40746i52035J7768J91973K47163K59525L08559K59077q324k82163k44245M2828
40736a59874J97025P7129n7681k3486J6729o5714o4308J81675L78743J45506l55750
40725B69994n65367k75907J45701L21616K77496J84813M9025j30055j70402L8965
40715A45879K73864K40559n583j66580j45639j10979j47830j30549J2448J49516
40705A15106J47970L6675j07341k49339l00383j43275J26461K02606j4224k04330
40695c90074o8188J98671J80173j17601k68053p2741J70717J68816N6257R6516
$$ plain form
40766 -221894 -50564 56332 51594 -34552 -152444 -181889 30000 452807 787072 745602
40756 745602 390027 51251 -74669 -102382 -208202 -380381 -518862 -638120 -804865 -952035
40746 -952035 -934267 -742294 -495131 -235606 72953 332030 323706 41543 -202702 -159874
40736 -159874 37151 114280 56599 33113 49842 -15872 -80180 101495 480238 625744 269994
40725 269994 -295373 -571280 -425579 -103963 173533 358346 407371 277316 106914 145879
40715 145879 419743 660302 654719 488139 342500 231521 83691 -46858 -34410 115106
40705 115106 263076 299751 192410 -56929 -357312 -500587 -374126 -171520 -185744 -390074
40695 -390074 -458262 -259591 -79418 -197019 -465072 -537813 -367096 -198280 -142023 -45507
40685d5507K23645J78390m8429k09312j83369j03157r4495j09501o0103M6819
40675d05019J48311J76988O7529j59598l28492k72058o7427N5104M4286P5330
40665f65046K27032L32005K55251J21459J03619J39355M7785j68043l20997k88250
40655b15830j05309J33764L17154L11890R2394j55292k22308j45878j21523j80175
40645b91113j62952j5908J29315K09843L05639L67898J66374k96339n85963l55154
40635e28360J16817K56568k3027k63329j80176k1245o4248j51063q062K45608
40625f20517K69863M4303j21677q0653r564l7925l0191J26071K65937J79451n7942
40614g2844j92347j45999p3932r4302j33929p1061Q9065K30552K50154J32751
$$ plain form
40685 -45507 178138 356528 308099 98787 -84582 -187739 -282234 -391735 -451838 -405019
40675 -405019 -256708 -79720 -12191 -171789 -500281 -772339 -839766 -784662 -740376 -665046
40665 -665046 -438014 -106009 149242 270701 374320 513675 561460 393417 72420 -215830
40655 -215830 -321139 -187375 129779 441669 534063 378771 156463 10585 -110938 -291113
40645 -291113 -454065 -469973 -340658 -130815 174824 542722 709096 412757 -173206 -528360
40635 -528360 -411543 -154975 -178002 -441331 -621507 -642752 -707000 -858063 -866125 -620517
40625 -620517 -350654 -306351 -428028 -508681 -518245 -556170 -586361 -460290 -194353 -14902 -72844
40614 -72844 -265191 -411190 -485122 -579424 -713353 -784414 -695349 -464797 -214643 -81892
40604h1892m3300j48519r1292J00683K92815L40933J82216j23135l94839m19944
40594c86274j37526K39097L68533J20559k62740m07709j97630J36457K99124K21112
40584f997M8858n6168l1519R8626K34931K32170L9396j89033k42640j24931l7823
40573c5130p1871q6373K1488J14363L6683j09226j08669L6727J30407P4673m9402
40562d6330j46754j61964k7477K24427L55455J82638r5615j29962M5001O3188
40552B62607j51272k34497j728K11979R9514j08091m4771J75690J77816m3495
40542C43752j63744r1466l7086n6354K5753J93396J69040j15401l45488k83193
40532c60791q3522K4314Q0465J99407K76875J57319o1545j48282p9456m2320j32383
$$ plain form
40604 -81892 -125192 -273711 -365003 -264320 28495 369428 551644 428509 33670 -386274
40594 -386274 -523800 -284703 83830 204389 -58351 -466060 -663690 -527233 -228109 -6997
40584 -6997 41861 -14307 -45826 52800 287731 519901 559297 370264 127624 2693 -35130
40573 -35130 -107001 -193374 -171886 -57523 -20840 -130066 -238735 -202008 -71601 3072 -46330
40562 -46330 -193084 -355048 -382525 -158098 197357 379995 284380 154418 199419 262607
40552 262607 111335 -123162 -124890 87089 186603 78512 33741 209431 387247 343752
40542 343752 180008 88542 51456 -4898 20855 214251 383291 267890 -77598 -360791
40532 -360791 -444313 -419999 -339534 -140127 136748 294067 232522 84240 4784 -37536 -169919
40521a69919k27775j66310O9635L40608M46928K70438j03708m28793n12183l66878
40511h47957j37387N0140J31511R3742k573m5511J6901J16977J51881R4054P957
40500c70265J402J45497L70290M63350K79069n8245k76868k74567j76285q7485
40490A5893K0243J38436J43417m964j51794j58183q9312p1009q7629n7553K443
40479c00012L1867N3270J02659J14144J8405j10596j51364j22244j28102j61910
40469f53883j10724N1282K07740K45494J58114J2235j00332r6898J5059J09605
40459a62308Q7241J9843M1076J16223O6963j43448k87748j34218K37725M85296
40449C26645L69839J2912k45267k08553M481J43189R8460m7438j59086j40831
$$ plain form
40521 -169919 -397694 -564004 -494369 -153761 293167 563605 459897 31104 -481079 -847957
40511 -847957 -985344 -935204 -803693 -709951 -712524 -758035 -741134 -624157 -472276 -378222 -370265
40500 -370265 -368863 -223366 146924 610274 889343 831098 554230 279663 103378 15893
40490 15893 36136 174572 317989 313025 161231 3048 -86264 -157273 -244902 -302455 -300012
40479 -300012 -268145 -214875 -112216 1928 20333 -90263 -241627 -363871 -491973 -653883
40469 -653883 -764607 -713325 -505585 -260091 -101977 -89742 -190074 -286972 -271913 -162308
40459 -162308 -75067 -55224 -14148 102075 169038 25590 -262158 -396376 -158651 326645
40449 326645 696484 709396 464129 255576 260057 403246 501706 454268 295182 154351
40439A54351L8782K72978L08778L116l97894m48015n2750L66868L94888J19493
40429G60595p6963o8603o1098j79049k67415j67552K6872J12282M4424n5905r5335
40418b7747r4141r8513r3968l4800P3436J55007J37491L1374q2720j40740j45703
40407c21024j36016j32141j15922m6292Q5666J99830J78943K7547q8680m8591
40397c96680N0496M6954k8574k4035N3065M4675o2661q7522M3061J65028J42619
40386e3574N1272q165o2167j03828m011K42770L86589K42929k0297j24042n3749
40375D93727J8891L8034M7698K348j49773k88181k71067j80510j78175k10951
40365f77959j20614M3961J13070J20217K22096L40642K33625o9933k55596j95556
$$ plain form
40439 154351 193133 466111 774889 778005 380111 -67904 -120654 246214 641102 760595
40429 760595 683632 615029 553931 374882 107467 -60085 -33213 79069 123493 67588 -27747
40418 -27747 -121888 -220401 -314369 -349169 -275733 -120726 16765 48139 -34581 -175321 -321024
40407 -321024 -457040 -589181 -705103 -751395 -665729 -465899 -286956 -259409 -348089 -396680
40397 -396680 -346184 -299230 -327804 -351839 -298774 -254099 -316760 -404282 -361221 -196193 -53574
40386 -53574 -2302 -10467 -72634 -176462 -180473 62297 448886 691815 671518 547476 493727
40375 493727 512618 550652 598350 600698 450925 162744 -108323 -288833 -467008 -677959
40365 -677959 -798573 -754612 -641542 -521325 -299229 41413 275038 205105 -50491 -246047
40355b46047r2291p4485j1421J32839J25773j26985l14728j51178J65162K37437
40345c55924N1931o1778L6142J42440R4820J947L963M7505L6123K8358J17828
40334A43355K23573J85782L5932j5133J02192J76738Q428k88107m36570l78382
40324b42192k94745k74464k03586m0547M9369k9231j06554j1525J48601J77659
40314h27215R9891N2286J9386n7555m2929J93888M22474K67379k07762m94644
40304e74801l08395N8137J82495L5575j19218j28219m6350L0039N3704J8140l5064
40293h33957n0068l0765n189O3979J99914K74561J43357q8908j58826k3156Q9182
40282d19876M6325k1107M51K7432k898J5477J38887K30454J87842J03786M9564
$$ plain form
40355 -246047 -338338 -412823 -424244 -291405 -165632 -292617 -607345 -758523 -593361 -355924
40345 -355924 -303993 -365771 -329629 -187189 -92369 -90422 -86459 -38954 -2831 25527 143355
40334 143355 366928 552710 588642 573509 675701 852439 860867 572760 136190 -242192
40324 -242192 -536937 -811401 -1014987 -1055534 -1006165 -1035396 -1141950 -1153475 -1004874 -827215
40314 -827215 -727324 -675038 -655652 -713207 -756136 -562248 -139774 127605 -80157 -574801
40304 -574801 -883196 -825059 -642564 -606989 -726207 -854426 -900776 -870737 -817033 -798893 -833957
40293 -833957 -884025 -914790 -919979 -856000 -656086 -381525 -238168 -327076 -485902 -509058 -419876
40282 -419876 -373551 -394658 -394207 -366775 -369673 -354196 -215309 15145 202987 306773 356337
40271C56337p4597k93639l92923k27816m66L1307l8178O6331L21197L96704J25563
40260B69820k64985m38990l09249n6915J08599J57359K16769L42920L80011J65640
40250E70979j74698l42236k72684j79944j56504m0088K06319L20085J58629j7709
40240G2149L7936J41361J8168j80154j15422J39687J91298m7814k54996k37376
40230b35163j62958j70801j29355O2201K38771K25916J08755O4162R2627Q3628
40220A77783K4577o242J9517N6755N7390O321o3467p5059P49O3932O49j24339
40208A38566j25141L7105J87995J85480Q7309J903q6976k26489l23706k25517
40198c49471M0705K35221J68798o9786k22254j72510n5093k3875k8070O3355J94720
$$ plain form
40271 356337 281740 -11899 -404822 -632638 -633104 -601797 -639975 -573644 -252447 144257 269820
40260 269820 4835 -434155 -743404 -800319 -691720 -534361 -317592 25328 405339 570979
40250 570979 396281 54045 -218639 -398583 -555087 -595175 -388856 -68771 89858 72149
40240 72149 110085 251446 269614 89460 -25962 113725 305023 257209 2213 -235163
40230 -235163 -398121 -568922 -698277 -636076 -397305 -171389 -62634 1528 94155 177783
40220 177783 202360 196118 215635 272390 329780 336101 272634 197575 198324 262256 262905 138566
40208 138566 13425 50530 238525 424005 511314 513217 426241 199752 -123954 -349471
40198 -349471 -308766 -73545 95253 25467 -196787 -369297 -424390 -448265 -476335 -412980 -218260
40187b18260J71483k6936j89722j95620j88500l04742m03776k62023O9730L03609
40177a244757K75965J08767Q409K7850O3086K6854j8195O0549K32687K62900M0436
40166a55449j61820j4653L35645M07125Q9311j83211j02517P8025K9599j19386
40156B02669r1450J6352n8980k34302k14994p838J08820M1250n9305j12156j40135
40145e50069p6081J23267K62787J46635p3653j24631m4209k3932N19J59543K37110
40134C7286j5997l03960j42105K87462L30690o7886k37548J19436M49281K65521
40124G22180j38407k91662k57769k84551k62565l5795J69779J23062K9859J26583
40114i9286J90896l5536k64002o3480L86394N13970J83749k12840l88087l86382
$$ plain form
40187 -218260 -46777 -73713 -263435 -459055 -647555 -952297 -1356073 -1618096 -1548366 -1244757
40177 -1244757 -968792 -860025 -851616 -823766 -760680 -733826 -752021 -691472 -458785 -195885 -155449
40166 -155449 -317269 -331922 3723 410848 500159 316948 214431 292456 322055 202669
40156 202669 111219 127571 68591 -165711 -380705 -388543 -279723 -238473 -297778 -409934 -550069
40145 -550069 -626150 -502883 -240096 -93461 -167114 -291745 -335954 -359886 -359367 -199824 37286
40134 37286 21289 -282671 -424776 -137314 193376 125490 -112058 7378 456659 722180
40124 722180 583773 292111 34342 -250209 -512774 -548569 -378790 -255728 -225869 -99286
40114 -99286 91610 56074 -207928 -271408 114986 628956 812705 599865 211778 -174604
40104a74604k55997K5295L04164L45508J84894N6738J3985n7083j23910o4161
40094B54829L6546J204r3612m7969O7470L0627r7956p5674M9363J6011j26685
40083A4154n6705K26999L35911J17139j12110r4698K8185O5277N1235J343k03134
40072C73596m79858m88783j46846J69410J82286J00218J68158K22806O2361r3144
40062G0204M2219K71827K03555j03047k68333k43261l06138m50671l25297J22311
40052i86631M39195L06625j8088j40060o5102j9641k2136K6510K5884j73672l92503
40041a019619k64604K16180O04934N53619K08898n2859q4201j1309K3262j6301
40031A58000j08941j90224j60311n315J33785J32790O8634Q9936J56687R7441
$$ plain form
40104 -174604 -430601 -405306 -101142 244366 429260 485998 499983 442900 318990 254829
40094 254829 291375 292579 198967 150998 218468 249095 151139 75465 124828 140839 14154
40083 14154 -42551 184448 520359 637498 525388 430690 458875 524152 575387 576730 373596
40072 373596 -106262 -595045 -741891 -572481 -390195 -289977 -121819 100987 163348 70204
40062 70204 112423 384250 587805 484758 216425 -26836 -332974 -783645 -1108942 -986631
40052 -986631 -547436 -240811 -258899 -398959 -464061 -483702 -505838 -479328 -453444 -627116 -1019619
40041 -1019619 -1284223 -1068043 -463109 90510 299408 246549 162348 151039 174301 158000
40031 158000 49059 -141165 -301476 -306791 -173006 -40216 28418 118354 275041 372482
40021C72482q0064j47502P440J86365J38798j11526l17866k97769p0041K06800
40011a12883L32460J87067j32799l64339l56577k20365j15285j3476J69463L21136
40001c05598K39920k9418j95537r9514R6623J72980J32203J02319R1613l558j95515
39990F518l44424l10898r7371J63022L04190K26231k9390k82209l44552j88264
39980h97147M5439K16554L12414L64862L25327J45927n0529n9595R9070J47758
39970F50080o1471k96437k65158m3012O6115m45l4988K3248k1337k32959l60893
39959e77257k08022O0422J66811R5396L0209O2904J36858J76331J37958L3205
39949A14815j9999Q9596K43436J89455o1877j99784r1783M732j06729k27157j37656
$$ plain form
40021 372482 292418 144916 152356 338721 477519 365993 48127 -249642 -319683 -112883
40011 -112883 219577 406644 273845 -90494 -447071 -667436 -782721 -796197 -626734 -305598
40001 -305598 -65678 -95096 -290633 -390147 -293524 -120544 11659 113978 205591 202033 6518
39990 6518 -337906 -648804 -746175 -583153 -278963 -52732 -82122 -364331 -708883 -897147
39980 -897147 -851708 -635154 -322740 42122 367449 513376 462847 403252 502322 650080
39970 650080 588609 292172 27014 -15998 50117 49672 14684 37932 16595 -216364 -577257
39959 -577257 -785279 -724857 -558046 -462650 -432441 -369537 -232679 -56348 81610 114815
39949 114815 94816 184412 427848 617303 555426 355642 263859 268591 161862 -65295 -202951
39938b02951J3860K7142L8625K03356K84843L8945k45221j42628J56813J18646
39928B91430k19261k93029N668J27253j77685m05854j44958K43185K33528m9053
39918c88776j26890O9125K29290K12621J11593m7473k55574l23036j14554J48201
39908d85473J75898O2582Q0110J71344P5132j40673j39002J04410K41433J37832
39898B83593O9868J89803K15540r8324n08808o08799l85182j46660l4802P2496
39888i51275K10415J94669o4248l27867k78309Q2766M34462N23385M09342K77378
39878E10718J51936m4885k31585k03891K2013J39389k8809k31775j32164J83944
39868A34891L08930Q3651k10103k63320r4104J01547K25687K57649J38696j27119
$$ plain form
39938 -202951 -189091 -161949 -123324 80032 364875 403820 158599 15971 172784 291430
39928 291430 72169 -220860 -215192 -87939 -265624 -671478 -816436 -573251 -339723 -388776
39918 -388776 -515666 -446541 -217251 -4630 106963 59490 -196084 -519120 -633674 -485473
39908 -485473 -309575 -246993 -166883 4461 79593 -61080 -200082 -95672 145761 283593
39898 283593 353461 543264 758804 660480 151672 -457127 -842309 -988969 -1023771 -951275
39888 -951275 -740860 -546191 -610439 -938306 -1216615 -1133849 -699387 -176002 233340 510718
39878 510718 662654 617769 386184 182293 204306 343695 314886 83111 -49053 134891
39868 134891 443821 527472 317369 54049 -40055 61492 287179 544828 683524 556405
39858E56405l57583l66114k04838p5627l6611L2106J75756K60653J79019J1511
39848A74677r9968j31270j36496j21705n9580L8861J56448K92766L62623J98797
39838F75153j76921m10219k04438K03144K77186p5374l58923k11523R7817J43751
39828d0347k3074q4714l3338q0691j44572N7432M20180M71513Q1353l13391l57667
39817d7316k20163j68017j23579M0369J32351k9943j95869k8106L01693L20782
39807a7798j8607k69502j61409P3402J38489P3953N5806Q0788N2440r279k9567
39796c1284k4895m4853o9032p0137p6090p7168O767J61487K16411R1148k0918
39785F1436R0153K91879K45678r9525l93511l48981j08774L774o2375r9607k2139
$$ plain form
39858 556405 198822 -167292 -372130 -447757 -484368 -452262 -276506 -15853 163166 174677
39848 174677 74709 -56561 -193057 -314762 -374342 -335481 -179033 113733 476356 675153
39838 675153 498232 88013 -116425 86719 363905 288531 -70392 -281915 -184098 -40347
39828 -40347 -63421 -148135 -181473 -262164 -406736 -349304 70876 542389 623742 310351 -47316
39817 -47316 -267479 -435496 -559075 -518706 -386355 -416298 -612167 -640273 -338580 -17798
39807 -17798 -36405 -305907 -467316 -393914 -255425 -181472 -125666 -44878 7562 -1717 -31284
39796 -31284 -56179 -101032 -170064 -240201 -316291 -393459 -386692 -225205 -8794 82354 61436
39785 61436 151589 443468 689146 589621 196110 -152871 -261645 -257871 -320246 -419853 -441992
39774d41992K1985o0525j37481o5068R9006K11942K36121J90954N1822j46479
39764c9715k23063o2395J59220J62094n4256k14690j48259K8219J24687R3301
39754a74857j2453j32456j96382j52817n0086R059N167p15J8596O0078J52022
39743d74844K62422K26521k8192k62576j95683N5935J16029r1322k67123k48425
39733i07258k04675k28547j37144J38336L42137L05083K24111K76013K86724Q6409
39723A81189j20491r1598J9993m5027j58956k7614K54876L07838M7635k22396
39713A45449k77022j86288q8996m8870j12505k46712k65809o3896J69849K15301
39703g59499J62885K03973K51595J30014k0581M2797J77156O1210j92341j71320
$$ plain form
39774 -441992 -420007 -480532 -618013 -683081 -584075 -372133 -136012 54942 106764 -39715
39764 -39715 -262778 -325173 -165953 -3859 -58115 -272805 -421064 -392845 -268158 -174857
39754 -174857 -187310 -319766 -516148 -668965 -719051 -709992 -704825 -705540 -686944 -626866 -474844
39743 -474844 -212422 14099 -14093 -276669 -472352 -416417 -300388 -391710 -658833 -907258
39733 -907258 -1111933 -1340480 -1477624 -1339288 -997151 -692068 -467957 -191944 94780 181189
39723 181189 60698 -30900 -10907 -55934 -214890 -242504 12372 320210 367845 145449
39713 145449 -131573 -317861 -406857 -455727 -568232 -814944 -1080753 -1144649 -974800 -759499
39703 -759499 -596614 -392641 -141046 -11032 -31613 11184 188340 249550 57209 -114111
39693a14111J05329J77141n8227j42090J50306L97054K31608n3902k0355K08132
39683H80885K12065k7449j74949j20198p2625j42971k04435j66914r4001l0485
39673E8923N1914J17777P1008p7668j92599j85769j01551j8367N2671J51937K82506
39662B10782L43685J97099j36032m08492m10525k41920j40559j03592N4630K85780
39652c49144K92814K0501j83843p7150J18283Q9416j02355k04088j91482j92314
39642g79362j58808M1074K91579L21212J21016r879J21226L54347L99037J52158
39632H53600k39633n17240m95873k16289P7664J71537O9689p7442j51453j13615
39622f39055J8142J49646J60913N6467l5246o9212j36380k30003j65323J16173
$$ plain form
39693 -114111 -8782 168359 110132 -31958 118348 515402 747010 693108 672753 880885
39683 880885 1092950 1065501 890552 770354 697729 554758 350323 183409 89408 58923
39673 58923 110837 228614 299622 221954 29355 -156414 -257965 -276332 -223661 -71724 210782
39662 210782 554467 751566 615534 207042 -203483 -445403 -585962 -689554 -634924 -349144
39652 -349144 -56330 -35829 -219672 -296822 -178539 -89123 -191478 -395566 -587048 -779362
39642 -779362 -938170 -897096 -605517 -284305 -163289 -173168 -51942 302405 701442 853600
39632 853600 613967 96727 -399146 -615435 -537771 -366234 -296545 -373987 -525440 -639055
39622 -639055 -620913 -471267 -310354 -253887 -289133 -358345 -494725 -724728 -890051 -773878
39612g73878L60330L21207J02187m0574p1030r8815r2292K5098J09437k2449k09121
39601c89900j22976J64376K04724j35056m04978k19520J57945K01841j12185l00931
39591i56660p2338L16092M70066L55619K13379J48226M4625j35616k09294m3699
39581A30400J80983J79170j9269p8716J62458M32117L81871M7866k35133k87655
39571H94092k35537k24914k10983j08982P872k095j29129k10295j51312n3030
39561d24313o1666j51334j57207k8695P7127L5981k7777P4764K66175K67843L972
39550a25130k69561k99500j10457J24874K91953L10213J15324j73310k50140J3288
39540c72446L41100L89361J85453J2838l2738j06107k71550l65333k43213K8441
$$ plain form
39612 -773878 -413548 -92341 9846 -30728 -101758 -200573 -292865 -267767 -158330 -180779 -389900
39601 -389900 -512876 -348500 -143776 -278832 -683810 -903330 -745385 -543544 -655729 -956660
39591 -956660 -1028998 -712906 -242840 112779 326158 474384 519009 383393 174099 130400
39581 130400 311383 490553 471284 392568 555026 987143 1369014 1416880 1181747 894092
39571 894092 658555 433641 222658 113676 121548 119453 -9676 -219971 -371283 -424313
39561 -424313 -485979 -637313 -794520 -823215 -746088 -710107 -737884 -663120 -396945 -129102 -125130
39550 -125130 -394691 -694191 -804648 -679774 -387821 -77608 37716 -135594 -385734 -372446
39540 -372446 -31346 358015 543468 556306 523568 417461 145911 -219422 -462635 -434194
39530d34194K80275L94418L24497J03393j31609k39800k34592k39214k72438j99809
39520f49073N3860L40205M15871K14004o0434j33622L3242J93913J32498m2202
39510D98262o7557N4255N2396j54551k81027j09325J55462J94730L2172q8829
39500B85988j14612j60527j97445r0693R4271J37039P231j12804j40093j46016
39490d37661j11171N7567K34663J41000j95235l62475j17055K62154L74957K27263
39480G4007J09888J13362N4844j50389l05304j96971J03676L21200L03817J61080
39470E89210M9838n7897k54109m10836k69013J24744L46385J47004j69696j95031
39460i9401k1124k8207k19382k29204L1070K19761J48568O6072J74939K74438
$$ plain form
39530 -434194 -153919 240499 564996 668389 536780 296980 62388 -176826 -449264 -649073
39520 -649073 -595213 -255008 160863 374867 314433 180811 214053 407966 540464 498262
39510 498262 430705 484960 537356 382805 101778 -7547 147915 342645 374817 285988
39500 285988 171376 10849 -186596 -277289 -183018 -45979 -38748 -151552 -291645 -437661
39490 -437661 -548832 -491265 -256602 -115602 -310837 -673312 -790367 -528213 -153256 74007
39480 74007 183895 297257 352101 201712 -103592 -300563 -196887 124313 428130 589210
39470 589210 639048 581151 327042 -83794 -352807 -228063 118322 265326 95630 -99401
39460 -99401 -120525 -148732 -368114 -597318 -566248 -346487 -197919 -131847 43092 317530
39450C17530J41687p2236j25511q6966j38293k07472j41779o5280j91650l89689
39440i59659l19218K4910K70429K19034J08014J99140L87339M12886K68597J58184
39430G69656J36872L7975k11359m01717l05477l1190O8979j38415l67711k79429
39420g21816P5851L34081K73929K2897j75646k21508j49685k3406Q9645J37743
39410c57915J39982J46929J33460L0539j26767k02248j35760j1399O5600N5064
39400b62515m4703j80776k21751j04555J8282l6485j78191j58626J5412Q2634
39390a071274j0018J3524K70592M47159K61732o9153j39065N8858J76275M0257
39380b1113j70866k44262j52564M1306K58834L56652K10826q3568k43483j02442
$$ plain form
39450 317530 459217 386981 261470 174504 36211 -171261 -313040 -378320 -569970 -959659
39440 -959659 -1278877 -1253967 -983538 -764504 -656490 -457350 -70011 342875 611472 769656
39430 769656 906528 944503 733144 331427 25950 -5240 63739 -74676 -442387 -721816
39420 -721816 -645965 -311884 -37955 -15058 -190704 -412212 -561897 -585303 -495658 -357915
39410 -357915 -217933 -71004 62456 92995 -33772 -236020 -371780 -383179 -317579 -262515
39400 -262515 -307218 -487994 -709745 -814300 -796018 -832503 -1010694 -1169320 -1153908 -1071274
39390 -1071274 -1081292 -1067768 -797176 -350017 -88285 -157438 -296503 -237645 -61370 -21113
39380 -21113 -191979 -436241 -588805 -547499 -288665 67987 278813 195245 -48238 -150680
39370a50680J91068L18585J05243k95430n07495k82656K19500N73793N36610K45870
39360I54408l6999k03586k47450j50913K1083Q2299m2656j77344j41668k010Q1888
39349A37052R4250O5355p7782l27245m33370k10756J26703K29304R5079j4082
39339c15492k1392m8877p5549J7349J02859n4270l04503k29311J59290L29163
39329d40733L2258k85017j79906J18728J54833l978K0815J85718R1350k74449
39319e80381m34493j69530J35674J16184k3318R0614L56568L66995P7655j13904
39309a77936J9547K04150Q7835k60458m72139l52593l9634K27608L11925J91184
39299b60511m3978j92286j02553J28339K51458J91823J27192J87396K53042J75553
$$ plain form
39370 -150680 40388 358973 464216 168786 -338709 -621365 -401865 171928 708538 954408
39360 954408 917409 713823 466373 315460 336543 418842 376186 198842 57174 55164 137052
39349 137052 231302 296657 218875 -108370 -541740 -752496 -625793 -396489 -301410 -315492
39339 -315492 -336884 -385761 -461310 -443961 -341102 -395372 -699875 -929186 -769896 -440733
39329 -440733 -408475 -693492 -873398 -754670 -599837 -603815 -583000 -397282 -305932 -580381
39319 -580381 -1014874 -1184404 -1048730 -932546 -955864 -865250 -508682 -141687 -64032 -177936
39309 -177936 -158389 45761 133596 -126862 -599001 -951594 -991228 -763620 -451695 -260511
39299 -260511 -304489 -496775 -599328 -470989 -219531 -27708 99484 286880 539922 715475
39289G15475M0113K5124R7785O2428j15749k42644j86404o2980m9703j35599j60706
39278a2860m6109J03794J22960l3635k35840l06870k07840o7675j3909k2893J8304
39267g02573J51157L10018M04373L66727J64750j39810l70027l74197j91935m082
39257c85599P8094R7239J31106J76229J67786N9166j23554k71217k68403j33916
39247d73069l2436o5950j13405N745K54030M07883L53288J95001N7165o1181j76393
39236C50678k18434j39168k0690K5979N708O43L9890Q0779P9142K0931p4189j34902
39224A6367q0916N8435J27808K6188j41214j83998p6584J8147j1061o8384q240
39213c23452J21848J16961r3551l03221k66910k3868J44539Q7697j7264P8119
$$ plain form
39289 715475 755588 780712 878497 940925 825176 582532 396128 333148 283445 147846 -12860
39278 -12860 -58969 44825 167785 134150 -101690 -408560 -616400 -684075 -697984 -720877 -702573
39267 -702573 -551416 -241398 162975 529702 694452 554642 184615 -189582 -381517 -385599
39257 -385599 -307505 -210266 -79160 97069 264855 324021 200467 -70750 -339153 -473069
39247 -473069 -505505 -571455 -684860 -679115 -425085 -17202 336086 531087 588252 527071 350678
39236 350678 132244 -6924 -27614 -1635 4073 4716 44606 125385 204527 225458 151269 16367
39224 16367 -64549 -6114 121694 147882 6668 -177330 -253914 -235767 -246828 -315212 -323452
39213 -323452 -201604 -84643 -178194 -481415 -748325 -772193 -627654 -539957 -557221 -479102
39203d79102L34069M48007K25425j77859m14157k97902J4631J81883K7812k53020
39193c90213k93318J1965L50878L58674N9489j96239k00018j04718j24273j95270
39183g23043r8915J65907L34900K37913L5688k3681L1653k4150j99967k09029
39173d72724Q0130L52998K59896l8237p7211K03013L59314J46082r6730m340K12995
39162I25186J07503k92292n35790m20282j79159j2119J42855K83542K03159j24578
39152I8025l52651k17475N0367N7302j76758k79163q7061J50169J58786o890r6169
39141g01518k22J53858J90074Q0768m7624p4873j9186K2561L9117J15179K48545
39130F679K69796N2261k55303l42008j01922K11003K57919L233k42059j78337
$$ plain form
39203 -479102 -145033 302974 528399 350540 -63617 -361519 -346888 -165005 -137193 -390213
39193 -390213 -683531 -671566 -320688 37986 97475 -98764 -298782 -403500 -527773 -723043
39183 -723043 -821958 -656051 -321151 -83238 -47550 -71231 -39578 -63728 -263695 -472724
39173 -472724 -392594 -39596 220300 182063 104852 307865 667179 813261 716531 712191 925186
39162 925186 1032689 740397 204607 -215675 -394834 -406953 -264098 19444 222603 98025
39152 98025 -254626 -472101 -421734 -364432 -541190 -820353 -907414 -757245 -598459 -605349 -701518
39141 -701518 -701740 -547882 -357808 -277040 -324664 -399537 -418723 -396162 -357045 -241866 6679
39130 6679 276475 328736 73433 -268575 -370497 -159494 98425 101658 -140401 -318738
39120c18738J34633L52948K63028J9971r0428k5757K4251k6151m4379M6254Q9754
39109D25386m8944k07387j27330J33920K45075P7596j05872n4321R3559M0464
39099D72146j90829k75684p7552J32222M7224k54789m13293k21997J62631M14707
39089b05214L52459P8588j44194j80359j69034k87143m03695k07309K50418M46015
39079d69468O4153m64098m71740L7187M17160K85254n4544j73768p2060K6698
39069h75226O6784R1076N2110m9347n2856J01954K10269J23441K0997J07514K41630
39058C8346J58311j00768k76340k81920k15164r4939J11467K80928K46630O5562
39048f7887p8367j61492k53734k65359o5895K08614K85170J63594R2088J47809
$$ plain form
39120 -318738 -184105 168843 431871 451842 361414 335657 359908 333757 289378 335632 425386
39109 425386 376442 169055 41725 175645 420720 498316 392444 338123 431682 472146
39099 472146 281317 5633 -71919 60303 107527 -147262 -560555 -782552 -619921 -205214
39089 -205214 147245 225833 81639 -98720 -267754 -554897 -958592 -1165901 -915483 -469468
39079 -469468 -405315 -869413 -1341153 -1303966 -886806 -601552 -656096 -829864 -901924 -875226
39069 -875226 -808442 -717366 -665256 -714603 -767459 -665505 -455236 -331795 -310798 -203284 38346
39058 38346 196657 95889 -180451 -462371 -677535 -772474 -661007 -380079 -133449 -67887
39048 -67887 -146254 -307746 -561480 -826839 -892734 -684120 -398950 -235356 -143268 4541
39038D541J52526K5351p8795l8207P8114J69478K03981J42896k2285j59900j40369
39027C37331o3490j14050k36282k18929o5086J9923r998o798M6846J1423q1926
39016c81036k3404J82072K45491L3608k11475k22015l4615J37561J54966M520
39006a14327j96868k21455L3940L35051L67647J69301K5315q1p0920j63684p3332
38995I0587J41163J61455o1943k15494j48971n8646m1749O2113K39234J96576
38985C64325j15289l41934k97242k15921k12951l0055L69069N05880J17888l09839
38975a66069k42125R7224J55308o2356j21724O8302K02654J64642J34254J73692
38965D03802J49082L0094q4594j72101k21420j04343J83987L32530J01795k67135
$$ plain form
39038 4541 157067 182418 103623 65416 143530 313008 516989 659885 637600 477700 337331
39027 337331 273841 159791 -76491 -295420 -360506 -340583 -350581 -357379 -310533 -299110 -381036
39016 -381036 -404440 -222368 23123 56731 -154744 -376759 -411374 -273813 -118847 -114327
39006 -114327 -311195 -532650 -498710 -163659 203988 373289 398604 398523 327603 163919 90587
38995 90587 231750 393205 331262 115768 -33203 -91849 -133598 -71485 167749 364325
38985 364325 249036 -92898 -390140 -606061 -819012 -849067 -479998 25882 143770 -166069
38975 -166069 -408194 -310970 -155662 -218018 -339742 -271440 -68786 95856 230110 403802
38965 403802 552884 582978 498384 326283 104863 520 184507 517037 618832 351697
38955C51697l73616k09415m4747L4899J00257R0199l9721p2929J38436K94665
38945B69725O2641l15591l40684l6734J34294M3634L090J24234J52543N875o0084
38934D2943N5129J15235p12r0339j9072O0650K2905l8089m6877o2254o3024N9925
38922C6420K15577J49573j32171k95968j46602J25191K50256J61453r0025l96554
38912a22850n09314k15695K92515N18766K44240k31955n03935m57292k06877Q4055
38902a108342K44216J99500R8555J22358J86674R8577m3342M0152L03809L78976
38892E21133J40123j15081j52721j02158j36048j86815j36219q987J40987K77850
38882B42064K55509m9908m15344m25098m9950K72861K50837P0094j7215o1820
$$ plain form
38955 351697 -21919 -231334 -276081 -241182 -140925 -50726 -90447 -163376 -24940 269725
38945 269725 332366 16775 -323909 -360643 -226349 -182715 -179625 -55391 97152 103027 42943
38934 42943 98072 213307 212595 122256 103184 163834 186739 148650 101773 39519 -23505 36420
38922 36420 251997 401570 269399 -26569 -173171 -47980 202276 363729 273704 -122850
38912 -122850 -632164 -847859 -555344 -36578 207662 -24293 -528228 -985520 -1192397 -1108342
38902 -1108342 -864126 -664626 -566071 -443713 -257039 -158462 -201804 -161652 142157 521133
38892 521133 661256 546175 393454 291296 155248 -31567 -167786 -176773 -35786 242064
38882 242064 497573 447665 32321 -392777 -442727 -169866 80971 151065 133850 72030
38872G2030j70712k28340j11859O4613J33402R3827k664j60607k94114k13654
38862h18078Q6009L37251L31569J46714m1117j51944j44932j3435R9666L0603
38852a37694j26718j43483n3360q3851j89667p8496K34191L56394J42038o8835
38842a49481j4433J22396J29591J20935K14799K45997P8550j31317k34345l16396
38832F6296m05586l22086n9929P5038k1714j5300K76296M74010K21675j90854
38822I7846k42781N7578K75842K08731K4492j00625j26640n2304M3174m038j91761
38811a0486k89168k00073j15575j23086k4446K13610K45941p3582l14972r6028
38801g87865K91379L54625J63057J10606J97882J22819j04032k00247j51903j91446
$$ plain form
38872 72030 -98682 -327022 -438881 -374268 -240866 -147039 -149703 -310310 -604424 -818078
38862 -818078 -732069 -394818 -63249 83465 42348 -109596 -254528 -267963 -168297 -137694
38852 -137694 -264412 -407895 -461255 -545106 -734773 -813269 -579078 -222684 -80646 -149481
38842 -149481 -163914 -41518 88073 209008 423807 669804 748354 617037 382692 66296
38832 66296 -339290 -661376 -721305 -646267 -667981 -683281 -406985 67025 288700 97846
38822 97846 -144935 -87357 188485 397216 421708 321083 194443 142139 185313 181275 -10486
38811 -10486 -299654 -499727 -615302 -738388 -762834 -549224 -303283 -376865 -691837 -787865
38801 -787865 -496486 -141861 21196 131802 329684 452503 348471 148224 -3679 -195125
38791a95125l14373l02304j68879j27555j62918p0152J12846J35793o167l2218
38781a131052J81565M36574N04840L45891O8428j30278r6851L9555l1008k85421
38771i7757k90709R2827L50861P2664l44769k95634Q8821K32028O7832n823N5659
38760g4000p3347l48197l30653N0147L69815M08903L72610L54336J95491l8436
38750H86669n7574O9527n1179l91527m24946j023L27260J33865k79311m29323
38740b17562l07118j53872j9457J13090J25826L620l4463J05863K11040J44088
38730b8945P0878R3829L0372j97893l22137j57324N5609M2760n8231L9028K95494
38719a36560M31517L12594K0794k90838m39130l00326j6040R5652l6332j39100
$$ plain form
38791 -195125 -509498 -811802 -980681 -1108236 -1271154 -1341306 -1228460 -1092667 -1098834 -1131052
38781 -1131052 -949487 -512913 -8073 337818 406246 275968 179117 218672 187664 -97757
38771 -97757 -388466 -295639 55222 127886 -216883 -512517 -423696 -191668 -123836 -129659 -74000
38760 -74000 -147347 -495544 -826197 -776050 -406235 2668 375278 729614 925105 886669
38750 886669 829095 898622 847443 455916 30970 29947 357207 491072 211761 -217562
38740 -217562 -524680 -678552 -698009 -584919 -459093 -455473 -489936 -384073 -173033 -28945
38730 -28945 41933 135762 166134 -31759 -353896 -511220 -455611 -412851 -471082 -432054 -136560
38719 -136560 294957 607551 628345 337507 -101623 -401949 -417989 -322337 -358669 -497769
38709d97769l8431R0775P0149J0723N8320J17184M5250r8649j87534j95640r9396
38698g25018J42010L79335L35575K6867j81779j08558j9271j58830l49128l07941
38688i66738p7548J29089K49526K87908J69379o5310j71484o1900J665j57578
38678f62991k84908j01190J96928K17345k4762j59092r780K42984L85861L64598
38668A64993J97365m8735k14673j82688l4766N5615L2478m3929j08223j06793
38658b89356k6411K4100p3312j96505q2638K36196L85221J82350q1827j02525
38648b4707L289j7552j09617o7244P6319J44723J40835J62730J38799l9212k25710
38637A82653j79907L4157Q8665j62186m84211n29578j86061L14567N80940M41562
$$ plain form
38709 -497769 -536200 -445425 -375276 -364553 -306233 -189049 -143799 -242448 -429982 -625622 -725018
38698 -725018 -583008 -203673 131902 158769 -23010 -131568 -150839 -309669 -658797 -966738
38688 -966738 -1044286 -915197 -665671 -377763 -208384 -273694 -445178 -507078 -505413 -662991
38678 -662991 -947899 -1049089 -852161 -634816 -659578 -818670 -828450 -585466 -199605 164993
38668 164993 362358 313623 98950 -83738 -118504 -62889 -30411 -74340 -182563 -289356
38658 -289356 -315767 -291667 -364979 -561484 -644122 -407926 -22705 159645 77818 -24707
38648 -24707 -21418 -38970 -148587 -215831 -139512 5211 146046 308776 447575 408363 182653
38637 182653 2746 36903 125568 -36618 -520829 -1050407 -1236468 -921901 -340961 100601
38627A00601J61146J20729K87263K71596m7192l19105k84146j48089j63117k04998
38617b25312q1339O6977L6196l9576O3479K35844K34867J08953N5071M5385l2433
38606D68112n7609J02946K38051Q3296j85740k00591j5816j769j98233k69134
38596c6487r4374P1079P4538N4198P0638k2961k16736k41668k628K14020J53687
38585B3306n2485j33829o4632j2865n0364q2571l772J70088K99202K51771P4510
38574D18359m1984l3529n8144j99007k58711o4190J97000K26332O5727j2925L8462
38563B77390M7908Q292P4805J85200P0594k90387n73861n56948l51934j09368
38553a218309J87547M98177O03782M11312J46269L8704l068j95187m78571n39244
$$ plain form
38627 100601 261747 382476 669739 941335 894143 575038 290892 142803 -20314 -225312
38617 -225312 -306651 -239674 -203478 -243054 -179575 56269 291136 400089 455160 500545 468112
38606 468112 410503 513449 751500 834796 649056 448465 432649 430880 232647 -36487
38596 -36487 -130861 -59782 14756 68954 139592 116631 -100105 -341773 -344401 -130381 23306
38585 23306 -29179 -163008 -227640 -240505 -290869 -373440 -377212 -207124 92078 343849 418359
38574 418359 376375 342846 284702 85695 -173016 -237206 -40206 186126 251853 238928 277390
38563 277390 325298 333590 408395 593595 664189 373802 -200059 -757007 -1108941 -1218309
38553 -1218309 -1030762 -532585 71197 482509 628778 667482 664414 469227 -9344 -548588
38543e48588k17268K50718M52808K37200j15388k05851J4218K14513J57307k305
38533B37364j3841Q6151J11912O5782N2164k843k11190l96056k79182L3557J42865
38522a73317l3804j39112L1570K06382J07660r1793p1478J11298J28345q9940
38512a4189k43132j01833J69665K38031L3509j72087j17860J21863K54190J58077
38502C26234R243j0603L9109M856j07098j69894j36443o0737J0558M9081K2426
38491b3268l4314j3264J05521J98019J86438J39017R1441l2327j95603j84560
38481B37100M3145J86463J8554k48801k91537j47323n5554k9950N6587J30465
38471a00851L7076j24440j49041q8794j10571j32256M201J39639K6956j61687
$$ plain form
38543 -548588 -765856 -515138 -62330 174870 59482 -146369 -132151 82362 239669 237364
38533 237364 223523 309674 421586 487368 539532 536689 325499 -70557 -349739 -316182 -173317
38522 -173317 -207121 -346233 -314663 -108281 -621 -92414 -163892 -52594 75751 -14189
38512 -14189 -257321 -359154 -189489 48542 82051 -90036 -207896 -86033 168157 326234
38502 326234 335477 324874 363983 368839 261741 91847 -44596 -105333 -94775 -45694 -23268
38491 -23268 -57582 -70846 34675 232694 419132 558149 649590 617263 421660 237100
38481 237100 280245 466708 485262 236461 -55076 -202399 -257953 -287903 -231316 -100851
38471 -100851 -63775 -188215 -337256 -426050 -536621 -668877 -664676 -525037 -498081 -659768
38461f59768n5406K53984L08995M7947q7912J03156K79119J67642j2455R365J04864
38450D59531J7375k17057l65361k99189m6681K47369L34090Q9962k11571j60021
38440a51553K04052M02243J96145j20828k23536j58185p9176M0225K14058K80664
38430F04109J59604P384o2381j41577k52372k16247J2034J76875R6183o8359j10576
38419B04677p4884n7391K558J14274R2767j41436l61134l46938j68503L1813K55901
38408d48296M42937L58120l5714l71140l37909j08302j0905l4836J1652R1302
38398d43091O9067O0162K33565L99539K25684j90648l90394k10497K3459L7058
38388a86096m1186k5473k6995j92205l20074r4365L63163N25532J54954l18167
$$ plain form
38461 -659768 -715174 -461190 -152195 -104248 -192160 -89004 190115 357757 345302 354667 459531
38450 459531 476906 259849 -105512 -404701 -451382 -204013 130077 220039 8468 -151553
38440 -151553 52499 454742 650887 530059 306523 148338 69162 109387 323445 604109
38430 604109 763713 771097 708716 567139 314767 98520 110554 287429 383612 315253 204677
38419 204677 129793 72402 74960 189234 282001 140565 -220569 -567507 -736010 -704197 -448296
38408 -448296 -5359 352761 317047 -54093 -392002 -500304 -511209 -546045 -534393 -443091
38398 -443091 -374024 -313862 -80297 319242 544926 354278 -36116 -246613 -223154 -186096
38388 -186096 -227282 -252755 -279750 -471955 -792029 -886394 -523231 2301 157255 -160912
38378a60912l45189R97J76130j2101j55723O7548L85524L89555J54531K0830J8752
38367E39942n1276j52767j06261k7866j71735l95549l07854N2322K22984O6760
38357c31300l3579J48523L48898L42695K95703L40947K76597k3169l03030l22358
38347G39927k00981j20565m4998K5094q6349l50221m12397j46096P2625m4934
38337e68895k38874j82204j8705o896q97K40708N30611N25860K92091J31695N7829
38326G62323r8157k43896j76479m0611j49203m16972m37075j12085K08648K51501
38316d52006J19611K5436K8426R4942J70330J44601n2398k94211l59650j97428
38306g72347L7630J83169J93143J18985O8332J15815J84183J14784q9264k29186
$$ plain form
38378 -160912 -506101 -505104 -328974 -341075 -496798 -429250 -43726 345829 500360 521190 539942
38367 539942 488666 335899 229638 201772 30037 -365512 -673366 -621044 -398060 -331300
38357 -331300 -364879 -216356 132542 475237 770940 1111887 1388484 1365315 1062285 739927
38347 739927 538946 418381 373383 398477 312128 -38093 -450490 -596586 -523961 -568895
38337 -568895 -807769 -989973 -1008678 -1015574 -1016471 -775763 -245152 280708 572799 704494 762323
38326 762323 664166 420270 243791 203180 53977 -362995 -800070 -912155 -703507 -452006
38316 -452006 -332395 -306959 -278533 -183591 -13261 131340 78942 -215269 -574919 -772347
38306 -772347 -734717 -551548 -358405 -239420 -171088 -55273 128910 243694 154430 -74756
38296g4756j75157r930J26931J53123k917l10214m86035k57106J82044L29469
38286e24548P6548j44298l5791J63910J45910j5759j08396j06510k9031J64647
38276d13318L32729J97095j70177l35465j77008p5888k01538j77032K08475N37225
38266b74902M43861K09000J88365J83528o7683k77219j05907J55584N6692k24214
38256B87105k12642M9422J63541P9935K8604n104j45558k13809k0900J82832J07676
38245C01102k0736J17469K89062J12145k15851k68840j61959k61120m16244k36284
38235g61256J25391K23185J16108J44020J73514r9213l52435p0874M25077L70813
38225B94330j42348k92417Q0884K79097J9330j68914k2694J4617k54682l46911
$$ plain form
38296 -74756 -249913 -259843 -132912 20211 17294 -292920 -778955 -1036061 -854017 -524548
38286 -524548 -448000 -592298 -628089 -464179 -318269 -334028 -442424 -548934 -577965 -413318
38276 -413318 -80589 116506 -53671 -389136 -566144 -642032 -843570 -1020602 -812127 -274902
38266 -274902 168959 377959 566324 749852 682169 404950 299043 454627 511319 287105
38256 287105 74463 123885 287426 367361 395965 390861 245303 31494 10594 193426 301102
38245 301102 280366 397835 686897 799042 583191 314351 152392 -108728 -524972 -761256
38235 -761256 -635865 -412680 -296572 -152552 20962 -78251 -430686 -501560 -76483 294330
38225 294330 151982 -140435 -59551 219546 238876 69962 47268 61885 -192797 -539708
38215e39708l463L13091K32651K9983p581l7150j30060j0069L06924L23838r2872
38204C85584l72771j62489R2814n0809l00918k07786Q6061K01310J49761J16827
38194f2416M3315j23879j59200M7994K04450R4625l1565Q1929K33738J35928j01344
38183C63575k13816j94679j46179l3951J21678J20316q8044k49053k01214j09265
38173f30632j12326q5374O6314K21323K96524L27899K17957j55082n09685l82736
38163g45818J04891K97212j3462k85289j42805O9890j3431j62369m6386J91428
38153g46139K80368K72091K64957J31643j28633k15082j9966J59358J69166K34969
38143D02732L86005K56014k12545n09412l86029k74496m37046m15343J02574N60826
$$ plain form
38215 -539708 -543171 -230080 2571 32554 24973 -12177 -142237 -152306 154618 478456 385584
38204 385584 12813 -149676 -56862 -107671 -408589 -616375 -530314 -329004 -179243 -62416
38194 -62416 -19101 -142980 -302180 -254186 -49736 44889 13324 95253 328991 464919 363575
38183 363575 149759 -44920 -191099 -225050 -103372 16944 -71100 -320153 -521367 -630632
38173 -630632 -742958 -828332 -762018 -540695 -244171 83728 301685 146603 -363082 -745818
38163 -745818 -640927 -343715 -357177 -642466 -785271 -715381 -728812 -891181 -937567 -746139
38153 -746139 -465771 -193680 71277 202920 74287 -140795 -160761 -1403 167763 402732
38143 402732 788737 1044751 832206 322794 -63235 -337731 -774777 -1190120 -1087546 -526720
38133e26720L79228p5477j18005J56614J96005O385K3721K46745K83850Q9669
38123F62015n0330j25422l27810m98187k92864J52345L24266R5711j33900p9096
38113b73272J03922J69855R5271j0633m9383J4840R1937N1105l1750O5410K92242
38102E19544K98923L98k22748j31874k1453j82414l82238k72748L0317J83181
38092a81112J43051Q5962N5525K5996N8812J13228j2275l00756m15276k16018
38082f42863L134L1918N6746J94802K07701l296j19408K7708J19883m4576j43442
38071c11693O2187K49456J15533q0858k7749R9864P7831Q9281K61601K84168j0574
38060H09047k34395j23876m7371k84562m29370j37860J63995K8423j73682N2495
$$ plain form
38133 -526720 -147492 -222969 -340974 -184360 11645 18030 41751 288496 572346 662015
38123 662015 611685 486263 158453 -339734 -632598 -480253 -155987 -60276 -194176 -273272
38113 -273272 -169350 505 95776 85143 35760 50600 142537 193642 161892 227302 519544
38102 519544 818467 818865 596117 464243 442790 260376 -121862 -394610 -364293 -181112
38092 -181112 -38061 47901 103426 129422 188234 301462 289187 -11569 -426845 -642863
38082 -642863 -639729 -607811 -551065 -356263 -148562 -151858 -271266 -243558 -123675 -168251 -311693
38071 -311693 -249506 -50 115483 34625 6876 106740 184571 273852 535453 819621 809047
38060 809047 574652 450776 403405 118843 -310527 -448387 -284392 -255969 -429651 -377156
38050c77156L61843J67231k79907l13266J4278J08173j33613k93052k20139j03508
38040a069116L9340K77970M07153K61527R9806J38484J07055j79031l16133j8316
38030b51261K40368J2269k78996q4836K62620J79973r3917j4358K03538N4148
38020B29548k03722k7683L01662J56973k30205j68952K06613J96057j84250l08581
38010c2540j14710o2861j30407N5070K89167J02546k20015o4934K94427J02658
38000B18401m54118m86557N9654L77424K46938K31336M33344L41212k4993p1195
37990H71446J72698M9794m13717m37783J04047M22572J68789j14804j10593j49669
37980E62780l03541j78265J59223J39997k26397l10511m3090n173k16704n3764
$$ plain form
38050 -377156 -15313 151918 -127989 -441255 -426977 -318804 -452417 -745469 -965608 -1069116
38040 -1069116 -1029776 -751806 -344653 -83126 16680 155164 262219 83188 -232945 -251261
38030 -251261 -10893 1376 -277620 -362456 -99836 80137 -13780 -28138 175400 229548
38020 229548 25826 -1857 299805 456778 226573 57621 264234 460291 276041 -32540
38010 -32540 -147250 -210111 -340518 -285448 3719 106265 -113750 -178684 115743 218401
38000 218401 -235717 -722274 -662620 -285196 -38258 193078 626422 967634 942641 871446
37990 871446 1044144 1093938 680221 242438 346485 769057 937846 823042 712449 562780
37980 562780 259239 80974 240197 380194 153797 -156714 -199804 -204977 -421681 -475445
37970d75445M49468M88430o3258l62975p4244J30415q7846j51987K13468L90364
37960D56390J6167l71570l42736k04364j85695j0099L14943K96237q0337j94345
37950c05409P9939J44723j34999j54129K10559K96033o4908j78593J79079L03878
37940C76173r6730l36429m2044J89959k7076k05973m4369J3899j85653q3136M29615
37929a1764N87939P6165l71263k50199l2291r9876r7990J24276J04973j88676
37919a58706j14026L74071M70668L665j84951J79667K94826j13919k15923K73468
37909H08840M61407O498j67047L12676M35901k64187o83734j32762L60592l5626
37899A102558m08150J33534P12294K82597l94678m3762R52496J264529O34880
$$ plain form
37970 -475445 -25977 462453 399195 36220 -38024 92391 4545 -147442 66026 456390
37960 456390 472557 100987 -241749 -446113 -631808 -641907 -326964 -30727 -111064 -305409
37950 -305409 -225470 -80747 -215746 -369875 -159316 136717 71809 -106784 72295 376173
37940 376173 279443 -56986 -99030 90929 63853 -142120 -186489 -172590 -358243 -441379 -11764
37929 -11764 576175 652340 281077 30878 -1413 -101289 -199279 -75003 29970 -158706
37919 -158706 -272732 101339 572007 575672 390721 570388 865214 751295 535372 808840
37909 808840 1270247 1276745 1109698 1422374 1858275 1594088 910354 777592 1138184 1102558
37899 1102558 694408 827942 1540236 1822833 1428155 1384393 2336889 3601418 4236298
37890D236298j98612p95097j037001p00521m4113P1494m64592o19244J1255L66609
37880H26476k01751o99378k58488L45686J97457j87430r7872k312l44243m04973
37870h26828K40575N87229m1062n69061j3243P31744N25419o3325o0721J03332
37860F14059k34883m31285J25746N48092L5740m98542j09546L68142m2396n53114
37850a77987j85134L14688K8249k71250K29941N50138k04292q39284j51444P24101
37840A7726L46454l99646j24681L86127j15239p03964p2530P50305K84368m84227
37830a15307J2858Q13989K63507o97366k88371O53457L07590n71896j77277P42415
37820I43599L41595o49550l37245O05970L14406n20238o2187Q62958K99952q43395
$$ plain form
37890 4236298 4037686 3242589 2205588 1505067 1460954 1532448 1067856 448612 459867 826476
37880 826476 624725 -74653 -333141 12545 210002 22572 -75300 -77612 -421855 -826828
37870 -826828 -586253 976 -40086 -609147 -622390 109354 634773 571448 510727 614059
37860 614059 379176 -52109 73637 621729 657469 158927 49381 417523 375127 -177987
37850 -177987 -363121 -48433 -20184 -291434 -61493 488645 284353 -554931 -706375 17726
37840 17726 364180 -35466 -160147 225980 110741 -593223 -665753 84552 368920 -115307
37830 -115307 -102449 711540 975047 277681 -10690 642767 950357 378461 201184 943599
37820 943599 1285194 635644 298399 904369 1218775 698537 636350 1499308 1799260 955865
37810I55865l94774Q16862M85928p00275m56982N56829J07423j016793m71070
37801a16987Q82680N37044o71536j98624R94841K38589j281316m96228J408812
37792A297275R42423r53253o01394J248977Q80836r49695m11241J598659R08715
37783C961302j528297j042490J640078J563254p39088k04207K477507J843518
37775G971577j214626m61994L386164L517273N94438K022999O762705N976746
37767B8555282N20743P77587O396881N767672j17737L679637J6760772K0863199
37759H3204036J9183757M3838860R7377292J19627183N6703524n4372121j18610926
37752B46951605r7419255m3803204j8682257k0361910j6566770l764690m30422
$$ plain form
37810 955865 561091 1377953 1863881 1163606 706624 1263453 1370876 354083 -116987
37801 -116987 765693 1302737 631201 432577 1427418 1666007 384691 -111537 1297275
37792 1297275 2239698 1286445 685051 1934028 2814864 1865169 1453928 3052587 3961302
37783 3961302 2433005 1390515 3030593 4593847 3854759 3650552 6128059 7971577
37775 7971577 6756951 6294957 9681121 13198394 13792832 15815831 22578536 28555282
37767 28555282 29076025 29853612 36250493 42018165 41900428 45580065 62340837 83204036
37759 83204036 102387793 146226653 243603945 363231128 419934652 365562531 246951605
37752 246951605 149532350 105729146 87046889 66684979 50118209 46353519 45923097
37745D5923097o954635p719164j459058n80670o105767p138485k103617k10481
37737A3651220l277212l660717J72984J434441j395486k320634J71763R14300
37729E690659j306341j798665L93145Q26490j324167j731386N15778J300038m34362
37720B131189r41429P84693J238982n27527j142820L95316R15853n90845j123088
37711A140324L31394Q92031n23555j205959M097O52092l78179q19070L68135R97456
37701A458766j1031o56211J22410N34923l45142q14074j8807M33369k26950m95996
37691a8743K29608M17168m29400o50872L24967Q14099P3893m38234l7554M3935
37681C28867n41501m21597N56835O66146m29765q46327O4340N49076j80414n56429
$$ plain form
37745 45923097 38968462 31249298 29790240 29209570 23103803 15965318 13861701 13651220
37737 13651220 10374008 6713291 6886275 8320716 6925230 4604596 4776359 5690659
37729 5690659 4384318 2585653 2978798 3805288 2481121 749735 1265513 2565551 2131189
37720 2131189 1189760 1974453 3213435 2685908 1543088 1938404 2854257 2263412 1140324
37711 1140324 1471718 2363749 1840194 634235 638332 1290424 912245 93175 461310 1458766
37701 1458766 1447735 791524 913934 1448857 1103715 289641 270834 704203 477253 -18743
37691 -18743 210865 628033 198633 -452239 -127272 686827 760720 322486 284932 328867
37681 328867 -212634 -634231 -77396 588750 158985 -687342 -623002 -73926 -254340 -810769
37671h10769J81555N34036k33964o19089J68025O62328K431m53238J60236N83888
37661A75439J4258l14960L41196O90501n4389n73368K2527M74820j53167o50252
37651b7395k0621N81569O2223n82822k45141K71439j0403l44669J27646O17738
37641D29564K57749k11827M5172L58333J6929k61482J46589L86417k12370o94192
37631B60882k38136K40673j70714o24134j33260N54550L93106o6815J16750N22485
37621H55387M50620M22399R40065J072195R166j190543j154081l72814j25681
37612I06713l23615j62875J03441j70215m79788l5160O15454M76927j14609j93197
37602F23076P9597p1701m40716l01243J34042J73462j4849J09018K52708q2363
$$ plain form
37671 -810769 -629214 -95178 -329142 -948231 -780206 -117878 -115447 -568685 -408449 175439
37661 175439 189697 -125263 215933 906434 852045 278677 301204 776024 622857 -27395
37651 -27395 -48016 533553 595776 12954 -232187 39252 28849 -315820 -188174 429564
37641 429564 687313 475486 520658 878991 895920 634438 781027 1167444 955074 260882
37631 260882 22746 263419 92705 -531429 -664689 -110139 282967 216152 332902 855387
37621 855387 1306007 1728406 2668471 3740666 3749832 2559289 1405208 1032394 906713
37612 906713 583098 420223 523664 353449 -126339 -161499 453955 930882 816273 623076
37602 623076 702673 630972 190256 -110987 23055 196517 181668 290686 543394 461031
37592D61031m23780j20008L52592K13804j76977o8483J97377j09841n80259l41818
37582e96362K97328L85154J7201J2641L29257K69816q0854n1887K64163K08664
37572A055121j52340k13893m6729j87283m77060l23854J26186K39333N3241O5071
37562A37793J69111o3295l60801j53329L04664L33624L6761k744J18061q7057
37552D32788l90368k22363J71115J32330j60999o2270K40645N9049m13152l60149
37542e73374J70477L39775l012j68389N9573J56276n6598j69265p9687j07583
37532d31807j97861J7533L88526M15710J69866J20271J97185j0176l09754j88238
37522A71255J43770N4441l22442k98243J10715K51244N0674L3659K07110P9301
$$ plain form
37592 461031 37251 -82757 269835 483639 306662 238179 435556 325715 -254544 -596362
37582 -596362 -299034 86120 103321 115962 445219 715035 634181 582294 846457 1055121
37572 1055121 902781 688888 642159 454876 -22184 -346038 -219852 19481 72722 137793
37562 137793 306904 243609 -117192 -270521 34143 367767 404528 401784 519845 432788
37552 432788 42420 -179943 -8828 123502 -37497 -99767 140878 199927 -213225 -573374
37542 -573374 -402897 -63122 -66134 -234523 -174950 -18674 -75272 -244537 -324224 -431807
37532 -431807 -629668 -612135 -223609 192101 361967 482238 679423 669247 359493 171255
37522 171255 315025 369466 47024 -251219 -140504 110740 161414 195073 402183 481484
37512D81484k54538k02749J59367J69081j71449j82824K06594L24656n529k26445
37502B97648j54824k08647m06664k65375J54335K10638j34839j92312K07090M25375
37492f7575J92780j931P6309N7930j35777q2477K19622K39220o2220j19487J30183
37481D46577J09816k22700k05656K50044L88216l6411k95753n722K40846M9678
37471G18935q1865J89545L66057P9677k12143j10125M6506m3914p8978P4039n6706
37460H91028n97947q25855k76696M30820N41610K05489m3977j44742k35284j94081
37450b49635k1984o0905l38467l44294R9305M48978L47298J56975J60818N7939
37440B56028k62897l16365O6816K86503J6863j71290J37635M14471J50360k40667
$$ plain form
37512 481484 226946 24197 183564 352645 181196 -1628 204966 529622 524093 297648
37502 297648 142824 -65823 -472487 -737862 -583527 -372889 -507728 -700040 -492950 -67575
37492 -67575 125205 123274 199583 257513 121736 39259 258881 498101 435881 316394 446577
37481 446577 556393 333693 128037 378081 766297 729886 434133 428411 669257 718935
37471 718935 637070 826615 1192672 1272349 1060206 950081 996587 952673 873695 947734 891028
37460 891028 293081 -532774 -809470 -378650 162960 368449 324472 179730 -55554 -249635
37450 -249635 -271619 -332524 -670991 -1015285 -915980 -467002 -119704 37271 198089 256028
37440 256028 -6869 -323234 -256418 30085 46948 -124342 13293 427764 578124 337457
37430C37457k30460p2563j25613q7413K91336N09036J65849k27150j25547J04739
37420E39671l0067j94117M0324K57696j4877l07494l0191L79383K11237k35102
37410F16463k29040J04562J91632J48637L73680N27833J07858m45928l99930r959
37400I85808L6588o5705K37639N75039K96021j10395K28422Q76300Q15041M12343
37390D287101P97621J622042J527535O75733N37364J168719J213106Q17284J695410
37381A4341915L786327N227515O751595J1850497J9620046K1474325J0318773
37374I3370993q577629k1393543k0817755j2673731o581215m969977m143948k103598
37366A2109597n74538p39667j330464j286695j231163j560330j412829m54557
$$ plain form
37430 337457 106997 34434 -91179 -178592 112744 621780 787629 560479 434932 539671
37420 539671 509604 315487 355811 613507 598630 291136 260945 640328 851565 616463
37410 616463 387423 491985 683617 832254 1205934 1733767 1841625 1395697 995767 985808
37400 985808 1022396 956691 1194330 1769369 2065390 1954995 2183417 3059717 3874758 4287101
37390 4287101 5084722 6706764 8234299 8910032 9447396 10616115 11829221 12646505 14341915
37381 14341915 18128242 23355757 30107352 41957849 61577895 83052220 93370993
37374 93370993 84793364 63399821 42582066 29908335 23327120 18357143 14213195 12109597
37366 12109597 11535059 10795392 9464928 8178233 6947070 5386740 3973911 3519354
37358C519354J63186l44944j046172q39151j61014l2532l49245l14840Q3538K13314
37348H91494N766o2928L2940j04682l90562l16494Q6823K21377o0438k16303M7236
37337A34229L34058K81166O4587p3941k11929l79504l48497q5208O8690m4224
37327b60573j11102R4568L18273K89215J50580J02823K6102j89968l12465j35146
37317b7693J28670J74307N0592l4933p2555j13312o8810N2782J2612k51932m00615
37306e50887j95428Q6896R7948m3634l7724P7990J10263J35215K97099M14627
37296C92365K40467o9701j77088q5399l9733o8435l8284q095j07447k01648q8921
37285b51919J03116J26253P0515J78396L36581K31225p2071j91272m7825M2729
$$ plain form
37358 3519354 3682540 3337596 2291424 1452273 1291259 1258727 909482 594642 678180 891494
37348 891494 897260 834332 867272 762590 372028 55534 142357 363734 303296 86993 134229
37337 134229 468287 749453 814040 740099 528170 148666 -199831 -285039 -216349 -260573
37327 -260573 -371675 -277107 41166 330381 480961 583784 609886 419918 107453 -27693
37317 -27693 100977 275284 325876 290943 218388 105076 36266 89048 101660 -150272 -550887
37306 -550887 -746315 -659419 -561471 -605105 -642829 -564839 -454576 -319361 -22262 392365
37296 392365 632832 563131 386043 300644 260911 192476 154192 146097 38650 -162998 -251919
37285 -251919 -148803 -22550 47965 226361 562942 794167 722096 530824 482999 525728
37275E25728p7712j99876j43857J8905J99650L92533M77345K61394j84740n08488
37265G60882m80643k13550M7807J49508N8630j17770j67729j9455J16100L9078
37255A72858j27640j55513q4871q8458j12892r424R6741l5866l00317l39499j02102
37244a086983R0042O6142K7001J53706L14357K89042O8087j69902k35580p0060
37234e54148J68875K20258M5397r1341j8778P3099j4079j19041k8657R0235k4746
37223b52926k16047j41335J20797J97227N6972J548O6794j7792k47164k67498
37213f99424O670K05570R4132r4104q7687N2105J64432K35410K47764J14791q6622
37202A53037j29177m424L9778o3319p7157Q9839J79803J4793k01986k27691j36972
$$ plain form
37275 525728 448016 248140 104283 123188 322838 715371 1192716 1454110 1269370 760882
37265 760882 280239 66689 114496 264004 322634 204864 37135 17680 133780 172858
37255 172858 45218 -110295 -195166 -283624 -396516 -405940 -309199 -345065 -645382 -984881 -1086983
37244 -1086983 -996941 -930799 -903798 -750092 -435735 -146693 -78606 -248508 -484088 -554148
37234 -554148 -385273 -165015 -119618 -210959 -229737 -156638 -170717 -289758 -318415 -228180 -252926
37223 -252926 -468973 -610308 -489511 -292284 -235312 -233764 -166970 -184762 -431926 -699424
37213 -699424 -692754 -487184 -393052 -487156 -574843 -522738 -358306 -122896 124868 239659 153037
37202 153037 23860 19436 59214 -4105 -81262 8577 188380 203173 1187 -226504 -363476
37191c63476j18816j52586r5844P9102K84568L98657K80523q7240m23790l76220
37181e75122Q132K98878K40979J3823j36981k02333k23050j20771J08047K84943
37171c03455K96551K32680J73078P9347j4699R608P4031p6040m21806n59665k44141
37160g54511K28486M01363K04948p8170k04867j39810J0217P8537j2032j03879
37150c69718J8173K66216L10788O3906j81978j94770r1671o5299j11416j68458
37140e24227k40425k37381K407L66512M62794J64413j45221j04016J44176K52076
37130A41108J76091Q7777K1328p2588j09282j7816M0299j08538l32275l67595
37120e41491k07483n9774j3588M827K1827M180N684J05930K33215K39961J35148
$$ plain form
37191 -363476 -482292 -634878 -730722 -651620 -367052 31605 312128 224888 -198902 -575122
37181 -575122 -566990 -268112 -27133 -13310 -150291 -352624 -575674 -696445 -588398 -303455
37171 -303455 -6904 225776 398854 478201 463502 473110 547141 471101 49295 -510370 -754511
37160 -754511 -526025 -124662 80286 2116 -202751 -342561 -332344 -253807 -265839 -369718
37150 -369718 -351545 -85329 225459 289365 107387 -87383 -179054 -244353 -355769 -524227
37140 -524227 -764652 -1002033 -999626 -633114 -170320 -5907 -151128 -255144 -110968 141108
37130 141108 317199 404976 426304 353716 244434 226618 266917 158379 -173896 -541491
37120 -541491 -748974 -808748 -822336 -817509 -795682 -791502 -785818 -679888 -446673 -206712 -71564
37109g1564P5921J35597K16252J97482P9337l0404l3661L9458M3828r0883k32884
37098C28479k24892j23016q6265r2810k744J36669J35772J3100j3419P8457O8408
37087B17739q3827j31876J2991R8264k5482j29933j2193J50122J16777k4065o8697
37076A19820n2403r1984r2722O7613K27546J33675j58200l51611l12605j74833
37066f85704r3345q0736n7419N0447K16916K86326J57344n024N0556K60913L05353
37055D05627J02886p9579r5044j11522k02400j54579R9966K61334J32473o5833
37045B93329j23392j79661l17947k59345J19317L72409J02510l42149l45690N5333
37035f25286L08542K13624N7634k661r1747j73285k8044K70082L54804J30969
$$ plain form
37109 -71564 4357 139954 356206 553688 633025 602621 568960 608418 652246 561363 328479
37098 328479 103587 -19429 -105694 -198504 -201248 -64579 71193 84293 70874 149331 217739
37087 217739 133912 2036 15027 113291 87809 -42124 -54317 95805 212582 188517 119820
37076 119820 67417 -24567 -117289 -49676 177870 311545 153345 -198266 -510871 -685704
37066 -685704 -779049 -859785 -917204 -866757 -649841 -363515 -206171 -211195 -160639 100274 405627
37055 405627 508513 428934 333890 222368 19968 -134611 -34645 226689 359162 293329
37045 293329 169937 -9724 -327671 -587016 -467699 -95290 7220 -334929 -680619 -625286
37035 -625286 -316744 -103120 -45486 -48147 -139894 -313179 -341223 -71141 283663 414632
37025D14632r4955j25387j03681j49416j52810m9589L9464N8862J10273J98872
37015A46265J67862k2101j96690k21050j25791M2710K49660L37326J42507k04932
37005C15766l60889k00779N3017J65592J18561j0668j48421j73875j2981J80843
36995g3834J69650k1352j30159m7034O8541Q4936N7741M1704j6269j24703j90565
36984a81344j76445j43206j05412j2083J17514K01705K26649K10200R3234j40955
36974H9857l14718k55529p8814k2190p3479m6958M6299M0413j4442J02510L45054
36963a81997L84692J18237j51237j62411k7293J8448n8959j46857j58070n2449
36953d17896J22552J70166n2426l39934l14459M7063L35813K47254o7361k81087
$$ plain form
37025 414632 319677 194290 90609 -58807 -211617 -261206 -221742 -162880 -52607 146265
37015 146265 314127 292026 95336 -125714 -251505 -208795 40865 378191 520698 315766
37005 315766 -45123 -245902 -192885 -27293 91268 80600 -67821 -241696 -254677 -73834
36995 -73834 95816 74464 -55695 -102729 -34188 50748 108489 150193 133924 9221 -181344
36984 -181344 -357789 -500995 -606407 -618490 -500976 -299271 -72622 137578 230812 89857
36974 89857 -224861 -480390 -559204 -581394 -654873 -701831 -655532 -615119 -629561 -527051 -181997
36963 -181997 202695 320932 169695 7284 -20009 -1561 -60520 -207377 -365447 -417896
36953 -417896 -295344 -125178 -177604 -517538 -831997 -784934 -449121 -201867 -269228 -550315
36943e50315k68566r5741J27499K64843K27614J24386J47794K68294K67863J08148
36933F21819j3215k4223p9911k10439k06779j0206J13803j909j28268j3844J97197
36922B44025K01719J976j48463j33305n0295J3129N6372P4768O9535R0958J30403
36911E50822N5496j93357m25432l91965j13635J36302J57395N064j41731j81145
36901e42186j33394o2043r73N0112R4731J43206K30889L55083L95049K27980l6540
36890G21914j22404R115L8908k37408n35535m62760r7358J54114J56717J21767
36880b52930J49587J14759J4910J8661R7614N768k64536l82567j82566P7911J32346
36869d71043O1533N2499R1985R7411J02113J26941R4993K3429N3941J53768P4378
$$ plain form
36943 -550315 -818881 -914622 -787123 -522280 -294666 -170280 -22486 245808 513671 621819
36933 621819 608604 584381 504470 294031 87252 77046 190849 188940 60672 46828 244025
36922 244025 445744 447720 299257 165952 115657 128786 185158 259926 329461 420419 550822
36911 550822 606318 412961 -12471 -404436 -518071 -381769 -224374 -219310 -361041 -542186
36901 -542186 -675580 -737623 -738596 -688484 -593753 -450547 -219658 135425 530474 758454 721914
36890 721914 599510 608625 647533 410125 -125410 -588170 -685528 -531414 -374697 -252930
36880 -252930 -103343 11416 26326 44987 142601 148369 -116167 -498734 -681300 -603389 -471043
36869 -471043 -409510 -357011 -265026 -167615 -65502 61439 156432 179861 233802 387570 461948
36858D61948k14583l55238j11539K16021J82881j75390m04555k16160K24437N29769
36848A37591M44210L5564l51285m12039k10218o0655p6891o0943J04953K40889
36838b08824J77131K0823n0079l4515O311Q5932J56128O5488j68720k69745p2657
36827b92727K13138K92390J44516o5837k34715l11583k51406j34720j32970k19563
36817i93477j54896J04024K66089J57112P336O4519K12956K35930J78559J61699
36807B39851R2956j21656k99592k36964n9178j4504q3524p7199L7940J76372L22775
36796b2723M34945L54934P2552j41876j33731j35540l31752m39253j32836L41183
36786a34097M45247J09935k35674l07253k09389q8778L5692R5507K961j11801
$$ plain form
36858 461948 247365 -107873 -219412 -3391 179490 4100 -400455 -616615 -392178 137591
36848 137591 581801 617365 266080 -145959 -356177 -416832 -493723 -554666 -449713 -208824
36838 -208824 -31693 -10870 -60949 -95464 -89153 -3221 152907 218395 49675 -220070 -292727
36827 -292727 -79589 212801 357317 291480 56765 -254818 -506224 -640944 -773914 -993477
36817 -993477 -1148373 -1044349 -778260 -621148 -613812 -549293 -336337 -100407 78152 239851
36807 239851 332807 211151 -88441 -325405 -384583 -399087 -482611 -559810 -521870 -345498 -22723
36796 -22723 412222 767156 839708 697832 564101 428561 96809 -342444 -475280 -134097
36786 -134097 311150 421085 185411 -121842 -331231 -420009 -384317 -288810 -285849 -397650
36776c97650j8419K31104L25100J25153j68502k97412j89617N1448K24800J60449
36766D6454p2782j96383r4726L1216L3908N5361J63445J06535k14125l82819n6874
36755e80790L85708L50596m7219j87676O4249K40954J12189l1007j1555n1020
36745B44429k46397l19155j11853J26351J66407J08082P4045j7291j84538k49210
36735d09130j51999p3616q5849j8925J71752K55331J22294P680J18258L09266
36725B45062L16078Q5990k42482m70899l92511J8534M19654L98118O354l03222
36715H0676k91991j29994K4742K08410L56415K84552O9026m521L1342j53398n18432
36704d3173n76824j97026J09792J0000j26215Q4706L74271L38974J40287J25952
$$ plain form
36776 -397650 -416069 -184965 140135 265288 96786 -200626 -390243 -338795 -113995 46454
36766 46454 -26328 -222711 -317437 -286221 -252313 -196952 -33507 73028 -141097 -523916 -580790
36755 -580790 -195082 155514 108295 -79381 -15132 225822 338011 307004 295449 244429
36745 244429 -1968 -321123 -432976 -306625 -140218 -32136 41909 24618 -159920 -409130
36735 -409130 -561129 -634745 -720594 -739519 -567767 -312436 -190142 -182462 -64204 245062
36725 245062 561140 647130 404648 -66251 -458762 -440228 -20574 377544 383898 80676
36715 80676 -211315 -341309 -316567 -108157 248258 532810 601836 597315 628657 475259 -43173
36704 -43173 -619997 -817023 -707231 -697231 -823446 -738740 -364469 -25495 114792 240744
36694B40744J48294j27472n24950n90277l38941j75604j83368o5749K40587M29745
36684i46991L44377J81153J12583Q0927L8438O5111J66750K17284J66670J03224
36674E29526Q4144P5410N0278K967q5471j72225j47894k4579L2050j6479J66J01268
36662D29161K1373l12972n13511k94515K1244J2363j24058P5793M91757N64761
36652C71396K04701j01742j08260r0863k09586k18449j5339R7188k8185q3576
36642a82715J20159K61563O0627k07516j75346N591j3506j37092k4679K52428
36632d0486K88079J4197j97044j31190Q368K4832J3599P0661N7256j27876k94930
36621c14534k22654j800J15986R9222J26853K47266K87544J41000m8006q4605
$$ plain form
36694 240744 389038 261566 -263384 -853661 -1192602 -1368206 -1551574 -1617323 -1376736 -946991
36684 -946991 -602614 -421461 -308878 -227951 -189513 -124402 42348 259632 426302 529526
36674 529526 613670 689080 739358 742325 656854 484629 336735 312156 344206 327727 327893 429161
36662 429161 450534 137562 -375949 -670464 -649220 -636857 -760915 -685122 -193365 371396
36652 371396 576097 474355 366095 275232 65646 -152803 -168142 -70954 -99139 -182715
36642 -182715 -62556 199007 259634 52118 -123228 -117637 -131143 -268235 -292914 -40486
36632 -40486 247593 261790 64746 -66444 -58076 -33244 -19645 51016 108272 -19604 -314534
36621 -314534 -537188 -538988 -423002 -323780 -196927 50339 337883 478883 430877 346272
36611C46272J3285O5992j6943j46604k00564j72453j58077k32739l46924l32470
36601a181225o0635L56436N86000M06515k676k30355j05805J29823J68439J0095
36591G6612j06976m2826J13169J97614J35257l7594k08567k48779j22620N0796
36581a93914J10215L6671k9880K4090J30857J18848n2746j87872o4067K38139
36571A30341L42516L2090m00465m58258p3026L02069K85666J4342j35006n3977
36561a3708O9420Q7188K7023m2927q7514o9717P638O0953N0621P4050J90246K48216
36549F01489Q9108j55452k09012o4361J4338p4628j21554Q375J15024j5099k33475
36538d5247k31012o326J32237J4762j80205k13367q0813P2518J69018J92568R7430
$$ plain form
36611 346272 359557 425549 408606 262002 61438 -111015 -269092 -501831 -848755 -1181225
36601 -1181225 -1241860 -885424 -299424 107091 104415 -125940 -231745 -101922 66517 76612
36591 76612 -30364 -73190 39979 237593 372850 335256 126689 -122090 -244710 -193914
36581 -193914 -83699 -47028 -76908 -52818 78039 196887 144141 -43731 -107798 130341
36571 130341 472857 504947 104482 -353776 -426802 -124733 160933 175275 40269 -13708
36561 -13708 55712 142900 169923 126996 39482 -30235 -22597 38356 88977 163027 353273 601489
36549 601489 690597 535145 326133 261772 276110 201482 79928 88303 203327 188228 -45247
36538 -45247 -276259 -282585 -150348 -135586 -315791 -529158 -609971 -537453 -368435 -175867 -78437
36527g8437r5975j88954J484L43013M90650L27356Q9281k4219j17624l11372m35204
36516ak94689p1659r6258k90860k41807J35844M10356K66995k6862m3189J89497
36505f2633K97217J24255j25419k39976k14671j16580L3389J85651K25086R4264
36495B00583j03254j74164k3350K15982K80849P8703j64588j86574n6974n5374
36485A1839k09747k42838l0784J93457K20494J48437J14958M7162r3641j12453
36475D6884P9564J87124n5632m00386m02708q3746J27311L3324j42514j81611
36465g92390j07412J8675J93544L19152K57746Q6098J8568N5106l724j72854k37167
36454c64658j41488r1064j68038j80422l3990O6168j9961q9514O7349K78248K22228
$$ plain form
36527 -78437 -174412 -363366 -361882 -18869 471781 799137 888418 864199 746575 435203 -1
36516 -1 -294690 -366349 -462607 -753467 -995274 -859430 -449074 -182079 -208941 -252130 -62633
36505 -62633 234584 358839 233420 -6556 -221227 -337807 -304418 -118767 106319 200583
36495 200583 97329 -76835 -100185 115797 396646 475349 310761 124187 67213 11839
36485 11839 -197908 -440746 -471530 -278073 -57579 90858 205816 252978 159337 46884
36475 46884 126448 313572 257940 -142446 -545154 -628900 -501589 -468265 -610779 -792390
36465 -792390 -899802 -881127 -687583 -368431 -110685 -24587 -6019 49087 45363 -127491 -364658
36454 -364658 -506146 -597210 -765248 -945670 -979660 -913492 -933453 -1022967 -955618 -677370 -455142
36443d55142p8721k79116j76541O8669J87444J01996o8418j80122j72790n6205
36433a108946J30764L13790L76204K48812K7249r8581p9737n5253r3810n2954
36423c92462J55549L22989J99636j07357k54753j40585J831r639q1397o2656K3353
36412c45491N1929l6540j90820k72878j46375J46611L57275L16929J60987R6027
36402A37654P2644o4322k21155j71304L7627J37991Q6139R4673J97352J56281
36392D63580j03155l07729k27014K8346K22778K63636J60940k7789j32422r261
36382C31910J89414J61954p7731k04759j12227n6190j59341j84139O33J25415
36372A4939l3423k50428k04338L3428J66005J07694k4035j59141k64098k56055
$$ plain form
36443 -455142 -533863 -812979 -989520 -920851 -733407 -631411 -699829 -879951 -1052741 -1108946
36433 -1108946 -978182 -664392 -288188 -39376 -12127 -110708 -190445 -245698 -339508 -392462
36423 -392462 -236913 86076 285712 178355 -76398 -216983 -215152 -224791 -306188 -368844 -345491
36412 -345491 -293562 -330102 -520922 -793800 -940175 -793564 -436289 -119360 41627 137654
36402 137654 210298 145976 -75179 -246483 -208856 -70865 15274 109947 307299 463580
36392 463580 360425 52696 -174318 -145972 76806 340442 501382 473593 341171 331910
36382 331910 521324 683278 605547 400788 288561 232371 73030 -111109 -110476 14939
36372 14939 -18484 -268912 -473250 -439822 -273817 -166123 -190158 -349299 -613397 -869452
36362h69452j45498q7750j20192p2622R5881J54809M52j15623n035J32611R4153
36351i38266M9560J85101K94151J40260n7427K9145K36151J59547j55795k95885
36341c53458j49594M949L6825Q8533J65821Q1318j36396k08557n8237Q3777Q5057
36330c59962N4756L4628o6022j63819l3376K52116L13547M4607j86284r8737R6351
36319a12195R0514m4742n9533L4445L1351r7066j68289p9856N7645P4652o2999
36308c36073k02059j39221J23652L06029J69692j33589k33556l5433J96390K52240
36298c1928J99581J37037J7226j57045k13935o4103J14914J13411k8204j10384
36288b3430l7959J12162J93965J06328r4336j89158m7430J43979J10652p7845
$$ plain form
36362 -869452 -1014950 -1102700 -1222892 -1295514 -1199633 -1044824 -1044372 -1159995 -1165030 -1032419 -938266
36351 -938266 -888706 -703605 -409454 -269194 -326621 -297476 -61325 98222 -57573 -353458
36341 -353458 -503052 -498103 -461278 -372745 -206924 -125606 -262002 -470559 -528796 -445019 -359962
36330 -359962 -305206 -270578 -336600 -500419 -533795 -281679 31868 76475 -109809 -208546 -112195
36319 -112195 -21681 -66423 -125956 -91511 -60160 -157226 -325515 -405371 -347726 -273074 -336073
36308 -336073 -538132 -677353 -553701 -247672 -77980 -211569 -445125 -480558 -284168 -31928
36298 -31928 167653 304690 321916 164871 -49064 -113167 1747 115158 86954 -23430
36288 -23430 -61389 50773 244738 351066 256730 67572 20142 164121 274773 196928
36278A96928r7328R0015J43352q7536k70851j03653J98580K27425l0122k52846
36268A3964k81759k30832j86015j03423J402J6759p5306j43661p2191J26031L43853
36257e91178M48229L67590J86450O8013J7800j29213l83464m62217j79627J86743
36247d70874J93145j77616m84799l80137L5754M12655N00334K80366n5539k12750
36237c59461l8922K88268M36212K88739J6262j98984l17794l11139j05522K26363
36227g5978M04681K44837p4553k09424p5277P2944j1179k68450m38749l73153
36217h04301j52394O7180K10828K57904J71965k4929j64072p6850J50228K24336
36207a40105K3716k17631k21915l9034O5194J0793k3505P1731J56746Q0907o8961
$$ plain form
36278 196928 99600 189615 332967 245431 -25420 -129073 69507 296932 266810 13964
36268 13964 -267795 -498627 -684642 -788065 -786663 -769904 -845210 -988871 -1061062 -935031 -591178
36257 -591178 -142949 224641 411091 479104 496904 367691 -15773 -477990 -657617 -470874
36247 -470874 -277729 -455345 -940144 -1320281 -1284527 -871872 -371538 -91172 -146711 -359461
36237 -359461 -398383 -110115 326097 614836 631098 432114 114320 -196819 -302341 -75978
36227 -75978 328703 573540 498987 289563 214286 287230 276051 7601 -431148 -804301
36217 -804301 -956695 -889515 -678687 -420783 -248818 -273747 -437819 -514669 -364441 -140105
36207 -140105 -116389 -334020 -555935 -594969 -529775 -518982 -542487 -470756 -314010 -233103 -302064
36196c02064j05215k5354Q324n3194o3675O8927J99619J42407l6080r3985K7292
36185b32998J20748N4715j5559N9297J09461r5484l77365k98314J81999N51732
36175E8232M08656j8285k33709j18699P1086J64397J97615J71907K7536j42774
36165E85962j52332k6587J1717r5607j59562q9879n2737j65764k84685k49793
36155f79267j27618l1107R7103L05416M07392J96295k05145m52328l90935j55696
36145a035890Q9513K86333L83083L34992K25010J85611J81736O8874j20372j81956
36135D16934q4330n4173k03801l11487j51760J42105K54350R9971j34004k60234
36125b86429k15874q934K54324L50827J56248j51696k87016k12555j16459q3281
$$ plain form
36196 -302064 -407279 -432633 -424309 -477503 -541178 -472251 -272632 -130225 -166305 -260290 -232998
36185 -232998 -112250 -57535 -73094 -13797 95664 180 -377185 -675499 -493500 58232
36175 58232 466888 448603 214894 96195 167281 331678 529293 701200 728736 585962
36165 585962 433630 407043 418760 323153 163591 73712 20975 -144789 -429474 -679267
36155 -679267 -806885 -837992 -740889 -435473 -28081 168214 -36931 -489259 -880194 -1035890
36145 -1035890 -946377 -660044 -276961 58031 283041 468652 650388 719262 598890 416934
36135 416934 332604 278431 74630 -236857 -388617 -246512 7838 107809 -26195 -286429
36125 -286429 -502303 -511237 -256913 93914 250162 98466 -188550 -401105 -517564 -600845
36115f00845j8078J15070K20839K64991L10534L25374J90368m4541j60775j11862
36105D91075j04044k16975k23916J5858K45457J61733j14361k25515j12949l9421
36095a23058j25690j86051o6488J22594K02974J57178O0790n9247j90758k62490
36085d70246k04542m1040J25232J91918J17606m5441j73525j67975l2470J52638
36075e47845K87906K80255J10690p7327p7650J07303K21517R3004j20225j73751
36065A03877q9906o3134j20237j22437n3123m3348j08558j04194J7655J26758
36055d56647J44328J48314J76311J18908q0549k71845k66917p1882J37834K06375
36045b15770J10113m7434j16387l9599P6570R4395K7130m388K8413L0106m7561
$$ plain form
36115 -600845 -618923 -503853 -283014 -18023 292511 617885 808253 763712 602937 491075
36105 491075 387031 170056 -53860 -38002 207455 369188 254827 29312 -83637 -123058
36095 -123058 -248748 -434799 -501287 -378693 -175719 -18541 42249 -16998 -207756 -470246
36085 -470246 -674788 -715828 -590596 -398678 -281072 -326513 -500038 -668013 -700483 -547845
36075 -547845 -259939 20316 131006 53679 -23971 83332 304849 397853 277628 103877
36065 103877 13971 -49163 -169400 -291837 -344960 -388308 -496866 -601060 -583405 -456647
36055 -456647 -312319 -164005 12306 131214 50665 -221180 -488097 -559979 -422145 -215770
36045 -215770 -105657 -153091 -269478 -309077 -232507 -138112 -110982 -115370 -86957 -56851 -104412
36034a04412j20198q2951O3916K03116J78134n1926k87562k46689N9066K72930
36024a16576J64805m7006o8554l040j15969l07553k52804J6224J42417O0666R0264
36013d37126L20161M01418J51030r5511k0811J68709J12450j25890k12814q1210
36003A80406K8667m3000k11274k96461j64504J73322M71868M27290P1902k03040
35993D35176j54508J9058M9304j8446l5274n7335j53671j54979O8527K74434J48897
35982D21183j99745l92348l18794j97153j75726j94528j87629j34441L2327K96045
35972a050809M11581J85018j70818k67996p8293Q0735N7589K3109J01581J81223
35962e27080J62333J05500M8142o9363k03292j71418O4021K69896K22650j7997
$$ plain form
36034 -104412 -224610 -307561 -243645 -40529 137605 85679 -201883 -448572 -389506 -116576
36024 -116576 48229 1223 -67331 -70371 -186340 -493893 -746697 -730473 -588056 -527390 -437126
36013 -437126 -116965 284453 435483 339972 319161 487870 600320 474430 261616 180406
36003 180406 209073 166073 -45201 -341662 -506166 -332844 139024 566314 638216 435176
35993 435176 280668 299726 349030 330584 295310 237975 84304 -70675 -2148 272286 421183
35982 421183 221438 -170910 -489704 -686857 -862583 -1057111 -1244740 -1379181 -1346854 -1050809
35972 -1050809 -639228 -454210 -625028 -893024 -971317 -890582 -832993 -809884 -708303 -527080
35962 -527080 -364747 -259247 -211105 -280468 -483760 -655178 -591157 -321261 -98611 -116608
35952a16608k08953j93579p183J99014K87526K38301J35224L3803q7863k04135
35942G5547j95310k9720J32471J45537O5546J972o5288j58211j58685p099J03687
35931h9553k8623k91033m00716k72352l5634J84907K98581K14563R669m2705J46221
35920c06675K79863J32457n1128L0078J86181O3673k04028k11645K806L8941j44294
35909a83771j84566J1352J40782R1976P7053J13916k7087k59842j91434J49938
35899b61683K39520o9610k53099k130K49343R4277j59060p3150J72179J85479
35889A22066P5264J47433K37626j6311m58694n80695k77246Q8066K75890L44570
35879d2031L17477J48556k3566r990P6765q465j79888j25284J56342L15303J61282
$$ plain form
35952 -116608 -325561 -519140 -526323 -327309 -39783 198518 333742 367545 279682 75547
35942 75547 -119763 -149483 -17012 128525 194071 196043 130755 -27456 -186141 -193240 -89553
35931 -89553 -118176 -409209 -809925 -1082277 -1117911 -933004 -634423 -419860 -410191 -452896 -306675
35920 -306675 -26812 105645 54517 84595 270776 334449 130421 -81224 -78418 -39477 -183771
35909 -183771 -368337 -356985 -216203 -124227 -47174 66742 39655 -220187 -411621 -261683
35899 -261683 -22163 -91773 -344872 -347002 -97659 -3382 -162442 -235592 -63413 122066
35889 122066 197330 344763 582389 566078 107384 -473311 -750557 -662491 -386601 -42031
35879 -42031 275446 424002 400436 390446 467211 458746 278858 153574 309916 625219 786501
35868G86501j31847l42123m07796l21012j12368N7297N2977j8812L047K9445r6726
35857e01417k31280j17755J32775J71752j387l0822J78564K95294J37464k1871
35847A1317O3848K01211J00715j42320k10915m5030J15314R3914k0483k8370J34069
35836B73270L06353K53780m6866l19743l05249j04124k7921j52020k56259k10909
35826e89688j43837j48692j01028Q5606K48684K17227R7845J06656K18219K02033
35816A93025j8112k36484k40096p4234N1497N0443L9564J24561K15739J54767
35806B60670l6337j75884j81841j45865j23042m3798Q3627Q9641r3110k60439
35796f26378k02175J3011J82142K33646J76539j5583k45263k27211J26018M42246
$$ plain form
35868 786501 654654 312531 -95265 -416277 -528645 -471348 -418371 -437183 -434136 -404691 -501417
35857 -501417 -732697 -850452 -717677 -545925 -547312 -578134 -399570 -104276 33188 11317
35847 11317 75165 276376 377091 234771 23856 -21174 94140 188054 167571 139201 273270
35836 273270 579623 833403 786537 466794 161545 57421 29500 -122520 -378779 -589688
35826 -589688 -733525 -882217 -983245 -897639 -648955 -431728 -333883 -227227 -9008 193025
35816 193025 174913 -61571 -301667 -375901 -324404 -273961 -234397 -109836 105903 260670
35806 260670 224333 48449 -133392 -279257 -402299 -446097 -362470 -272829 -365939 -626378
35796 -626378 -828553 -815542 -633400 -399754 -223215 -238798 -484061 -711272 -585254 -143008
35786a43008L47410J6077j13785j7513j8750j53245j32219N5056O1533j74900
35776b73344k45389N4951L48726K61422l0298j60666j23625j03506o9005P1493
35766b69241J52040p983k16396j57390R5046J93380O0921n5301l3112n722l2005
35755b75763J4073J56895K22958J26793K617m4115q7288j80009k20810j43774
35745d28423m8143J82J11727L44307M94278L45128K5240j37935q9587r9165k90497
35734B27112m06908k18207P2946J11315n9165o9630J62564K71402J5512l26065
35724b19124l67604j57511l132M0027J39573K66182K03430l5575j79452j36165
35714d49351j07778j82330j60792O3192K72181K65963J58710J30335J34626P8177
$$ plain form
35786 -143008 204402 220479 106694 89181 70431 -82814 -215033 -159977 -98444 -273344
35776 -273344 -518733 -463782 -115056 146366 116068 -44598 -168223 -271729 -340734 -269241
35766 -269241 -117201 -125184 -341580 -498970 -403924 -210544 -149623 -204924 -238036 -243758 -275763
35755 -275763 -261690 -104795 118163 244956 247573 203458 116170 -63839 -284649 -428423
35745 -428423 -476566 -476384 -364657 -20350 473928 819056 844296 706361 616774 517609 227112
35734 227112 -179796 -398003 -325057 -213742 -272907 -342537 -179973 91429 106941 -219124
35724 -219124 -586728 -744239 -747371 -707344 -567771 -301589 -98159 -133734 -313186 -449351
35714 -449351 -557129 -739459 -900251 -837059 -564878 -298915 -140205 -9870 124756 202933
35704B02933M6987R7275M4634k34587m74543l39147M3702K28494Q9245n1424L8211
35693c08220J78695J24299n6500j42678j17584j38547k24556j88745P3387L65644
35683d34805L80765Q8071j90069j60045Q0152K01044J06423K3244J01812J74070
35673C70662M6689j68906k21169q2727N5460P1704O618o7351r2184J861J92798
35662A13455K89838J37961j44560l06245k85980k08627j22835J6439J30520N5945
35652c24089j55519k32400p0554J00803N9809j00046j49477m8510P0429J20498
35642g29056R7188p303j56889k03385l9668K02581K73288J34482J8448J04444
35632c05870K70930K73392Q6685o9404m0288O6670O7069k5368m9903J2266j7138
$$ plain form
35704 202933 249920 347195 391829 157242 -317301 -656448 -612746 -384252 -295007 -346431 -308220
35693 -308220 -129525 -5226 -61726 -204404 -321988 -460535 -685091 -873836 -800449 -434805
35683 -434805 -54040 34031 -156038 -316083 -235931 -34887 71536 94780 196592 370662
35673 370662 417351 248445 27276 -55451 9 71713 78331 10980 -81204 -79343 113455
35662 113455 403293 541254 396694 90449 -195531 -404158 -526993 -510554 -380034 -324089
35652 -324089 -479608 -712008 -782562 -681759 -621950 -721996 -871473 -919983 -849554 -729056
35642 -729056 -631868 -639171 -796060 -999445 -1039113 -836532 -563244 -428762 -410314 -305870
35632 -305870 -34940 238452 325137 255733 215445 282115 349184 323816 273913 286179 269041
35621B69041k18186l86240k85802O270J86436J17904l8986r9066p3333m8878q157
35610e78997J01439K12719K01055P1122m6837q9586j27980j99010j83094L9546
35600e99623L52859M62319K37809r2885j83750L7250L07375L42257J10841k03342
35590G71110m00877l87658k05814j6855K2382o4510r5058Q958Q0915m9954k59148
35579e96509k41882P5969M03678M20887J35498j68275k61434j57717n261J02285
35569b92761J64870J88047J45863N0884j0744K2368R5082J13804P6772L5414k6745
35558E62854j37547j88686l8994K10274K67262O6719r5702l232J35181K0450k35232
35547E63347k60863N500K37700K12165O0136l4763r5761j82392k07496r6293M4150
$$ plain form
35621 269041 50855 -335385 -621187 -614917 -428481 -310577 -349563 -448629 -521962 -570840 -578997
35610 -578997 -477558 -264839 -63784 7338 -39499 -129085 -257065 -456075 -639169 -599623
35600 -599623 -246764 215555 453364 360479 176729 213979 521354 863611 974452 771110
35590 771110 370233 -17425 -223239 -240094 -217712 -282222 -377280 -368322 -287407 -337361 -596509
35579 -596509 -838391 -762422 -358744 62143 197641 29366 -232068 -389785 -395046 -292761
35569 -292761 -127891 60156 206019 256903 246159 268527 363609 477413 554185 589599 562854
35558 562854 425307 236621 197627 407901 675163 741882 646180 642948 778129 798579 563347
35547 563347 302484 307984 545684 757849 817985 783222 687461 505069 297573 201280 245430
35536B45430P6770K8110l991j4216l2939k4121K7953M0309k8483p1831j0492M1643
35524B74142m6692j90671k23529j66107j34865o3326J90207M67140L81658j12173
35514C75784n25143m19648K0221K58114J05244j28970j29652O0422K05822J80566
35504B760K6116j30864j46098K7731K42701K95895J91274J02388N6042j13427
35494E54518m06618n24597k87006M4583J22415Q400J468J07369O0665j67286k82954
35483g69043j49332K2502P5570J43807L07914L50716J20267j27231o2014K11468
35473A24624K93734M3967k87968m36244l72947j97352O609J67851K32647K05171
35463b19908J16656q304j05112r5643l2744o5809j64242q2634K35902M59311L19808
$$ plain form
35536 245430 322200 350310 346319 332103 299164 275043 302996 343305 314822 242991 232499 274142
35524 274142 227450 36779 -186750 -352857 -487722 -551048 -360841 106299 487957 375784
35514 375784 -149359 -569007 -548786 -290672 -185428 -314398 -444050 -383628 -177806 2760
35504 2760 28876 -101988 -248086 -220355 22346 318241 509515 611903 667945 554518
35494 554518 147900 -376697 -663703 -619120 -496705 -488305 -486837 -379468 -318803 -486089 -769043
35483 -769043 -918375 -895873 -820303 -676496 -368582 -17866 102401 -24830 -86844 124624
35473 124624 418358 462325 174357 -261887 -634834 -832186 -825577 -657726 -425079 -219908
35463 -219908 -103252 -111556 -216668 -312311 -345055 -410864 -575106 -657740 -421838 37473 357281
35452C57281M2736p166Q6530k2977k92748l14618m478K20682Q0292j88511k75283
35441c18260k31681k14574j34430J22751L63136L07164R095k25250k46223j48210
35431g16482l4441P6200J57979J92990K42125L38051L57466J66144j49453l57891
35421B72688l63235k60650j40623k704J27042J46988R333j86195k79482j98114
35411h74952r155J48965J90897J57152J47245J87419K13816J78355R4962j5173
35401D19531j24405j44883p663J77087J88425j8672k39611k98489k38601j50033
35391d37314J535K23680L45993K23758j8007j45800j40162j56936k35105k61869
35381f00227k00110j36645r8511j7726R5968J29919N9095j998J2029L2089J6890
$$ plain form
35452 357281 400017 392851 479381 456404 163656 -150962 -155440 65242 145534 -42977 -318260
35441 -318260 -549941 -764515 -898945 -776194 -413058 -105894 -96799 -322049 -568272 -716482
35431 -716482 -750923 -674723 -516744 -323754 -81629 256422 613888 780032 630579 272688
35421 272688 -90547 -351197 -491820 -494524 -367482 -220494 -211161 -397356 -676838 -874952
35411 -874952 -884107 -735142 -544245 -387093 -239848 -52429 161387 339742 434704 419531
35401 419531 295126 150243 142580 319667 508092 489420 249809 -48680 -287281 -437314
35391 -437314 -435779 -212099 133894 357652 339645 193845 53683 -103253 -338358 -600227
35381 -600227 -800337 -936982 -1035493 -1053219 -957251 -827332 -768237 -770235 -758206 -726117 -709227
35370g09227M2905J40314J78030M1084j65187k21857p1534J20588J70045N6147
35360d18692r6062j49369o1101R1763J76574J26210J1489k8760N9309J79601J86181
35349G7143L6543j61257k37984r8833J87314M03661L40587R607l16838l64083
35339a24140j49726O9366J27097Q4850L2660m2349j04990j4492K07573K58073
35329C43922m1951l77859k96147J54021M75556L96557J32742n2184j68467k67286
35319B98904k45985q0987L3120j7531p6076j6214J9991r8126k18837j64700l9778
35308f06219j9977m2375K0636P3950j1556r8595M482J79939J85588P6073Q5044
35297a53010J87446J53622j9644j08970p3159r5397k10236k38897j21995R143
$$ plain form
35370 -709227 -666322 -526008 -347978 -306894 -472081 -693938 -765472 -644884 -474839 -418692
35360 -418692 -514754 -664123 -725224 -633461 -456887 -330677 -319188 -347948 -288639 -109038 77143
35349 77143 113686 -47571 -285555 -384388 -197074 206587 547174 556781 239943 -124140
35339 -124140 -273866 -204500 -77403 7447 40107 -2242 -107232 -121724 85849 343922
35329 343922 301971 -75888 -372035 -218014 257542 654099 786841 734657 566190 298904
35319 298904 52919 -28068 5052 -12479 -88555 -104769 -84778 -182904 -401741 -566441 -606219
35308 -606219 -626196 -668571 -647935 -573985 -585541 -684136 -679654 -499715 -314127 -238054 -153010
35297 -153010 34436 188058 168414 59444 -13715 -109112 -319348 -558245 -680240 -671097
35287f71097J05819K18144K46924N2123j83078j13626J91658K81441K7232j78675
35277b3135r7691j8129j80709l05484p8204K73317L26202J00849q0828j39965
35267b23777j99578j92688J4839K33807J63199o8987n3734K15305K96393K1298
35257B06077k14880p7065K05167K30282J7180j06266j4425J18696J38399O8891
35247E72056j7910r9595j65454k05069k25443k01658o9310J36429K13421J5435
35237d7098k93613l78392j46378J32803J85253O6693K0418J09017J66359R3156
35227i1782P747L5823J06892Q3556j3511n5794j2570M8874J17673K17245K55672
35216F99825J02796j66183l13566k72819k22504k55130k20102l3048J10856M9484
$$ plain form
35287 -671097 -565278 -347134 -100210 -48087 -231165 -344791 -153133 128308 155540 -23135
35277 -23135 -120826 -138955 -319664 -625148 -703352 -430035 -103833 -2984 -83812 -223777
35267 -223777 -423355 -616043 -601204 -367397 -204198 -273185 -326919 -111614 184779 206077
35257 206077 -8803 -85868 119299 349581 366761 260495 246070 364766 503165 572056
35247 572056 554146 454551 289097 84028 -141415 -343073 -412383 -275954 -62533 -47098
35237 -47098 -340711 -719103 -865481 -732678 -547425 -480732 -460314 -351297 -184938 -91782
35227 -91782 -84035 -48212 58680 142236 128725 72931 60361 109235 226908 444153 699825
35216 699825 802621 636438 322872 50053 -172451 -427581 -647683 -680731 -569875 -520391
35206e20391l3614J14278L78375M26365K09902j325o0122j01145k25465l17147
35196a30289k65096j37729m2582K680l373o0042o0268J12549L30068L06499K7595
35185H0012j69838p9692P7314K5618j45936j78153m8758Q5828J88402K84396K39789
35174C58982o8494m19212m23373n5704K79954K65013n219k51995l18179j74201
35164h12428J27218L86876L64860Q6098j28190n3242J69057K58278J34122q4404
35154D48245k56329k68299o3111K35102L57059J93656n1511j35978o3780K9533
35144D24587J00601J32382K4979k17694l45703j76951O6209L6597k00597k47117
35134d02707K3854K88179K62197N9271o9805q9152j06720j41624j25789k6465
$$ plain form
35206 -520391 -554005 -439727 -61352 365013 574915 573590 513468 412323 186858 -130289
35196 -130289 -395385 -533114 -575696 -573016 -576389 -636431 -696699 -584150 -254082 52417 80012
35185 80012 -89826 -169518 -92204 -66586 -212522 -390675 -439433 -353605 -165203 119193 358982
35174 358982 290488 -128724 -552097 -607801 -327847 -62834 -68053 -320048 -638227 -812428
35164 -812428 -685210 -298334 66526 152624 24434 -28808 140249 398527 532649 448245
35154 448245 191916 -76383 -139494 95608 452667 646323 594812 458834 395054 424587
35144 424587 525188 657570 682549 464855 119152 -57799 8410 45007 -155590 -402707
35134 -402707 -378853 -90674 171523 230794 160989 71837 -34883 -176507 -302296 -328761
35124c28761J28524K51660K04273m0859k46214j41713J59044K39681m0198l27871
35114a42434k75344J7977K39606K84558K25642R5161n8682r3286O898J8807j63921
35103A54982k75781p5414K09201J95020n1715j30590O2294K37049K16993J29325
35093F71364O2574o7585k37975k73632j76626j49240j98362r2554J60811K04022
35083i7203r2872l29053j45465K19367K93296M9575j45647j03943K8610R8959
35073b24376J05943O7666J359Q627J46483K55617J51043o0467j02458N6596J70251
35062E76284J03852m373k7016m8600j73416l16028l12650j34578R8410K39039
35052I24K01302J6199j66254k14055j66792j60081k05004j78047m7073N2957L8876
$$ plain form
35124 -328761 -200237 51423 255696 214837 -31377 -173090 -14046 225635 185437 -142434
35114 -142434 -417778 -399801 -160195 124363 350005 445166 386484 293198 300096 318903 154982
35103 154982 -120799 -196213 12988 208008 156293 25703 87997 325046 542039 671364
35093 671364 733938 666353 428378 154746 -21880 -171120 -369482 -462036 -301225 -97203
35083 -97203 -190075 -519128 -664593 -445226 -151930 -102355 -248002 -351945 -323335 -224376
35073 -224376 -118433 -50767 -49408 -40781 105702 361319 512362 451895 349437 406033 576284
35062 576284 680136 675763 648747 600147 426731 110703 -201947 -336525 -238115 924
35052 924 202226 218425 52171 -161884 -328676 -488757 -693761 -871808 -918881 -865924 -827048
35041h27048L1968J78259M03467M69980K59851p3811k45923j17552J50068K42309
35031D71568M1448k10367j95369O8596K54253J71750j33j7359P2973M7290j34351
35020E70299k83946k70805j66198q0407j3836O5853J18562R3384K6596m457Q332
35009F3377J828o5750j57459j79746n6463J74316L33135K52086p546j86101j42716
34998B8961l3752n9143j45016p7316J10723J47641m3439j90761q4360R5644O8181
34987a82637j10046j54596l15J37217J18126L3384j8703o7431j17942q4774K7099
34976d20618O7595j3687l9572J28117L29656K95369K2927k06517j83513q245O1763
34965C3275p4532k51904k36892j0066J96867J78568J3799m1374J11569K94470
$$ plain form
35041 -827048 -795080 -616821 -213354 256626 516477 442666 196743 79191 229259 471568
35031 471568 513016 302649 107280 175876 430129 601879 601746 584387 657360 704650 570299
35020 570299 286353 15548 -150650 -231057 -244893 -179040 -60478 32906 59502 55045 63377
35009 63377 65205 -545 -158004 -337750 -394213 -219897 113238 365324 357778 171677 28961
34998 28961 -4791 -63934 -208950 -286266 -175543 -27902 -71341 -262102 -346462 -250818 -182637
34987 -182637 -292683 -447279 -447594 -310377 -192251 -158867 -177570 -245001 -362943 -447717 -420618
34976 -420618 -353023 -366710 -406282 -278165 51491 346860 369787 163270 -20243 -28488 33275
34965 33275 -41257 -293161 -530053 -540119 -343252 -164684 -150885 -192259 -80690 213780
34955B13780K73008N965l27979m75685l09875J9721J82106L3540j76775j35150
34945f97344Q6698J59216K5762k0167J62958L25563K33004J0257j09838j19511
34935E6598j02742j4977J53760K11565L8965j49799j10887K5702k1004j88468
34925a01287j67601O3303J82515L6577j35718r4350O5580J11103M985j06896j22647
34914b64436q0348p7502j43635j71555j4818K89867M85087L85982J18048p0872
34904D55818j25748j41234j25684l8721K5019n0523j59405j09557L7199M5251
34894a87585r4125j49805n1233K3962J3682P8935K40146K51543J7858j75560q2526
34883a14708J17209J20610k3398m7765O8153R5762l3779j25679n9840J6605p3786
$$ plain form
34955 213780 486788 492753 164774 -310911 -620786 -601065 -418959 -385419 -562194 -697344
34945 -697344 -610646 -451430 -425668 -445835 -282877 42686 275690 285947 176109 56598
34935 56598 -46144 -61121 92639 304204 343169 193370 82483 108185 87181 -101287
34925 -101287 -268888 -205585 -23070 13507 -122211 -216561 -150981 -39878 -34893 -141789 -264436
34914 -264436 -344784 -422286 -565921 -737476 -752294 -462427 22660 408642 526690 455818
34904 455818 330070 188836 63152 24431 49450 -1073 -160478 -270035 -232836 -187585
34894 -187585 -281710 -431515 -482748 -458786 -445104 -366169 -126023 125520 143378 -32182 -114708
34883 -114708 2501 123111 99713 51948 120101 215863 182084 56405 -3435 13170 -60616
34872f0616k75584l74470k40533P0253L80909M97251L17600o4440l81125m08103
34862e38858j98726l4971r0514k19586j86562k5685K6643o0518m4234J64690K98848
34851i09473J66257K1243J87177M93448M76391P0913k89796k87931q1253K7423
34841a25601k7518j32469j81555r7436J28248L42169L68730K64258K08773J59553
34831I07152p9301m18298m80967j52787K15747L07805K10885J13926k1000k38257
34821C64905l43975j82290N7746Q6193j02275l06830m04209l49419r5196K66696
34811a008654M74442M20007L07787K94114K18354n8499l08395k47561J1928J43971
34801B47494O9061o8554j97943k81455j76148J17287K62375K7817k64791j63634
$$ plain form
34872 -60616 -336200 -710670 -951203 -880950 -500041 -2790 314810 250370 -130755 -538858
34862 -538858 -737584 -772555 -863069 -1082655 -1269217 -1294902 -1268259 -1328777 -1373011 -1208321 -909473
34851 -909473 -743216 -721973 -534796 -41348 435043 505956 216160 -71771 -153024 -125601
34841 -125601 -153119 -285588 -467143 -564579 -436331 -94162 274568 538826 747599 907152
34831 907152 827851 409553 -71414 -224201 -8454 299351 510236 624162 603162 364905
34821 364905 20930 -161360 -103614 -17421 -119696 -426526 -830735 -1180154 -1275350 -1008654
34811 -1008654 -534212 -114205 193582 487696 706050 647551 339156 91595 103523 247494
34801 247494 316555 248001 50058 -231397 -407545 -290258 -27883 -66 -264857 -428491
34791d28491K03977L26420J00250r6048q0456p2609j72206j66813M947Q2559l9286
34780c37756r3775Q4779K56467J79645j6839j02886q9130o7812O127J33539J30382
34769H2741p8664k54019j80414p013L827j19011j62613q4524j346N0397R9702
34758f50937J01210L9636N6394K30679L49523J73972j44328k20773O1J52845n840
34747H2442k46636k23082K3172J42513j1259j84812j02967J32843J98441L7205
34737a52140m1309J59423L70050K12569k21785m59345k88109R130J34053J54613
34727a22850K34168K71769Q9802k00664l17116k04947o7283m1960p1412o6872
34717d97365L37J50766L45609M03345J76944j78198l26228j81655j3386m8065
$$ plain form
34791 -428491 -224514 101906 202156 106108 25652 -46957 -219163 -385976 -381029 -298470 -337756
34780 -337756 -431531 -346752 -90285 89360 72521 -30365 -119495 -187307 -181180 -47641 82741
34769 82741 4077 -249942 -430356 -437369 -433542 -552553 -715166 -799690 -801036 -750639 -650937
34758 -650937 -549727 -510091 -453697 -223018 126505 300477 156149 -64624 -64563 88282 82442
34747 82442 -164194 -387276 -364104 -221591 -232850 -417662 -520629 -387786 -189345 -152140
34737 -152140 -193449 -34026 336024 548593 326808 -132537 -420646 -411516 -277463 -122850
34727 -122850 111318 383087 472889 272225 -44891 -249838 -317121 -359081 -430493 -497365
34717 -497365 -497028 -346262 -653 402692 579636 401438 75210 -106445 -119831 -167896
$$ [...]
##END NTUPLES=NMR SPECTRUM
##END=
