##TITLE=1H_44-2026-Bay
 200.13Hz, CDCl3.
 8 sc
 
 28.4.2026
##JCAMPDX= 6.0         $$ Bruker NMR JCAMP-DX V2.0
##DATA TYPE= NMR FID
##DATA CLASS= NTUPLES
##ORIGIN= UXNMR, Bruker Analytische Messtechnik GmbH
##OWNER= pz
$$ XWIN-NMR		Version 3.5
$$ Tue Apr 28 14:32:27 2026 Russian Standard Time (UT+4h)  she@DPX200
##.OBSERVE FREQUENCY= 200.131
##.OBSERVE NUCLEUS= ^1H
##.DELAY= (6, 6)
##.ACQUISITION MODE= SIMULTANEOUS
##.ACQUISITION SCHEME= undefined
##.AVERAGES= 8
##.DIGITISER RES= 18
##SPECTROMETER/DATA SYSTEM= spect
##.PULSE SEQUENCE= zg30
##.SOLVENT NAME= CDCl3
##.SHIFT REFERENCE= (INTERNAL, CDCl3, 0, 14.3821)
##AUDIT TRAIL= $$ (NUMBER, WHEN, WHO, WHERE, WHAT)
$$ ##TITLE= Audit trail, XWIN-NMR		Version 3.5
$$ ##JCAMPDX= 5.01
$$ ##ORIGIN= Bruker BioSpin GmbH
$$ ##OWNER= she
$$ F:/spectra/data/she/nmr/H-C/1/audita.txt
$$ ##AUDIT TRAIL=  $$ (NUMBER, WHEN, WHO, WHERE, WHAT)
(   1,<2026-04-28 14:30:45.39 +0400>,<she>,<DPX200>,
      <created by zg, POWCHK disabled, PULCHK disabled
       configuration hash MD5:
       00 E9 B6 7A A2 85 ED C7 34 08 36 98 17 FE 4E 26
       data hash MD5: 16K
       A2 E0 9A 21 0A 4C 20 5A 4D C7 A6 CF 02 C4 30 E9>)
$$ ##END=
$$ 
$$ hash MD5
$$ 20 22 E7 29 BD 60 2D 3F CB 7D 10 57 9A 3F D9 B8
##$RELAX= 
##$RELAX= 
##$RELAX= 
##$RELAX= 
##$RELAX= 
##$RELAX= 
$$ Bruker specific parameters
$$ --------------------------
##$DU= <F:/spectra>
##$EXPNO= 1
##$NAME= <H-C>
##$PROCNO= 1
##$TYPE= <nmr>
##$USER= <she>
##$AMP= (0..31)
100 100 100 100 100 100 100 100 100 100 100 100 100 100 100 100 100 100 
100 100 100 100 100 100 100 100 100 100 100 100 100 100 
##$AQSEQ= 0
##$AQ_mod= 1
##$AUNM= <au_zg>
##$AUTOPOS= <>
##$BF1= 200.13
##$BF2= 200.13
##$BF3= 200.13
##$BF4= 200.13
##$BF5= 200.13
##$BF6= 200.13
##$BF7= 200.13
##$BF8= 200.13
##$BYTORDA= 1
##$CFDGTYP= 0
##$CFRGTYP= 5
##$CHEMSTR= <none>
##$CNST= (0..31)
1 1 145 1 1 1 1 1 1 1 1 1 1 1 1 1 1 1 1 1 1 1 1 1 1 1 1 1 1 1 1 1 
##$CPDPRG= <>
##$CPDPRG1= <>
##$CPDPRG2= <>
##$CPDPRG3= <>
##$CPDPRG4= <mlev>
##$CPDPRG5= <mlev>
##$CPDPRG6= <mlev>
##$CPDPRG7= <mlev>
##$CPDPRG8= <mlev>
##$CPDPRGB= <>
##$CPDPRGT= <>
##$D= (0..31)
0 0.7 0 0 0 0 0 0 0 0 0 0.03 0 0 0 0 0 0 0 0 0 0 0 0 0 0 0 0 0 0 0 0 
##$DATE= 1777372245
##$DBL= (0..7)
120 120 120 120 120 120 120 120 
##$DBP= (0..7)
150 150 150 150 150 150 150 150 
##$DBP07= 0
##$DBPNAM0= <>
##$DBPNAM1= <>
##$DBPNAM2= <>
##$DBPNAM3= <>
##$DBPNAM4= <>
##$DBPNAM5= <>
##$DBPNAM6= <>
##$DBPNAM7= <>
##$DBPOAL= (0..7)
0.5 0.5 0.5 0.5 0.5 0.5 0.5 0.5 
##$DBPOFFS= (0..7)
0 0 0 0 0 0 0 0 
##$DE= 6
##$DECBNUC= <off>
##$DECIM= 32
##$DECNUC= <off>
##$DECSTAT= 4
##$DIGMOD= 1
##$DIGTYP= 9
##$DL= (0..7)
0 120 120 120 120 120 120 120 
##$DP= (0..7)
150 150 150 150 150 150 150 150 
##$DP07= 0
##$DPNAME0= <>
##$DPNAME1= <>
##$DPNAME2= <>
##$DPNAME3= <>
##$DPNAME4= <>
##$DPNAME5= <>
##$DPNAME6= <>
##$DPNAME7= <>
##$DPOAL= (0..7)
0.5 0.5 0.5 0.5 0.5 0.5 0.5 0.5 
##$DPOFFS= (0..7)
0 0 0 0 0 0 0 0 
##$DQDMODE= 0
##$DR= 18
##$DS= 0
##$DSLIST= <SSSSSSSSSSSSSSS>
$$ [...]
##$SUBNAM0= <"">
##$SUBNAM1= <"">
##$SUBNAM2= <"">
##$SUBNAM3= <"">
##$SUBNAM4= <"">
##$SUBNAM5= <"">
##$SUBNAM6= <"">
##$SUBNAM7= <"">
##$SUBNAM8= <"">
##$SUBNAM9= <"">
##$SW= 18.0517599122864
##$SWIBOX= (0..15)
0 0 2 0 0 0 0 0 0 0 0 0 0 0 0 0 
##$SW_h= 3612.71676300578
##$TD= 16384
##$TD0= 1
##$TE= 0
##$TE2= 300
##$TE3= 300
##$TEG= 300
##$TL= (0..7)
0 120 120 120 120 120 120 120 
##$TP= (0..7)
150 150 150 150 150 150 150 150 
##$TP07= 0
##$TPNAME0= <>
##$TPNAME1= <>
##$TPNAME2= <>
##$TPNAME3= <>
##$TPNAME4= <>
##$TPNAME5= <>
##$TPNAME6= <>
##$TPNAME7= <>
##$TPOAL= (0..7)
0.5 0.5 0.5 0.5 0.5 0.5 0.5 0.5 
##$TPOFFS= (0..7)
0 0 0 0 0 0 0 0 
##$TUNHIN= 0
##$TUNHOUT= 0
##$TUNXOUT= 0
##$USERA1= <user>
##$USERA2= <user>
##$USERA3= <user>
##$USERA4= <user>
##$USERA5= <user>
##$V9= 5
##$VALIST= <valist>
##$VCLIST= <CCCCCCCCCCCCCCC>
##$VD= 0
##$VDLIST= <DDDDDDDDDDDDDDD>
##$VPLIST= <PPPPPPPPPPPPPPP>
##$VTLIST= <TTTTTTTTTTTTTTT>
##$WBST= 1024
##$WBSW= 4
##$XGAIN= (0..3)
0 0 0 0 
##$XL= 0
##$YL= 0
##$YMAX_a= 133574
##$YMIN_a= -360746
##$ZGOPTNS= <>
##$ZL1= 120
##$ZL2= 120
##$ZL3= 120
##$ZL4= 120
##$ABSF1= 10
##$ABSF2= 0
##$ABSG= 5
##$ABSL= 3
##$ALPHA= 0
##$AQORDER= 0
##$ASSFAC= 0
##$ASSFACI= 0
##$ASSFACX= 0
##$ASSWID= 0
##$AUNMP= <proc_1d>
##$AZFE= 0.1
##$AZFW= 0.1
##$BCFW= 1
##$BC_mod= 2
##$BYTORDP= 1
##$COROFFS= 0
##$CY= -3
##$DATMOD= 1
##$DC= 2
##$DFILT= <>
##$DTYPP= 0
##$F1P= 0
##$F2P= 0
##$FCOR= 0.5
##$FTSIZE= 0
##$FT_mod= 4
##$GAMMA= 1
##$GB= 0.15
##$INTBC= 1
##$INTSCL= 1
##$ISEN= 128
##$LB= 0.25
##$LEV0= 0
##$LPBIN= 0
##$MAXI= 10000
##$MC2= 0
##$MEAN= 0
##$ME_mod= 0
##$MI= 1.114404
##$NCOEF= 0
##$NC_proc= 0
##$NLEV= 6
##$NOISF1= 3.799351
##$NOISF2= 2.8
##$NSP= 1
##$NTH_PI= 0
##$NZP= 0
##$OFFSET= 14.38212
##$PC= 1
##$PHC0= -4060.212
##$PHC1= 6.192291
##$PH_mod= 1
##$PKNL= yes
##$PPARMOD= 0
##$PSCAL= 0
##$PSIGN= 0
##$REVERSE= no
##$SF= 200.129724274929
##$SI= 16384
##$SIGF1= 3
##$SIGF2= 2
##$SINO= 400
##$SIOLD= 16384
##$SREGLST= <1H.CDCl3>
##$SSB= 0
##$STSI= 0
##$STSR= 0
##$SW_p= 3205.1282051282
##$SYMM= 0
##$S_DEV= 0
##$TDeff= 0
##$TDoff= 0
##$TI= <>
##$TILT= no
##$TM1= 0
##$TM2= 0
##$TOPLEV= 0
##$USERP1= <user>
##$USERP2= <user>
##$USERP3= <user>
##$USERP4= <user>
##$USERP5= <user>
##$WDW= 1
##$XDIM= 8192
##$YMAX_p= 0
##$YMIN_p= 0
$$ End of Bruker specific parameters
$$ ---------------------------------
##NTUPLES= NMR FID
##VAR_NAME=  TIME,          FID/REAL,        FID/IMAG
##SYMBOL=    X,             R,               I
##VAR_TYPE=  INDEPENDENT,   DEPENDENT,       DEPENDENT
##VAR_FORM=  AFFN,          ASDF,            ASDF
##VAR_DIM=   8192,          8192,            8192
##UNITS=     SECONDS,       ARBITRARY UNITS, ARBITRARY UNITS
##FACTOR=    0.0002768,     1,               1
##FIRST=     0,             0,               0
##LAST=      2.2672688,     0,               0
##MIN=       0,             -360746,         0
##MAX=       2.2672688,     133574,          0
$$ Real data points
##PAGE= N=1
##DATA TABLE= (X++(R..R)), XYDATA
0 0 0 0 0 0 0 0 0 0 0 0 0 0 0 0 0 0 0 0 0 -5 8 -8 8 -8 8 -11 13 -15 16 -19 21 -21 28 -29 32 -37 41 -46 50 -56 61
41 61 -68 74 -81 90 -99 108 -120 129 -143 158 -176 194 -214 235 -264 297 -333 379 -436 508 -598
62 -598 717 -883 1131 -1515 2183 -3550 7308 -35711 -105717 30841 -38924 -154656 -101450
75 -101450 11041 -91121 -132181 6218 -83575 -96395 29826 38956 -71975 -39162 106512
86 106512 -4751 -3585 86539 3229 -39306 45192 95805 -65420 -39313 57453 -43182 -27024
98 -27024 36286 1267 -93079 14067 93317 -46201 3522 64617 11371 1982 96348 81486
110 81486 -61109 53196 97520 -7426 9660 48327 -7018 -72721 60159 25746 -110511
121 -110511 -24675 4654 -55697 -68414 15804 -61463 -132493 20583 -12788 -103657 -65800 -12833
133 -12833 -75618 -90013 29063 -77173 -128529 -13226 -10250 -81036 -71251 9133 -88242 -72845
145 -72845 44125 -45236 -94670 -29050 17180 -74213 -48946 22154 -98948 -74619 12104 -27170
157 -27170 -108514 -54960 3192 -102891 -40667 9246 -85023 -85499 3370 11211 -97289 -20859
169 -20859 8743 -85382 -21528 20518 -47076 -105754 -1687 -1636 -107148 -25862 -27808 -98164
181 -98164 -69580 10304 -45639 -125211 -1261 -16694 -75958 -6812 10153 -52309 -54150 69337
193 69337 1839 -58373 37847 16482 -23992 11498 65061 -32875 -44060 76545 6732 -30374
205 -30374 21560 25876 -36022 1747 82002 -36263 -33268 53082 17904 -18789 21999 49558
217 49558 -50399 9734 82521 -16294 -20927 36597 34838 -30477 36461 57700 -56335 7539
229 7539 61656 4335 -34004 27714 24748 -58429 35832 37481 -55156 -24593 37314 7580 -52262
242 -52262 37807 9778 -56291 35816 47321 -18319 -29919 57482 15205 -33866 57692 9817
254 9817 -44094 6099 49131 -25309 -56250 36289 -29530 -51070 19123 -4208 -63355 -34273
266 -34273 47604 -36801 -39632 35957 -19672 -31650 23825 41278 -51235 -19184 55639 -29936
278 -29936 -20778 22021 -11952 -58685 4341 38632 -70367 -24420 24550 -28871 -26215 25763
290 25763 13681 -62884 26742 52317 -34467 -130 32426 -1905 -34434 42248 13829 -74493
302 -74493 7676 17118 -38890 -37006 12790 -27286 -67633 36428 1723 -58166 -3118 26884
314 26884 -12848 -23834 52990 -13172 -42636 44894 18814 -33804 -19295 30442 -35440 -36689
326 -36689 39734 -35069 -54544 5598 20320 -39447 -19448 44210 -33490 -7133 56200 11556
338 11556 -24956 22014 57675 -25957 10428 46221 -31956 -19508 28642 9831 -62733 -5764
350 -5764 19480 -58601 -7782 17342 -30348 -44120 28656 26271 -49987 23439 28969 -23077 8915
363 8915 45491 3572 -42721 45005 22971 -36805 17455 17251 -23330 -19313 50568 -1715 -42300
376 -42300 44020 21654 -7322 25714 54342 697 1081 86899 24209 -177 52406 44268 6276
389 6276 25595 71861 -11632 -2431 65725 17822 -4641 27790 45322 -16469 23530 72021
401 72021 -9431 5274 53379 37680 -4046 37422 55058 -23854 29150 60100 2625 -7285
413 -7285 37393 35348 -24115 40797 42325 -23539 19092 53116 22878 -11485 52916 38429 -13412
426 -13412 55504 48567 676 8741 60633 26792 -14825 54852 19437 -15796 29336 41365
438 41365 -7489 -19601 50793 1232 -19626 36546 8293 -22970 2154 44975 -20615 -24710
450 -24710 37150 -14006 -21814 15032 12906 -41446 -14644 37675 -34737 -22568 16951 -13878
462 -13878 -33289 6506 23405 -51098 -9938 27441 -26329 -17879 12187 562 -44434 14254
474 14254 26404 -43804 -3896 19218 -8770 -22470 24723 9856 -45433 22937 22882 -24251 -9115
487 -9115 19690 -5793 -35578 29892 -2732 -47345 2825 7929 -25951 -32315 16802 -25747 -45289
500 -45289 21715 -9605 -39286 -14067 15488 -26199 -28259 28629 -26641 -32870 14551 5847 -33086
513 -33086 -18215 24445 -34785 -19714 23412 -21567 -32708 2225 18410 -37835 -9264 24257
525 24257 -32780 -11387 19482 -713 -36970 5210 22317 -39864 -1157 12682 -27144 -25850
537 -25850 11599 907 -52864 1555 3147 -41621 -12063 1790 -25744 -48221 9130 -10447
549 -10447 -56304 -7964 -14584 -42874 -35030 -245 -36711 -62820 1704 -25330 -49789 -19956
561 -19956 -10038 -39324 -36893 18943 -29297 -40376 9142 -6344 -26952 -11384 16935 -35084
573 -35084 -25146 24015 -23916 -32093 -4928 -1309 -39665 -15514 16104 -43405 -21862 12970 -8809
586 -8809 -26201 3095 18897 -31365 10151 30142 -16663 -7253 21000 13743 -25837 14728 15038
599 15038 -34657 2571 13767 -14677 -29020 11841 3375 -35190 17486 9626 -19398 2047
611 2047 30815 9827 -12853 42371 19395 -3435 37146 33635 6379 5678 49974 13154 -3853
624 -3853 42252 14364 -1248 20160 39406 -1670 211 48896 7102 6731 36559 27346 1864
637 1864 21922 54403 265 13371 44945 13461 7407 28770 34039 -13167 16211 40534 -8114
650 -8114 5640 24104 10859 -12904 21626 26760 -24418 12465 23969 -3769 -5105 19863 10105
663 10105 -25476 22800 16473 -20819 2179 15296 -1600 -18532 24024 1557 -27341 17534
675 17534 10576 -12467 -9627 20045 -6931 -22130 25576 -5427 -22907 2560 10852 -16591 -19736
688 -19736 19902 -21050 -22414 13584 -5716 -24228 -10305 16112 -25012 -14270 18453 -19907
700 -19907 -17802 5525 7281 -27466 -7754 16997 -28394 -8524 9422 -12103 -25889 97
712 97 9521 -35273 -3980 6554 -25067 -13599 4980 -3682 -34408 5406 6285 -29983 -579
725 -579 4289 -13188 -20152 14156 888 -30477 12314 3615 -16240 -3430 13429 -7651 -22866
738 -22866 23126 -1299 -20338 7581 5703 -12448 -11401 21655 -13627 -20994 18740 -3123 -14357
751 -14357 -758 14497 -15708 -8983 27378 -11675 -9520 14044 9572 -11175 2392 24569 -18645
764 -18645 -1171 21259 -5406 -11671 4783 11698 -24399 1150 13870 -24473 -8462 6842
776 6842 -1901 -23490 4357 8226 -26575 6068 10460 -10627 -10377 13876 8040 -20552 17127
789 17127 8306 -15257 5483 13960 -2086 -17781 18394 629 -20393 12295 1790 -13597
801 -13597 -9463 16556 -8249 -19693 18996 -4495 -11686 7096 12970 -9102 -6953 27838 -5458
814 -5458 -5459 19195 4885 -6574 4251 22462 -14985 -5709 18806 -10859 -9849 2614 3116 -23726
828 -23726 -4592 12673 -25282 -8685 4977 -6717 -15753 4360 10370 -23474 6834 14519 -9052
841 -9052 -1748 11710 7025 -16070 15573 9874 -19028 4373 6572 -6476 -16357 8917 -4590
854 -4590 -26660 8490 -2263 -17573 -8524 7706 -6385 -17203 18768 -3079 -12152 12430 11437
867 11437 -2959 -3732 23787 -4059 -6467 20495 -1015 -9008 221 12771 -14914 -11305 13508
880 13508 -17624 -12527 3026 -1460 -18481 -5709 13881 -18198 -1732 13251 -4462 -4657 10144
893 10144 17077 -12241 9974 19227 -7129 5819 13043 5770 -12194 11254 11422 -18587 5658
906 5658 5879 -8081 -7956 9566 2725 -19154 14535 7322 -7700 7844 15064 5888 -2903 28556
920 28556 11705 -2023 23856 16165 6333 7418 25513 3682 -3840 25421 2887 -3007 7529
933 7529 12145 -5114 -3416 21926 -7018 -3361 15688 7030 -960 6455 22955 -4081 8149
946 8149 25740 2319 5400 15037 18032 -4130 9765 20711 -9282 5400 11883 1776 -8623
959 -8623 5894 10249 -16572 7034 8180 -8482 -1888 9597 7348 -11656 14773 10672 -7790
972 -7790 12435 12613 3875 -3547 18911 8018 -9163 16684 5110 -4888 581 11568 -2993
985 -2993 -13035 14662 -4408 -10622 4406 1842 -7959 -8000 14287 -8713 -8896 11508 -2698 -5319
999 -5319 1085 11590 -10052 -4605 14728 -9588 -5007 3282 686 -12600 -3518 9116 -19225
1012 -19225 -6109 2965 -9525 -11349 -2967 2409 -19874 164 5973 -14200 -3004 3087 949
1025 949 -12088 7319 6377 -14963 6737 5286 -4449 -6618 7094 1780 -15498 9730 -199 -11825
1039 -11825 -1362 3135 -4197 -13378 10202 -4959 -12751 7035 -423 -6731 -6742 9601 -6632 -10616
1053 -10616 10888 -6235 -7679 -98 4285 -9825 -9051 10178 -12101 -7641 3395 -4409 -10654
1066 -10654 -5448 7008 -15572 -5973 5260 -11086 -7476 -1335 1644 -15634 -2719 5991 -15210
1079 -15210 -2383 1259 -4060 -11037 1768 4767 -16703 2684 2491 -8527 -4452 2708 -9 -15410
1093 -15410 6028 553 -13585 -3 -673 -5294 -11529 5802 -3917 -15291 5329 -2661 -7551
1106 -7551 -5018 4456 -4977 -11225 10482 -5473 -8096 1848 949 -6379 -8041 8855 -10254 -8837
1120 -8837 5518 -5653 -7659 -4787 4587 -11319 -6100 7783 -10067 -4711 1173 2003 -8410 -1255
1134 -1255 8717 -11519 80 5134 -4121 -5724 748 5553 -12618 2084 4584 -9322 -462 2566
1148 2566 1402 -10070 5743 4756 -9792 6435 3556 -1175 -3863 7663 3671 -9636 9380
1161 9380 1015 -5382 982 3977 -1210 -9024 9264 -2310 -7555 5284 -72 -2841 -3881 8983
1175 8983 -3976 -6456 9586 -3184 -2929 540 4583 -5817 -5181 9563 -8236 -3893 2602 -1587
1189 -1587 -5845 -2690 6987 -10500 -1702 6395 -5045 -2166 1116 5034 -8008 2551 7838 -7934
1203 -7934 1983 3746 1583 -5037 4140 5966 -9612 5787 4107 -2954 -870 4365 3697 -7458
1217 -7458 8448 3277 -5497 4395 3489 985 -5358 7866 692 -7434 7143 -538 -2703 -2564 4995
1232 4995 -2039 -7660 8626 -3483 -3537 2703 2534 -2509 -4471 9463 -4689 -2802 6162 -2181 -2332
1247 -2332 -1330 6773 -6711 -2875 6913 -6238 -1077 1147 2055 -5270 223 8048 -6805 2385
1261 2385 4740 151 -414 3473 7411 -6269 5565 6228 -3316 2267 3178 3202 -5956 5297 3333
1276 3333 -7494 3724 793 -1052 -3965 3737 826 -8654 6193 13 -3464 4 3020 561
1290 561 -5358 8592 -1164 -3741 5077 1168 -419 -2871 6820 -2968 -4055 6552 -3422 -2320 -931
1305 -931 2819 -4434 -3729 6833 -5877 -908 2997 1185 -1185 352 8679 -3741 3134 7700 -105
1320 -105 2521 3707 7308 -3272 3855 6421 -4540 2638 1724 602 -4471 1627 3039 -7763 3274
1335 3274 718 -1898 -990 2909 3442 -5024 7776 3591 -1085 5212 4302 3695 -1745 8325 1968
1350 1968 -3535 6057 -301 -856 -1897 3399 -2201 -5958 5300 -3347 -2368 692 1816 -873 -2001
1365 -2001 7956 -2140 384 6626 1746 1940 1821 7770 -1741 1204 7436 -2511 1226 1552 2615
1380 2615 -3384 -456 4304 -6382 987 1635 -1143 -2022 410 4548 -5388 3944 3449 -2048 2046
1395 2046 2555 3753 -3290 5147 3578 -3511 4497 1758 1121 -2318 3330 1259 -5414 4197 -2110
1410 -2110 -3154 -1703 18 -1644 -6697 3094 -3925 -4799 660 -2080 -2008 -4153 3724 -3274 -3533 4059
1426 4059 -2837 -792 -1004 2042 -3600 -3397 3751 -6013 -2440 -1474 -2951 -5141 -4940 902 -8990 -3760
1442 -3760 -1463 -6077 -3686 -3361 417 -6733 -617 1665 -5314 436 -587 232 -4103 350 982 -7119
1458 -7119 812 -2295 -4330 -4713 -3047 -2572 -9569 -1015 -4741 -7292 -3245 -3967 -3072 -6997 602 -3184
1474 -3184 -5973 1235 -2797 -2170 -3178 1123 -2363 -5333 2405 -4631 -3209 -1846 -1433 -3597 -5379
1489 -5379 1906 -5821 -2966 -162 -3080 -2182 -2707 2319 -3926 -1042 3078 -2946 719 457 2582 -1529
1505 -1529 1280 4591 -3007 2606 1386 760 -603 830 3546 -3937 2495 1265 -1638 861 480
1520 480 2567 -3217 3351 1693 -2296 3028 431 1606 -1063 3259 1950 -2382 4864 676 916
1535 916 1212 2476 1406 -1850 5168 -330 -33 2769 740 986 -1024 4689 -393 -476 4301 -298
1551 -298 1571 577 3802 307 60 5361 -1345 2007 2086 2372 940 671 4809 -1444 2447 2848 -152
1568 -152 1179 869 3405 -2184 2148 2661 -1913 2079 543 1566 -1597 1148 1958 -3523 1908 -626
1584 -626 -897 -1170 386 829 -4008 2260 -1027 -1583 537 -362 643 -2952 2859 -523 -2326 1894
1600 1894 -1436 63 -2010 1581 -1536 -3024 1864 -3076 -1232 -1011 -659 -1380 -2751 2582 -3051 -643
1616 -643 1152 -733 434 -697 3040 -1765 495 2632 -1415 1175 -216 1392 -1851 -415 1985
1631 1985 -3619 547 -837 -764 -1559 -1220 958 -3944 881 -259 -1549 88 -306 1570 -2481 1646
1647 1646 347 -1929 1837 -392 858 -1838 1286 183 -2660 1924 -1656 -695 -894 -260 -537 -2931
1663 -2931 2295 -2094 -1178 608 -650 431 -1677 2524 -1133 -375 2481 -899 1115 -180 2446
1678 2446 -241 -319 2774 -1706 998 104 345 -836 -1303 1882 -3319 42 -107 -1938 -839 -1647 709
1695 709 -3124 -458 197 -2446 610 -1100 440 -1760 295 884 -2824 1263 -1048 -682 -1311 -806
1711 -806 -239 -3956 38 -2581 -2886 -1643 -2373 -1123 -4218 -184 -1792 -2909 216 -1838 -194 -1702
1727 -1702 1068 -659 -1984 1885 -1508 121 -296 144 -372 -1865 1462 -2737 -767 -477 -1597 -892
1743 -892 -2331 806 -2573 -1122 328 -1830 347 -989 1350 -836 365 2081 -1571 2040 154
1758 154 778 -119 97 2023 -1572 1620 107 -220 610 -172 1554 -1739 1592 632 -569 1953 158
1775 158 1989 288 2566 2422 427 4182 1342 2558 2140 2924 3033 978 4497 1622 2477 3187 2160
1792 2160 2974 697 4254 1395 1997 3770 1380 2819 1654 3650 1947 2215 4362 1052 3743 2303
1808 2303 3258 2161 1986 4064 911 2804 2302 1293 1956 686 2788 -451 1443 1769 -690 1747
1824 1747 -78 1402 -697 604 1379 -1530 1284 -414 480 -545 40 840 -1718 1200 -1232 -716
1840 -716 -351 -1635 -69 -2439 96 -1907 -1925 -345 -2517 -905 -2635 -643 -1891 -2691 -508 -3212
1856 -3212 -1526 -2187 -1400 -1841 -3262 -619 -3447 -1561 -2179 -2604 -1692 -3436 -581 -3496 -2658 -1818 -3447
1873 -3447 -1856 -3515 -1624 -3267 -2671 -1565 -3792 -1749 -3011 -1842 -2637 -2845 -1250 -4009 -1142 -2292
1889 -2292 -2286 -1383 -2251 -457 -2967 -469 -1436 -1838 -372 -1812 -71 -1661 -96 -327 -1881 1096 -1048
1906 -1048 -5 -454 -2 498 -1195 1795 -658 580 621 -178 1024 -1038 1732 -34 355 1519 15
1923 15 1223 -259 1767 -50 -20 1848 -598 1427 -103 543 578 -172 1782 -906 1223 474 171
1940 171 641 -138 1378 -894 791 365 -698 601 -420 1042 -724 -27 914 -870 1218 -605
1956 -605 618 -195 -149 895 -1436 1511 -712 -19 261 -263 885 -1313 1023 -460 -437 689 -931
1973 -931 370 -988 290 -398 -863 871 -1411 606 -825 -422 -69 -1212 816 -1220 78 -596
1989 -596 -873 -44 -1632 609 -1674 -573 -283 -1338 -223 -1627 195 -1256 -1006 -95 -1971 0
2005 0 -1587 -424 -826 -1099 308 -2009 184 -886 -943 -131 -1219 259 -1777 156 -670 -1009 5
2022 5 -1275 205 -1404 -122 -555 -1758 180 -1492 49 -1132 -583 -59 -1941 322 -1532 -537 -675
2039 -675 -1082 32 -1676 213 -1449 -796 -187 -1338 -228 -1571 -80 -1310 -1508 -103 -1975 -351
2055 -351 -1821 -868 -1044 -1852 -413 -2452 -1032 -1533 -1533 -1249 -2107 -407 -2288 -1047 -1149 -1823 -523 -2040
2073 -2040 -413 -1610 -1353 -651 -1774 310 -1701 -949 -1279 -1326 -408 -1725 -312 -1781 -1364 -1064 -1722
2090 -1722 -378 -1960 -29 -1355 -1504 -530 -1914 -5 -1658 -137 -775 -1503 125 -1488 -171 -1237
2106 -1237 -737 -487 -1886 -415 -1929 -856 -1419 -1801 -1006 -1932 -374 -2173 -1182 -1053 -1980 -550 -1935
2123 -1935 -358 -1344 -1138 -226 -1858 106 -1487 -585 -1057 -1323 5 -1796 -449 -1640 -1165 -815 -1872
2140 -1872 -367 -2207 -565 -1142 -1534 -560 -1581 -273 -1664 -404 -343 -1190 15 -1265 -174 -754 -661
2157 -661 25 -1163 168 -1406 -696 -875 -1290 -686 -2151 -452 -1822 -1302 -736 -1670 -556 -1614 -461
2174 -461 -1040 -1279 177 -1359 294 -1004 0 -188 -763 600 -945 275 -863 -501 -49 -1003 539
2191 539 -1190 -115 -284 -862 170 -996 534 -781 -325 507 -639 987 -399 783 188 298 949
2208 949 -166 1045 -42 575 574 136 883 -667 609 -144 -448 542 -716 714 -689 238 -17 -373
2226 -373 795 -688 591 -239 414 398 -546 1072 -685 647 77 -247 606 -911 737 -715 51
2243 51 60 -643 467 -1290 -67 -629 -561 204 -1317 535 -1052 4 -350 -383 583 -998 748 -219 72
2262 72 363 -481 861 -644 561 -184 -620 332 -982 364 -1092 -147 -199 -804 272 -1111 239 -354
2280 -354 -302 307 -640 689 -308 366 51 -8 990 -172 1072 -212 318 789 -170 687 -288 722 8
2299 8 204 788 -430 1168 177 802 513 216 1152 -185 1123 613 749 1273 454 1505 572 1205 1261
2318 1261 802 1580 561 1780 586 1013 1047 201 1542 629 1039 699 654 1714 126 1311 214 1052
2336 1052 860 318 1089 331 1225 209 729 598 -38 1189 4 698 -20 -174 748 -431 364 -200
2354 -200 -213 -167 -506 295 -811 -195 -569 -805 -102 -779 100 -798 -547 -93 -607 -14 -1142 129 -844 -602
2374 -602 -77 -1109 -365 -1295 -304 -769 -917 -283 -1240 -123 -833 -867 -357 -1228 -304 -1401 -324 -1163 -689
2393 -689 -298 -1285 -255 -1308 -576 -703 -902 -159 -1181 -545 -582 -753 -392 -1120 -156 -925 -358 -508 -591 -56
2413 -56 -881 367 -520 -534 21 -770 -85 -771 19 -215 -216 127 -509 418 -157 375 268 -266 752 -494
2433 -494 615 1 242 578 -156 1092 -210 669 553 160 881 -194 1014 254 491 624 192 912
2451 912 -95 868 345 210 789 29 988 -114 465 305 -32 1052 -536 760 176 172 608 -131 723
2470 723 -347 250 126 -148 524 -669 591 -242 246 289 122 654 -337 466 53 14 583 -100 996
2489 996 -57 245 95 -165 454 16 530 59 20 437 -207 460 -149 536 51 -96 519 -271 527 -89
2509 -89 510 740 118 800 -245 353 145 -36 185 -300 621 -369 444 188 -275 548 -534 354 77 287
2529 287 388 -224 682 -215 338 415 -24 373 -273 651 89 424 149 -299 773 -197 427 309 -67 425
2549 425 -197 737 -152 522 369 -291 831 16 398 -166 256 549 165 823 -18 665 362 349 647 67
2569 67 866 110 569 469 129 906 281 712 361 79 679 185 605 94 506 586 136 768 -128 699 289
2590 289 490 645 282 914 194 709 619 347 934 305 809 487 649 685 257 741 6 950 533 490 1029
2611 1029 206 1105 434 924 857 489 995 228 908 529 612 1067 387 937 353 738 632 474 803 424
2631 424 592 95 287 177 316 849 66 360 482 209 692 258 716 4 401 159 34 759 -158 484
2651 484 32 -18 296 -18 419 -155 103 143 -414 296 -192 36 -192 24 76 -85 36 -569 41 -38 -308
2672 -308 -122 -291 322 -407 -65 19 -548 9 -219 133 -312 -391 113 -575 28 -496 -226 -129 -378 -31 -451
2693 -451 -49 -525 -217 -246 -295 -122 -383 136 -577 -534 115 -437 60 -282 90 -223 -348 156 -177 279 -39
2714 -39 23 226 -306 130 -293 209 100 -66 604 -239 376 -6 -104 131 -99 392 191 505 68 96 645
2735 645 -5 446 171 370 294 -95 394 -103 610 175 329 572 296 523 50 216 326 257 390 50 304
2756 304 -80 70 221 50 412 -107 301 151 -148 381 114 332 -148 257 244 -133 470 -32 312 132
2776 132 34 123 23 434 -19 356 41 -262 242 -182 277 -214 71 164 -153 169 -186 180 148 -240 180
2797 180 -296 118 -45 58 197 -283 476 -609 87 -482 -73 6 -294 143 -423 12 -362 -214 -105 -637
2817 -637 -276 -335 -292 -100 -383 27 -411 -75 -5 -518 -65 -81 112 34 -96 -165 -229 274 -207 292 -256 -315 47
2840 47 -102 222 -125 143 -119 -86 195 -373 -28 -144 89 199 -129 332 75 173 10 -75 469 -295 134
2861 134 -20 43 -74 -80 212 -152 539 -413 98 454 -61 252 -240 190 21 -87 165 -467 177 -117 133
2882 133 23 130 -354 111 286 0 -79 -66 -195 202 -387 -169 -233 2 -11 -371 454 183 47 159 -203
2903 -203 126 191 -93 7 121 287 -153 167 -376 -39 9 -345 414 -257 48 -119 153 -94 -94 60 -73
2924 -73 180 80 -144 88 57 206 -44 64 212 -276 241 -140 163 126 -466 -33 -92 121 -187 -81 -52 -108
2946 -108 23 -63 -10 -401 -241 34 118 234 -318 127 198 -44 -342 -155 103 -194 225 385 -305 250 -127
2967 -127 -129 159 73 45 -202 442 -15 49 279 -348 -104 -171 -35 -376 -134 -3 -163 236 -238 -266 37 -30 328
2990 328 -180 54 45 -85 -192 -74 155 -81 -74 -192 60 259 -154 144 -113 240 10 -51 93 -110 -20 -79
3012 -79 -27 297 -118 55 41 -37 44 -213 378 73 190 -344 -57 384 -235 455 -82 150 32 -207 281 -233
3034 -233 69 -117 52 33 -119 99 50 -31 77 -230 82 -381 251 63 96 454 -28 90 161 79 -41 -63
3056 -63 70 -484 216 -83 46 -2 -107 46 -172 255 -102 -44 -153 -19 24 -231 22 34 -196 -76 -131 39
3078 39 -121 196 -64 -188 32 -137 -126 115 -351 297 -52 39 -46 135 138 -95 -250 -111 157 -457 32 247
3100 247 -259 21 -328 -245 31 56 182 -77 287 -31 7 -11 -69 -132 -211 229 193 -102 178 -216 67 -242 95
3123 95 -181 -121 284 188 -1 -74 -248 297 -133 104 28 -62 213 -115 195 -69 162 -65 -116 165 -14 299
3145 299 212 -210 170 48 159 -106 208 87 -106 171 -214 114 -260 157 52 5 331 -196 238 -232 252
3166 252 96 -82 -34 -234 -32 -91 73 214 -67 140 -160 68 -26 -93 128 182 -41 -66 -47 214 72 220
3188 220 -116 119 72 127 89 -294 129 -160 214 -99 -101 97 -325 -244 14 -24 166 28 32 20 154 216 173 16
3212 16 -103 179 -10 321 207 164 306 -300 94 108 65 366 -89 36 14 85 148 -281 143 -54 429 110
3234 110 92 110 220 404 -190 21 190 -289 43 -129 -88 69 -68 234 -237 374 -188 35 13 30 74 -59
3256 -59 54 -237 271 156 -373 -25 -17 242 37 -18 362 92 -50 -4 -16 86 110 76 -417 -38 -60 94 242
3279 242 -166 69 33 132 183 12 210 -95 114 7 143 -18 -191 165 -220 55 234 -51 -50 -94 340 -158
3301 -158 16 -5 -272 -14 39 361 -212 38 -177 -168 -224 -87 -26 98 404 -77 -39 238 -37 -37 -97 -170 175 105
3325 105 121 -53 -58 252 -230 -199 4 -5 238 -39 18 -125 -73 -159 -55 -136 7 -294 -27 67 2 111 -3 41
3349 41 226 147 -43 191 -57 185 -95 -25 27 -18 56 -253 92 -247 152 16 -185 -18 -261 0 -126 -27
3371 -27 350 -111 187 -93 -170 105 -247 127 -212 -121 -233 20 244 -359 -11 91 229 146 -283 -262 -96 -290
3393 -290 117 221 5 51 -183 -231 -179 203 28 -211 -258 58 -68 22 -73 40 25 -63 -364 259 -7 -153 -357
3416 -357 171 -375 304 -151 -312 202 -102 361 59 -176 -101 -238 69 -73 207 -245 -36 71 -207 -21
3436 -21 -78 235 20 -191 227 -4 -131 50 -195 115 -170 200 -118 -77 -76 -351 -158 -358 209 -254 -266 279
3458 279 83 101 -287 -72 -28 146 67 -398 -281 16 0 31 27 -70 -219 229 -85 127 -172 -137 68 -309 -138
3481 -138 -21 39 -51 83 -108 -61 153 97 -73 -69 -72 16 -98 -21 294 -351 260 -198 -252 -138 -92 208 124 208 -79
3506 -79 46 523 -211 -39 -103 101 72 -52 -162 -97 260 -216 -17 156 -126 83 16 -90 -84 -292 123 -184
3528 -184 -101 -81 -4 -168 -3 186 -208 57 -98 86 -82 -89 153 -86 -88 157 16 -277 43 -12 -232 271 15
3551 15 -74 56 -298 165 43 108 -52 -84 74 304 -228 -45 -20 212 13 280 149 -67 -92 -75 40 63 121
3574 121 -12 216 160 -204 8 175 197 110 -322 61 239 128 -129 -80 192 -95 315 -65 202 257 -261 108
3596 108 94 294 -24 24 -98 257 92 -154 221 93 173 491 -109 373 -3 37 5 -226 395 -142 236 -32
3618 -32 -29 280 184 377 -40 50 301 0 81 89 195 181 134 463 193 356 140 41 235 104 171 -3 143 141 -116
3643 -116 -50 2 522 -175 219 3 81 199 -54 91 30 -136 52 16 78 -144 343 61 218 130 249 160 -209
3666 -209 174 120 -323 212 128 138 213 -84 -146 64 152 -88 -129 -140 164 -119 254 76 122 177 374 -235 500
3689 500 -82 270 39 65 108 99 160 9 181 33 -54 83 -208 66 24 -44 199 271 233 79 20 -54 213 151
3713 151 -237 313 105 196 -60 -169 292 -243 48 -126 68 157 -83 197 -140 106 212 -180 -11 -95 -14
3734 -14 44 195 86 -73 66 -152 252 73 -136 34 -80 299 -252 -74 -440 -245 -192 -46 -198 -136 -168 -222
3756 -222 -396 58 -340 -53 -269 -119 105 -297 230 -102 47 143 -202 -122 -354 81 -7 -132 94 -440 71
3777 71 -114 -65 48 81 -53 -186 19 -172 -79 -120 -79 134 -214 -170 -148 135 -153 -406 -22 -13 4 128 -264 -87
3801 -87 -92 267 -137 242 11 165 -77 563 844 -134 153 34 -163 203 -22 -211 63 -166 13 -22 49 138
3823 138 -236 -165 -324 59 -91 -66 129 -330 -172 11 105 -209 157 -165 -11 -46 -208 -15 4 -393 145 -331
3845 -331 99 18 8 -53 -161 162 -47 8 91 119 164 -49 255 -107 -20 -86 -185 -64 -88 179 -129 82 -18 -66
3869 -66 199 -80 -72 -115 -200 59 -380 120 -160 -52 -23 -97 -111 -308 173 -45 -120 -198 -519 -118 -311 38 39 -297
3893 -297 1 -59 79 -60 -159 -23 -567 -19 -247 -11 -57 -215 -31 -400 -7 55 -14 -323 -123 167 -225 -91
3915 -91 12 -130 132 -52 -320 -345 -22 -44 -124 187 -156 -279 56 -247 -234 -51 35 -8 -40 -166 119 106 -434
3938 -434 -254 -262 -47 -20 -44 -187 -182 105 221 -442 46 -437 102 -152 -333 -131 -122 21 -398 -1 -355 -80 170
3961 170 110 142 -260 106 -18 56 -89 118 184 52 112 84 96 54 74 -53 -103 327 38 120 120 -131 64 33 -154
3986 -154 110 -277 199 -119 19 105 85 152 -142 58 175 -61 70 -356 -191 -285 -295 74 -52 113 -41 -149
4008 -149 -171 -114 32 -101 28 -127 98 -29 42 -65 -249 73 215 21 271 138 -44 -187 244 -20 193
4029 193 279 -231 173 -27 19 -118 61 214 -314 81 -151 -79 5 -239 -198 -160 -182 195 -7 -14 -210 -105 -66
4052 -66 -166 254 -74 199 -374 175 -485 -221 -48 -382 -70 55 182 33 50 187 -382 -80 58 -19 -163
4073 -163 34 306 49 -315 15 -132 230 -304 45 248 -54 -65 -154 114 -185 127 -12 -49 18 307 205
4094 205 -14 -31 169 59 201 73 105 232 -119 205 9 -101 164 -125 -36 -17 -23 -326 101 -37 -100 287
4116 287 34 251 19 -13 -272 74 135 -371 60 -77 163 174 113 -15 -107 40 -61 -305 94 -21 169 -208
4138 -208 -361 87 -212 -32 -158 14 -89 -210 89 -141 31 -201 45 -333 -110 279 -312 82 -369 67
4158 67 128 -117 221 -279 60 -265 -305 95 -180 36 -414 90 -168 -153 -48 -188 78 -133 -1 -214 -131 -217
4180 -217 37 -134 42 -75 -516 -643 93 -87 -65 77 -192 -184 -397 -89 -212 -110 -159 53 -188 -85 120
4201 120 48 51 -311 -278 -191 -22 336 -266 -155 161 -174 -111 178 20 -439 -81 -138 -28 33 -322 2 -124 -221
4224 -221 107 -74 169 327 -137 162 59 110 -31 49 202 -366 59 -235 227 88 130 145 -11 51 -15 8
4246 8 -68 124 101 -103 -46 -199 -3 254 -152 187 -128 268 45 68 280 -308 45 146 38 45 -22 75 -98
4269 -98 226 -52 -164 81 -311 -176 -42 -95 72 -85 -211 36 156 -77 -231 90 -305 114 -251 -32 -64
4290 -64 -365 210 -353 195 211 -75 -22 -165 13 -251 154 -26 -116 57 -274 -24 -234 -181 480 -364 -23 226
4312 226 -138 169 -45 374 -350 185 82 -145 281 23 -229 31 101 -98 -14 63 -204 98 127 351 56
4333 56 58 405 15 -61 183 65 -14 42 86 -244 545 -10 141 234 -109 221 -148 -10 28 -32 79 -154 268
4356 268 199 -187 -220 6 88 -188 988 -571 -158 178 -178 163 -97 16 46 74 261 -80 -20 -17 -21 229 -140
4379 -140 -116 309 246 225 157 370 -41 296 -156 -45 91 33 -189 -60 155 79 -407 83 -224 237 -128 38
4401 38 315 -325 292 -153 323 -264 209 275 -139 229 -247 -164 136 -69 290 -153 -175 -14 91 -156 -192 36
4423 36 -217 101 125 34 -12 78 200 -122 56 -239 -282 178 94 45 227 112 -40 19 68 -131 -62 38 -94 171
4447 171 -10 140 -163 -6 -153 -143 -96 -360 -378 -143 -25 -148 -223 -209 197 -188 -119 -184 -208 -362 18 -153 20
4470 20 -218 -189 94 -289 -191 -156 -254 143 -126 5 -178 -213 -247 -50 169 -203 43 -121 -39 -60 -55 104 85 -89
4494 -89 111 -191 0 -44 -83 -373 174 85 -267 126 29 211 122 -53 123 113 157 8 -56 63 20 177 6
4517 6 122 196 232 120 23 -19 -201 112 -150 -36 -7 -150 187 -107 221 322 -63 302 -342 60 91 -21 78
4540 78 -206 152 57 7 116 220 -2 243 80 10 67 158 -134 -125 -143 200 124 45 227 -36 201 41 36 5 72
4565 72 232 -276 415 -201 -164 28 -46 56 33 -49 68 -39 139 241 -182 -52 -27 500 -53 -28 114 -72
4587 -72 -20 -127 1 -158 264 -154 10 -3 -124 -30 -210 -31 236 260 41 215 105 91 -64 186 -199 173
4609 173 -37 152 57 275 19 161 64 53 292 237 -140 22 23 49 160 121 176 29 18 -206 -73 12 117 29
4633 29 12 65 98 6 228 239 186 -130 172 289 -240 98 -17 203 120 102 -79 -25 81 -170 519 -118 125
4656 125 72 -122 94 -239 -111 117 175 113 158 208 44 -76 169 35 260 -197 -183 54 35 -228 13 275
4678 275 61 -154 -97 -112 -87 -201 174 -164 -112 24 -78 -74 -213 8 -154 -162 -93 30 -67 -83 59 -162 -174 -237
4702 -237 -536 92 -195 -34 -135 -267 -137 -217 -82 59 -70 177 154 61 -479 123 -117 -390 232 -201 -197 -188
4724 -188 -31 55 -152 100 -68 -26 -83 88 -233 -184 -53 -27 56 21 25 -206 -116 18 112 193 115 -28 82 -227
4748 -227 -139 -11 42 110 38 292 23 222 42 -138 17 -226 -20 63 -39 18 -21 328 36 88 19 -225 128
4771 128 -71 -61 186 -166 -169 -150 134 -52 97 -1 32 171 -273 27 67 301 76 146 4 103 -34 82 84 -35
4795 -35 109 -37 -54 24 -16 -125 103 -53 -18 -32 135 337 130 -9 -64 9 20 -303 -41 -124 -162 -83 96 261
4819 261 41 -86 -97 -268 147 -325 -27 -250 -31 -76 -107 -64 22 -169 -82 1 117 -188 -102 -27 49 -72 -120 8
4843 8 87 261 -217 -176 -195 -118 -235 59 281 -12 11 105 132 -187 -302 83 101 -153 -98 -106 -60 -252 7 -55 157
4868 157 72 -154 -104 21 188 170 42 -54 13 53 -89 111 3 -74 91 29 -224 184 -54 -7 -164 -104 46
4891 46 -121 382 -149 -99 -42 -107 -61 -59 51 128 -117 145 -121 -180 -105 120 277 126 101 -286 283 24 -78 16
4915 16 29 -131 -30 -24 -279 8 148 255 120 46 72 -49 -183 62 92 62 -189 51 135 -140 168 -269 -159
4938 -159 6 174 -55 -102 76 -209 114 89 -96 -67 -263 23 153 -121 -111 -57 -16 128 229 -48 116 -305
4960 -305 145 -174 -174 -148 -258 -10 -192 202 -50 49 59 -219 -98 -93 -9 142 49 -172 -26 216 -124 -93 -173 125
4984 125 -82 28 161 151 -130 -116 173 26 -207 -115 -44 -308 -105 -158 -320 -4 137 103 48 -26 -3 108 232
5007 232 177 -28 -84 62 -1 -221 -146 53 257 41 -85 124 84 -126 201 -52 156 -15 137 -63 71 18
5029 18 -6 42 -94 102 -134 -155 226 -311 188 113 141 -344 19 -87 -115 344 37 -304 -111 140 172 -43 125
5052 125 -205 -45 163 -81 -305 175 171 -97 71 -88 -109 183 272 8 227 202 -121 166 154 66 13 -14 138
5075 138 52 -181 -48 118 13 96 -173 25 43 74 52 37 -76 27 -170 52 50 -103 2 91 -36 -81 108
5098 108 -75 -41 53 -66 91 119 263 55 -64 -181 -212 -52 -24 124 -279 14 -131 -7 -152 -347 52 277
5120 277 14 -7 -297 -127 -36 -162 -10 162 -96 -248 -122 146 -91 27 -21 -43 -2 -42 30 -31 63 -110 138
5143 138 -157 71 187 -154 111 48 42 -28 -183 2 -81 330 -41 52 16 -135 -118 -102 -101 -137 -168 11 -50 -283 -235
5168 -235 69 -5 -44 -36 15 -35 132 250 -109 15 59 -143 -147 -10 -122 61 355 -82 40 -272 95 67 71 -298
5192 -298 80 -121 -58 5 -83 218 50 256 244 41 94 -213 -131 -247 -51 287 191 46 14 -94 -13 74 -137
5215 -137 -125 290 160 -118 -85 116 164 -253 164 271 -132 102 63 12 80 -109 -101 -131 4 -93 207 -114 -105 69
5239 69 135 82 102 167 297 155 -27 -44 199 118 -91 -2 118 -119 -106 71 56 -5 -258 220 157 -34 -120 -71 -123
5264 -123 -148 37 -20 -55 -59 319 99 204 264 118 29 58 -311 -192 101 -6 25 -205 57 140 -262 145 119 -194
5288 -194 59 -146 81 2 63 -223 -209 -161 -13 -251 144 178 157 233 -166 -77 166 -120 68 80 -191 89 -1
5311 -1 -48 89 -232 -15 118 199 -72 -22 16 30 -24 131 320 -131 69 177 267 -55 88 24 57 -149 -49 -91
5335 -91 -106 69 -43 35 -174 266 -179 148 -106 200 -181 -93 -234 -357 223 218 -166 26 -84 116 -129 55
5357 55 -241 -207 85 19 24 10 -31 -90 130 -155 12 4 -25 55 73 10 -93 -38 49 -129 -72 181 -2 3 205 -180
5383 -180 5 -65 -296 -27 123 240 11 22 -151 -108 -93 -257 -49 260 5 56 278 -22 147 27 58 248
5405 248 -108 5 90 7 218 33 -17 -81 49 -223 76 -78 -47 38 -9 145 -227 1 22 -2 -82 109 -222
5428 -222 -18 -85 104 195 58 183 -145 -160 183 88 214 -138 202 1 -80 99 -94 82 -66 -135 -197 -335
5450 -335 -257 -75 25 -84 88 18 125 141 -358 197 64 -80 -147 -65 142 66 -105 146 -241 -72 -152 90
5472 90 -166 -93 -163 61 -141 -170 -133 1 143 -44 -265 -142 -393 13 -150 241 -27 -245 73 -100 222 178
5494 178 136 -78 -112 32 -69 12 252 49 31 -66 -129 78 190 108 -47 89 -56 -40 265 69 -73 68 90
5517 90 -158 208 -45 -114 56 131 -28 78 -193 -147 -102 -20 -95 20 -109 119 -262 -78 126 -2 -119 97
5539 97 -96 -50 112 -17 92 64 -63 -32 -238 153 -123 -80 94 90 -118 138 15 -208 225 -189 409 27
5561 27 -136 105 0 -439 -16 -23 76 134 65 -133 244 163 -13 -17 17 115 15 188 -129 -92 -74 -75 93 -148 -18
5586 -18 -2 -62 106 -182 -67 180 -188 -275 -165 -40 -248 99 57 -131 -11 -44 -110 27 3 21 184 290 89
5609 89 -80 -20 -71 -102 -128 56 46 12 -81 121 49 -96 125 130 60 173 203 158 57 114 214 -94 78 -149 195
5634 195 -35 -185 306 -354 207 193 -183 26 -63 303 -146 -7 15 127 70 -140 -52 188 251 -78 -81 312 -19
5657 -19 70 59 -321 44 -306 136 -60 -37 45 115 284 240 309 204 98 -92 -122 25 -60 -14 10 -14 159 62 319
5682 319 134 -51 -55 164 182 -131 -126 71 241 212 10 184 55 85 -124 -233 43 56 119 56 -73 -54 -157 67
5706 67 343 179 68 -82 -195 218 261 -131 3 -125 52 -64 -143 -140 -132 66 -245 -18 -85 -235 173 -162 7
5729 7 189 79 -18 -183 228 330 216 -180 -161 433 64 243 62 -91 147 -7 -28 -12 -218 -256 223 -102
5751 -102 -188 -77 69 -148 142 -53 -79 -98 172 37 114 -124 60 -15 12 136 -196 -266 -274 323 -172 -102 16
5774 16 151 -155 19 -89 -16 33 -104 41 -376 -21 84 -184 142 -152 264 -146 -255 -26 -51 -107 -36 64
5796 64 -143 121 -106 -44 24 -27 -82 -31 -221 310 25 168 -160 -104 167 -211 -30 62 22 -25 22 54 136 137 17
5821 17 -144 -266 211 -131 -270 17 -99 -39 -67 -157 -6 59 136 -195 -214 59 -235 134 -183 29 -193 16
5843 16 -21 -132 272 151 125 414 -12 -159 156 64 -123 -224 -17 -186 220 16 -249 79 -195 107 -148
5864 -148 -57 95 202 154 -98 -33 43 -39 390 18 235 72 -131 -232 138 -23 7 70 -179 -76 -241 73
5886 73 -81 36 -50 -165 44 122 -49 81 -215 81 40 31 227 133 148 347 -3 -277 -187 -155 106 -86 -88 118
5910 118 248 -219 20 5 -24 1 5 250 29 -61 -97 323 47 -251 301 14 152 -27 -16 13 62 298 -186
5933 -186 -93 268 -242 -249 -169 -144 -129 -101 29 -206 263 -66 -58 214 34 -177 -27 -244 -283 108 -118 166 296
5956 296 283 -138 -27 25 225 -104 -44 -56 -242 282 290 -7 -260 -38 -34 0 64 5 102 -48 22 55 -238 94 -74
5981 -74 249 178 -170 -250 306 -160 -37 -125 -142 -55 -77 171 277 -43 132 -26 -166 -113 169 -49 -32 -139 135
6004 135 -36 46 138 67 -198 73 343 225 -278 88 -149 57 -19 -88 -87 61 -5 -63 -71 -136 -64 -31 39 21 -107
6029 -107 -107 -338 -30 140 -149 52 60 -120 91 4 -249 41 -14 76 -147 -37 -148 -189 -67 125 190 -154 -10
6052 -10 93 20 91 420 -146 192 55 -155 181 -145 -110 -69 9 70 348 -95 179 50 106 153 69 -270 -32
6075 -32 138 158 46 -143 206 -73 -29 59 189 44 24 -249 -141 -265 354 20 -100 9 -11 -107 -138 -230 -2
6098 -2 -232 -88 -7 -121 -109 37 68 355 -48 -325 -144 24 184 127 -7 -145 85 -27 9 106 -66 174 -78
6121 -78 168 -149 49 -91 -49 -8 -76 -275 -189 57 -98 61 -205 -84 -65 -3 -20 -220 146 37 68 -182 241
6144 241 157 -138 122 109 -82 -279 -239 -280 -128 124 289 -93 42 80 87 277 202 -51 -3 103 18 -52 -119 91
6168 91 3 188 97 149 2 49 -55 153 -127 10 16 56 -122 120 -132 181 149 73 51 61 -238 -132 -50 -44 -216
6193 -216 -81 -292 78 -280 167 15 -43 94 226 -124 -486 -260 -95 317 26 105 392 -179 170 68 5
6214 5 -115 -85 112 56 2 -213 -155 -217 21 -60 373 22 -73 46 180 -130 153 116 -59 105 32 201 24 237
6238 237 -323 181 21 14 162 121 18 11 -41 252 -247 75 125 -189 -112 -35 162 239 -152 -23 -200 -103 -85 113
6262 113 39 39 -4 -60 -16 15 -23 46 -5 61 123 -52 3 109 -28 45 -35 285 26 103 113 290 86 117 154 -68
6288 -68 40 -10 18 -104 209 10 20 -270 18 -51 -210 72 184 -51 102 209 118 174 -47 -114 19 -7 121
6311 121 -58 -276 -6 193 54 -134 56 1 -68 142 -24 169 -34 -227 26 56 -152 155 45 -54 20 76
6333 76 -198 -122 197 190 112 -49 -134 -85 85 16 -76 -122 -65 157 -203 -17 46 4 -227 -63 89 -222 -85 -94 11
6358 11 12 -86 -164 -5 -103 -31 15 -9 175 47 -189 -181 17 8 132 -13 55 -103 98 -253 253 -144 77 97 -67
6383 -67 -45 -203 59 -103 -1 -2 -49 -41 234 171 12 -43 -57 -153 13 -105 -93 204 -80 -247 179 283 -33 245
6407 245 -129 -202 -139 58 -92 -102 -7 363 13 -83 -101 226 -68 114 212 -232 157 -29 -70 59 -193 206 -107
6430 -107 -319 221 -269 109 -105 43 2 -48 -50 87 -43 66 -103 95 -57 127 -240 -78 108 -159 -7
6451 -7 -33 178 246 -66 -204 140 -154 -190 13 -9 264 -167 -188 2 -109 21 82 168 -21 243 78 -259 -213
6474 -213 -205 79 286 231 63 174 -17 -41 278 -106 -75 237 2 90 -54 -215 207 99 193 61 -55 -133 -239
6497 -239 79 129 -44 223 -154 -3 -33 -305 65 -15 -4 203 -2 187 66 202 -177 67 -38 -111 -96 52
6519 52 -96 60 -298 72 -63 101 203 -81 -44 -155 -26 -59 -99 -45 -57 5 -32 87 -25 56 159 23 -24
6542 -24 173 85 14 -49 41 161 -167 -181 194 -43 -122 122 447 27 302 -73 7 -40 122 95 67 195 125 102
6566 102 -15 -192 32 58 8 -96 60 -77 -103 26 40 10 -114 -32 116 214 -273 76 49 -118 219 164 -25
6589 -25 114 125 -109 -78 31 -227 33 77 -117 100 5 114 13 338 27 -245 -53 124 246 -90 -182 22
6611 22 32 -111 206 -150 -35 33 39 30 -35 10 37 38 -111 -95 -52 -127 -20 -27 34 -385 212 -108 -291 -11 -180 187
6637 187 -94 227 -196 86 -67 51 136 85 75 -44 -98 88 50 238 18 -135 -115 -122 18 68 50 30 -13 -27
6661 -27 -89 117 -45 -147 19 -92 203 -135 174 46 258 42 109 6 -235 132 40 35 -70 24 298 -456
6683 -456 5 -347 -80 90 20 99 87 79 -22 -200 83 -233 -327 -40 -425 251 6 53 78 37 -185 -132 -249
6706 -249 91 13 -58 50 -157 -201 -6 7 -168 282 -180 90 39 147 169 0 -130 -153 39 1 -74 15 16 -88
6730 -88 137 -32 -216 -68 -240 -238 103 -106 -93 -137 -60 -78 -68 -229 -23 -29 10 324 66 -108 446 -116 8 -77
6754 -77 -74 -7 15 281 -169 142 66 77 -76 -61 331 -398 79 14 -4 45 -112 18 292 111 146 33 1 161
6778 161 -197 85 169 44 150 -65 9 102 124 -175 -420 14 67 188 183 -37 59 103 -161 -63 191 65 167
6801 167 -100 -146 405 64 1 -171 -27 92 -89 331 6 -65 112 -26 -198 9 -88 -303 -76 -102 -75 94
6823 94 -41 169 32 -131 215 -243 138 -36 -43 50 42 236 -216 230 1 72 -3 -10 -101 -52 84 35 -236 0
6847 0 156 130 -144 -56 17 -64 -219 -93 -81 23 176 -113 -205 -101 97 135 -49 -207 -275 80 159 39 308 -35
6871 -35 -49 -152 -170 -177 -192 254 8 -37 276 76 1 -106 -132 236 -226 54 -53 -261 138 23 153 -24 85
6894 85 -116 99 186 -79 -47 -141 328 -26 -134 -15 172 -152 45 154 64 -82 41 -144 15 -32 -70 90
6916 90 18 247 -121 -20 -232 -42 -84 -234 -75 -71 -69 224 20 2 -122 232 308 -20 -464 -216 208 -444 -89
6939 -89 -112 63 208 -86 229 181 5 311 -166 -147 -26 -8 163 118 -36 39 -72 125 77 -61 168 -130 181
6962 181 198 113 -106 67 -49 -72 60 118 -5 -146 93 -6 69 71 124 -54 -51 -127 -183 114 94 56 -31 -100 233 -85
6988 -85 -143 247 -156 -25 -38 -151 102 118 -64 -106 113 -17 -275 48 62 11 -59 99 -94 -154 -72 4 -43 -20
7012 -20 -5 -374 147 113 116 159 -108 97 198 -105 118 22 -309 132 148 106 106 54 129 11 -52 35 -53 -365 -6
7037 -6 -66 -78 152 187 227 87 114 192 102 55 73 -25 119 -155 -107 227 36 -175 -44 -142 -41 -307 -305 34 -261
7062 -261 189 -16 77 -9 187 147 57 -77 1 -157 -150 210 79 -144 -225 150 37 -290 47 -13 -65 110 -34
7085 -34 -28 19 -61 -81 170 22 315 177 -164 219 -97 213 -145 83 -291 278 -20 -150 116 125 129 174 253 -293
7109 -293 -192 7 67 -79 -172 18 110 -125 -96 38 -111 188 -180 164 -77 -94 -138 -107 115 298 105 -416
7131 -416 -35 -236 -134 -94 78 -240 115 25 176 211 115 245 52 72 -202 -142 2 -318 71 -85 70 20
7153 20 160 88 -57 -59 90 47 -46 249 -285 -205 -121 -219 -45 -156 -16 -249 77 -95 -76 -52 -296 -146 -81 -218
7177 -218 104 108 -83 -141 -133 80 195 177 -41 207 -312 99 89 125 223 -127 -85 -11 -82 -170 283 -129 -278 128
7201 128 -102 42 -252 -58 130 -100 -199 -91 -216 5 -48 19 118 -173 128 -124 92 107 18 -237 107 12
7223 12 -178 128 25 -5 18 -236 -85 -208 198 70 4 -60 -311 -77 190 -127 60 -261 -212 51 -46 96
7245 96 -130 191 99 -70 -99 151 -59 164 -33 -30 224 93 -189 208 84 168 36 153 280 -154 -23 -146
7267 -146 32 -182 -23 68 -24 3 -98 37 87 57 343 101 507 100 47 46 -79 348 11 166 268 211 -112
7290 -112 72 281 -22 115 100 129 -108 -291 -276 -166 89 -180 237 172 -118 271 270 -117 79 -17 175 6
7312 6 7 -188 -79 37 -116 55 -9 343 104 191 252 -30 96 83 109 92 119 -117 -107 173 -16 132 9 -172
7336 -172 176 -110 -96 160 -31 -139 -501 33 -76 -54 -6 -130 -127 -161 -99 -140 -144 51 90 -101 84 -106 -28 -102
7360 -102 178 -410 -50 -42 -30 134 -216 180 -152 -35 -2 -197 -4 -151 -102 -265 117 -15 67 -61 192 4
7382 4 -218 -47 19 211 82 -89 -146 -31 -215 75 -142 116 -74 98 -224 115 -165 -143 -56 -46 -264 80
7404 80 101 -130 -177 10 137 242 187 153 20 -123 -107 -98 -52 157 -77 -92 -244 -503 108 -360 146 49 -18 84
7428 84 -7 -66 44 88 154 96 233 22 78 1 -131 86 -53 164 151 -312 14 53 21 138 20 188 -148 150
7452 150 -145 227 -227 -204 78 109 -348 -390 132 232 -2 76 -9 -124 -276 51 96 83 96 132 -4 -20 49 79
7476 79 6 131 -195 309 9 123 -2 -194 347 -277 330 133 -43 136 -203 62 128 65 194 -239 125
7497 125 -31 249 104 169 -54 2 -61 -5 -43 1 215 301 -27 -26 -29 108 -2 -134 1 -124 -103 -54 65 64 -65
7522 -65 141 16 -90 239 -46 -142 -111 81 -159 291 306 -156 168 -273 -178 56 124 35 -113 15 121 174 367
7545 367 -179 16 -46 229 561 152 67 -238 -27 -146 17 217 62 -294 -110 -6 -39 207 57 -48 42
7566 42 -235 2 62 -163 5 10 -73 -105 233 197 -41 195 -14 80 -225 -125 -45 -306 -116 -352 -151 100 -266
7589 -266 -39 72 -15 -209 -86 -192 -264 405 -59 28 -226 -155 -123 -106 141 -45 125 72 -146 69 26 -21 198
7612 198 16 260 -102 -6 -96 153 -52 46 39 -174 156 306 -41 12 -71 247 -247 -122 27 -379 158 -15
7634 -15 -153 -155 20 -52 -218 227 58 212 64 133 164 142 340 -104 -178 244 73 71 204 286 202 -223 -34 54
7658 54 96 47 289 69 1 90 -121 -170 -135 -49 443 -78 -71 6 43 -51 142 -100 214 235 -309 -79 81 232 -40
7683 -40 14 271 -238 -293 280 1 -162 -60 11 50 -197 98 -61 -59 -207 388 176 -61 190 -188 27 -92
7705 -92 -97 -226 230 -57 -142 -167 -98 -199 178 -18 167 -182 -136 164 74 -25 69 -78 16 34 332 -39 42 -197
7729 -197 486 -27 -17 98 -159 -179 -167 -190 423 -296 317 69 17 -158 -151 -27 -311 231 -336 -33 70 -235
7751 -235 44 -112 162 3 -303 197 -250 98 -253 127 3 -52 257 -109 -78 -19 -251 -190 -26 -84 74 335
7773 335 -176 51 63 233 220 371 -215 309 -78 142 314 150 -34 -69 282 -142 -50 -17 -106 74 207 52
7795 52 -93 75 -69 -87 44 144 131 138 21 29 -36 286 -286 94 -119 -139 35 -262 -46 -294 106 -1 294
7818 294 103 -203 -52 188 -241 23 279 170 -243 229 94 38 266 -169 34 83 -204 241 -161 -53 52
7839 52 98 -110 -95 51 57 107 103 -144 36 154 130 136 142 276 301 127 -201 -99 -258 61 66 -225 93 -70 -120 -163
7865 -163 21 83 -39 118 -3 74 -212 121 35 -158 10 -95 -326 -90 -126 -35 -50 86 -10 -128 -61 12 -155
7888 -155 116 147 -325 91 26 -3 168 392 79 -10 -15 -34 -206 59 -253 59 -86 -119 -102 -70 219 -18 -42 228
7912 228 -5 -191 157 71 -14 -467 62 -281 92 35 -117 348 150 -255 -209 -50 65 -158 6 174 -17
7933 -17 -34 -118 293 -250 29 -48 -127 90 93 178 -129 177 85 99 -73 -18 226 -72 203 2 168 242 -48 160
7957 160 198 -45 180 -14 -3 -164 59 160 -139 143 115 299 161 186 114 136 78 39 -106 142 -71 -130 -156
7980 -156 175 -421 97 -77 -337 244 -91 385 -253 -50 -132 26 -44 -105 40 -27 -39 -69 -34 -206 57 -84
8002 -84 -34 -69 298 -238 110 -220 334 67 -134 118 -252 241 -192 83 290 53 254 -99 185 204 -126
8023 -126 292 142 93 -70 -162 -34 51 164 29 -189 101 48 180 -91 77 -262 -189 -16 -184 144 -188 -155
8045 -155 -103 -232 143 -294 92 -122 -209 143 6 92 82 300 21 153 121 -319 54 73 150 49 150 -42
8067 -42 -272 -71 -112 142 143 -133 158 -238 44 -67 266 93 -51 179 29 51 303 101 238 4 -46 23
8089 23 -248 -47 -192 61 -93 -21 36 -41 4 -76 -117 -212 208 48 -45 -53 -130 -298 -303 38 -47 -227 90 -15 -159
8114 -159 -103 -71 72 -276 -113 -82 -144 -102 -346 -5 27 -121 -152 -55 44 -202 142 -247 -28 251 -97 26 -17
8137 -17 -132 168 -209 107 -67 -142 -45 273 -6 68 30 -81 -350 -131 101 -237 -15 294 -98 144 -15 81
8159 81 -33 -325 145 -138 -94 -4 -54 100 -180 15 116 -19 173 30 -204 -326 124 -51 -206 296 -56
8180 -56 296 -15 -5 -135 -100 281 -39 -167 16 161 174
8191A74
$$ Imaginary data points
##PAGE= N=2
##DATA TABLE= (X++(I..I)), XYDATA
0 0 0 0 0 0 0 0 0 0 0 0 8 -8 8 -8 16 -16 24 -24 32 -40 48 -56 65 -80 92 -105 126 -145 168 -191 218 -248
32 -248 284 -320 361 -408 457 -513 574 -638 711 -791 877 -973 1075 -1186 1312 -1443 1594
49 1594 -1755 1933 -2128 2346 -2588 2861 -3165 3514 -3914 4377 -4923 5580 -6381 7392 -8707
64 -8707 10502 -13110 17265 -24975 44309 -205052 -336905 -215424 -360746 -290266 -240814 -268678
76 -268678 -320508 -121059 -176640 -285993 -175339 -125771 -192843 -193317 -102062 -199383 -262805 -92918
88 -92918 -151161 -241800 -205335 -138905 -213850 -207500 -79803 -197511 -227900 -94272 -80320 -151256
100 -151256 -129578 -34819 -141935 -101737 14713 -84362 -137932 -62467 -9075 -121321 -84019
111 -84019 -18108 -150240 -109449 -16370 -57862 -151613 -73082 -10413 -123345 -38782 8520 -86698
123 -86698 -81019 28844 31416 -86947 16419 39697 -50099 28268 75986 5403 -48633 86515
135 86515 77766 -20910 76335 69758 6575 42592 133574 56899 -21555 110650 77070 19015
147 19015 78652 86189 5050 6262 132244 37520 -18618 74890 49872 8792 48480 103701
159 103701 -11124 -2776 121514 41768 7763 59155 63653 -11509 38705 110182 -29836 -17829
171 -17829 64146 22329 -24916 22373 42867 -69279 13173 79342 -25443 -24566 42899 43212
183 43212 -25434 62904 71862 -42382 38720 92503 32553 -11089 63967 49008 -33667 71669
195 71669 56373 -36818 -5935 61157 18333 -45158 51982 6440 -52570 40358 46195 -27761
207 -27761 -37839 60651 4273 -34543 59512 4518 -41517 15523 67714 -18561 -35720 62782
219 62782 -10768 -20723 49010 23414 -46097 -6317 75482 -28477 -22944 45864 -15941 -28746
231 -28746 31457 44264 -61268 -8950 63954 -24815 -4924 40847 9910 -37567 45039 71396
243 71396 -44729 14142 55282 -1029 -4801 48093 20160 -65002 34775 42192 -47618 -14712
255 -14712 16945 -18950 -48896 42290 2763 -74871 19785 30875 -19101 -15088 43762 -5909
267 -5909 -37968 69955 17988 -41976 8162 36964 -17312 -28913 47257 -35915 -55275 33852
279 33852 5911 -48643 -25169 33922 -39277 -22753 54514 -25612 -38723 25284 38619 -36830
291 -36830 -9828 43451 -48980 -18238 34438 -19783 -65751 -10547 21038 -70787 -18351 13390
303 13390 -58747 -34939 24735 8321 -63733 13424 33415 -40738 15803 33803 -17302 -36674
315 -36674 41043 20317 -61654 13532 5614 -45616 -16092 23833 -26761 -66959 34040 4605
327 4605 -43622 15324 18245 -21861 -11799 64400 -4885 -40596 43348 10013 -26409 -1024
339 -1024 21909 -50698 -45274 36824 -41477 -62545 -9544 -14804 -56860 -23753 25501 -63570 -35486
352 -35486 35258 -11294 -32546 7014 23867 -46428 5984 44352 -45227 -28189 17075 -1835
364 -1835 -51225 -292 8819 -71227 -5332 22185 -32755 -40501 15528 11642 -46075 30366 21533
377 21533 -40825 4528 38764 633 -38900 31579 2233 -46923 22014 7325 -42835 -33639
389 -33639 27429 -17281 -50959 25447 -14316 -40295 10063 28333 -27185 -28314 49017 -9448
401 -9448 -20560 36208 6252 -27197 5556 50916 -26101 -17349 44699 -8370 -9897 31297 30809
414 30809 -28215 14978 67180 -9297 12321 50438 21530 30 47773 58224 -23425 28396
426 28396 58149 2810 8850 39991 23432 -25982 42463 43036 -28070 15225 35902 6605 -9470
439 -9470 45183 19566 -33424 42235 34858 -11162 3034 37085 4828 -20427 52602 9524
451 9524 -29695 24265 31375 -6805 -10404 44970 -8307 -19413 49151 11728 -19627 8306 41184
464 41184 -12196 -7302 48268 -14977 -15457 31585 22237 -24243 -1371 40431 -26851 -3190 35197
477 35197 -11869 -25409 13590 26585 -39648 -2923 22478 -37778 -14401 14186 -9540 -51344
489 -51344 694 11878 -51061 -5781 4686 -31481 -29042 17458 2023 -50207 14722 11526
501 11526 -28315 3347 20675 -9968 -29302 37711 8666 -32673 20065 13343 -14162 -4236
513 -4236 37732 -7687 -26954 43054 9899 -12525 17831 29910 -8422 -646 55915 -3482
525 -3482 -10783 36755 19784 -6196 12018 40434 -20377 -247 47035 -3474 -10080 19680 25423
538 25423 -18473 14490 40531 -23973 2697 33941 9979 -14633 18950 27585 -27566 20061
550 20061 32387 -13945 -3934 28672 20369 -19121 32797 27650 -17014 26717 38810 10420
562 10420 -5048 43642 24908 -13087 40022 21651 -11431 5497 34122 -1048 -26053 29840
574 29840 -4334 -24997 14066 9973 -22371 -17379 33217 -12174 -20674 26496 -2230 -16553 7090
587 7090 26295 -24550 -17136 28073 -21871 -22220 3818 -8417 -41410 -16070 12765 -47068 -25847
600 -25847 4006 -24073 -27638 898 7968 -39683 3285 25410 -19458 -1774 18460 7040
612 7040 -18941 23239 20804 -30964 9565 17332 -10745 -14845 15018 -194 -34614 21200 8701
625 8701 -24744 167 18301 -1077 -15674 34287 4803 -18755 28698 20279 -4576 -490 33715
638 33715 -1649 -10944 37868 1938 -13231 13220 25319 -8132 -4635 36501 -8729 -3099 32364
651 32364 14347 -6734 12423 40345 -6573 11437 40654 2051 5645 30584 32194 -7458
663 -7458 20197 41694 -4381 19554 36031 15602 -548 32381 38013 -9131 28045 33720 3002
676 3002 13711 34345 21026 -12294 33953 27035 -8519 21263 24602 4246 -3460 37260 14239
689 14239 -15104 30815 18266 -1383 10849 30740 2236 -8910 39746 7520 -8775 18844
701 18844 17358 -5140 -1129 32953 -10612 -11798 25981 2262 -10143 4020 19954 -17029 -2974
714 -2974 29641 -12860 -8056 14631 10552 -13745 5588 24877 -21209 3412 23018 -2896 -9725
727 -9725 11492 17631 -20729 12833 19693 -17291 96 16548 5170 -19051 14568 11572 -23699
740 -23699 11713 12072 -10051 -11239 17463 4998 -22605 20280 5747 -15038 6858 18424 -2152
753 -2152 -14777 26897 1794 -13445 18804 7231 -10205 -4454 23751 -9554 -17260 20102 -7207
766 -7207 -13817 3735 9890 -18106 -11001 23515 -14310 -8938 14320 2014 -10137 5965 24728
779 24728 -15773 2251 25310 -3062 -630 14092 15106 -15740 9969 22980 -17087 1584
791 1584 12892 -350 -13283 11201 11271 -24808 10076 13505 -9904 -3694 13629 5983 -16439
804 -16439 22331 11498 -14400 11795 16185 1559 -7687 22815 2942 -16278 20127 4602
816 4602 -11838 -4251 13213 -8857 -18182 17724 -10495 -17382 5319 5168 -12854 -9518 20362
829 20362 -10846 -6439 21379 1546 -4791 8168 23515 -7680 2838 25560 -6656 634 14233
842 14233 8566 -14347 2499 17623 -19570 -595 9520 -8649 -11583 6292 10361 -21601 7583
855 7583 14204 -10677 4528 14491 7197 -10773 20571 15726 -12487 14216 11907 -3057 -5558
868 -5558 15214 86 -22551 11972 -2164 -17615 -5144 2069 -12500 -20290 13445 -9173 -18813
881 -18813 7522 1341 -7884 -4383 18011 -7754 -8240 21498 -1368 -5464 4759 11262 -10781
894 -10781 -5820 16685 -16777 -10782 4796 -4855 -17106 -7424 7255 -24375 -6533 8380 -13717
907 -13717 -9776 3250 7605 -15544 6969 15371 -12888 6199 13389 4074 -8417 11372 11379 -16672
921 -16672 9596 5608 -11707 -7426 5503 -2552 -22938 7298 -2948 -19248 1272 2616 -7268
934 -7268 -13082 14981 -44 -12191 16116 4404 -3287 3328 17946 -792 -7271 21139 -1595
947 -1595 -5339 7978 5471 -8440 -6308 15995 -12154 -8649 9748 -4185 -7249 1460 13319
960 13319 -11573 614 19521 -4472 2779 12204 11489 -4249 10502 20636 -9230 7737 13974
973 13974 884 -3577 7595 9078 -16919 7054 6860 -13085 -3042 3571 -890 -15868 8239
986 8239 2284 -17309 5933 3839 -4732 -7828 9839 384 -14247 13091 -422 -9997 -696 5744
1000 5744 -6255 -14558 10259 -9896 -15038 2753 -4763 -12937 -11890 6542 -14018 -13810 7550
1013 7550 -10321 -10002 -1642 5319 -11872 -6593 12488 -11776 -4367 5744 -1286 -10463 -2025 9508
1027 9508 -17063 -3658 4429 -12228 -9158 -1736 334 -20541 -2228 3163 -18308 -4045 -1091
1040 -1091 -6057 -14599 2687 1591 -19386 3051 71 -9497 -6671 2465 -3042 -17942 6903 -2632
1054 -2632 -14127 -971 -370 -6653 -12780 7915 -6572 -14969 6076 -3533 -7874 -5343 6682 -7130
1068 -7130 -10373 11928 -6619 -6926 2735 3804 -5965 -4886 13056 -9105 -3311 9462 -1295 -3938
1082 -3938 428 10637 -10118 237 11532 -7967 -1577 4025 4183 -9595 1586 9222 -12548
1095 -12548 2345 5377 -2741 -5541 4480 7292 -11879 7622 6407 -6341 1878 6413 3667
1108 3667 -9069 9600 4407 -9261 7091 3085 -1994 -5390 9055 1366 -10555 10463 451
1121 451 -3592 2260 7897 -82 -5679 15325 166 -2440 9438 4840 82 0 14362 -3071
1135 -3071 -2409 12812 -752 -600 3546 9200 -4253 754 14724 -4619 2074 8463 5732 -901
1149 -901 5250 13812 -6338 5673 11169 -359 1116 5437 8155 -7472 6813 8571 -7235 3557
1163 3557 4658 2772 -5429 7288 6341 -8508 8839 5014 -1050 -414 7310 4201 -7749 11022
1177 11022 1552 -5111 3992 4077 115 -6100 9952 -994 -6051 8846 582 -1441 -703 9305
1191 9305 -1045 -3526 12419 -1697 -358 4931 5824 -2277 -1460 11540 -5517 -933 6819 -1100
1205 -1100 -2665 61 8044 -8040 152 7617 -6147 -410 2062 3096 -7592 1008 6667 -9664
1219 -9664 1096 1716 -2777 -5763 671 2483 -12282 2667 1138 -6805 -2059 757 237 -9311 5721
1234 5721 1131 -8447 3428 674 -1196 -5136 5438 -839 -8671 7023 -1891 -3776 -977 3496
1248 3496 -1722 -6123 9044 -3416 -3262 4880 2107 -131 -1541 9905 -2563 -819 9494 -658
1262 -658 301 1761 6562 -3870 -570 8679 -5835 184 2699 1350 -4399 -395 6791 -7958 2039
1277 2039 4424 -2099 -240 2640 6252 -5769 5495 6729 -3410 5008 4193 4197 -2699 6589 6353
1292 6353 -5057 7313 2787 -118 303 5450 3143 -5651 8299 1161 -2143 4026 4360 2305 -2154
1307 -2154 10388 1973 -718 9235 3783 3416 2471 9977 1574 167 10281 -436 1160 2793 3798
1322 3798 -1941 -2088 7314 -5694 -1260 3052 -1499 -2017 -833 5984 -5323 1504 6410 -2186 2080
1337 2080 3215 5593 -2514 3488 6798 -5107 3289 2151 21 -3695 508 1806 -9122 1530
1351 1530 -1096 -5861 -2567 -822 -429 -7755 3191 -146 -5134 3068 597 114 -3239 5044 -3
1366 -3 -5014 5567 -1985 -2700 -2069 871 -3664 -7520 3076 -6421 -5834 -1367 -3331 -4856 -6211 2881
1382 2881 -6823 -4611 1969 -4578 -2721 -2315 2410 -5498 -2463 3834 -6086 -1183 -690 -868 -5101 -2537
1398 -2537 2191 -9106 -1964 -1536 -5547 -5072 -3839 -1083 -10120 -1645 -1795 -8196 -2783 -3432 -2447 -7230
1414 -7230 236 -769 -7526 1790 -1400 -1941 -2767 1171 -216 -6542 3438 -2433 -4081 -1224 -1323 -2458
1430 -2458 -6768 1864 -5101 -6287 114 -4056 -3459 -4892 1293 -3981 -4587 3716 -3660 -818 140 1740
1446 1740 -1747 -1770 4550 -4590 -970 438 -2341 -3446 -3891 820 -7991 -3856 -1501 -7480 -3943 -4229
1462 -4229 -1867 -7608 -2733 -76 -7310 -465 -1891 -1842 -4059 -194 1301 -6511 1375 -1445 -3897
1477 -3897 -2572 -2023 -1583 -7944 69 -3357 -6957 -1583 -4189 -3124 -6089 -58 -2988 -6150 1404
1492 1404 -3661 -2245 -2427 439 -1962 -4702 3087 -3864 -2694 -483 -1914 -2646 -4622 1823 -5762
1507 -5762 -3767 170 -4785 -2915 -4019 -36 -5491 -3491 581 -5919 -1587 -2223 -1134 -3734 -2155
1522 -2155 1658 -5371 344 21 -1917 -1302 -733 1846 -4246 1579 1346 -2913 1018 -306 1396 -3368
1538 -3368 2235 1425 -3067 3111 75 529 -653 2403 2014 -2181 4891 416 729 2529 2303 2128
1554 2128 -625 5596 888 516 4408 1158 2118 490 4574 394 18 4798 -407 2151 1390 3123
1570 3123 577 122 5003 -1442 1730 2304 1005 758 425 4239 -2162 1738 2809 -359 2111 1024
1586 1024 3102 -1099 2539 3730 -1432 3424 1611 2235 -123 1780 3193 -2503 3013 553 -39
1601 -39 206 257 1582 -2931 2306 -197 -1418 1625 79 1225 -1438 2785 210 -1526 3207 -503
1617 -503 635 -461 1484 -225 -2688 2298 -2649 -1465 -808 -1669 -2001 -3998 771 -4392 -2323 -262
1633 -262 -3254 -1410 -2868 471 -3515 -2178 913 -3716 -431 -1525 -496 -2572 -1961 564 -4813
1648 -4813 -746 -1895 -2657 -2617 -2777 -375 -5350 -1013 -1521 -3705 -1142 -2772 -730 -3657 -235 -696
1664 -696 -3756 700 -1821 -830 -2113 16 -320 -3627 1546 -2099 -1584 -1018 -1164 -858 -3623 1098 -2779
1681 -2779 -3027 -600 -2879 -1374 -3563 -50 -2799 -3006 258 -3003 -883 -1766 164 -1786 -1857 1677
1697 1677 -3037 -66 -324 -733 -560 -1791 1204 -3004 -638 -512 -2682 -1008 -2338 -77 -3601 -1129
1713 -1129 -245 -3461 208 -1448 143 -1572 -4 1054 -2367 1500 -310 -422 145 -90 790 -3013
1729 -3013 1021 -1426 -2509 -554 -2656 -1339 -4201 -1036 -2862 -4064 -652 -3415 -1723 -3317 -1279
1744 -1279 -1909 -3685 149 -3570 -1775 -1833 -2127 -1722 -3664 -426 -3908 -2800 -1914 -3907 -2575 -4484
1760 -4484 -1904 -4954 -3730 -2286 -4724 -2151 -3894 -2546 -3829 -2970 -861 -4495 -1089 -2313 -2192
1775 -2192 -1904 -2492 -292 -3622 -457 -1358 -2713 -742 -2563 -837 -3181 -843 -1497 -3373 -130 -2351
1791 -2351 -1130 -2096 -685 -614 -2550 1172 -1478 -408 -304 -292 534 -1552 2114 -637 29 1229 -191
1808 -191 1286 -955 1952 -92 -27 1994 -702 1287 -37 1629 313 328 2725 -238 2346 1693
1824 1693 2033 2148 1368 3989 884 2975 2971 1942 3153 1619 3782 1424 2931 3371 1016 3535 1762
1841 1762 2858 1751 2668 3148 686 3561 1666 2168 2271 1823 3186 402 3425 1504 1082 2537
1857 2537 778 2426 -119 2157 1377 27 1909 -29 1310 -365 845 296 -1078 1757 -1055
1872 -1055 -74 -102 -191 -160 -1610 1163 -1398 -485 -152 -1299 -92 -1675 502 -1663 -711 153 -2423 -197
1890 -197 -1759 -331 -1429 -1188 51 -2775 -72 -1752 -1348 -1470 -1760 -78 -3093 -731 -1302 -1789 -677
1907 -677 -2006 -304 -2532 -862 -1127 -2556 -309 -1836 -602 -1909 -1202 -859 -2604 71 -2005 -1026
1923 -1026 -1449 -1274 -572 -2374 43 -2041 -1344 -476 -1635 75 -1984 -47 -939 -1072 343 -1634 69
1940 69 -1621 -90 -523 -1135 1082 -1534 203 -221 -4 516 -584 1461 -843 940 597 -226 840
1957 840 -344 1546 -660 608 870 -609 1215 -256 1128 -174 71 1105 -1073 1235 -370 265
1973 265 264 -195 768 -1085 947 -196 37 405 -898 867 -1187 501 -491 -1091 736 -1011 147
1990 147 -771 181 -135 -1281 943 -1238 216 -475 -84 72 -1319 1047 -1212 -218 122 -611 618
2007 618 -1229 1068 -727 -248 652 -972 985 -644 663 -108 -348 1033 -802 809 -325 295
2023 295 241 -468 1166 -975 674 -153 -231 604 -509 768 -518 661 333 -502 907 -395 1157
2040 1157 -138 841 810 -783 1056 -570 908 37 294 1155 -938 1413 -210 402 682 97 1360
2057 1360 -353 1416 490 526 1716 157 1958 461 1398 1265 601 2480 727 2130 1219 1573 1978
2074 1978 932 2482 593 1914 1625 818 1773 528 2116 975 1557 1880 825 2183 1035 2235
2090 2235 1730 1456 2543 944 2955 1286 2260 1964 1423 2651 870 2453 1371 1683 2092 977 2396
2107 2396 930 2050 1461 1296 2540 1168 2211 1691 2281 2566 1653 3405 1774 2971 2084 2324 2881
2124 2881 1788 3463 1779 2589 2589 1661 3004 1369 2818 1568 1920 2369 1193 2653 1068 2372 1858
2141 1858 1581 2731 1104 2675 1507 1902 1771 1174 2687 901 2233 1259 858 1603 167 1346 17
2158 17 773 304 -524 927 -823 669 -493 117 304 -737 1008 -666 391 -135 168 429 -417 790
2176 790 -304 -13 330 -1053 444 -1110 124 -1095 -1058 -22 -1296 -229 -1330 -773 -1161 -1228 -89
2193 -89 -1338 -126 -1077 -752 -318 -1312 218 -1199 153 -500 -891 89 -1371 39 -1202 -599 -468 -1632
2211 -1632 -382 -1725 -529 -1273 -860 -386 -1857 -117 -1511 -471 -812 -836 222 -1003 357 -231 10
2228 10 424 -331 925 -446 482 273 -217 788 -485 710 -436 349 567 -488 884 -205 622
2245 622 209 579 1131 -111 1601 126 1331 930 649 1550 268 1557 813 1033 1248 161 1446
2262 1446 467 1220 392 351 965 -392 1379 -133 574 751 151 1157 -167 1202 166 446 1381 -127
2280 -127 1591 540 899 804 571 1019 177 1483 240 594 826 -315 1392 -13 929 478 57 1100
2298 1100 115 975 366 870 1092 354 1640 309 1346 671 875 1475 447 1723 671 1276 1021 704
2316 704 1350 228 1358 547 732 1304 376 1341 140 1079 713 600 1380 112 1552 703 1048 1069 450
2335 450 1579 301 1505 636 813 1520 519 1453 314 1069 824 476 1251 161 1285 162 726
2352 726 1053 413 1248 373 1156 757 595 1103 516 1345 450 740 597 386 1082 263 1258 278 392 639
2372 639 176 852 -116 186 169 51 742 -267 451 -239 -24 125 -651 451 -625 206 -259 -575 233
2391 233 -809 212 -906 -514 -179 -759 -76 -1111 -218 -778 -505 -507 -1091 -271 -1083 -395 -834 -846 -376 -1205
2411 -1205 -418 -830 -293 -492 -1030 6 -1089 -519 -454 -504 -389 -1122 -341 -921 -415 -294 -789 59 -945
2430 -945 -164 -841 -568 -103 -960 -31 -917 -329 -240 -739 161 -831 318 -619 -332 -35 -686 227 -1045 8
2450 8 -307 -268 117 -742 152 -482 -174 120 -433 620 -330 250 -152 -133 54 -418 376 -309 130 89 -230
2471 -230 580 -476 574 14 271 457 -306 910 -251 457 199 311 622 -122 600 40 232 127 -36
2490 -36 526 -339 229 -23 122 472 -417 802 -177 179 195 -273 360 -335 792 96 166 214 -444 374 -215
2511 -215 244 -27 -407 494 -754 63 -258 258 421 -425 454 -385 315 -364 68 106 -462 532 -200 545
2531 545 175 41 734 -243 748 142 289 520 -301 627 -42 732 438 76 296 -280 734 41 417 536
2551 536 -52 461 155 610 -3 419 682 -139 770 24 645 388 15 720 9 651 230 299 447 13
2571 13 478 -2 542 188 423 373 -358 410 -17 254 164 -55 321 -66 676 -208 201 629 -62 369 92
2592 92 326 288 -122 496 -180 564 190 282 308 63 552 -273 444 303 -263 519 -315 657 -83 242 264 69
2614 69 765 -173 703 131 69 203 -417 585 -65 182 183 182 569 -179 338 -147 140 298 -236 506 -2 309
2636 309 196 136 576 -279 431 -111 401 368 -36 767 -91 570 -27 192 453 -128 796 77 -40 89 39
2657 39 536 -108 294 -118 -38 445 -107 431 -347 371 119 -24 29 -469 171 -229 -297 -278 -451 33 -383 92
2679 92 -147 -510 -98 -828 256 -629 -269 -455 -411 -71 -647 -93 -642 -576 -437 -761 -121 -922 -594 -463 -534
2700 -534 -148 -958 -323 -769 -562 -468 -787 -179 -838 -286 -680 -692 -392 -855 -49 -726 -302 -523 -416 -196 -573
2721 -573 -293 -419 -686 -376 -686 -43 -362 -602 -270 -481 -160 -790 -123 -575 -289 -191 -633 -59 -503 95
2741 95 -641 -369 -275 -382 -169 -456 18 -64 -366 -201 -535 202 -203 -212 -91 -321 202 -183 98 218 -148 -13
2763 -13 -140 255 -25 475 35 -165 289 144 317 25 123 292 -57 557 139 350 116 -53 490 -94 493
2784 493 354 318 502 177 630 16 484 377 479 442 -235 436 -27 307 425 -35 473 -103 321 16 -129
2805 -129 301 -102 386 -24 153 218 111 204 -244 200 125 204 189 -264 396 -235 496 206 -121 364 -114 235
2827 235 -247 284 16 7 345 -189 359 -55 -144 183 21 432 18 163 -16 170 251 -275 383 84 125 227
2849 227 99 142 -27 -9 227 25 97 -45 152 -86 0 304 -282 314 -181 300 230 250 283 -36 102 43 64
2872 64 -87 20 266 -311 250 76 170 131 43 513 24 209 -134 -221 491 -178 163 -6 357 107 -100 218
2894 218 -140 446 211 256 356 86 669 53 297 509 -202 407 -182 205 27 -123 324 -80 223 31
2914 31 -59 -174 -120 -182 -562 105 -21 -79 75 -110 325 -124 -134 -206 298 -64 -196 74 -70 246 -34 -96 -27
2937 -27 -136 69 -156 -97 -183 -649 11 -301 109 -15 -23 344 -163 73 -144 -58 196 -189 227 -185 126 153
2959 153 -371 -61 -152 59 61 -39 83 -185 239 -26 312 -98 -123 47 -401 296 -350 -53 -202 -115 78 -515
2981 -515 284 -214 -132 -7 -6 161 -23 123 -77 -195 225 -402 247 -84 180 41 -115 -84 -295 184 -221
3002 -221 -174 107 -368 275 -164 -270 -84 21 32 62 121 31 -44 122 -117 386 -319 277 -117 -6 48 -318
3024 -318 275 -104 110 17 47 17 -165 189 -152 109 325 -248 160 234 194 -113 -17 110 -111 135 -100 242
3046 242 -33 -197 286 -60 229 -251 79 112 -120 74 -45 217 -131 -181 -62 -154 91 59 51 10 19 353 -162
3069 -162 194 79 61 575 52 362 60 89 66 -236 317 -63 -101 -123 -69 280 -182 135 -129 82 -60 13
3091 13 -42 -195 293 -57 -1 100 -295 26 -22 4 -8 -365 351 91 214 -204 -173 208 -31 65 -234 93 153
3114 153 -32 142 -131 45 -66 58 150 40 344 -155 122 -99 13 270 -330 83 105 2 169 136 50
3135 50 105 341 236 223 -26 38 205 134 249 71 -166 232 17 207 -20 -9 -96 -170 222 -187 148 155 -3
3158 -3 453 120 228 -140 -136 118 -44 275 -20 61 -49 143 149 -401 208 -350 -68 -60 -47 383 -207 389 54
3181 54 -2 154 87 77 -20 17 97 -429 20 -295 91 -387 145 -159 -190 285 -95 126 -71 105 71 183 56
3204 56 175 308 -51 -21 194 -17 -73 -32 -74 247 -464 389 89 125 -223 18 136 -183 -89 30 203 -149
3226 -149 -237 381 -176 8 -153 60 453 183 273 203 -254 55 -171 -51 -38 111 -85 -39 225 36 -46 -192
3248 -192 72 -142 -116 114 -148 381 -21 -81 170 -60 145 -172 196 1 76 -106 -99 -45 -154 -132 -31 -47 -162
3271 -162 203 40 -249 -14 -87 -447 -212 30 -220 -82 -96 62 -300 -59 69 26 -135 -91 90 -85 73
3292 73 9 -495 -24 -81 163 38 -221 -84 -128 -289 -249 94 -322 -229 -172 -277 257 -172 -78 161 33 280 -102
3315 -102 184 -87 -155 55 -221 114 -215 -188 105 -232 134 -293 73 -243 178 311 -144 3 -168 208 -136
3336 -136 87 -78 -80 60 -316 -330 39 -275 -5 96 46 -164 134 83 -188 288 -160 225 -70 64 151 -132
3358 -132 -42 -126 86 97 -340 66 2 174 -31 -412 39 -203 -79 -160 34 -88 -23 -132 -170 250 -73 -34 329
3381 329 -158 350 70 106 130 -124 -199 -214 3 -39 -71 361 -203 242 -112 165 -70 -397 94 -277 36 -104
3403 -104 -110 -285 -152 -103 -87 -259 -96 10 63 -3 -160 -352 -281 5 -179 93 -266 -239 168 -186 15 -52 55
3426 55 -335 210 -7 157 281 146 6 -194 -108 20 -1 -131 -158 -69 -147 214 -20 -140 474 60 184 93
3448 93 -224 -127 -220 183 -229 -68 114 -325 40 -260 77 78 120 -21 -106 -161 -178 176 8 -54 137 -373 45
3471 45 18 40 165 76 244 -144 119 289 98 194 -246 117 252 -31 221 -79 470 -69 89 55 -310 247
3493 247 -143 146 21 -21 123 -49 210 109 17 -59 -121 305 -100 61 -55 70 276 136 -26 76 288
3514 288 -71 20 148 92 307 198 149 28 -98 268 -269 -74 31 -9 30 -57 -4 -193 510 -133 168 310
3536 310 0 -160 -171 131 204 -47 252 154 136 192 177 73 2 -37 -84 243 108 -25 57 -61 62 47 90 -93
3560 -93 144 206 39 226 51 -15 89 -156 220 -57 -10 -110 -194 242 -116 76 -242 -87 163 -130 19 299
3582 299 -4 53 -15 -24 -52 -73 -186 323 55 -23 176 -112 14 97 70 118 23 407 -165 199 97 250 142 14
3606 14 326 8 30 52 -159 -85 -178 -36 434 -70 188 -52 -181 -176 220 15 191 321 -129 243 -272 17
3628 17 401 41 205 149 -83 28 -140 207 -15 227 109 -73 157 -47 274 -31 -219 -135 32 97 -201
3649 -201 32 129 90 26 -80 -45 -99 259 -34 368 107 -109 403 -29 -19 -204 -83 199 -1 125 -40 84
3671 84 -253 -212 24 -179 213 73 -10 136 -223 132 -81 48 25 -47 139 -312 -130 79 -325 317 -53 82
3693 82 -368 398 -6 -82 8 -266 -212 -195 57 -67 -408 30 -370 -213 26 -429 6 -371 10 -150 -269 -45
3715 -45 -142 -223 115 -108 -130 -203 249 -341 -83 -159 -146 -112 24 250 -379 152 -321 -223 -189 -230 -13 -279 -119 -141
3739 -141 -480 -164 -203 -26 -303 -26 -41 -456 154 -493 -108 -77 -165 -19 -296 72 -189 -49 -156 -172 -82 -308
3761 -308 -56 -305 -227 -52 -82 -28 -188 23 -156 -161 -20 -320 84 -260 5 -42 -136 240 -432 -99 -24 -31 63 -129
3785 -129 130 -383 102 85 -198 -180 -281 -16 -47 -66 -59 -117 78 -213 -76 -450 -30 -42 -304 367 89 235 -142
3808 -142 -96 235 -267 -58 -222 -114 -112 -312 -162 -91 -61 53 2 -40 -101 -121 38 50 -168 -145 -157 13 -241 -308
3832 -308 -142 125 -148 33 -154 -4 -10 -65 170 112 256 111 8 368 -115 454 208 56 280 -102 244
3853 244 47 -18 -40 183 39 -72 293 207 254 11 -36 -99 -184 298 -389 109 -36 17 62 -34 285 14 121
3876 121 153 -109 299 82 -46 88 -31 77 97 153 33 366 257 261 256 6 90 -83 223 262 -65 122 25
3899 25 139 229 54 135 -84 270 74 -38 287 -91 522 -175 17 271 201 157 -175 189 215 99 -260 -119
3921 -119 110 -301 36 93 329 230 -125 -131 91 65 -13 10 20 35 133 134 -59 260 -238 180 -155 72 -15 192
3945 192 -60 -227 255 -196 111 156 50 248 -87 151 100 -225 263 -2 229 90 -139 -161 -184 20 -242
3966 -242 211 -101 34 -145 72 223 -240 264 -123 -166 44 -227 182 -74 210 -103 -193 -5 -270 98 -113
3987 -113 -37 233 -19 189 98 -264 115 -104 -5 -99 -177 120 14 -1 -213 16 14 198 -51 140 238 5 167
4010 167 -85 -126 -335 248 163 149 303 5 198 276 43 267 -262 231 -69 1 310 -65 -28 -42 27 -105 -193
4033 -193 489 -218 145 136 138 116 64 146 -28 151 -268 197 156 -108 322 115 206 -171 -279 190 99 -288 220
4056 220 -182 108 -310 291 51 11 104 7 243 -268 233 -215 -29 81 -165 211 120 -4 -203 -114 -96 -45
4078 -45 456 -26 158 110 -253 220 -57 270 -75 -201 86 6 30 217 217 -21 -30 265 -242 84 353 -63 22
4101 22 -130 244 -262 30 22 306 388 -271 130 -69 63 282 -42 -59 -8 313 -13 -130 178 29 274 -41
4123 -41 277 360 255 112 49 293 -36 -35 118 175 325 -87 460 232 366 90 -14 90 -23 52 488 47
4145 47 298 -27 298 133 -6 488 207 353 247 373 161 -164 179 -110 166 -95 14 89 180 194 65
4166 65 -89 24 -203 231 283 114 -2 69 -161 24 184 -269 83 -56 -168 185 113 266 13 199 77
4187 77 3 106 -157 -15 94 -128 -36 -170 253 36 159 305 -208 49 -414 -11 5 -74 158 -363 -124 -12
4209 -12 168 -143 -388 46 -143 -16 69 -224 36 -159 44 -23 -97 -35 -90 95 -248 -15 -434 2 -74 -234
4231 -234 -197 -27 100 -83 -132 0 89 90 155 -54 173 197 350 -106 55 -158 38 21 -39 82 12 82 283 86
4255 86 148 5 289 133 340 219 75 44 -114 66 110 123 63 -138 -2 -19 -47 -272 94 348 127 226 -171
4278 -171 97 59 231 269 62 113 276 -6 213 -362 123 291 -84 276 173 578 -80 85 0 98 -127 -146
4300 -146 62 -33 121 108 320 195 -297 -35 -146 94 72 3 172 -135 295 248 237 -68 97 124 157 162 -217
4323 -217 -66 -153 -4 19 -6 84 -75 59 150 -135 230 -350 -270 335 -137 158 -103 64 2 -27 225 -243 254
4346 254 -386 27 46 -98 -245 -73 86 247 -84 -110 295 153 -35 202 162 -91 -701 -197 147 -119 177
4367 177 -86 -175 -54 -12 252 -193 206 147 -167 141 -376 -73 278 84 -156 -318 189 146 44 -25 194 196
4389 196 -27 69 7 -211 -123 -81 226 -34 59 41 123 332 -210 -38 -170 77 134 -131 236 -68 -21 33 10 -3
4413 -3 397 176 -160 44 127 -117 -133 -7 -43 -161 44 64 271 202 142 -137 -103 -102 205 321 350 -56 -136 307
4437 307 -21 256 0 63 115 -86 304 35 93 -15 -78 21 -118 285 -80 176 -1 35 122 -109 75 92 74
4460 74 117 9 -74 140 94 229 69 -79 -123 8 -201 -102 -24 137 131 -94 305 -125 -166 -51 41 82 -214 181
4484 181 -108 -103 216 -136 -153 -84 181 -117 -465 242 68 160 -202 -23 167 -385 325 -113 -13 -108 -480 27
4506 27 -42 -199 -53 -133 -198 -301 -141 -372 98 -95 -164 122 -7 -284 -303 -141 -156 20 -41 -377 87 -52 -217
4529 -217 104 155 157 18 111 196 -127 248 -144 112 5 125 22 -117 156 166 72 -47 259 162 -1 278 185
4552 185 143 -21 -42 246 -42 324 -201 -45 179 -277 390 118 -18 52 -128 -208 -56 -3 175 314 16 -119
4574 -119 29 -78 320 -55 -73 190 133 447 -211 13 201 -79 -214 -35 271 -258 276 327 -48 -38 -153
4595 -153 88 -115 63 131 -345 154 77 92 371 -310 69 -75 -66 -128 -44 152 -73 254 14 27 23 -106 -22 -269
4619 -269 235 -128 2 -80 -377 -4 -272 -139 93 15 -167 -55 207 66 77 39 -160 70 -149 -78 184 58
4641 58 9 181 63 101 24 -134 -39 34 -12 -111 -143 74 264 -68 101 -100 230 70 -69 -107 18 -5 -144 -268
4665 -268 52 292 -13 -50 -80 78 -166 -11 12 241 35 -20 59 -131 137 -396 138 -240 -105 118 -45 -475
4687 -475 -302 -110 -313 303 -31 -22 -18 -176 -66 5 -42 112 20 -67 -138 137 -170 -77 -274 -16 -165 324 55
4710 55 -99 -248 -99 -188 -313 111 124 152 -96 97 -26 -167 177 56 -110 -132 19 -36 -204 -110 203 53
4732 53 156 23 -137 27 -210 230 -129 117 59 247 -206 17 367 -230 -133 -73 303 90 -51 -125 -28 44
4754 44 -136 57 -139 -405 150 -107 -28 -72 212 -119 -37 -136 99 -39 59 -27 29 -135 241 60 100 -57 66
4777 66 240 78 -87 11 231 -269 76 -118 82 174 -107 -35 -75 -62 34 -300 -16 189 168 3 -186 145 -30
4800 -30 -39 50 103 56 -223 84 -157 -132 75 -71 -96 -75 -96 -291 65 61 23 131 -218 106 -6 -146 -129 -98 208
4825 208 -33 135 -236 69 -113 -203 -118 31 -107 50 -150 -74 -59 7 -178 -151 35 193 -73 138 -27 115
4847 115 -134 -144 214 118 169 -24 53 -23 51 87 -140 133 -57 -122 114 32 -139 -210 210 68 8 66 287 -59
4871 -59 -223 31 159 110 198 -93 -14 -126 -53 -93 251 6 232 -51 -250 -95 -23 300 -69 157 -132 -132 168
4894 168 158 -46 122 -62 -55 81 170 -193 -162 -100 -47 -20 -126 202 167 18 -117 22 -37 -76 16 101 -125 259
4918 259 -12 55 114 -171 30 27 137 11 -173 364 -55 -60 -113 -43 -224 199 249 -327 192 174 -5 94 -124 -60
4942 -60 83 -147 162 125 -120 45 126 244 -77 -159 -351 4 -7 -260 107 -48 198 67 188 175 -149 -57
4964 -57 -2 -230 -184 224 98 -187 -125 -173 -4 -131 -48 -22 -175 55 202 74 -46 -65 -175 230 32 -75 59
4987 59 -177 51 180 -63 11 -15 125 -33 27 204 264 122 106 -84 -299 -16 353 122 312 -257 -3 -182
5009 -182 -107 -101 -199 115 -100 217 125 269 -153 -95 -334 -18 -19 -57 217 -44 -126 -182 194 210 110 -86 68 44
5033 44 13 52 -282 124 50 -20 183 -216 1 188 -99 98 -185 -343 -72 67 57 -28 216 119 -21 41 43 -72
5057 -72 -50 -110 -154 -48 -136 -429 -10 -78 46 8 -125 -114 -176 122 207 -140 49 64 226 -136 3 2 -15 47 202
5082 202 79 165 -56 80 -21 172 -295 76 187 -276 -24 -205 -19 64 -182 -52 -32 45 123 24 45 210
5104 210 93 -30 333 -68 136 134 184 100 114 -39 -32 -172 -212 139 135 143 -131 163 -243 9 88 47 18 26 164 183
5130 183 281 -23 -68 -89 259 -324 -13 172 20 -48 63 60 -12 -38 114 -166 90 -57 -68 250 -192 257 307
5153 307 92 150 -175 14 34 166 -23 242 31 -175 108 -178 -234 -12 -3 -65 150 -255 -220 -194 23 169 -84
5176 -84 -4 109 348 153 -81 -36 -98 -204 232 -35 -14 27 4 16 -314 -69 47 67 33 -46 69 61 93 -100 -24
5201 -24 -52 57 -35 -83 153 0 224 74 2 -83 -187 -41 -178 -96 34 -211 154 48 82 86 163 -125 -35 -214
5225 -214 76 -45 98 -223 -204 173 -180 121 16 -39 187 246 8 97 -232 -8 -117 270 -63 -30 -124 25
5247 25 310 -66 136 -280 49 71 -113 -18 112 -146 60 103 43 -53 -37 -149 -194 -26 -22 -195 137 81 -76 115
5271 115 -142 55 58 75 24 -271 -79 -112 237 -113 44 -34 -175 11 67 19 10 -77 7 -37 -55 -51 -110 57 -266 156
5297 156 -42 104 -52 40 -158 -84 -85 191 -165 231 -4 -200 32 24 -198 -62 150 -203 -82 -156 -78 -96 57
5320 57 -82 32 -243 71 -137 -89 -8 -45 -103 153 -292 -48 167 0 -69 -148 184 -100 13 -205 -105 -68 -24
5343 -24 203 16 5 -51 -138 -202 -75 71 237 113 17 327 18 -99 151 231 -56 -12 137 70 24 223 42
5366 42 344 -237 -324 93 132 34 147 -4 47 363 151 211 127 -64 231 93 -206 62 -250 -194 -75 -97 279
5389 279 150 111 -91 21 328 108 220 434 -54 -144 255 -1 -79 -222 -43 -94 -297 105 35 -135 94 26
5411 26 -158 -153 37 -252 -277 -103 65 86 -89 79 43 -223 154 -112 -77 -304 184 7 -73 -37 19 62 -123 -38
5435 -38 -250 -118 86 -114 -78 127 -73 22 -344 123 186 18 127 -31 -163 -149 -63 111 -239 -38 11 -129
5457 -129 -67 1 152 -8 142 27 78 -150 86 160 -75 -141 49 39 -109 -129 99 337 300 22 -181 -175 174
5480 174 47 50 -25 421 192 25 209 -9 -1 -211 -321 -34 146 136 95 168 -49 -148 -50 -95 -69 44 -37 -123 -125
5505 -125 126 2 -16 -29 -146 -211 247 235 -126 -96 -67 43 92 -150 -119 41 -55 260 100 -56 78 39 180
5528 180 -92 142 -29 123 -29 261 274 169 142 -7 -19 -103 101 -19 -72 -73 -218 167 -182 -99 49 324 60
5551 60 143 21 90 -14 -95 71 -160 88 -111 112 50 -229 -71 124 -151 -214 -137 92 -20 -315 168 -61
5573 -61 309 261 54 -103 -42 85 -111 -4 58 -184 107 -114 -132 -220 105 101 -70 84 -171 96 -163 -207 -59
5596 -59 25 159 -52 254 -16 -264 -23 -202 108 -190 146 -66 -264 67 91 -118 -88 7 -34 109 75 -122
5618 -122 62 9 89 -125 -155 -174 205 0 -316 -56 96 224 265 -25 17 -229 -129 -138 79 72 -58 -44 62 -49
5642 -49 255 81 107 41 -400 -104 -58 116 25 22 -188 -44 187 -23 47 -181 -303 -154 -229 -133 -286 102 52 83
5666 83 -18 26 55 -232 116 -94 -95 -72 -229 129 -29 -231 -180 131 -141 34 15 124 -191 212 -23 -167 196
5689 196 48 151 196 55 -218 -67 159 -252 86 -171 97 -96 -122 -10 176 71 74 51 -26 -124 10 -223
5711 -223 145 -49 -165 158 115 244 -72 19 157 59 118 -163 194 -130 -92 -105 -110 30 -176 254 137 -199 149
5734 149 294 -17 -270 -22 52 -213 61 -107 21 15 144 87 109 116 -77 -233 -219 -94 209 127 -226 -6 197
5757 197 -120 107 25 161 219 151 -140 65 146 -31 170 -219 -159 -6 -90 -49 -95 -65 -114 -68 -70 236 -176 -46
5781 -46 -97 -79 88 -98 1 103 -44 173 -48 -104 -62 -1 -52 135 -94 -36 -3 -14 42 -246 95 163 -93 18
5805 18 -75 145 -366 -195 -183 45 -76 -61 134 50 172 193 12 -157 -140 -115 112 -138 -4 -235 -167 -346 -288
5828 -288 151 97 -177 -115 202 17 -141 51 -161 -209 185 -175 1 -6 66 -44 215 52 -126 -69 122 163 193
5851 193 -80 170 -225 180 -282 -217 337 23 8 -249 113 74 156 -31 131 40 68 -110 2 155 134 -181
5873 -181 -45 229 -35 -20 -114 -87 56 30 431 -81 -115 18 94 -84 75 63 -220 -137 15 9 3 10 -121 8 -58
5898 -58 -73 207 -24 -266 -48 -49 64 90 -79 36 289 -383 -58 -47 -70 -224 -238 -92 111 -66 61 -48 -38
5921 -38 -203 -38 -167 60 -36 142 21 107 -83 -202 310 179 -187 -142 -62 -84 79 -135 21 -95 105 -113
5943 -113 11 -60 269 -144 -36 -88 -257 -3 -276 -123 -239 135 7 -15 -182 -35 -239 69 86 -117 46
5964 46 -26 257 -13 94 -2 -35 140 -94 -103 -16 16 -111 -230 134 43 -10 -35 521 38 -338 -191 -146 113 -184
5988 -184 -16 5 232 -130 138 203 1 67 185 -17 2 9 65 -55 121 -28 244 51 210 -14 -303 36
6010 36 270 140 -120 -30 -201 -62 99 -24 -41 -120 -23 147 -90 0 177 -36 -130 -114 199 151 -204 -188 83
6033 83 -63 -20 -202 110 -148 -43 238 115 -41 -108 44 -40 -304 -101 115 37 182 -202 39 -2 -6 127 -212
6056 -212 -151 -148 86 168 160 -56 29 -23 226 -173 -179 20 -198 -44 117 280 -88 -5 162 33 -37 -144 20 22 -1
6081 -1 70 67 56 -93 115 -23 160 -119 -129 -19 -134 -28 36 243 37 129 272 110 35 304 -137 87 53 -77
6105 -77 256 18 257 -90 -108 -6 133 -92 224 248 -51 -71 -35 3 -112 145 -134 91 27 -126 95 -62
6127 -62 81 -201 -31 199 328 -401 -85 -115 67 -195 214 -160 34 -172 76 -104 -290 48 -44 -332 -45
6148 -45 47 -87 -95 71 159 321 22 41 141 -60 98 76 -126 132 -130 -175 -181 -140 -81 -63 -6 0 103 47 286 17
6174 17 -89 185 107 -281 -139 -68 -55 104 -72 -130 -242 -74 25 101 -74 -150 157 117 -132 -73 -191 3 77 8
6198 8 73 175 35 33 117 -11 -106 -53 -173 196 9 218 144 209 99 -151 33 80 -140 40 75 -93 -115 -26 102
6223 102 -109 75 91 -45 -59 -31 192 -10 24 142 -61 -89 177 200 105 12 -32 -11 -153 115 -121 68 -55
6246 -55 -185 260 -76 18 111 -314 155 -184 -72 90 97 66 -67 -176 116 77 267 -325 -52 96 -28 -157
6268 -157 226 196 142 -193 88 36 186 72 142 -36 174 -9 234 -11 186 167 -145 15 -33 88 -42 -129
6290 -129 80 -120 -23 56 -294 59 77 159 -48 -114 -40 133 207 -30 131 -72 277 -9 21 -195 111 13 -308
6313 -308 128 83 -110 162 -138 86 -273 -118 35 -94 43 3 -156 -107 -120 -53 -234 -147 23 33 -101 154
6335 154 290 292 -2 -135 56 256 96 22 -46 -6 216 35 -53 266 -190 120 106 -105 -261 -3 154 220 218
6358 218 -222 -204 67 356 -107 92 -68 -76 81 111 0 33 -38 178 -239 53 -181 154 -11 -59 111 -23
6380 -23 96 -282 -51 -151 110 -61 153 90 -10 -146 183 -166 -301 243 -156 -53 121 16 -135 -103 11
6401 11 -61 -11 -44 70 138 -54 127 -175 -16 -118 48 -61 197 -88 -52 102 184 -85 16 85 158 -221 53
6424 53 45 -142 53 46 344 -2 -41 -143 39 -235 147 110 -280 57 63 -443 -69 28 132 -60 -37 226 -49 -43
6448 -43 -94 101 153 99 -176 -218 1 46 76 84 -201 -91 -275 87 -6 -219 165 135 21 277 7 81 -107 -107 -80
6473 -80 168 -109 223 -144 -221 379 -72 161 -81 -62 270 -16 -35 112 -111 -5 -88 -121 85 -231 -205 -115 51
6496 51 -166 -101 -213 -318 -131 94 -136 -37 -160 52 -172 -401 107 -184 -82 -131 -126 -253 189 200 -78 -60 108
6519 108 86 -54 -91 -221 85 -43 94 -21 43 73 -115 -16 65 -57 69 146 -142 -90 -99 123 83 33 -24 -116 158
6544 158 -4 81 -58 93 99 -134 22 97 -190 -185 228 57 54 -212 -79 -29 -134 15 170 -18 -14 7 -32 205
6568 205 -99 -125 29 -226 -122 -218 -61 274 29 -41 99 15 -246 60 -99 -12 -213 -72 22 28 -3 -107 7
6591 7 15 -36 56 -82 128 79 92 255 142 23 -78 61 -90 55 -138 -114 45 -182 -439 -125 -207 -48 -140 -73
6615 -73 -30 -85 -4 42 8 61 212 -261 60 35 61 158 -162 106 -240 -47 41 -163 -233 103 197 -99 432 -234
6639 -234 250 203 72 13 71 152 -176 -23 -11 -56 -212 6 2 -50 -203 -78 84 -176 -144 -208 -10 -131 -30 2
6663 2 -166 13 -28 -143 -158 -95 40 -190 -160 -195 270 54 133 -82 72 76 -174 121 140 17 192 -47 155 -157
6687 -157 -213 309 40 -139 19 105 74 -165 129 86 -192 -71 -21 -282 -9 158 297 108 -222 105 138 63
6709 63 290 -201 -144 -96 13 -74 -76 125 9 176 -124 -119 53 201 157 86 127 74 -192 63 -26 134 -155 -209 -188
6734 -188 -281 117 130 -25 -21 -295 -95 100 14 214 146 -71 -77 195 -152 -41 140 -276 63 21 -131 -64 -68 -240
6758 -240 90 172 124 81 -110 65 170 105 -94 12 58 329 52 169 -25 -72 -161 -6 -122 -7 70 103 -159
6781 -159 -34 105 -20 -139 -51 -67 -22 176 -9 59 -88 52 75 -33 15 -98 331 48 -196 371 -62 40
6803 40 -87 -2 101 134 -21 -299 81 34 9 25 153 -90 137 -204 144 -133 -37 -71 45 235 -52 -197 192
6826 192 218 -227 170 -309 -88 -35 118 91 -41 -310 -97 -99 -60 -17 58 113 203 88 303 -13 -109 143 94 -198
6850 -198 -103 -26 -80 -100 113 38 -282 -66 81 214 86 104 140 62 16 -90 -38 -40 -362 221 -57 63 -24 206
6874 206 36 -120 190 39 83 190 -80 168 189 -77 70 -62 117 49 123 -114 55 120 228 -80 22 -53
6896 -53 138 6 113 -112 -135 -113 -248 -133 62 -110 -89 -40 -8 -198 -118 -354 17 -153 -67 -398 -158 -6 -237
6919 -237 -41 -5 189 50 -77 -230 59 24 -53 102 -122 77 -46 22 252 -2 -99 116 5 -158 -139 76
6941 76 63 -74 104 -159 -149 -33 270 71 16 -87 -36 211 -202 -55 -78 21 299 94 -165 248 120 -54
6963 -54 -180 72 43 127 166 -229 23 33 -26 -16 -214 -126 26 50 6 -44 -13 -7 -131 -308 219 42 -394 77 136
6988 136 -81 257 305 114 129 -113 -151 224 -219 87 178 80 118 219 -11 -1 -15 77 -58 203 192 -163 -26
7011 -26 224 283 -180 -84 81 191 -43 74 80 110 -131 -106 42 -41 -96 91 -117 -248 163 207 213 -18 156 -72
7035 -72 161 -44 -242 -35 42 -68 -114 150 -53 -36 181 69 -6 -54 2 240 -227 219 40 -49 -5 5 -65 -71
7059 -71 -237 -27 -49 25 94 -89 150 -155 -53 -85 -149 -61 280 -47 80 -148 57 -137 -200 141 350 93 216
7082 216 -228 -273 -1 209 -13 -254 -69 -30 76 -187 203 -93 -121 -239 -244 -197 138 -95 -225 124 -53 -6
7104 -6 41 80 -35 104 -101 -131 150 13 -228 -70 -39 -395 178 -54 -216 16 -47 -190 17 -12 80 89 165 205
7128 205 280 -179 -21 -275 96 33 -20 262 -202 -28 244 1 -89 78 113 223 15 317 53 -39 29 -194
7150 -194 138 -59 -46 34 316 183 -30 35 34 -21 -92 35 -110 -96 -126 97 -39 -141 -251 119 -63 73 241
7173 241 119 -64 -110 -29 -283 283 -34 218 -68 -72 -37 -154 -102 -120 204 -171 -123 -96 -9 45 345 -47 -75 -353
7197 -353 148 -211 348 256 -105 185 16 -16 -210 -317 -148 79 -135 -161 -20 4 -81 -195 36 111 -85 13
7219 13 -2 -33 148 -120 52 317 -73 -176 -9 281 -13 -9 -44 -276 -196 73 132 -17 -106 230 -22 144 -245
7242 -245 -124 221 316 65 37 194 52 -19 74 -37 284 360 -64 104 -41 395 -332 121 82 -39 17 41 136
7265 136 59 -223 64 -354 177 -9 243 243 -54 49 -24 168 -48 79 -423 -76 -43 2 -93 -188 -37 52 -129
7288 -129 -88 -202 22 285 -226 -45 124 174 -14 1 -38 -206 31 -4 75 -43 30 -131 -121 133 -136 -2 80
7311 80 -165 -131 -188 43 -74 100 -246 115 48 21 61 26 214 -69 -252 58 -328 -150 102 -146 137 162 -27
7334 -27 -26 -60 116 -74 -20 -163 144 -42 1 52 43 57 -89 315 48 -104 81 3 18 -23 298 159 34 -56 252
7359 252 -57 -91 39 75 -127 62 -61 -7 124 103 240 -94 -109 385 -134 29 109 214 -2 128 -7 -44
7381 -44 75 69 -151 18 18 288 -178 23 61 228 -88 -143 55 -378 -63 45 168 115 -161 293 181 225 3
7404 3 -268 -39 26 236 -17 119 -85 101 38 -195 62 -26 -2 -105 31 11 -217 -36 208 -45 81 117 -31
7427 -31 20 -28 229 129 72 173 -9 -27 88 -199 212 157 40 82 178 -86 -193 -129 46 11 -27 161 55 -58
7451 -58 -207 205 273 304 23 -262 -154 -305 -21 -25 -58 -166 118 3 63 -172 -237 -16 -138 2 136 222 -26
7474 -26 289 -236 109 -12 110 139 -10 -127 94 184 -12 -336 10 109 -173 -322 -64 120 39 -134 10 -29
7496 -29 -14 1 169 -239 -158 -97 -131 224 -404 -350 16 -402 -35 -27 57 -108 73 283 -39 -104 -90 169 -83 -175
7520 -175 106 -145 209 -144 -47 -29 -22 -288 235 86 -272 25 -141 -80 -45 -6 147 -40 -25 -152 -74 -14 -102 111
7544 111 -56 -147 253 90 122 -148 -41 96 121 87 -76 210 -30 99 54 -73 62 -91 71 -238 -233 299
7566 299 -308 182 -155 140 241 -120 50 -41 34 -172 -233 35 -139 88 -65 304 -487 -136 -201 -196 -83 -153
7588 -153 258 126 -183 -83 -250 -171 83 -38 -29 -193 124 -281 -155 19 -26 -39 -208 105 22 21 277 -61 -28
7611 -28 -153 87 -20 80 -30 -61 -23 -169 39 -189 14 -3 221 -206 -116 169 14 -173 -202 -173 -23 357
7633 357 -91 14 -217 240 -212 47 45 -6 252 157 -106 -30 -344 -37 -75 205 -57 -66 -27 198 280 -197 -54
7656 -54 242 -33 11 77 -207 -177 -86 -51 55 176 -117 230 12 -294 35 60 59 19 147 -195 134 151 -113 11
7680 11 -161 -180 -119 -53 -79 192 -44 -261 3 113 -310 -164 -221 319 -75 7 40 101 235 69 -56 124 24
7703 24 23 -109 163 -102 61 197 53 106 -120 310 42 47 182 63 -2 -126 147 148 16 -108 -241 140 53
7726 53 91 88 43 -258 -17 92 206 -112 252 -21 -38 -255 55 -19 -203 225 -81 -63 130 -183 -195 -194 93 132
7750 132 -24 96 162 -78 -147 -54 48 250 63 -294 73 162 126 117 -147 155 -191 -8 -58 18 -36 104 -159
7773 -159 -153 322 111 -302 153 -55 219 114 -240 -61 -4 -209 98 106 -169 119 153 -58 128 -26 193 -65
7795 -65 10 47 -302 -29 -9 -10 52 -168 66 -176 44 -327 -72 227 32 357 -110 208 -3 -179 -6 -226
7817 -226 154 -31 224 249 13 78 40 77 2 86 -27 18 138 -51 -122 35 -68 -164 -289 -28 327 -156 24
7840 24 -324 -11 -413 -96 245 124 29 -114 38 -59 -233 37 -97 102 -208 106 196 -39 291 -80 235
7861 235 -130 4 196 -179 109 -76 -24 -180 -121 1 -206 -70 -46 -127 1 79 -86 -170 -202 150 102 -53 -185
7884 -185 119 -295 67 -37 -130 -95 -49 83 -220 163 155 81 -104 -126 108 176 125 161 157 39 -245 71 -168 -50
7908 -50 29 -230 -77 -96 -133 -306 127 10 20 -106 17 -224 -64 -38 -32 -120 220 186 -164 70 -118 -192 36 -222
7932 -222 214 -38 -103 149 336 86 -144 189 -175 11 204 -33 131 76 -250 -44 77 -53 -161 -1 -318
7953 -318 -255 50 8 -74 -25 4 -207 283 -172 -140 51 -246 223 -160 23 -120 208 163 -34 108 -233 318
7975 318 164 -134 -27 182 -71 14 152 4 -39 88 63 -117 179 27 56 40 140 -76 116 138 -80 217
7997 217 -95 -133 191 22 76 -276 48 60 423 -93 351 105 -46 129 45 28 117 115 120 156 -184 -50 33 160
8021 160 -214 122 -153 -313 239 -70 227 -95 20 -241 -88 -8 -171 343 107 -19 8 -261 266 -137 -33
8042 -33 -61 136 -110 -143 1 -16 -49 232 -111 -39 -100 218 -245 43 -16 -84 134 -175 -103 -62 308 310 -31 -91 -89
8067 -89 -180 85 79 -37 140 84 -278 -50 -48 57 31 128 145 260 -206 252 -261 -59 -241 256 240 -63 70 -297
8091 -297 -80 -69 -60 183 -5 304 43 -145 128 67 140 -242 235 -18 336 -14 -345 84 83 -6 -231 -18 372
8114 372 108 -34 21 10 -14 -268 -11 -57 -53 208 -131 15 -404 -98 -235 -10 -163 -158 211 -363 291 -71 -148
8137 -148 -99 -131 -122 -285 34 82 -47 182 -165 98 -146 8 -199 -64 109 -120 70 -132 -99 -7 -195 -128 -8
8160 -8 -364 132 -425 43 -126 63 403 -89 -197 -145 279 -100 207 308 -276 52 -174 -21 -308 36 156
8181 156 -38 227 -78 32 192 -219 -66 -79 311 42
8191D2
##END NTUPLES=NMR FID
##END=
