##TITLE=1H_43-2026-Bay
 200.13Hz, CDCl3.
 8 sc
 
 28.4.2026
##JCAMPDX= 6.0         $$ Bruker NMR JCAMP-DX V2.0
##DATA TYPE= NMR FID
##DATA CLASS= NTUPLES
##ORIGIN= UXNMR, Bruker Analytische Messtechnik GmbH
##OWNER= pz
$$ XWIN-NMR		Version 3.5
$$ Tue Apr 28 14:23:51 2026 Russian Standard Time (UT+4h)  she@DPX200
##.OBSERVE FREQUENCY= 200.131
##.OBSERVE NUCLEUS= ^1H
##.DELAY= (6, 6)
##.ACQUISITION MODE= SIMULTANEOUS
##.ACQUISITION SCHEME= undefined
##.AVERAGES= 8
##.DIGITISER RES= 18
##SPECTROMETER/DATA SYSTEM= spect
##.PULSE SEQUENCE= zg30
##.SOLVENT NAME= CDCl3
##.SHIFT REFERENCE= (INTERNAL, CDCl3, 0, 14.3821)
##AUDIT TRAIL= $$ (NUMBER, WHEN, WHO, WHERE, WHAT)
$$ ##TITLE= Audit trail, XWIN-NMR		Version 3.5
$$ ##JCAMPDX= 5.01
$$ ##ORIGIN= Bruker BioSpin GmbH
$$ ##OWNER= she
$$ F:/spectra/data/she/nmr/H-C/1/audita.txt
$$ ##AUDIT TRAIL=  $$ (NUMBER, WHEN, WHO, WHERE, WHAT)
(   1,<2026-04-28 14:21:13.62 +0400>,<she>,<DPX200>,
      <created by zg, POWCHK disabled, PULCHK disabled
       configuration hash MD5:
       00 E9 B6 7A A2 85 ED C7 34 08 36 98 17 FE 4E 26
       data hash MD5: 16K
       70 42 93 43 0E 5C 70 98 2F F6 3C 50 AA 09 B0 48>)
$$ ##END=
$$ 
$$ hash MD5
$$ 2C BE A7 AE 5E 11 3E D2 3A 31 37 DD 3D 1B 5C 6D
##$RELAX= 
##$RELAX= 
##$RELAX= 
##$RELAX= 
##$RELAX= 
##$RELAX= 
$$ Bruker specific parameters
$$ --------------------------
##$DU= <F:/spectra>
##$EXPNO= 1
##$NAME= <H-C>
##$PROCNO= 1
##$TYPE= <nmr>
##$USER= <she>
##$AMP= (0..31)
100 100 100 100 100 100 100 100 100 100 100 100 100 100 100 100 100 100 
100 100 100 100 100 100 100 100 100 100 100 100 100 100 
##$AQSEQ= 0
##$AQ_mod= 1
##$AUNM= <au_zg>
##$AUTOPOS= <>
##$BF1= 200.13
##$BF2= 200.13
##$BF3= 200.13
##$BF4= 200.13
##$BF5= 200.13
##$BF6= 200.13
##$BF7= 200.13
##$BF8= 200.13
##$BYTORDA= 1
##$CFDGTYP= 0
##$CFRGTYP= 5
##$CHEMSTR= <none>
##$CNST= (0..31)
1 1 145 1 1 1 1 1 1 1 1 1 1 1 1 1 1 1 1 1 1 1 1 1 1 1 1 1 1 1 1 1 
##$CPDPRG= <>
##$CPDPRG1= <>
##$CPDPRG2= <>
##$CPDPRG3= <>
##$CPDPRG4= <mlev>
##$CPDPRG5= <mlev>
##$CPDPRG6= <mlev>
##$CPDPRG7= <mlev>
##$CPDPRG8= <mlev>
##$CPDPRGB= <>
##$CPDPRGT= <>
##$D= (0..31)
0 0.7 0 0 0 0 0 0 0 0 0 0.03 0 0 0 0 0 0 0 0 0 0 0 0 0 0 0 0 0 0 0 0 
##$DATE= 1777371673
##$DBL= (0..7)
120 120 120 120 120 120 120 120 
##$DBP= (0..7)
150 150 150 150 150 150 150 150 
##$DBP07= 0
##$DBPNAM0= <>
##$DBPNAM1= <>
##$DBPNAM2= <>
##$DBPNAM3= <>
##$DBPNAM4= <>
##$DBPNAM5= <>
##$DBPNAM6= <>
##$DBPNAM7= <>
##$DBPOAL= (0..7)
0.5 0.5 0.5 0.5 0.5 0.5 0.5 0.5 
##$DBPOFFS= (0..7)
0 0 0 0 0 0 0 0 
##$DE= 6
##$DECBNUC= <off>
##$DECIM= 32
##$DECNUC= <off>
##$DECSTAT= 4
##$DIGMOD= 1
##$DIGTYP= 9
##$DL= (0..7)
0 120 120 120 120 120 120 120 
##$DP= (0..7)
150 150 150 150 150 150 150 150 
##$DP07= 0
##$DPNAME0= <>
##$DPNAME1= <>
##$DPNAME2= <>
##$DPNAME3= <>
##$DPNAME4= <>
##$DPNAME5= <>
##$DPNAME6= <>
##$DPNAME7= <>
##$DPOAL= (0..7)
0.5 0.5 0.5 0.5 0.5 0.5 0.5 0.5 
##$DPOFFS= (0..7)
0 0 0 0 0 0 0 0 
##$DQDMODE= 0
##$DR= 18
##$DS= 0
##$DSLIST= <SSSSSSSSSSSSSSS>
$$ [...]
##$SUBNAM0= <"">
##$SUBNAM1= <"">
##$SUBNAM2= <"">
##$SUBNAM3= <"">
##$SUBNAM4= <"">
##$SUBNAM5= <"">
##$SUBNAM6= <"">
##$SUBNAM7= <"">
##$SUBNAM8= <"">
##$SUBNAM9= <"">
##$SW= 18.0517599122864
##$SWIBOX= (0..15)
0 0 2 0 0 0 0 0 0 0 0 0 0 0 0 0 
##$SW_h= 3612.71676300578
##$TD= 16384
##$TD0= 1
##$TE= 0
##$TE2= 300
##$TE3= 300
##$TEG= 300
##$TL= (0..7)
0 120 120 120 120 120 120 120 
##$TP= (0..7)
150 150 150 150 150 150 150 150 
##$TP07= 0
##$TPNAME0= <>
##$TPNAME1= <>
##$TPNAME2= <>
##$TPNAME3= <>
##$TPNAME4= <>
##$TPNAME5= <>
##$TPNAME6= <>
##$TPNAME7= <>
##$TPOAL= (0..7)
0.5 0.5 0.5 0.5 0.5 0.5 0.5 0.5 
##$TPOFFS= (0..7)
0 0 0 0 0 0 0 0 
##$TUNHIN= 0
##$TUNHOUT= 0
##$TUNXOUT= 0
##$USERA1= <user>
##$USERA2= <user>
##$USERA3= <user>
##$USERA4= <user>
##$USERA5= <user>
##$V9= 5
##$VALIST= <valist>
##$VCLIST= <CCCCCCCCCCCCCCC>
##$VD= 0
##$VDLIST= <DDDDDDDDDDDDDDD>
##$VPLIST= <PPPPPPPPPPPPPPP>
##$VTLIST= <TTTTTTTTTTTTTTT>
##$WBST= 1024
##$WBSW= 4
##$XGAIN= (0..3)
0 0 0 0 
##$XL= 0
##$YL= 0
##$YMAX_a= 69301
##$YMIN_a= -439653
##$ZGOPTNS= <>
##$ZL1= 120
##$ZL2= 120
##$ZL3= 120
##$ZL4= 120
##$ABSF1= 10
##$ABSF2= 0
##$ABSG= 5
##$ABSL= 3
##$ALPHA= 0
##$AQORDER= 0
##$ASSFAC= 0
##$ASSFACI= 0
##$ASSFACX= 0
##$ASSWID= 0
##$AUNMP= <proc_1d>
##$AZFE= 0.1
##$AZFW= 0.1
##$BCFW= 1
##$BC_mod= 2
##$BYTORDP= 1
##$COROFFS= 0
##$CY= -3
##$DATMOD= 1
##$DC= 2
##$DFILT= <>
##$DTYPP= 0
##$F1P= 0
##$F2P= 0
##$FCOR= 0.5
##$FTSIZE= 0
##$FT_mod= 4
##$GAMMA= 1
##$GB= 0.15
##$INTBC= 1
##$INTSCL= 1
##$ISEN= 128
##$LB= 0.25
##$LEV0= 0
##$LPBIN= 0
##$MAXI= 10000
##$MC2= 0
##$MEAN= 0
##$ME_mod= 0
##$MI= 1.114404
##$NCOEF= 0
##$NC_proc= 0
##$NLEV= 6
##$NOISF1= 3.799351
##$NOISF2= 2.8
##$NSP= 1
##$NTH_PI= 0
##$NZP= 0
##$OFFSET= 14.38212
##$PC= 1
##$PHC0= -4063.744
##$PHC1= 13.39229
##$PH_mod= 1
##$PKNL= yes
##$PPARMOD= 0
##$PSCAL= 0
##$PSIGN= 0
##$REVERSE= no
##$SF= 200.129724274929
##$SI= 16384
##$SIGF1= 3
##$SIGF2= 2
##$SINO= 400
##$SIOLD= 16384
##$SREGLST= <1H.CDCl3>
##$SSB= 0
##$STSI= 0
##$STSR= 0
##$SW_p= 3205.1282051282
##$SYMM= 0
##$S_DEV= 0
##$TDeff= 0
##$TDoff= 0
##$TI= <>
##$TILT= no
##$TM1= 0
##$TM2= 0
##$TOPLEV= 0
##$USERP1= <user>
##$USERP2= <user>
##$USERP3= <user>
##$USERP4= <user>
##$USERP5= <user>
##$WDW= 1
##$XDIM= 8192
##$YMAX_p= 0
##$YMIN_p= 0
$$ End of Bruker specific parameters
$$ ---------------------------------
##NTUPLES= NMR FID
##VAR_NAME=  TIME,          FID/REAL,        FID/IMAG
##SYMBOL=    X,             R,               I
##VAR_TYPE=  INDEPENDENT,   DEPENDENT,       DEPENDENT
##VAR_FORM=  AFFN,          ASDF,            ASDF
##VAR_DIM=   8192,          8192,            8192
##UNITS=     SECONDS,       ARBITRARY UNITS, ARBITRARY UNITS
##FACTOR=    0.0002768,     1,               1
##FIRST=     0,             0,               0
##LAST=      2.2672688,     0,               0
##MIN=       0,             -439653,         0
##MAX=       2.2672688,     69301,           0
$$ Real data points
##PAGE= N=1
##DATA TABLE= (X++(R..R)), XYDATA
$$ [...]
2007B8n0M3k6j58N3J85k0l6J8l6j99O2K56l29M71r9m5j60p7J76j99L44n39L67
2031C0j91J64lL31l09n0p2kM97n34K60k83K98j84O0N9j65j38L40j32J69rl60K08
2055a6K73l3j53J21Lk57J32J80j54j9o6q5L17l09K32j0l31n1J53M4M0j81l1K88
2079H7L72m84j08qj57J20q6L70l66M03N7j92K43l09J13j30O3Rk73N58m39k8J33
2102e2R7l19K86M1j11r7J9P4J44J21l53J14l65N76k29R7R7j19k96K25q0l2J39
2125b3l5o0L8o2K84P9k76J17M6k22k8M15m04K98L7j42j98r0J39J6M6kL3o7LJ56
2151I8JL6l04j3L30j31N9J7j01j74K37j57k9k41K17J70j01o1J0J05j17q5K34J99
2175A99k95k78K89J61k02k13L56j20K96J5l62L2J10J7l17M08j57J77j35j50K80
$$ y = [28, -22, 21, -5, -163, -110, 75, 55, 19, 37, 1, -198, -136, 120, -209, 262, 163, 118, -42, -119, 57, -142, 202, -337, 30, -161, 3, 0, 331, 22, -28, -100, -102, 395, -139, 121, -162, 136, -48, 12, 71, -94, -232, 108, -24, 145, 136, -224, -16, 257, 224, 71, 192, 195, -62, 70, 250, 96, 77, 11, -74, 243, -66, 166, 156, -175, -226, -73, -29, 11, -170, -201, 87, 459, -25, -133, -141, -298, -178, -264, 106, -260, 143, 200, 8, 251, -58, 55, -75, -12, -3, -276, 282, -157, -185, -52, 45, -274, 12, 53, -58, -155, -136, -62, 82, 203, -150, -36, -401, 175, -54, 43, 140, 21, -275, -50, -130, -162, -23, -58, -118, -80, -142, 142, 221, -55, 62, 108, -114, -142, 273, -131, 167, 204, 62, -136, -226, -87, -71, -25, -27, 6, -61, -58, 98, 99, 135, -169, -182, 148, 17, 76, 93, -8, -182, 55, -102, -131, -372, -155, 15, -86, -147, -137, -32, -149, -234, 0, 199, -96, -374, -85, 76, -126, -339, 17, -103, 193, 208, -154, -122, -12, 5, -312, 96, -61, 116, -19, -169, 111]
2196A11p5K05l62M31l49o1K17j72J10k23j03K44J13j78L13m40K47N8j56P6k3R9
2218H2j54J68m96K29R9K50J20j32j42r7J26J94k31k58J13J21K02j18k71J77r4
2239a12J46M6j48L5J29J2k46K08j05J59k71QK52O0j47J57l44J11L24l45L0K17
2261A76k78P4J45M1m10J18J75j91L75j75k44J57j5M3J13J7k81J95j5p1L3o1K06
2284A27j76j23K30K0j47K5N0k0L6j52K46J8k97K62k36o7Q7Q9M9o3j4J73LN4n02
2309c28M37o4q3k29K03J13k04K98n21L90k73L75j4N3k32N35l71k82L90l70K07
2330C0j64L61l91K3K72K29q02J007J52p30j3j15j8m7o3N17l12R1N4o1j82J00R4
2353C2J18M8J72p66L43J75r02M08J47M1O8J53J83m86M73k66N5m39J89N94n29L19
$$ y = [111, 36, 241, -121, 310, -39, -100, 117, -55, 55, -168, -271, -27, 86, -92, 221, -219, 28, 86, -70, 6, -17, 82, -72, 96, -400, -171, -72, 178, 298, 166, 24, -73, 53, 247, 16, -242, -129, -8, 194, 76, -195, -18, -112, 34, 80, -68, -33, 96, 108, -138, 70, -35, 124, -147, -139, 113, 173, 26, 183, -161, -50, 274, -71, -41, 176, -102, -28, 117, 158, -252, -134, 41, -150, 225, 50, -194, -37, -52, -9, 104, 121, -160, 35, 20, -51, -18, -79, 127, -49, -172, 58, 78, -69, -44, 6, -14, 22, -130, 116, 134, -163, 99, -137, -204, -117, -28, 21, -42, -56, 117, 120, 174, -328, 109, 45, -38, -267, -64, 49, -155, 143, -378, 12, -261, 114, 100, 153, -79, 456, 85, -197, 193, -177, 30, -134, 227, -164, -141, 131, 360, -442, 565, 717, -13, -26, -141, -159, -206, -269, 248, -64, 27, 81, 20, -162, -62, 32, 150, 198, 370, -396, -53, 122, -780, -372, -225, -184, -116, 37, 220, -266, 207, -59, -4, -443, -254, 340, -189, 130]
2375A30J86k7k70j13l84L79L23j88L1k14O76p58K43Pk27N78n54L98Q9nl36J24
2397H8J0k59K34q6M0o1k07J64K75k13J97l29OL5J87n5j90N5p5J19p7K16m44J17
2421b53O7L46j59j37K53k90J55K21J87m01n1O2K3J8p9J48k20q5j06K23K26l5j31
2444a8k1j61K27P1n2j03L0J38J22k59l9r4J24K42l45K56K06l10j02nK81l67K73
2467I4j29N2k12J94J28l03K28k08J74P4N2k41L80l41K59j41j6J59k05P5J05k63
2489h5K96l82o0N50n82L58k45j9K0K1K23j94N6Q2k18K69j3J73o52L01M4J71m50
2512c36J49J26R9k30N20k50j84J58r4L81j91j22J02k33r3J43K42k28L83l82m0
2533h0K5J18O2j87N7k50M31j81j05K73nm07J26J1J96j59O7p6K39k31p7J39K66
$$ y = [130, 316, 289, 19, -94, -478, -99, 224, 36, 67, -147, 529, -229, 14, 21, -206, 372, -182, 216, 305, 300, -36, 88, 98, -161, 73, -13, 27, -34, -241, -77, 198, -15, 182, -147, -141, -106, 81, 26, -164, -109, -184, -65, -142, 74, -370, -253, -186, 160, 1, -136, 117, -173, -18, 203, 390, -11, -62, 0, 23, 41, -38, 110, -110, -195, -301, -78, 148, 113, -18, -39, -200, 27, 98, 46, -57, -27, 111, 233, -26, -65, -159, -35, 207, -138, 118, 324, 14, -88, -93, 188, -179, 94, -35, 17, -195, -1, 127, -176, 52, -156, 18, 92, 144, -97, 283, -58, 201, 60, 44, 203, -2, 73, 178, -85, 211, -171, -231, 319, -263, 95, -150, -169, -149, -128, 95, -99, -43, 39, -179, 90, 77, 250, -402, -101, -57, 114, -336, -187, -61, 38, -192, 328, 78, -106, 52, -42, 339, 148, 26, 128, -105, -198, -55, 187, -41, 342, -40, -80, -55, 63, 125, -62, -5, -255, 176, -5, -110, 163, 158, -249, -123, -112, 84, -75, -8, -84, 155, -76, -153, -14, 252]
2556B52k26O7k37K67k9j52k3nP6k33K84K9m4K3k53K23j09P8j81J38J16l37L98
2579A22j63K7o4p5M27j97k59K34j26K5J4J38j02R8l54L86j51l2O8l3n6M0j94J07
2603a20J05J81l11K99J60l40R2K54l72j03j18J45K16n4p5R2o6k11K35J46J34k65
2625B4O3Nj18rP2K1Q5j52J0J00j98R3j79M04k16Mr5J96j30K74k46KJ12k44O9j3
2651f6J22R1k78J50k0P6o2r1q6J51K6m4K74m60K69K17l57J16K3q3J67j76K05j38
2675B6L69l80K34k92r1L4p3L77m55K78j85O2K37l15J59K70J34m97M1K57q47N25
2697a32M52k55j4j96J5K10m3L72j7j40q8J40q8k75n2LP0K35l76j98J40j4P7J21
2721e3J71P3k73J3J81j63j14K54%n9k49J34l79O45k70J5j73K32J68k02n7k31J89
$$ y = [252, 26, 93, -144, 123, 94, -58, -81, -86, -10, -243, 41, 70, 26, 49, -204, 19, -90, -12, -193, -55, 61, -276, 122, -41, -14, -78, -153, 274, 77, -182, 52, -74, -49, -35, 103, 1, 99, -255, 131, -20, -52, 16, -17, -73, -33, -227, -120, -15, 166, -145, 154, 314, -26, 66, 320, -52, -155, -273, -128, 88, 34, -41, 51, -15, -226, 9, 155, 289, 24, 87, 92, -26, -35, 37, 58, 143, -9, 1, 101, -97, -4, -183, 221, 5, 9, -86, 110, -20, 254, 8, 10, 122, -122, -53, -66, 56, 147, -131, 19, -1, 75, 13, -78, -164, -13, 13, -31, 243, -217, 52, 269, -88, 28, 51, -32, 135, -41, 164, 26, 395, 15, 249, -43, -134, -100, -173, 204, -251, 27, -158, -96, 141, -174, -15, 255, 389, -108, -67, 190, -657, -132, 320, 65, 51, -145, -130, 80, 37, 409, 392, 252, 164, 304, 216, -59, -111, -108, -38, 197, -179, -377, -237, -251, -174, -53, 118, 191, -82, -69, 112, -51, -165, 89, 89, 30, -219, -85, -464, 181, -89, -74, -247, -15, 153, -49, -106, -337, -148]
2744a48J07j6j37L76l8l2k59L31l4m39N06l11jJ68j12k67K07J34R4O9j21K41k20
2767I8J36m07K66j18R3j99K19k07K63n5J91j27n05N65k35J28k22K22n55M77J16
2788A44l48L25j92j45M04k31O5K50l89m9J72j53kp8J30K95j08M2n06L49J22l17
2810b20N7Q0%K50k7P1j35j49j60J79J13j08K23L0j82j1j04k4K9O1l0K0Q1J57q5
2835A16n3N1j73J35k71L40j24j6j71J23o3n2J43j15j05l2M82k84Q3M3q0j46Q9
2858h0N7K88j56k21J62j60Q5L10Q1l17k07m0J99K56j04j22P8k11K59j69k1K29
2880A96j66M2J16R6l39l7o5J07J96n77K29J34K02k68L00k41M3J24O0n8M8J9k81
2903a20K30k51J92l39K17j8P5Q6j29K13J65p79N05kJ72j19k93J00Ko3L27k90n0
$$ y = [-148, -41, -57, -194, 182, 144, 112, -147, 184, 150, -289, 217, -94, -95, 73, -39, -306, -99, 35, 129, 198, 77, 318, 98, 234, -173, 93, -25, 68, -131, 88, -119, 144, 89, 280, 153, -352, 213, -22, 106, -116, 106, -449, 28, 144, -204, 121, -71, -216, 188, -43, 22, 272, -117, -166, 6, -147, -149, -227, -97, 198, 90, 132, -374, -25, 97, -220, -163, -83, -83, 167, 140, 211, 76, -73, -233, -54, 59, -49, 174, 204, 22, 11, -93, -117, -88, -27, -57, -37, 44, 201, 116, 63, 114, -59, 76, -195, 145, 21, 5, -166, -43, -106, -158, -15, -130, -235, -267, 215, -69, 14, 57, -23, -169, -80, -23, 265, 109, -112, 50, -110, -25, 285, 366, 49, -158, -198, 1, 257, 153, 31, 109, -102, 157, -12, -33, 196, 30, 72, 188, 284, -55, -92, -157, -50, 146, -431, -202, -68, 134, -134, 166, -75, -32, 92, 152, 94, 142, 161, -120, 110, -141, 51, -288, -71, -89, -14, 72, -57, 156, 321, -458, 47, 45, 217, 98, -195, -95, -93, -156, 171, -119, -169]
2926a69Q7L58l77J44KL2k50L56j97r5K2J25J40l49J88N0j65K00P9k66j23K31j83
2949a60K1K19J3j69K39j66j37K64j71R2K23j65q2m5K04l55N4K55p0k02K80l23
2971a81K40J26K44o07Q0J10j20l9J14k1o2p7L06p8K22n6k84L59n58M26q1oL5p
2995H5k22O7M7O2k14K58j28Q9j50J63l33K00R3k53K95o5l54N03l33M12j84m1k51
3018b54K20K9J0j15K75j63J38r0N3Q5n3j61Q4j87P1l7J31K13m50J02k4J33J47
3041A57j06k9K4K12k56k68K57o6J11R5M6m07K11K9J44l71o1L01n1n7oJ68O1m21
3065b83M66kk56N9K1J40j2l01k25L69j25M03k72J20k16O3K65J7j92j49q6J95N5
3088E4K38n47K38K04m1mJ52k53nj45R8q0K40J2j06J64j49k03J66O6k97L38j53
$$ y = [-169, -82, 276, -101, 43, 45, 77, -173, 183, -14, -109, -87, 38, 178, -171, 17, 67, -98, 102, 181, -85, -208, 23, -160, -139, 80, 93, -76, 163, -3, -140, 124, -47, 45, 268, 103, 21, -24, 180, -175, -121, 134, 64, -138, 142, -181, 59, 185, 429, -178, -98, 12, -108, -147, -33, -54, -116, -193, 113, 35, 257, 201, -83, 276, -282, 144, 63, 57, 92, 85, -137, -70, -23, 39, -175, 83, -45, 44, -106, 57, -276, -76, 17, -236, 59, -6, -360, 143, -190, 222, 38, -3, -254, -34, -5, 5, -110, 165, 2, 140, 50, 103, 188, 135, -26, 58, -129, -58, -95, 36, 249, -201, -99, -123, 10, 157, 51, 22, 46, 258, 2, -266, -9, -75, 36, 131, 177, -230, -19, 10, 154, -217, -278, 23, -28, -85, -91, 77, 138, -283, 183, 181, -75, -16, 5, 145, 133, -168, -393, -24, -149, 254, -18, 102, -114, -51, 214, 231, 39, -110, -196, -1, 54, 292, -255, -17, 187, 146, 142, 294, 41, 36, -109, -11, -91, 149, 161, 55, 219, 70, -133, 33, 99, -198, 140, -13]
3111a3k32K13L40l95M6k7J84j93K61p2j52r9K55j35K53l64J51j06q0O0L70m43
3133a78L02j51j42K11P9q2l40K61J63L7j26R1l40O8K90n1l94L01kJ58K27k47k8
3156A07j34K3J5j97K81j64k71L27J43Q8l5l30L4K14j17N2j08O8k56K20n7O8J8
3179a1Q5k6k06J93o4n5J24k82M66k34L70m29J11j71J45j14J71l07J42k1J54j13
3201g2r9K76k31K60K0p2l0J8p0J7q6J27J11m19J0M97k15k21K79k02jJ91k28J85
3225D5M7p0K79p33L51L8K84j68j08N6q1J93Jj30j23o4J62l7n0R8L50l06J34j37
3249C1q2K2K30l17J34Q2l96M45j64l3j87N45l69r2K5K52p4Q5k35J55j37L06m67
3272b41L4K92l47O00l84n6Jn9K82J32j93q3L6J2k26K85l42J23Q07l03n92N1M58
$$ y = [-13, -245, -32, 308, -87, -41, -68, 116, -77, 184, 112, -40, -139, 116, -19, 234, -130, 21, -85, -165, -105, 265, -178, 124, -27, -169, 42, 121, 39, -301, -40, 123, 160, 34, 125, -215, -147, 143, 92, -302, -1, -3, 155, 382, 135, 107, -27, -4, 11, -186, 95, -69, -340, -13, 130, 218, 183, -147, -113, 101, -16, 36, -72, -4, -260, -40, -97, -29, -11, 74, 48, -158, 35, -29, -84, 40, -242, 224, -10, 360, -69, 42, -129, 16, -98, 73, -234, -92, -113, 41, -72, -171, 105, -126, 134, 154, 82, 52, 70, 0, 17, -69, 58, 169, -250, -240, 257, 42, -179, 100, -102, -103, 88, -140, 45, 92, 22, 301, -432, -81, -43, 241, 73, -35, 21, -60, 133, 134, 4, -119, -183, -21, -58, -108, -10, 340, 34, 168, 31, -51, -29, 201, -116, 18, 100, -296, 149, -15, -48, -235, 310, -59, -151, -126, 126, 52, 137, -98, 57, -80, 226, -241, -207, 85, -262, 338, -46, -102, -101, -160, 122, 254, 61, -22, 14, 26, -200, 85, -257, -134, 673, 370, -222, -171, 287]
3295B87l90K86j39k99K0k81j33L39Q86O0p76N96j85n42M24Ro11M80l56k87J083
3316D71J24k50j81Q7p43Q38n58j06j90O51r63P72M80K81K55j322M19K2k20l6J75
3337FP73p82l99N45K71r77l32Q93r09j65J356l22n61N04j54JP13n47l02N00J22
3358B34j152M22N07O39j075k09O26n71N76Q6j77J55j092L87N12l5l63O37k21q4
3378a98P75r28M49p4N46j083L97M11n87K38l80J060p71k97O34l6K93k25j41O1
3398A44J97J00M45j488R85p36k48J342k56k42j70J72j52K7l78O31l59K65m22j23
3418b66M49l82R9L23k95L2K57k57K20q12L48k56K72P79j12o41J86P0l24L25j12
3439i7N7J61K45l19k01M63M66j047Q00j023M89m04O74j5O10j284M38q65R61pJ42
$$ y = [287, -103, 183, 44, -255, -235, -516, -649, -310, 576, 636, -140, 456, 271, -271, 153, 162, -449, 31, -325, -612, 471, 595, 345, 164, 251, -492, 346, -212, -318, -508, 143, -820, -48, 432, 713, 968, -354, 65, 87, -133, -169, 6, 779, -3, -402, 143, 414, -563, -895, -2, -911, -1076, 280, -42, -603, -99, -253, -252, 461, -86, -388, 112, 234, -918, -496, 11, 650, -425, -634, -8, -579, -3, 83, -94, 61, -1031, -644, -132, -167, -530, 107, -114, -198, 577, -351, 98, 24, 570, -513, -116, 295, -292, -54, -434, 626, -145, -442, 192, 156, 449, 224, 83, 144, 341, 441, 886, -602, 383, -353, -601, 741, 485, 243, 73, 245, 93, 120, -258, 373, 14, 279, -143, -266, 183, -199, -100, 223, -72, -40, 217, -40, 180, -632, -284, -540, -268, 511, 399, -242, -56, 14, -310, 15, -97, -40, 121, 366, 47, -154, 309, 775, -272, 528, -495, -6, -410, 264, 249, 859, -425, 13, -852, 109, 102, 244]
3460B44p46M85l48P0j46O73J30j38n32O03m38Q2P69m29l76L46j81M6K17j13K58
3481D76n00K96o91O81k74p29O47Q19r44r4k61M17r24J758q90J57P28p01M67j68
3501B70l95j39J73K32J022j076n70O21J11n81l72M47N4k66L94j66j44N1N70K99
3521E35p01k41Q19n6l29M27j23o0k69J88l25k56K60l28L42l84J90j93L48l5J97
3542FQ3Q9n91N54J47p67l30O91K1j10l52O82j05K1l41N74m62k43P88j135R24r4
3564E0mJ95K73l50J27O3k28K50n25M02j55n91R45p50M46l73K17k92N27j30n47
3585d50K40Q28p57k35N42r98M90L48k90K95k55L93P9k39l7M40o12n16Q69j55p42
3606g62M53K11N7j48J017o67p05M82m65M81O94n44k01J2l58J259q01n80J98P35
$$ y = [244, -502, -17, -365, -295, -441, 232, 362, 224, -308, 295, -143, -61, 708, 279, -97, 249, 68, 114, 331, 218, 476, -24, 272, -419, 262, -12, -741, -94, 725, -219, -313, -574, -157, -1081, 677, -213, -56, 672, -29, 438, 270, -125, -264, -91, 141, 1163, 87, -483, 138, 249, -332, -704, -257, -203, -469, -75, -241, -385, -334, 236, 535, -166, -407, 412, 356, 27, 454, 331, 271, 2, 190, -135, -391, -131, -459, -117, -501, -311, -504, -156, -191, 6, 89, 178, -413, 141, 288, -479, -809, -118, -97, -207, -559, 123, 18, 39, -302, 272, -190, -433, 355, -780, 144, 50, 46, 241, 514, 164, 291, 354, 126, 376, -149, 253, 98, -493, 452, -298, 148, -225, -8, -300, 227, 97, -450, -210, 618, -139, -374, 168, -830, -340, 8, -282, 13, -242, 151, 230, -9, -46, 394, -218, -734, 135, -20, -762, -309, -98, -41, -189, 828, 161, -544, -62, -527, -46, 648, 104, -97, -85, -443, 816, 15, -565, -367, 368]
3626C68o57N12L66p82K84K58m33m7R8l62J060j179J55N55l5o40j0L39q32J482
3646E00o07j56Q85o66J27m44O76n74l5J88p87Q60l37m58J525r53k00N67k39O28
3666E00P6M7m99l60M06J65m77J90o3m8P8O6l39J68K26J32j49j29j76m33N31N67
3688D79l60jk05l54R40n14P56q33k29M73n8K92r89Q85k32K13p03l6l56P92J97
3709A57p24N33k06N01R9j70k09p7N0J34J41k8n40L25J15k19j2J16j49J60L2l39
3731c10J86K25l11L29p3L9j05j75K90j2k1j18o5j41K37j29J07P7J52Mk21N4m5
3754b6J29rj54K13K0N3m4j03q9j04j62M33l24m9M36k70J50j17J94j84P0k95R4
3777a38K54k48l4J06L43k56R2n1j35J67q1l0j1k9n1O8qJ68q1L1kl5k26Q9K84j11
$$ y = [368, -289, 223, 589, -193, 91, 349, -84, -131, -33, -395, 665, -514, -359, 196, 161, -479, -489, -150, -982, 500, -107, -263, 622, -44, 83, -361, 315, -259, -294, -106, -893, -33, -370, -828, 697, -256, -456, 111, -128, 500, 576, 623, 124, -236, 170, 335, -142, 48, -15, -63, 15, 81, -258, -90, 136, 268, 119, -10, -186, -619, -88, 479, 119, 118, -87, -441, 499, -15, 741, -92, -321, 152, 94, 386, -603, 282, 50, 263, -440, -476, -832, -40, 157, -567, -34, -240, 261, 360, 190, -19, -96, -46, 88, 229, 201, -339, -14, 101, -118, -130, -14, -163, -3, 29, -310, -124, 101, -210, 119, 46, 85, -20, -195, 95, 83, 62, -56, -121, -262, -25, -154, -47, 30, 182, 186, -35, 19, -26, 103, 94, -60, 153, 173, 226, 182, 79, -10, -114, -276, 157, -167, -216, 220, -50, 100, -17, 177, -7, 63, -232, -138, 116, -132, -166, -60, 283, 27, 119, 68, -67, 100, 19, -11, -22, -51, -102, -34, -42, 126, 45, 76, 74, 39, -187, -98, 186, 75]
3803G5r0n6k23K73k80L79j13l2oJ02Q1k12J98p4M3j63Q5n1j3r1K03j55O2K19l59
3828a98O8m3L3O2J31J6k53N38m72J50o8J3m3R6J76l91K33J80l65J29j30J77k27
3851a88N1J25r8L56l11r6J01k10L91J65j7o0l8j09j39M8q0L44j79j81L11j63k72
3874b49L46Qk3j09J67jr2p1J90k75L10j07R8k06J9j53o2N11l9k49k57L12j05k69
3898c06J58J19K47j70r4J68j89K42l39K11K5j09m5K03j05l8kL65l75j08J82q0
3920d0r0j9p6J78L36j91Q0k22r0K42M3k78J0P7L2J1O8o9K02k86j75L60j09l2J49
3945A11j25jk56K07J67k36L35j10j6j86J55k12J52K4j78J75j37L85%q5q7J11r2
3968A01j71k49L75Q05n50q5j42J96j94m81K79O03o39q5L24L03q29m87J229k8K97
$$ y = [75, -15, -71, -294, -21, -301, 78, -35, -67, -73, 29, 110, -102, 96, 22, 65, -98, -13, -64, -77, -168, 35, -120, -58, 161, -198, -130, -173, -140, -78, 53, 69, -184, 354, -118, 32, -36, -23, -66, 30, 206, -185, 48, 228, -137, -8, -138, 39, -188, -137, -12, -110, 246, -65, -161, -60, -270, 121, 286, 269, 209, 171, 62, -77, -29, -109, 235, 56, -125, 186, 23, -249, 97, 105, 82, -27, 140, 139, 47, -24, 166, -109, 201, 94, 192, -14, 5, -148, -210, 301, 262, 13, -244, 68, -37, -306, -148, -29, 218, 48, -46, 122, -67, 175, -164, 47, 72, -37, -82, 121, 16, -22, -24, 341, -34, -142, 40, -40, -130, -149, -225, -47, 289, 98, 178, -44, -134, 108, 151, -127, -117, -40, -8, 3, 71, 2, 204, -82, -257, 103, -6, -38, 111, -14, -15, -271, -64, 103, -133, 202, 92, 76, -110, 45, -167, -15, 9, -169, 6, -131, 254, 254, 169, 82, 193, 101, -70, -319, 56, 861, 311, 226, 84, 280, 86, -395, -116, 487, -152, -237, 87, 390, -439, -926, 303, 275, 572]
3989E72o35M5Q4r95J130J01j074J218j161L82L22j12j051R62K09j001R11m10M01
4008a02R6k20K66j66J68N1O2k03O1L73k75k72L44k2O1n40M03k72K71R0o2nj47
4031d0j74L43l90J61M3K04r0R0j49J14l5Q1N1q6J08K7j47N6j45J59j01n3J06q4
4055D9j48J74Q4m00J31K01r9o1J05p4L0K23j11o1j28O2M0J45j13j38J59o5K9K20
4079B54N9m02K7J80j26J74j19J30k09j08L3K5N0K25k73N24L4l01r7j6k85Q0j15
4102b56L40l19K34J33k36k8J74o9j8j3O0K10k75j74K16K42j48K4j25J27m89J58
4124b32J96K92j71Q6l27J07Q2L4J38k67L4q7L54j90j07RK51l81R2K51k24K19k18
4147e9Q7j2j29K09J6k86L78k76M2K67p30L53QL0K24k91J41k53L24l54K14K01m01
$$ y = [572, -63, -18, 66, -929, 201, 302, -772, 446, -715, -333, -11, -123, -1174, -212, -3, -1004, -93, -503, -102, -6, -226, 40, -126, 42, 93, 155, -48, 13, 386, 111, -161, 183, 161, 222, -318, 85, -187, 84, 174, 112, 107, -40, -214, 129, -261, -100, -57, 147, 57, 147, -2, 112, 77, 158, 209, 123, 231, 258, 111, 167, 22, 181, 80, 27, 133, 49, -99, 75, 159, -241, -110, 91, -8, -69, 36, -38, -8, 215, 104, 43, -85, -23, 17, 162, 49, -89, 70, 5, 34, 254, 313, -89, -62, 118, -8, 166, 47, 177, -32, -140, -107, -82, -32, 193, -80, 444, 478, 177, 80, 64, -221, -141, -256, 84, -235, -1, 132, -104, -132, 42, -27, -45, -58, 2, 212, -63, -237, -21, 221, 73, 97, -28, 99, -390, -232, -36, 256, 85, 171, -156, -49, 33, 67, 205, -62, -28, -115, 239, 49, -58, -49, 202, -179, -87, 164, -60, 159, -59, 28, 16, -113, 96, 112, -174, 204, -72, -30, 237, -493, -140, -132, -102, 122, -169, -28, -281, 43, -311, -97, 104, -297]
4170b97K96lj64K1J36J21l17K29J36m09L03j49J65j79N3k32L67l8O7j19j73j20
4192c06K33N2l7kj25J9N2J38J42k69Q9N5k12M8J94p5k31K35m0R7k3J78k80P7l22
4217c13L96j32J43L8o4R0q6L9j62J19J09N4l54M2L46l72k5K78l46Q3K02p1J98
4240B12k85RK66j70l17J54L0J76K10j39l02k0L77k63J16o5J23j22O9j22kj34J43
4263e6kP1r4L04j97k88J99k05N15k15J23j05Kj29q8O5J05k65K48q9L31l24M9l4
4287g9J40j15J65l2j31K83l44J12K7J8R0l89K15O3q2J02j9Q7L6l5pQ6l90J56M0
4312ck46J56j45L47N5p7k48K55m25K53K10L6J99j39k21m2r5m1J80L18o10PL20
4335D4l63M11M2j14O8j28k2J27m7n9M19m34p2O7K71k49Q5J05k82J94L3k60J80
$$ y = [-297, -1, -4, -168, -147, -11, 110, -207, 22, 158, -251, 52, -97, 68, -111, -58, -290, 77, 39, 106, -13, -186, -306, -73, -21, -58, -60, -185, -166, -114, 24, 166, -103, -14, 41, -171, -123, 71, -4, -235, 0, -40, 57, 34, 212, -68, 9, -313, 83, -49, 94, 132, 68, 158, 72, 111, -51, 68, 177, 231, -123, -81, 265, -107, -132, 146, -200, -117, 85, 14, 212, -73, -64, 202, 32, -285, -131, -101, 75, 285, 146, -156, -176, 201, -62, 54, -11, 112, -10, 59, -63, -65, -199, -56, -58, 13, -81, 223, 26, -262, -63, -268, 247, 32, 155, 50, 52, -77, -165, -100, 5, -260, -12, -101, 230, -94, -45, -79, 61, -54, 111, 79, -52, 231, -113, -1, 26, 44, 134, -255, -40, 23, -59, 43, 24, 111, 147, 112, 105, 191, -199, -43, -3, -249, -93, -238, 109, 164, 87, -161, 94, -331, -78, 132, 168, 367, 228, 7, -35, -130, -171, 9, 327, -283, -276, 44, -319, 92, 134, 20, 88, -40, -62, 65, 18, -41, 378, -56, -128, -61, 210, -39, 46, 151, -131, 63, 96, -164, 16]
4358A6j87J56J21j99P6K56j58k2J19k11rl0M4j13lk68J68J61j53Q6K45Q0q5k28
4382a38L02j88M1N2j09J22p6j71J8K42p7j87O2R8J71j37Q3k63M44k50m6P7j88
4405a18K47l38L7J95P5o7j4pq5K69l19L5N4m7L08k07o6l6R1L3J25l48L13o0j74
4430a04J60l48O9J20O7M18n73K2P2O5J31l20K27J8l6j05K26j49N0P8M8M1p2M42
4454E47l14m03J21j66Q5k25M83k37N9j6K70K9j32M5m12K07K4L42k98J37K3n2L6
4477A53j88k91N5K80j20O5J42j52K86j95j05j87R3K25j63L34k85L35k58N6J44
4498B24l80K39k08n8OK56k20J87Rl94N74l05j19M34l52M2J25J5j27j12L81k95
4520g8l0N3L21j59l25L05j29J44l51K24K9k25J12J05n0J52n90K93q7K42R8M3K04
$$ y = [16, -171, -15, 106, -93, -17, 239, 81, 59, 178, -33, -42, -72, -28, -141, -144, -412, -244, -83, -236, -150, 95, 175, 90, -138, 164, -24, 17, 69, -40, 82, 6, -165, -147, 95, 18, -169, -107, -9, 162, 25, 108, -155, 289, 39, -7, 70, -118, 129, -209, -172, 23, 98, 31, 17, 10, -75, 194, -125, -90, -36, -83, 225, 18, -48, -84, 7, 40, 165, -183, 130, 70, -104, 56, -292, -223, -103, -36, 382, -191, -169, -97, -32, 99, -221, 6, 24, -12, -117, 109, -40, 10, 88, 136, 177, 105, 547, 233, -170, -49, -215, -130, -355, 128, -109, -50, -66, 204, 233, 101, 146, -266, -59, -35, 307, 9, 146, 169, 117, 153, -35, -326, -271, 9, -111, -46, 96, -56, 230, 35, -70, -257, -164, 61, -102, 232, -53, 282, 24, 80, 224, -156, 83, -125, -183, -177, 79, -141, 46, 55, -339, 235, -70, -189, 245, -107, -65, 60, 75, -52, -164, 217, -78, -108, -55, 266, 107, -218, 87, -42, 102, -249, -25, 4, -221, -109, -4, -54, 98, -492, -199, -286, -44, 54, 97, 301]
4543C01m56L51k87K98q6p1j17j78L66k74j20K58j30J12J28j78P0l80J53n1M78
4564A87m05O2J82j01J75l25M92j17M1l19rJ20r5J68l47O0K66k01Q6j07J88p7J73
4587I7j1j28r8p3j17M44j40R4j47QJ44l28K4R0L65k34J30j37n3j8K35r1Q6j14
4611B8Q0o8j77L06q9J2j38r3N5K85l38K9lJ71k58K06P4p5O7j62L4m0J05O4j44
4636f9J70M3k64J16K37j09j59J85l44J9M9K19j89J09J8q5O3l0K37k44k55J74J36
4659B7J3pql8R2k07J87j60K62n0k42J6K53Q1j86P4J02k95Lk4O1R8p2N3j13j07
4685a87K68j64J18p3K3N1j74J75mj87j2K41K36l85J79o1Mk16K07j50J58p1L9j85
4709a70K37n4o5J88J5k84K23j13o6l2J63r6j06j63K89j70J42J39r3J10m7r9N0
$$ y = [301, -155, 196, -91, 207, 121, 50, -67, -245, 121, -153, -273, -15, -145, -33, 95, -83, -13, -393, -240, -291, 187, -218, -156, 26, -75, 100, -225, 267, 150, 191, -128, -137, -17, -112, 56, -291, -231, 35, -166, -80, -187, 1, -76, 97, 86, -42, -140, -213, -330, 114, -26, 68, -79, -71, 73, -255, -231, -141, 224, -10, 120, -17, -70, -88, 147, 56, 142, 28, 108, 40, -137, 169, 80, 92, -46, -139, -84, 201, -137, -108, -111, 60, -198, 8, 82, 7, 74, -88, -54, -94, 11, 75, -69, 101, 144, -120, -4, 233, 124, -35, 150, -194, -175, -126, 93, -96, 13, 31, -54, 9, -21, 216, -28, -283, -109, 27, 40, 33, 25, -13, 79, -128, 59, -101, 161, 111, -131, -115, 138, 219, 33, 107, 209, -86, -83, -107, -46, 52, -20, 33, -80, -187, 81, -83, 35, -38, -15, 36, -138, 37, 33, -154, -166, 75, 311, -74, 105, 44, 48, -168, 39, -111, 47, -24, 15, -170, 67, 13, -52, 136, 151, -133, 90, -23, -89, -121, 42, -54, -160, -323, -34, -204, -62, 77, -16, 94, 47, -52, -2]
4732bM3l04J89J83Q2j06R5k20K73l89l2j06J70P8K4k23L70j67o7n5J39J28K5j36
4756hr9O1K49j90j6m24N51q1J88k0k58J82j28K3J97k32j06L26k38j7o1L9J72j97
4780h7j2L5q4K73m81M05n1m3l53M29m71Q10l20L33k82n86J132r48M67p80P12K00
4802B98m17RL72M6k69r24J554k31n87l91J86o0M11K79p25M59N3j47J44j55m64
4823e59J526j803J105M72m72n43P13p72J288m44n48J70m76R09J55j933J600k57
4841A31m91k25J810q12q0j080K87N78M17p8j058O52O91n35k34j49M30N1k57rO0
4862I9R0J6p37J28J206r85Kn50J185j141M68R01o73l64M73k45l49NQ24o40M17
4883A30J3o91J2K00M09J11J22j12l25P2k7j5P0K50j09k36PO4k04L65k13Q6m2k57
$$ y = [-2, 41, -263, -74, 109, 191, 85, 180, -40, 233, -156, -188, -294, -124, -46, -22, -245, 125, -42, -109, -164, -25, 103, 128, -8, -107, -46, 203, 13, -3, -427, 124, 43, 231, 211, -47, 135, 7, 30, 227, -5, -111, 215, -23, -40, -101, -62, 110, -87, -99, -64, -148, 125, -356, 49, -2, -45, -398, 31, -440, 370, 50, 383, 101, -485, 647, -301, 166, -614, 98, 298, -119, -110, 262, 308, 39, -885, 669, 438, -149, -540, -354, -414, -3, 276, -449, 10, 63, -84, 60, -95, -559, 967, -836, 269, 741, 269, -274, 439, -333, 955, 511, -37, 133, -343, 566, 721, -1212, 388, 131, -360, -585, 1225, 413, 333, -747, -460, 118, 535, 457, -601, 51, 742, 207, -27, -176, 254, 305, 48, 39, 99, 189, 205, -532, -404, 802, -183, -181, -731, 454, -687, -219, 682, 9, -355, 118, -127, -476, -471, 353, -287, 130, 143, -548, -536, -336, 73, 184, 306, 194, -131, -59, -86, -101, -31, 219, 110, -126, -119, -55, -259, 106, -107, -21, -63, -320]
4907c20L22j37K29K7L4j44N10p55M50k81N7j20M5L42J86m11J55l33K07p3Mj72
4929a78Q8k9L50k86R4K97n17L30j31k7l5J94j79j99K49P2k79K04q9k0k20N54l44
4952a01J92K28m38J37rJ0J16k3k0J6j09o4K86j49l85O7K29J54l85J55M28k5k09
4975A01p0L06k61l55J61pp48J415k22K52l43p04J28K98M89p07J24K52k45k80M51
4996C5J91l76K93m27O68n70q23L97J362m44k41n4L65o0j82p9M37n37l03N71j66
5017E7j42j29L04O5p8m57M49R9j41M71l69j64k37L71p5J12k00j56J17L13J77n23
5039a36L5J4o6J77r0j0L22r9j49j00k4J74j69R7L49n57L79M8k8l1l3j4L5j33j52
5064a61N7K33k29q8J53R9j85r4R2L77m78J70j33K36k0O5j59K39l17J76j90J87
$$ y = [-320, 2, -135, 94, 121, 155, 11, 521, -234, 216, -65, -8, -128, -83, 259, 445, 34, 189, -144, 63, -10, -6, -178, -90, -119, 231, -55, 39, 336, -181, 149, 18, -9, -44, 150, -29, -228, 21, 93, -186, 18, -71, -91, -311, 243, -101, 91, 319, -119, 18, 9, 19, 135, 112, 92, 108, -1, -65, 221, 72, -313, -246, -17, 137, -248, -93, 335, 310, 101, 31, 337, 76, -279, -118, -125, -873, 542, 320, 572, 229, -475, -347, -49, 440, -267, -143, 109, -136, -416, 35, 226, -150, 143, -284, 384, -186, -1009, -612, 750, 306, 65, 11, 376, 316, 134, 55, 492, -45, -348, 223, 57, -85, -214, 90, 155, 77, -380, 69, 168, 27, 498, 129, -35, -272, 99, 24, 136, -64, -220, -103, 210, 387, -136, -101, -87, -153, 24, -66, -76, 246, 147, -2, -102, -126, 48, -121, -24, 325, -232, 147, 195, 167, 136, 103, 89, 124, -9, -161, -104, 129, -100, -188, -35, 64, -121, -215, -123, 254, -224, -54, -187, 49, 29, 94, -65, 174, -143, 33, -157, 30]
5086C0r7j7K3n6L72m35J56Q8m11L4L43j45R7j45K69j72o0K40j34Q7p8L20j51j66
5110hn4L31k77mQ9j8J73m57L54L7l19K64j16L44k30J9J91k87Q3r9j93k13K92N7
5134d1Rk27J26L43k97J44k74N10k82o7R4j15J10N4k59J16J06k67j03N94l32N3
5156ej85L37l73K30Kj03J39r2K08q9J14Kl85m11O34M4K83o81Q01j157N32OM74
5179C25n68R47p41k11L71j59M69n8j24l67ok37M57L3m85M00J4P0j79O9R8j63J51
5202A06j70K7O7N8j05j25K21K82k72r7K4o3K9o2J6P6K56j79m5JM9n6o9J72k01
5227f0K61k33L9j34J11j58J24K21Kk55N91k42l43P7LQ1k91o4P0M40j67K36k93
5250A6k40M7j53M05j02m8J55k00LK48k60K67j3k32L0k25L16K6k45oJ59J21J18
$$ y = [30, -67, -84, -61, -117, 255, -180, -24, 64, -347, -313, 30, -115, -18, -163, 106, -66, -126, 114, -20, 67, -11, 309, 158, -8, -62, 269, -8, -12, 77, 59, 232, -225, 129, 166, -153, 111, -5, 339, 109, 128, 319, 32, 115, 16, -177, -390, -98, -41, -32, -259, -133, 210, -87, 57, -217, 293, 11, -56, 38, -77, 33, 87, -172, -56, 50, -217, -320, 274, -58, -5, -190, 147, -226, 4, 6, -97, 42, -50, 158, 69, 183, 185, -200, -611, 23, 67, 350, -331, 470, -687, -155, -149, 325, -243, 704, -37, -248, 123, -36, 433, 375, 251, -116, -122, -359, 98, 131, -354, 46, 60, 130, -49, 20, 118, -45, 106, -64, -37, 30, 88, -17, -142, 79, 361, 89, -8, 16, -47, -18, -80, -64, 12, 268, 89, 44, 45, 94, 38, -31, 141, -60, 201, -32, 7, -127, -16, -174, -50, 171, 173, -82, 509, 267, -76, 1, 4, 85, -206, -270, -200, 240, 73, 309, 16, -224, -177, -330, 75, -27, -75, 80, -120, -117, 131, -129, 138, 125, -107, -77, -302, 14, 40, -205, -211, -52, 69, 187]
5273A87k40M3Q2j53K6J55M6k7j11R6K2k92L3K61mj94O3j07K03J2jJ80k85n7J1
5298e1j60J44J66p5j1q6J80J01J51n05L39l08K40j17J42r3k76k7R8j73O22l46
5320d5rr0K83j72K71m7r1j96N6J49q7j72K23k12J47n5L7J95k92Q9R0P3n7J2k62
5345a62K65j57j7L18l2j22K27j50m8k66J49K74k93J26k52N8j2J40j33J57k04J91
5367E7k29K8K52m0R1j81N5k16K32M3J1j9j42J63n5J50m78K28m5l45L33L96k53
5390C6K6n06L19J35l8j59J14J62n1r1j92K89k42P38m34j21p8Q1j4PK3J10n4j43
5414h3k3k23N15J22j79l0J07l0m6K4o8j06j90J49k9m7j03L00l0J1J12l80J61L6
5438c0K35k76N4k17L80j48j35K74j3j80J1J07k91L4M7J22Q6k48N56m08N5K7j36
$$ y = [187, -53, -10, 72, -81, -55, 100, 146, 119, 8, 104, 126, -166, -133, 128, 124, -70, -7, -114, 89, 101, 100, 280, -5, -62, -51, -211, -67, 99, 24, 13, -73, 107, 208, 359, -146, 193, -115, 125, 8, 150, 57, -219, -246, -148, -321, 301, -45, -54, -144, 139, -33, 238, 191, 100, -96, -40, 109, 22, -150, 73, -139, 8, -47, -10, 185, -107, -18, 72, 145, 88, 100, -162, 103, -54, -71, 247, 215, 93, 320, 170, 122, -144, 5, 279, -14, 112, -140, -82, -94, 46, -87, 70, -134, 57, -172, -144, 108, 68, 159, -22, 33, -183, 49, 92, 103, 84, -58, 105, 50, 200, -278, -50, -95, -440, -107, 289, 36, 62, -444, -125, 10, -28, -187, -73, 89, 38, -53, -245, 44, -198, 540, 106, -15, -93, -12, -26, -19, 4, 114, 60, -83, -106, -329, 186, 308, 129, 99, 206, 176, 130, 154, 86, -20, -210, -61, -90, -137, -240, 60, 30, 41, 153, -227, -66, -30, 205, -71, -17, -234, 146, -2, -137, 137, 124, -56, -45, 62, -229, -195, -148, -26, 60, -188, 368, -40, 15, 42, -94]
5461i4L41k90n4K36j54J1J00j49p2J04L13j92k09J46K0j94J2J51O5k2J5j2Q1j23
5485C0L7J33m79K77J47jo7k51P9J74l57j59O20k44k27n5m3M25o9J98l9k18M70
5508C81k63j84K96l32K35k52K90M66p76O61n41P05j266L11M46k6n08O61l91j44
5528b31N23Np30L44N30n32n6N08o69N41J89p66J72K47j82J73l5m67K68Q44j371
5549f95O95l68Q2m6K26k91N17k4N58p76M18k9K50q20M06K48j90J91k2n59P13o5
5571D19n9k09J28q1qo18r2Q28l96N93J23o65J4K88l57K63j3l15J46J27j60O82
5593F38r88J12j2O2j38O63l17l63k98M86pK47l76J04L88m21P95j124N79l4o9j18
5615a91K0J96K50J31j86k60J24p68N37q13R57M44l83KN3J09j87J74n9j62L57k97
$$ y = [-94, 247, -43, -97, 139, -15, -4, 96, -53, -125, -21, 292, 100, -109, 37, 57, -137, -125, 26, 91, 69, 84, 72, 153, 30, 67, 200, -279, -2, 145, 144, 77, -174, -95, 79, -278, -437, 183, -61, -288, -343, -386, 39, -30, 168, 129, -89, 381, 118, -66, 230, -102, 133, -119, 171, 637, -139, 522, -19, 686, -580, -269, 177, 151, -357, 304, -87, -231, 292, 297, -433, -89, 441, -91, -147, 361, -308, 233, 422, -344, -172, 75, -107, 66, 31, -436, -168, 676, -695, 0, -368, -286, -332, -106, -397, 120, 96, 654, -122, 296, 267, 517, -303, 103, 351, 161, 352, 330, -229, 484, 419, 360, 151, 279, 198, 190, -428, -520, 308, -88, 505, 628, -37, -23, 265, -92, 171, 158, -157, -11, 116, -44, 638, -350, -238, -250, -188, -326, 337, 20, -343, -641, -155, -162, 85, -291, -187, 201, -220, 575, -549, 30, -4, -73, -191, -171, 25, 275, 406, 220, -40, 84, -684, -147, -960, -3, 441, 58, 60, 113, 222, 35, 209, 150, -12, 345, 48]
5637D8j18N4l65L27k1L08N8l67k8K3L5J61J10k95J80o30Q72m09M8O3J53J62K30
5660E99m17j63M32k94K01l91K72M83r90L35K09n09N89r06J101k59p88L90k3pL0
5681a06J005m91K63k44n77Q11K23l81m6j1q15J1k5K82L07j90N9j0K64o1J92m02
5703E8K63L61j94q65P8Q48o61M0O04o74l65L04M52N53r29J65J03M51j42l26j4
5724A10j054K193n18l38j40M14p03n80K14j36M51K74L09j02J4k22K19p06k4N0
5744b75P53p91M2K97Q51j284M29n1m3N76J6j50n45L89K39K00r91K89q1j18L87
5765A39N94k5j392O6O61j06j1J18m10J044m01m7m50R50r27Q22q44Q93n08J65p88
5786d57N23N71L00o10q9O82r03L57o49R05m60j536J378j087J094J42K24j338J003
$$ y = [48, -70, -16, -381, -54, -75, 233, 291, -76, -104, -81, -46, 115, 225, -70, 110, -520, 352, -57, -9, 54, 207, 369, 599, 182, 19, 451, 157, 358, -33, 239, 722, -268, 67, 276, -233, 356, -550, 551, 292, -496, -106, -129, -136, -106, 899, 408, 671, 427, -150, 661, 884, 503, 457, 446, -369, -358, -383, -101, 206, 16, 75, 65, 329, 268, 460, 58, 321, 682, 488, -377, -299, 549, -112, -72, 532, -142, -507, -203, 249, 802, -127, 38, 141, 592, 450, 124, 110, -944, 1249, 731, 393, 253, 667, -36, -616, -402, -538, -87, 187, 496, 394, 408, 186, 405, -301, -325, -275, 478, -313, -271, 26, 877, -407, 22, -29, -72, 504, 520, 370, -175, 214, 453, 653, -338, -49, -130, -248, 139, 733, 708, -684, -618, 43, -63, -74, 44, -366, 678, 277, 230, -220, 730, -197, 625, -219, 674, 166, 331, -457, 66, 637, 937, 327, 238, 920, 17, 374, -275, 630, 170, -1366, 12, -1075, 19, 161, 385, -953, 50]
5805E0l57k19J542j600K45M49K50O01J69q99j34J70L34o54K81l55l50j27Q70l57
5825i1r2J18m60P16o40O05M48m15k1o67R51l81j87r7M17j81rM31p45q8Q41j0q77
5848d34N08K49l03pj6p7M78m14K89l12K98n04M87l98K48l6j11L0k44J06O0L74
5870B71m30J76qM8K5Mm9j22l5K87l4K5l61L96K6l11M7J93l31j19L78j16j41M88
5894C07j69l64M58l1l00J13j6K4M3jj61L4K21m03L41j17k09L96j14R2l20l5K38
5917B7j20K85j09l82O61m02j04J30j84J87k4K10k64K54l65P2k12K66j21J75Q6
5938F6k84M6j19J91J20nj44J22M01l38Lk53K17N4n4q8J29M4j18J29j1N5l59K56
5962F0P7J5j27j20J59j16N3k55J13P8K64m01K87q6J25P4j24k86K66k89K57q6J00
$$ y = [50, -307, -526, 1016, -584, -339, 110, 360, 961, 1130, 231, 97, 267, 601, -53, 228, -127, -477, -604, 266, -91, -183, -65, -525, 191, -449, 156, 604, 189, 168, -499, 452, 71, -116, -213, 204, 23, 14, 445, -300, -388, 453, 443, -434, 74, 323, 20, 13, -3, -80, 398, -16, 273, -39, 259, -245, 242, -156, 92, 56, -55, -25, -269, -163, -103, 271, -159, 17, 9, 57, 82, 86, 37, -85, -120, 167, 133, 158, -203, 193, 219, -92, -45, 148, -183, -302, 76, -40, -181, 307, 138, -226, 232, 201, -99, 14, -2, 22, 65, 64, -97, -63, 158, -245, 96, -21, -230, 166, 52, 144, -176, -211, 27, -93, 192, 83, -299, 362, -40, -144, -14, -198, -11, -35, 175, -89, 165, -200, -128, -340, -74, -195, -20, 66, -218, -172, -291, -100, 20, 15, -129, -7, 394, 56, 59, -194, 23, 77, 23, -65, 64, 108, -10, 119, 108, 163, -196, 60, 137, 152, 25, -95, 64, -52, 1, -254, -141, -63, 201, -200, 87, 1, 126, 200, 76, -210, 56, -233, 24, -62, 38]
5985C8K5q1k37K33K36l73L15N6m9k3p1l67K19J24m61M33n2J87p4nO9j47j50O6
6009h9L30l65l4K15P8l06L46j46L18m68K89k0k28R5J04L4j44L5J23k73K59J9j42
6032C0J7l2k56J33j3j05J14M02j56p7p4O2J07L1k95J8L10k79P6p7J09k45M6J09
6056d5r6J63l26M70m5QJ12m79L44j53k4O2j20K72P9k44J63j19r3N8Q4l2k40N3
6080a48K2M9J97k98O8L37j36K7k78K14j2j75K4R5k17K19L9Q7m18QK69r8j1JK28
6105I3k52J7NK65k53mJ15M6k37N73k04j90l8P0K5p7J42k66P4nJ3k1j54K44J78
6130A59m22J66j43L10J20k40P6r2O1J93Qj82J2p7L4j8o8r6J53r7P2l2l7O6O0J36
6156A22o4l2q4J13j11j71L57j84J79k9k8k99J64J36j77L7L74k78r0L1Qk07K91
$$ y = [38, 63, -18, -255, -22, 214, -159, 156, 212, 163, 140, 69, -298, -79, 45, -416, 17, -35, 152, 78, 73, 142, -5, -155, -89, 241, -124, -158, 57, 135, -171, 175, 29, 347, -121, 168, 148, -80, 15, 119, 153, 9, 44, 167, -106, 153, 172, 30, 47, 15, -241, -108, -121, -226, -112, 290, 134, 57, -17, 45, 152, 183, -112, -94, 216, -63, 13, -64, 45, -200, -154, -45, -141, 22, -304, 166, 121, 129, 241, -238, 106, -47, -71, -9, -129, 143, 222, -22, 141, 22, -71, -13, 71, 39, -201, -148, -126, -77, 120, -178, -110, 227, 91, 118, -160, 54, 42, -133, -109, -14, -231, -12, 27, 114, -304, -296, -27, -125, -136, -135, 93, -159, -142, -137, 128, -125, -129, -14, 32, -205, 368, 164, -26, -64, 6, 31, -46, 96, -170, -96, -101, -88, -109, -263, -19, 159, -263, -97, -240, 70, 190, -50, 26, -66, -5, 188, 196, 14, 26, -51, -17, -35, -103, -199, -46, -143, -71, -103, -140, -74, -14, 122, 58, 26, -58, 55, -56, -227, 130, -54, 125, 96, 68, -231, -67, 69, -108, -71, 303, 25, -65, -34, -26, -233, 58]
6179E8n5l05L74J54q3p5R9q9j83L08m0M9j97j13K13m95N36n8J67j67l20J55r7
6202a64p1jN39l48O7j59M3O2K16l16l4K8Q6O5k51J01m5J53L24m18l6K31j20J17
6226F9R3j11k83J54q2P0K86l39PL30j56n0J26j9L13m52j8p2L55q9l07R4N6j64
6250a89M8k04L15JP0J30l36K00n4J97p9j1J09k40J15j5r7J4l96M17j81K97L0r
6274A32j70r1J25q9r5J09J56o7M9k06K90L4j5j36j62J47n2L38n05P9J74j15L2
6297c8j19K62j83Q2r7J97k2j39J7K86k70J35j54J51n1k68K67j76M6K22o6k14K14
6320H2R3o2j54J84j78m3M0R9J4q0J6M3k28J04L48l92Q2m1n3J38j94J02L97k59
6344E8kk00O9J89J68l70K10l25K64j29K54n8l25L78j44K02j36j13lL38n22K50
$$ y = [58, 3, -302, 72, 226, 143, 68, 167, 78, -105, 203, 163, 212, 15, -98, 115, -380, 156, 98, 265, 98, -222, -67, -164, -235, -236, 303, -45, 22, -137, -94, -32, 184, -132, -166, -138, -52, 13, -238, -137, -182, -29, 295, -123, -159, 72, -48, 69, 162, 51, -232, -78, -160, -90, 196, -143, -136, 194, 38, -12, 114, 95, 408, -44, -62, -134, 221, 132, -175, -81, -25, -189, -141, -345, -30, -29, 41, 171, -165, 35, -19, 178, 99, 88, 197, -43, 72, 57, -40, -26, -422, -5, -186, 111, 141, 132, -38, -129, -4, -93, -188, -79, 77, 10, 59, -147, 143, 177, 162, 26, -136, 11, -41, 297, -208, -129, 45, -70, -38, -157, 105, -78, 4, -93, 104, 82, -57, -40, 246, -24, 111, -43, 108, 57, -211, 56, -120, -74, 148, 82, -132, 82, 175, 113, -41, 143, -35, -78, -38, 61, 75, -5, 11, 54, -174, -70, 278, -114, -32, -73, -126, 12, -182, -80, 317, 58, 56, -144, -75, 114, 282, -88, 122, -203, 61, -68, 186, 128, -197, 181, 37, 239, 103, -10, -13, 325, -197, 53]
6366E3J75j26k15J52O5O3j58Q8o4j33K61k14L29m32J07LJ97o7nj02q6J40K45l36
6390f0J73J75j25j86j83j1K77q3oq9K10J71m10o1K56N1j88j38J70M4j88J79O8
6413D6l6K13m26K54J32p2l10K03L6j50L64m68J67n4jK59j40J38j64J93o1l8r3
6436hJ55j80K07j76J72k22K17Nl20R3K54Q8k44J44j6R5m12Q9J08j51K38l52N4
6459a62K11m75L73%k4K75q3k27J67J34k7j25J84p9k80J28o9K05l8L8r0K27m51
6482a88M9o9kr8N06j85q9j30L60r8k77N09l67J44k31J40k97L70j64L17j41j32
6504g3J63j90J35J59n29J66K4L28l02K12k35J87J89n16K31K11j81m6J89k41J99
6525H0r0k6K29q1J41n32M54j39j44j7L80p8k04J79r2M7l49K10L6r4L87k92K16
$$ y = [53, 228, 102, -113, 39, 104, 167, 9, 97, 33, -100, 161, -53, 276, -156, -49, -46, 151, 84, 79, -23, -109, 31, 276, -60, 113, 288, 163, -23, -206, -217, 60, -23, -29, -118, 92, 263, -147, -208, 48, 99, -89, -227, -57, -13, -201, -22, 46, 10, 223, -203, 51, 183, 111, -199, 4, 40, -110, 254, -214, -47, -101, -102, 157, 17, 155, -9, 184, 123, 85, -8, 147, -33, 174, -2, 170, -52, 165, 170, -150, -57, 197, 285, 41, 185, 169, 264, -148, -59, 49, -102, 136, -216, -162, 49, -426, -53, -53, -77, 198, 115, -112, 55, 189, 162, 37, 221, 142, -138, -10, -79, 126, 88, 126, 36, 263, -188, -139, -208, -210, -308, 198, 13, -76, -206, 154, 56, -221, 288, -79, 65, -166, -26, -323, 47, -117, 200, 59, -73, 90, -100, 35, 194, -335, -169, -145, 183, -119, 93, -142, 45, 234, -282, -51, 160, -21, -67, 122, -119, 80, -10, -36, 193, 112, 253, -279, 175, 36, -108, -125, 255, 177, -27, 152, 60, 107, -242, -32, 4, -90, 297, 5, 221]
6548B21l54L09n9K5J10j45l29K91k58M00j5k61Q1m4qJ05j12K47n21K33k4r3M21
6571B20m03J56n5J47j31J88k05L92n86K26j9J29J99l75L40k46l8M49n22J92q1
6592b3n3O7j57K19k04K82p7j4p8J79ln9k7L3l23M26m33j86L72R8Krj32J23K94
6617C17m02L2L23l57J59j72J48j12J09K38l88JK05L1k94J80j86K61k28N09k62
6638A12k45J03K90K43m66k4J04k11M7K24j42j38J63j22M08o38L34j82J9J73Q0
6659A32n96M45n3k91N46o5K6k27rK3NL05j73r1K75k48j50P2L57R2m39K62R6k99
6683ej30L36l35K71l21J39K14j61J92k52P0j79J57k8J23J6k71Q8k3p2l9L18k23
6706a15q4N4R1O3j64L13o9j25J25l28J58j1j12K18l03O49m28l2o3J89Mj51K7P0
$$ y = [221, -133, 176, 117, 142, 252, 107, -222, 69, -189, 211, 196, -65, 16, -28, -36, 69, -43, 204, -317, -84, -108, -201, 220, -183, -27, -82, 65, -66, 122, -83, 309, -277, -51, -70, 59, 258, -117, 223, -23, -61, 388, -134, 58, -23, -76, -9, -166, 53, -151, 131, 54, 40, -38, 141, 138, 79, 52, 85, -238, 188, -245, -431, -59, 39, 41, 32, -100, 23, 317, -85, -53, 270, -87, 72, -100, 48, -64, 45, 283, -105, -104, 101, 132, -162, 18, -168, 93, -135, 374, 112, -133, -30, 260, 503, 37, 13, 117, -94, -47, 177, 35, -103, 60, -62, 346, -292, 42, -140, -121, 52, 132, -464, -19, -72, -363, 183, 118, 144, -83, -92, -69, -64, 241, 68, -23, 252, 4, -146, -74, 283, 375, -64, 198, 294, -5, -135, 201, -134, 137, -184, -45, 169, 8, 200, -52, 18, -161, -4, -32, 91, 107, -164, -76, -99, -171, -210, 108, -115, -199, -145, -54, 9, -155, 158, 89, -36, 89, -239, -81, -92, -204, 14, -289, 360, -68, -100, -163, 26, 30, -121, -94, -24]
6730b4j92L12j72J45j39K57l0j37j6j93r3K10M6J10P1m16K76oR5l65M22j12K40
6753B89k02L7m5M5j91K4r8L2l8K41l20L04M4n23L29j48K6O5oJ49Q6k62L05k10
6777f7k26J98J90j78M1L1k51K56j26M0J55rk07J19J45J54r3q4l1J98k65k28M43
6800B05k30J82O7j67j11J05k81L45J3pp4j8M5l28L6J47J93k29R2J41j48j16k08
6823c46K84p7L17l65J29J18R8M8l01M6N8K02l46J12j31L88j08j56Q6l01O01k02
6845A54k90J46p1J94k87M7Q1R1j65K22j44R5o1l6J39q6j05j15K74kk1J38j48j24
6869g4K32l02K49l25L31J1j06j85K69j52K76l73O4J54j78J65r4R3m0l5J86m88
6891c22K82n8K3K01k69L02n6j1l59L10K56l10o2N9J24k27R3j62K87N6k53Lk04
$$ y = [-24, -216, 96, -76, 69, -70, 187, 157, 20, 4, -189, -282, -72, -26, 84, 155, -261, 15, 9, 104, -261, 161, 49, 289, 87, 124, 79, 124, -67, -43, -141, -109, -147, 94, -226, 78, 122, -401, -72, -220, -194, -129, -135, 14, 100, -162, 143, -67, -293, -95, 95, -83, -42, -11, -262, -6, -132, -92, 63, 54, -153, -34, 111, 265, 172, 88, 57, 255, -10, -238, 205, -25, 157, 224, 57, -54, 51, -230, 115, 128, 121, 47, 29, 74, -254, -218, -71, 122, -107, -15, 126, -22, -138, -346, -62, -139, 178, -187, -58, 60, 158, 206, -95, -49, 9, 211, -135, -23, -154, 234, 126, -30, 56, -245, 356, 154, -136, 10, -61, 133, -154, -107, -26, 65, -100, 122, -22, 73, 12, -24, 115, 29, -76, -191, 83, 81, 60, 198, 50, -74, 158, -144, 105, -220, 111, 122, 16, -169, 100, -52, 224, -149, -85, 69, -109, 56, -38, 55, 15, -20, 166, -322, -40, -98, -75, 126, -143, 159, 103, 92, -267, 43, 299, -11, -73, -14, 110, -117, -24, -186, 101, 157, -96, -93, -297]
6914b97M9L08q7J96m36J56K83j31k54L33l3m2M3N4m35J51L86k03J33l91J13Q7
6936a7J26l05K31K0K1k50K93j75J50j10j18K04O1j23j83J25N8q0J90L5j3k03R8
6959C5j14K56p8j83l0L49m20K69j62J02K28j94J04l33K29J58j66J65l44P8M8k26
6981b29K91k70M01j48l61M24M9l0j52j31J79J91k63J01j29m0J77N3j84Q2J30l34
7003a93RK24Q4J2l33N1K95j10R9k34O3j60M30l35J9M6J89k26J1j04J51J00m32
7026c44J68M1%L93l27J05J4R0j10J8o5n5j6n0L20k44j10L06j42r4J7k91M25J75
7050B24o2n2j77J9Q0j01O8M17l80r0J48j0K0J38j4j78r5J39J02r3m5k9j6J31J28
7075B72o88P77l51l02N11l05J65l46K91k3p3J39j10Kp7k55K08n8L84K02l25J05
$$ y = [-297, -248, 60, -27, 169, -267, -111, 172, 41, -213, 120, 87, 45, 88, 142, -293, -142, 244, 41, 174, -217, -104, -17, 109, -196, 35, 55, 76, -174, 119, -56, 94, -16, -134, 70, 131, 8, -175, -50, 8, -72, 118, 153, 140, -63, 35, -79, 177, 99, -84, -114, 235, -185, 84, -78, 24, 252, 58, 162, -171, 58, 216, 50, 215, -129, -51, -3, -229, 62, -208, 193, 45, -316, 108, 157, 127, -25, -156, 23, 214, -49, 52, -77, -117, 60, 113, -71, 11, 141, -193, -184, 40, 124, 136, -197, -146, 149, 39, 138, -96, -33, -193, 237, -98, -79, -33, 156, -70, -59, -163, -12, 88, -344, -176, -135, -135, 258, -69, 36, 50, 140, 30, 48, -17, -72, -88, -138, 182, -62, -172, 134, -8, -102, -85, -376, 49, 224, 162, 110, -67, -48, 32, -69, -1, 416, 36, -54, 94, 84, 104, 242, 228, 50, -45, 94, 196, 103, 58, 29, 13, 144, 272, -416, 361, 10, -292, 219, -86, 79, -267, 24, 1, -72, 67, -43, -41, -118, -373, -165, -223, 161, 363, 38, 143]
7097A43l9j22j11R0j1P3k3O6L9R6J84o12L14l37k2J05M03j39M0k18MN1q8K60k14
7122f8q4J98P1K18k85K23m12L7J87rl45K73j38J26k62L58K7j38p8qK83k06K06
7145A74p3M8j59J37J37l76L56o37K48N51l93p7Q3n1j86J75K18qJ61p2k65j37L9
7168a07m2J50P8j05K28l8j38o0J09k71K81j69j6o5M56r0K9k08k46Q6M2J2M3J14
7192G3N3K5l07K14L7m3l0j89L60l22n6J19o7Q7j8p8OK45j80N7o8J65j04j86L36
7217A29k88L83l58j02K55J70n5p3k6k25M3J16k8J67R5K2m2j16j93j32L10R2l35
7240a91K43p1j03p1K30j54K68l21J71j6k7L0O0l61K97M9l82J77K01L9k94M92j61
7263A05k5k74L32k47J11L4j21J26n4Kj34L35j46J15O2j56j77J14k67J82K27m1
$$ y = [143, 104, -18, -129, -39, -50, 23, 0, 66, 105, 201, 385, -227, 87, -250, -272, -167, 236, 97, 137, -81, -77, -26, -114, 146, -68, -152, 46, 117, 335, 50, 273, -139, -102, 85, 76, -269, 4, -134, -8, -270, 88, 115, -23, -101, -109, 174, -32, 174, 101, 149, -10, 127, 264, -112, 244, -393, -145, 406, 13, -64, 19, -32, -218, -43, 175, 167, 328, 256, -9, -146, -107, -149, 1, 79, -26, 202, 164, 26, -34, 75, -196, 85, -84, -100, -165, 291, 201, 230, 22, -224, -138, -96, -84, -41, 73, 126, 151, -156, 58, 95, 52, 22, -167, 193, -129, -185, -66, -133, -46, -64, -142, -136, 109, -71, -14, -82, 83, -21, -207, 129, -159, 224, -134, -236, 19, 189, 134, 61, 35, -190, -147, -31, -59, 108, 203, 225, 183, 67, -126, -258, 52, 144, -191, 52, -19, -122, -193, 37, -117, 151, -170, 1, -15, -42, -12, 48, -313, -16, 33, -349, -172, 29, 68, -226, 266, 105, 80, -194, 138, -109, 2, 36, -85, 41, -13, -11, -145, 190, 44, 159, 221, 65, -112, 2, -265, -83, 144, 103]
7285A03j31j85Q7K66j04J83j07M5j48m6%J45j21K7n9R6j72J19q4k2J95K12l33
7308c4K94k01n5J96j44q3P6r9M7L3j63J06M16k20K7k02J10j64nk5J74O3Q4j04
7332A27q4j14k9Q4jL0j11m2J30K8J06l80J00J78Lj81j74L73J48lj39j31q1J50
7356a3P4o4j40K06j8J73j47n6J96j83j15K50j26L9k40J65o3Q4J71j27k54L37L5
7379A84j50m9j02r7J19k8J12J23k52P9K0L4l2j09M4L74n00J24K00k55J79Rj7J35
7403A45qj15J5K46l96J64O0k06J17pJ67m30K64N5j1j21p8J60l5k64O00m86K07
7426D3Q2l78K48j21M17m60M08n83K41L3j60R8J8k8J24m0L38j86k32J48N1j54L1
7449f2R6J5p9p8J98n7M8r3R3pl50L36O6j80j50J69J43J16m19K02K30m54K79j37
$$ y = [103, -28, -213, -126, 140, 36, 219, 112, 157, 9, -37, -37, 108, -13, 14, -45, 51, -121, -2, -86, -108, 87, 299, -34, 260, 59, 4, 200, 56, -27, 49, -50, -3, 30, -133, -27, 389, 169, 196, -6, 104, -60, -65, -90, 84, 147, 231, 127, 43, -71, -100, -16, -17, 13, -98, -140, -10, 18, 124, -256, -156, 22, 25, -156, -330, 43, 191, 188, 49, -82, -163, -13, 61, -3, -143, 63, 45, 218, 71, 15, 211, 28, -87, 163, 37, 76, -164, 1, -62, 22, 193, 66, -188, 149, 184, 34, -15, -117, -214, -95, -123, -11, 112, -140, -61, -41, -7, -39, -148, -104, 270, -230, -106, 94, -161, 18, 27, 10, 145, 137, 22, 37, 283, -113, 51, 111, -95, 22, 15, 182, -248, 16, 71, 60, -61, -139, 21, -14, -278, 322, -164, 43, 125, -253, -5, -126, 291, -169, 239, -344, -103, -70, -230, -132, -114, -142, -18, -58, 280, 94, -138, 10, 61, -93, -62, 34, 49, -30, -108, 90, 33, 81, -12, 81, 74, -276, 60, 126, -54, -204, -35, 108, 224, -195, 7, 237, -217, 62, -75]
7473g5j36kM46k89K33j03j36j76J39O9K24n9k59K14J99j59o1l24k63L35O0K25
7495A02k75J20j03J03l7k03N52p3q1r4r6mj9J21p3J64j04K6k27L19l60L05J31
7518A94J6j27k47K65l1l69J61K41l01J62K96m36K14L6j64J99j23K6N8l97M82j12
7540D3o6K22j97%j1J75k31L00j1j59l02L98k6j59J20J03k52J57k51Q1K84j26J69
7563B61l98K07j09r3J67J77k02Kk0k10J32L9K7M22l14k78K87k76K31j77L91m74
7585b08J92j43Q9L62m86K37Nl40L79J93m9o3k64J11j88OK92l3K54j99r5J04m4
7608A12l24J4M03k59J79l86N86k49L2k91J42K05j07j82J25k86M52k4j42K4K0j64
7630a20J46Kj41J82o0k11J20K50j73J31P7l84J23K6RK98k16j73J81k49J92O9n8
$$ y = [-75, -211, -213, 233, -56, 177, 74, -62, -238, -99, -30, 194, 135, -124, 90, 289, 130, 69, -255, -518, -183, -123, 102, -173, -53, -156, -53, -90, -293, 259, 186, 105, 11, -85, -89, -108, 13, -60, 104, 0, 26, -201, 118, -242, 63, 194, 210, 83, -164, 101, 70, -299, -138, 103, -198, -36, 260, -176, 38, 74, -90, 109, -14, 12, 70, -327, 155, 43, -23, 199, 2, 2, -9, 166, -65, 235, 224, 65, -237, 161, 135, -24, 96, 199, -53, 104, -147, -66, 218, 92, 261, -137, 70, -39, -132, 35, 212, 10, 12, -8, -218, -86, -47, -20, 402, 88, -190, 97, -179, 52, -125, 266, -208, -16, -159, -70, 292, -194, 43, 48, -292, 87, 280, 231, 168, -96, 15, -173, -167, 125, 92, 346, 147, 52, 156, 112, -212, -198, 205, -54, 125, -261, 325, 76, 108, -183, -41, 164, 57, -125, 0, -286, 166, 142, 0, 24, 44, -120, 26, 28, -113, 69, 9, -202, -82, 168, -5, 126, 203, -181, -58, -32, -23, 275, 59, -114, 67, -182, 10, 79, 21]
7653B1J91k52k30L61j83J38NJ46j41J58j89j17J91l86N23k33J00k26L22J18k61
7674E6k31J26N5J78p1J46k41j64L93l30J42p6om5K06K8k80J82q7m5r9M6L89j01
7698A71k66K76N4l68K15k64K26J10j36j49K00j43o8K4K13j07K9m4J92j01j79J9
7720i6J10j44K64l10J76K5j25M50j79l51j62M49q6Pl01o2J23K41L6M7r8J78N7
7743B49k3k98J53k13J43K08J0k58L4j44M5n8K02k56J23J2J26k57K98r0k74J15
7765a53K7M88o40M68rj05l92N25l6j06n6J18k40k2J11j22K63j84P9J48k9L7k77
7788a07L1O2k69J14J89J83m9j30k93J03L35J3k46j18J73J72j79lL10k15m2N5o5
7811B4j6lj61J30J0J87j55j6j09L88k24j17j4K3L18k70o8j1M6Oq7J00m7ml9l1
$$ y = [21, 212, -40, -270, 91, -92, 46, 51, 197, 56, 214, 25, -92, 99, -287, 236, 3, 103, -123, 199, 317, 56, -175, -49, 6, 184, 113, 259, 18, -146, 247, -83, 59, -17, -23, -68, 138, 166, -114, 68, -19, -64, -163, -117, 272, 171, -95, 181, 235, -133, 82, -182, 44, 154, 18, -131, 69, -74, -142, -118, 95, -12, 17, -27, 165, 64, -115, -96, 14, -130, 134, -176, 0, 25, -100, 350, 171, -180, -342, 107, 21, 28, -273, -335, -212, 29, 65, 112, 14, 192, 249, 226, -72, 81, -132, 11, 219, 229, -29, 5, -139, -94, -152, 50, -206, -83, -71, 55, -202, 96, 6, -268, -153, -126, 362, -278, 190, 181, 76, -316, 209, 173, 67, 11, 129, -111, -133, -22, -144, 119, -65, 14, 162, 133, 170, -107, -76, -14, -283, -169, 20, 203, 154, 24, -269, -166, 169, 182, -64, -182, -9, 163, -16, -19, 291, 76, 34, 89, 24, 8, 5, -156, -26, -16, 171, 16, 0, -109, 279, 55, -62, -76, -53, 265, -5, -73, -84, -38, -32, -119, -19, -66, -70, -109, -140]
7837a40J05j4m4L09l20K55j76Q3j53N3J16k82K93J5n0k0j54J97K1j23R8j69J06
7860FO9k61K24k64K56q5j13L4K21Q5k66L60o6l40P9j45L83k55m4r1k3J8J91J06
7884G9k58K41k7k43M01k04Q6l8K32j87k66J97j59J10J82k84O9J66j58L8L7qj40
7907a34L23j07K9j47J12k3q4k2j1L92l53Q7j94%J47J13j4k18N3O5J01k91KJ0J36
7932b8QL0K12k93kJ53j68J93M8j93J06k75L36P0o5j21Q4l82J07K69L3k22l6K13
7956G7Om3l21K03P1j09j10K53L6j53J29J58m19K91r4K97m04Q1J44r5J03q1J3L24
7980C57p91l56J210j137K63O04r9L94j02l93l09L37p4j79P23J17l11K65p75K59
8000Ck26J72J58O48o64j40M21n07m46N42O96l14K5l65K20k67P0M33l23J5kqL91
$$ y = [-140, -35, -49, -93, 216, -104, 151, -25, 58, -95, -42, 74, -208, 85, 100, 50, 30, -124, 73, 94, -29, 69, -100, 6, 75, -186, 38, -226, 30, -55, -168, -134, 87, 172, -94, 266, 200, -140, -61, -206, 177, -78, -122, -213, -236, -218, -27, 79, -179, 62, 35, -208, 193, -11, 75, 37, 269, 82, -184, 13, -146, -36, 146, -138, -69, 97, -61, -23, 14, 6, -134, 189, 82, 111, -36, 76, 53, -31, -53, -64, 328, -25, 62, -132, -132, 15, 128, 114, -104, -51, 14, 115, -176, -174, -164, -28, -20, 10, 222, -71, -73, 80, -88, 105, 153, -40, 66, -209, 127, 197, 132, 11, 95, -287, -180, 89, 122, -100, -136, 77, 83, 40, -281, -78, -7, -116, -226, 27, 63, -90, 39, 197, -222, 69, -25, 272, -132, -51, 93, -2, 101, 20, 33, 357, -434, -790, 420, -717, -454, 150, 51, 445, 343, -50, -359, -22, -96, -275, 448, 565, 254, 519, -256, 3, -223, -51, 107, 755, 91, -49, 372, -135, -581, -39, 657, 343, 368, 3, 223, -44, 26, 459, 136, 151, 149, 141, 532]
8023E32k68o10j62O3K54L7j5K18m69K94m67P96n14K85L4L31L3N84j118j50N29
8044B17l10Q1J63J54j42m08M90p64J70N04n28J95J12l56L52L17p6l09Lj50J56
8065a29M16l35l15K82N28k94K43n58J94L5k15o8q0K87k9k6O01j86n59J95l06J60
8087a59K16K84m65J54j8l14K43j51J8J14m1j4J07Q3l00K48K23k48l29N52oJ63
8109C60l16K60j92l44K8J64j25J28l24M80o42J076l85m49P32q76J156j118M25
8128C8m5K81o79N93j43j68M14K77l69m39P27m16J08J45j014M16J97J15N96m96
8148A38o52q3j18J402j65j27q97M36k59j073J511r5k09p7o70J234N0l49K13j64
8168D6o35L78J4J31k30N30M24O5j378Q90l29j24K39n21N63L07j69l99J6Q22r80
$$ y = [532, 264, -346, -508, -445, -191, -154, -169, 49, -420, -126, -593, 203, -311, -26, 8, 339, 372, 956, -162, -312, 217, -93, -12, 151, 305, 163, -245, 245, -519, -349, 155, -373, -178, -66, -422, -70, 247, 171, -138, -135, -285, -129, 287, -48, -363, -81, 447, 153, 396, -162, 32, 67, -148, -216, -296, -9, -38, -64, 537, 351, -208, -13, -319, -159, 57, 341, -124, 30, 12, -302, -59, -210, -192, -78, -119, -133, -26, 57, -243, 5, 228, -20, -349, 203, 197, 360, 44, 304, 112, -232, -204, -40, -165, -37, -361, 119, -523, 553, 168, -281, 451, -425, 731, -387, 38, -7, 274, -405, 188, 45, -123, 291, 568, 199, -240, 487, 71, 179, 324, -690, -274, -77, 38, 634, 138, -514, -597, -715, 687, 522, 395, -502, -66, -325, -1398, 113, 18, -191, -268, -938, 296, 346, -3, 210, 46, -589, -211, -197, -66, -296, 234, 658, 723, -655, 235, -94, -218, 21, -500, 63, 370, 201, -198, -182, 640, -340]
8189c40m22M72
$$ y = [-340, -762, -290]
8191b90
$$ Imaginary data points
##PAGE= N=2
##DATA TABLE= (X++(I..I)), XYDATA
0@%%%%%%%%PpPj4J4j4K1k8L5m9O3p1Q5j05J20j41J68j96K28k64L03l48M01m58
32b43N20n89O66p52Q45r49J063j185J322j471J631j808K000k211K441k692K969
49A557l274L605l970M375m824N326n892O534p266Q112r102J0279j1708J3488j5777
64h537J8843k3195K9915m1809O9374k58801k25443Q0004o1023M5111k9235O8892
76c35904k2275K0381q079M6536J3097j4802L0105L867L5040O19k4089O0591o546
89b01459J5356j8976K9023K9888j9425J6817k475L6039J607j5138L3193J073K9222
102f5255j5664J1067K7509O682R195j4030M3298K129n397J4682l738L8495k1076
115B7897P9J9895J038Q845k1057J6014N216K954r288j1223K8931j7306J162o506
$$ y = [0, 0, 0, 0, 0, 0, 0, 0, 0, 7, 0, 7, -7, 7, -7, 14, -14, 21, -28, 35, -36, 49, -56, 64, -77, 91, -105, 123, -141, 162, -186, 215, -243, 277, -312, 354, -398, 447, -502, 561, -624, 698, -773, 858, -950, 1050, -1161, 1280, -1412, 1557, -1717, 1888, -2082, 2293, -2531, 2795, -3097, 3437, -3829, 4283, -4819, 5460, -6248, 7240, -8537, 10306, -12889, 17026, -24783, 44591, -214210, -439653, -359649, -420672, -375561, -404796, -335904, -358179, -337798, -345877, -299341, -286244, -301046, -270941, -267074, -232034, -231415, -255504, -194913, -201459, -186103, -205079, -176056, -146168, -165593, -148776, -151251, -115212, -113605, -128743, -95550, -94477, -65255, -80919, -69852, -42343, -35661, -26466, -40496, 2802, 4931, -466, 14216, 10478, 48973, 27897, 27976, 47871, 48909, 57754, 36697, 52711, 57927, 60881, 51593, 40370, 69301, 51995, 53157, 46651]
129D6651L983J7056k8200R849J796O238m423j4673J9220n579M493j4249K879J6336
143F1377j5668K643q704J1777j673j5756P354m523R236j8599k634J1358j0840
156B5348K870j5918Q407L600j2182J50n059J2460j1499l441K583K27P708j8474
170c220R107L856l509R85j0222J3904m448l388j548J213Q102j2404L067j339M604
185D760o60j2342J0831k119L82n689j037R675q021J864m939O618K378r542O381
200a460k272O461n157l637P826k025J840p249N894K777n430J920m709Q911m225
215e35m241L882j552M125p934J864K961q29m40n829P876k046k223p2r70O542o412
232e833M56J117J140J631o427M998n49Q86k154k323O955m095N81j837K339K928
$$ y = [46651, 50634, 67690, 39490, 49339, 51135, 57373, 52950, 38277, 57497, 51918, 56411, 42162, 45041, 61377, 45709, 48352, 39648, 51425, 49752, 33996, 41350, 36827, 46063, 27464, 24830, 36188, 25348, 28218, 12300, 20707, 24307, 12125, 12275, 7216, 19676, 8177, 4736, 7319, 7546, 15254, -3220, 5887, 9743, 6234, 7219, -3003, 10901, 6453, 3065, 1517, 2730, 10832, -1572, 1495, 156, 4760, 4100, -8242, 2589, 470, 852, -4837, -5874, 3801, -4220, -2356, -7295, -677, 1701, -7841, -1460, -3732, 2729, -2428, -6065, 1761, -264, 1576, -5673, 221, 2998, -2432, -512, -5221, 3690, -535, -4776, -894, -2446, 1679, -6255, -4391, -1430, -2259, -2699, -8528, -652, -2698, -4921, -4993, -5963, 579, -5833, -5377, -4260, -3120, -1489, -7916, -2918, -3467, -2581, -4735, -7058, -103, -4198, -3617, -5454, -3115, -187]
248a87n996K704k79L434k860k541M836j974K345l619J271L645l061J136k280M845
264A419j232k444K247o39L737m750J020K664j298J564l768L558P0j326Nq80M371
281D318l602J84M41N00J773m318K394O42o2q35j721L743j990J61j410R88K153
298C359l394J365p99J903o02k570K287q05J062j833O7K184k027P20j420K139j9
315A617j792J142n78J583j849k59J199j72P85k486J956P52j295M14j195K579j569
332H32l34K01J27J365k319Q96M22M62l61j378J987n12l40n40J96J220j828L30
350D26o2J011k75j935J913o55N27j182k94J459r01K93j009J070k7j124P12p77
368h30J100j061n34J079n39O08j347P37K35o71K55q77J124j06o55q2o5Q47o31
$$ y = [-187, -6183, -3479, -3758, -324, -3184, -5725, -889, -2863, -518, -4137, -2866, 779, -2282, -1146, -3426, 1419, 187, -2257, -10, -649, 3088, -1662, -642, 2022, 724, 2288, -1480, 2078, 2148, 822, 827, -53, 4318, 716, 900, 1341, 1841, 3614, -704, 1690, 2332, 2270, 1435, -286, 3457, 1467, 1628, 218, 1206, 3359, -35, 1330, 531, 2434, 1832, -738, 1549, 744, 1806, -27, 40, 2224, 197, 917, -503, 1636, 1617, -175, 967, 389, 1972, 123, -136, 1063, 891, 1676, -810, 1146, 1898, 603, 1017, -178, 2401, 832, 498, 699, 826, 2191, -128, 768, 1190, 1652, 1291, -87, 1900, 1388, 1048, 508, 704, 1924, 96, 426, 364, 1375, 1100, -835, 1078, 423, 950, -232, -526, 933, 32, 325, -684, 386, 359, -765, -53, -830, 270, -791, -1325, -246, -785, -177, -1524, -787, -552, -1223, -968, -1845, -721, -827, -1482, -1564, -1629, -782, -1413]
387a413k76L01k9L42q15Q37j11J38m27o4R10p19K30j70N89j61o69Q87l84J54k65
408a115l61R10p38O57p46M08N06l89M39o91R09L9n15L00Q8L15m11J92N17l51K26
429A89n70O47j8p8j05O8M15p48M33J12p1M8l56L67K60J45l98j30P43o59k70L9
451F3N96L21o92N31l65M63j44m39L89k30J66l47J12M34n15p1O2QL7r3j52J20L31
474E85p54J93K74j17l14k56O82k54r7K54k36L22m47O6J93k46M09l28l9J08J44
495A42P1k70R3l6k95J70L1K16j42j64J07m6J92n54O63k55l4q6M42m08o5J60k99
518c67N25j66j61J58k66L49M7n08L90k70j8J31l6L08m28J80k79K22r9j35J85q8
540c26R6l4j34K60k04N1k40K65j2n3J19K34o6l87J23K4j04L12j89j35J86M2l74
$$ y = [-1413, -1689, -1388, -1417, -1075, -1890, -1053, -1164, -1026, -1453, -1517, -607, -1326, -1096, -1266, -677, -838, -1507, -620, -1004, -850, -1115, -1476, -566, -1304, -647, -1393, -985, -479, -868, -429, -1120, -211, -172, -687, -387, -299, 16, -395, -203, 314, -37, 189, -381, 266, 248, 170, 65, 133, 548, -200, 233, 345, 274, 322, -34, 333, 593, 738, 340, 210, 953, 294, 24, 63, 659, 980, 288, 819, 454, 917, 773, 334, 723, 493, 659, 312, 424, 858, 343, 272, 334, 342, 379, 286, 134, 254, 585, -169, 24, 298, 181, -133, -389, 293, 39, -58, 196, -40, 282, -165, -99, 94, -152, 257, -71, -110, -2, 142, 213, -57, 36, 0, -295, -125, -94, 122, -20, -184, -77, -123, 69, -485, 178, -77, -111, -197, 245, -163, -228, -68, -367, 158, -8, -169, -11, -277, 72, 119, -389, 1, -269, -287, -156, -192, 116, -312, -132, -411, -189, -288, -423, -238, -326, -230, -264, -398, -138, -342, -291, -531, -266, -278, -331, -212, 22, -44, -431, -308, -284, -388, -76, -265, -400, -214, -172, -546]
563e46L71J55m62L8K98j25J16j37L30j44Q1k57L7J11k43j80L25J36M2K58k64j90
585b50J50M2l17O05j43k2m17J24K66N4j1j24J06lj55K71r5J8o8j4J95J5p9k51
609a03K07k4ml0J20j44L62l23K62l43J24j20K00j20L68l05j91K11q0L4K18l86
631f7n5K68K8j60J2j04K80l26J74R6k64K15J05k77J16r3J76j67j84K64j93M03
653B47l98J06Q6j19mJ96j25J17M9j29J01j83k5k46L06Q7q4k6K48j46j76J16l36
676c38J32K66j89r9L77l99K80j97J59L27m35KK07J82j70k50P5J6l6K7j35J43j21
699a76J43l4O7k7Jj9L45k61l8N%k02J37K22k7J14k69K07l32M21n93L32J14j68
723c8J80r0n4k5n2j2j96L30j51J7L8J1O2P3l04L08p6N7Q9m03N16n2j26m8k0J2
$$ y = [-546, -175, -20, -482, -444, -146, -271, -155, -292, 38, -106, -25, -282, -245, -134, -377, -557, -232, -96, -54, 204, -60, -250, -100, -58, -375, 230, 87, 65, -352, -228, 38, 92, 81, -43, 63, 60, -95, 176, 81, 99, 31, 17, 212, 227, 148, -103, 104, 80, 76, 46, 166, 22, 384, 61, 323, -20, 104, -16, 184, 64, 432, 127, -64, 147, 67, 101, 319, -67, -122, 146, 174, 14, 26, -78, 202, -124, 50, 146, -118, 97, 202, -75, 41, -52, 124, -43, -227, 37, -156, 247, -151, -45, 41, -78, -82, 114, -11, 106, 155, 26, 127, -56, -81, -327, -21, 66, -18, -44, 204, 58, -118, -2, -338, -206, 60, -129, -228, 149, -250, 30, -167, -8, 319, -116, -114, 93, 275, 105, -145, -70, -54, -90, -63, -198, -55, -176, -33, -67, 0, -27, -26, -45, 300, 39, 1, 6, 6, -196, -59, 163, 136, 250, -19, 188, -144, 277, -316, 16, 130, -38, 142, 52, -2, -27, -79, -91, -287, 43, -108, -91, -53, -42, 20, 93, -211, 97, 21, 78, 167, -236, 280, 228, 102, 54, 34, 46]
749D6o8j56K79q4K3j02o7N7J65J07j88J91j60l3L9r9L6M6k21K12R7j87N4K64k08
774D3KO8O2j68k45K27p1N8j8r3J68Q8j02k5J83k11K71m42J77l9L30l47k22K45
798f1L14n67K39J58N7O1m96L14O4o8R5o1p9j06L91j75k09M95k58l12M23k12oK26
822B27l31O9M8r5rK03m29K37J19L6J42Rj16j30%m4K4J21K50m01O8P9l8q1P6j36
848a02K60k85L01k75K21q5K65l69L46k35n0J86j92j38L1K77m9r4N0l9J73J90m51
871f4J46l84M44o79R33k8r5m86L89N1l11k7l04P31j32K7l04K77n11N01j07j04
893c7K64l13j13k5K41j9K7R9m31L32J20l8m24K06l3N58J84k91m49K47o8k22j32
916c17L04M49l18K60m59J172j078J45l48M1N25q45M41N04o81R12n25q3m62J94
$$ y = [46, -22, -178, 101, 17, 40, -62, -129, -72, 93, 200, 12, 203, 43, 10, 49, -50, -14, 32, -189, 23, 120, -67, -13, 251, 43, 45, 113, 175, 7, -238, -11, -82, -24, -42, -135, 33, 121, 19, -6, 177, -34, 237, -205, -28, -67, 263, -84, -306, -61, 253, -314, -75, 83, 140, 201, -295, 19, 83, 15, 110, 49, -30, -136, 255, 80, -129, 366, 108, -204, 219, 7, 1, 227, -104, -35, 13, -82, -91, 112, -317, -80, 39, 75, 217, 226, 110, -20, -20, -64, -40, 81, 331, -70, -2, 77, 39, -42, 34, -102, 158, -127, 174, -101, 120, 35, 300, -69, 277, 42, -8, 178, -14, -152, -121, 156, 107, 13, 63, 24, 197, 387, -64, 82, -302, 142, -537, 396, 368, 273, -213, 176, 227, -84, -111, -415, 316, 184, 211, -93, 184, -327, 174, 67, -37, 227, -86, -199, -224, 17, -2, 25, 124, -307, 25, 145, 107, -317, -111, -144, 414, 598, 307, -142, 105, 37, -185, -317, -13, 436, 118, 378, -81, 1091, 13, 158, -190, -149, 376, -469, -28, 476, -205, 707, 182, 99, -363, -169]
936a69or5N63k26L44J79n14J48m76N05k29o18M6P5Q67k06J179q72l4n81r6P84
958E68r93Q03k55J50j56K72j79m82J074j217K84m5L86K61K9j31m00Q04j166J209
978H16j602Q41Q39j67m30J37q81p6J403q74Q5q7J173j347P23p51R82j129P44K62
998F61r37L07j01l82J118m47N24n23l25n9K0Q1R7N54o36L88L95m76o22J042k20
1019D59l42p9nJ99Q75j011l2l6J72q30R00j276J251k47P55p15n91Q73m91Q44l09
1040C64n50P7L68j332O56K86l27k12O47J028j128J048n17l85N70m33J91j089L75
1059c63P64O24p30Q4o7J39n16J72M87n85N9r9n17N40l8L6J18j8l59K02K66j35
1081F4j1k75J34l2j1J19j22j8j84pL78j88K66k94j3K05j62o7n0M93l38O5j28J3
$$ y = [-169, -175, -270, 293, 67, 411, 590, 76, 224, -252, 253, 24, -594, -548, -473, 394, 188, 1367, 495, 461, -120, -216, 568, -425, 378, 123, 273, 117, 389, 210, -272, 802, -415, -131, -176, 210, 471, 500, 369, -31, 773, -393, 816, -786, 55, 894, 727, 297, 434, -447, -523, 880, 6, 91, 4, 1177, -170, 553, -198, 784, -345, 399, 661, -276, 31, -70, -452, 666, 219, 743, 220, -105, -164, -144, -63, 34, 588, -48, 340, 735, 259, -363, 679, 459, 117, 38, 33, 232, 1107, 96, 64, 28, 200, -630, 270, -1006, 245, -2, 753, 38, -553, 320, -171, 673, 364, -186, -109, 259, -1073, -417, -131, -458, -670, -23, 1005, -123, 925, 408, 23, 593, 160, 351, -738, -363, 401, 1025, 295, 379, 312, 451, -65, 107, 594, 9, 68, -31, -548, -8, -46, -10, 108, 90, -269, -67, 199, 64, 53, -222, -88, -120, -131, -12, -134, -152, -336, -343, 35, -153, 113, -181, -194, 11, -151, -218, -268, 225, -113, -48, -176, -163]
1105a63L23p3o5l9R0Oj08j76J41L2j1j03K30j88J88j91kk9M8R7j27K20k03n9P1
1130i1J39k12J60n4qp8M0k09N10j64j19r9K39L6l04M16k99J4p4L02N3j16R8l69
1154a89J24m8j38K63J46r3O0m44L04k06K58o5JM6R6j12m3K11j67K63l09K25l92
1177b09K63J25j79j70m7M27j50Mn04K62L36k15K59k32L7n0Q6O8J18N2m42N9L44
1200B42l14j51J48J44o7j35j42k4L34p3R3J7p5K45k83LJ75m62M26k31J79l14L95
1223A30l11M06l70K08m12j05L83K26j4o7J24k20j0L17l14P6k93P81n93k25Q03
1244E20l44N0L62p77L27r7K21o54P27k66k13m1N62J9l35Q00j116J24R4j46O55
1265D72Q9l55J06k80j75J08L41K43l16p3j57P94r6r07J041j595R63L5J15p40M31
$$ y = [-163, 160, 87, 22, -17, 73, 79, -29, -205, -64, -32, -43, -146, 84, -104, 84, -107, -109, -138, -90, 7, -120, 100, -103, -162, -91, 48, -164, -4, -58, -66, -144, -104, -313, 197, 33, -86, -185, 54, 90, -214, 202, -97, -83, -157, 145, 198, 82, 180, -189, -65, -113, -251, 12, 158, 65, 125, -319, -15, -221, 37, -28, -27, 19, 115, 3, -40, 171, 4, 267, -42, 183, -209, 54, 179, 0, -170, -217, 210, 60, 64, -440, -178, 158, -57, 202, -30, 7, -43, 43, 111, 229, 281, -161, -102, 242, -72, -223, -75, 69, 2, -133, -275, -299, 35, -38, 55, 72, -3, 242, -41, -38, 137, -325, 101, -130, 49, -265, 130, -181, 225, -145, 63, -349, -454, -71, 155, 141, 74, 198, -22, -32, 285, -29, 47, -246, 535, -58, -283, 520, 176, 226, 588, -189, 138, 41, 262, -392, 335, 69, -144, -185, 377, 396, 61, 861, -255, -131, -37, -183, 472, 561, 206, 312, 32, -143, -35, 306, 549, 233, 160, 3, 797, 701, -206, 835, -760, 203, 238, 353, -387, 44]
1286D4p69O66l60k23J330j214M14O91n53N54O6m64K85J61l62m97K71M32O64j90
1306I46j202Q97l94L12R3j042N95m15K13K5l09Q20k58k84ln89L14N62J16j344
1326i47J314j395N15P71J96oj064O12q5P92n59L29j27j32l89j28L48l05M93Kq59
1347f24R39o1M39j142Q61p30L93K04K0l92l18M12L08l8N3L01K52q61n84L63M0
1368a65O27O5j319J233J95o10J0M83r9L78n05p05R86p84J069j041n6R03j362N30
1388a67O4p0M49m95O19k0r86Q31L2q16M97m61P87m50j48R10N2j018L15K12K08
1409C45Q2j73nk85l72l10M70L86j82l89l57J708r82P57J88r66J52m48J48J168
1429I35l87M68r13k00L43n10J46L0L24j50L9l99L58k49M2J02LK65K16n09J67k56
$$ y = [44, -725, -59, -419, -642, 688, -526, -112, 579, 26, 580, 646, 182, 467, 628, 266, -231, 40, 472, 1136, 946, -256, 641, 247, 559, 652, -390, 205, -210, 3, 28, -281, 539, 281, -3, -6, -595, -281, 281, 397, -947, 367, -1028, -513, 258, 454, 448, -616, -4, -89, 703, 144, 473, 346, 214, -175, -303, 45, -260, 233, 235, -624, 315, 254, 693, -449, 412, -318, 75, 279, 299, -93, -411, 1, 309, 271, 324, 625, 877, 16, -568, -205, -165, 462, 527, -792, 441, 636, 26, 36, 519, 420, 798, 293, -412, 574, -210, 859, -182, -238, 665, -697, -167, -103, -173, 276, -219, 400, 380, -606, 225, 257, -559, -62, -523, 264, -186, -334, 576, 628, -390, -75, 137, 345, 427, 254, 249, -36, -408, -718, -248, 138, -44, -433, -790, 918, -64, 693, 881, -85, 67, -381, -233, 935, 548, 1016, 103, -97, 246, -264, -118, -88, 236, 86, 125, -274, 84, -165, -123, -21, -18, 247, 463, -46, 121, -135]
1451a35J75l06L66j23L4J85l01K66r7j46L9L09l72L18j81M34l07l15M6J20j10
1472a01L73n54N81m06J44P0k94K49n05L95k38L64J16k37L10j47J73k80M8l7k06
1493a82K11n0J69k42L58k83L12k76K07m81L20j09j30L55k9j03k7p2K71m2K91n42
1515g4K21N6l37K8J71j89L01k02J40l14J0L99R9l16J14r5K99l94k43M98k11J29
1537I0o2K75j92j05k75L32O5J5j28m0n2R5j4N7J1o4m8J47k79rL19k50J78j29R5
1562C2J44j88J0J40j12M8k36L5J66j72J71j41K59L9j03l0n9J32k30K1J37k20L91
1585B34k60O9R0l08K94N1k28j2K62j17M5k93J90j65L23o6j59P1K41pl41K55j66
1608CqL06Q0J7o8k63J11l52l03N35N06k28o70O34J272j306m98K24j01j21r9M71
$$ y = [-135, 40, -266, 100, -23, 11, 196, -105, 161, 64, -82, -43, 266, -106, 212, 31, 465, 158, -157, -111, 9, -101, 272, -282, 299, -107, 37, 107, -187, 62, -443, -48, -286, 78, 194, -43, 267, 120, 293, 13, 61, 24, -182, 29, -21, 148, -94, 264, -19, 293, 17, 224, -257, 63, -46, -176, 179, 150, 47, 20, -52, 219, 177, 468, -74, 147, 203, -134, -106, 65, -124, 177, -25, 115, -199, -189, 210, 309, -7, 107, 12, 311, -83, -326, 172, -39, 90, 28, 303, 111, 6, -269, 63, 128, 143, 15, -25, -77, 18, 4, 61, 72, 8, -40, 107, -172, -181, 138, -112, 66, -63, 32, 176, -12, -2, 138, 26, 74, -162, -127, 39, -133, 38, -103, 156, 195, 92, 62, 3, 135, -95, -74, 63, -157, 234, -26, 43, 133, -175, 119, 170, -58, -70, 192, 75, 120, -173, 17, -148, 175, 109, -50, 21, 262, 255, -86, 169, 3, -5, 301, 381, 398, 330, 67, 178, -174, -477, 58, 564, 336, -334, 300, 1572, 266, -232, -8, -109, -230, -329, 142]
1630A42J00j24j006J727j453P88L4o1j60k47J23J17P67j031p4o3K24N09m23M97
1650C86p35M77K5j57L97r52J161o06n67J510p11m64J44K03Q25P79p74m17k93n85
1670c54J054o15Q14j215K6M59o23J059k39M96r48j87m48Q57n16J309j274J71o14
1689g88K38l95J112J04o65M71k20M06n33l41p9J057q32M19M08j77N15o66k2O78
1709F90r92O2K38L80q68P38l14o1k68P68o66k38J69R26n81J48j04j52J64K9q5
1730a7Rr6N4M12n21L10m59L99O4j35J07j57PKK71l68M59L4o29M15k44J24J32l83
1754b10M97j91P8K1l01r5J25K40k32P1j61J80J67rj77j34L95Q3l59j14j82M15
1776A07j42l3K02k73N7K73l07K66J6l18K07l5Qj37J08l9N5j43J32J46J18j06l6
$$ y = [142, 242, 118, -888, 839, -614, 174, 208, 147, -13, -260, -137, -20, 747, -284, -358, -421, -197, 312, -111, 386, -349, 128, 153, -4, 393, -559, 602, -4, -571, 939, 228, -236, -92, 111, 936, 1715, 941, 524, 231, -354, 700, 85, 899, -316, -290, 169, -454, 605, 366, 862, -86, -273, -721, 136, -380, 929, -345, -174, -788, -550, -945, 167, 271, -394, 77, -143, 263, -270, -611, -690, 367, -465, -46, 362, 185, 700, 34, 12, 690, -302, -240, -2, 378, -490, 248, -66, -127, -395, 373, -293, -531, -362, 564, -17, 131, 27, -125, 39, 68, -17, -8, -104, -50, 362, -159, 151, -308, 91, 155, 20, 127, -30, -23, -21, 250, -118, 341, 375, -254, 161, -83, 41, 173, -210, 287, 96, 174, 195, -106, -201, -76, 164, -68, 3, -158, 22, 189, 180, 3, -131, 264, 347, -12, -126, -308, 107, -35, -68, 134, -139, -82, 191, -116, 150, 166, -152, 55, 20, 28, -109, -1, -40, 15, -128, 4, 150, 268, 162, 126]
1799A26J74n08J63k42J48m8L37l3q3r0j37K13j18J48k15L57p9J31p2j08J37j71
1821C0k08L61j25K83k26j41J56k71j0J03j08J12P2j53Q7r7L31j90N6k70J00K38
1843A30k47K10j05Q1j88j38L2J53J31l2P8j3l9p3K00j68K48j06l17J62R0j35J48
1866A02k88J29J38O9j25K30j50n9k13R4j03L70j88k12M71j70k12l8K48m01K79
1887b9o5l7q8L96l63J15J35J77m19K06J57k45J7Q7J29m61M2M08N4j73m38P52j86
1910A71l8k30L5J65j1K0j17j29l3K16q7lJ4M29l10l64J0M37J21k05k73J04J15
1933C7o6r3K91J8j18j05m7J82m5p9K62l34K27p6r0o8J17p4K6j69K97m49J44M33
1957B21p7l43K08n0M7n4N3K53j95J67j67j38o6L92m26k4K80k30L06j23k53L04
$$ y = [126, 300, -208, -45, -287, -139, -187, 150, 117, 34, -56, -193, 20, -98, 50, -165, 192, 113, 244, 172, 64, 201, 30, -178, 183, 58, 341, 115, -26, 130, -141, -151, -48, -156, -44, 28, -125, -38, -135, 196, 6, 62, -208, -108, 130, -117, 93, -12, 69, -119, -257, -225, -72, 59, 27, 105, 92, 53, -20, 180, 12, 260, 154, -163, -1, 89, -46, 102, -186, -57, 81, 150, 25, 255, 105, 46, -167, -73, -176, 194, 6, -206, 265, 95, -117, -155, 93, -308, -29, -94, -131, -219, 177, -186, -71, 64, 241, -178, 28, 185, -60, -43, 44, 173, -288, -246, 162, 216, 43, -395, 357, 171, 133, -97, -62, 103, 92, 112, -5, -134, -167, 49, -38, -41, -27, 402, 92, -272, -262, 175, 296, 91, -182, -78, 37, -29, -122, 169, 187, 69, -36, -83, 99, 54, -25, 237, -97, 130, 54, -36, -104, 13, -61, -35, -204, 93, -356, -212, 221, 144, -199, 9, -41, 6, -48, 5, 258, 63, 230, 63, -75, -141, 251, -175, -199, 81, -149, 157, 34, -219, 85]
1979H5J40k30M9J15j37pJ36j7k17K88p4J00k91K55j07j56N8J47n0P4p3k22K92
2002A58p7k42q3Q9J37J87l29M57m96M1K30k05K3N7J22j60j96M43M6k72K22m4l7
2025G1j99K77Ml98N7L89k58R0n3O3n5J2K14j88j36Q9K4OJ31m0J78j81j1%k82K59
2051F3m38O39o2j53j5K62k85j9L2k34K40k14J17M6L0P9L2j12K08k54J65R1k64
2074d6J57k75J03RJ61l85K70k9N6j46K25l1o1M5P8l33L5J43n8k2L33m05j2N47
2098C59l04J53l11L38m83J66K77j22P7m24L21q0J7q5J89J7l1l25R2J85J36m51
2120b89L18j07K76p8o8j42J47l3L5k06j9j05K34pJ99j3r4j05o9M1J2L85j79j51
2144a8o2mL02j52j86K4J19P5J70k76L23k94m6j24r9M09rj30j49M2k7K83j6l61
$$ y = [85, 225, -5, 44, 159, 22, 15, 151, 134, -83, 205, 131, 231, -60, 195, 88, -68, -10, 137, 87, 161, 88, -134, 158, 81, -161, -244, -155, -18, 169, -160, 297, -199, -158, 72, -133, -110, -53, 69, -91, -287, 156, 202, -70, 152, 108, 71, -128, 149, 153, -245, -188, 201, -57, 33, -20, 43, -12, 0, 214, 26, -110, -21, 3, 9, 140, 100, 278, 97, 86, 86, -196, 63, -375, 264, 202, 49, 34, 296, 11, -8, 24, -210, 30, -184, -67, -21, 9, 88, 120, 8, 216, -38, 127, 218, -46, 111, -164, -61, -52, 109, -276, -6, -35, 21, -125, 100, 69, 8, 53, 131, -202, -167, -24, -82, -104, 229, -176, -188, 359, 55, 208, -103, 235, -248, -82, 195, 73, 150, -274, 47, -33, -16, -101, 88, 105, 74, -251, -159, 26, 162, -289, 29, -78, 198, 120, 52, -90, 57, 24, 59, -147, -166, -271, -37, -44, 155, 142, 48, -57, -126, -85, -73, 312, 133, -18, -80, -84, 218, 66, -120, -96, 23, 98, 268, -8, 315, 21, -25, -149, -248, 161, 152, 22, -127, -85, -112, 171, 155, -206]
2168b06l6J97K14j17j8j40P6L36l88P4n2K16m6l60K32M8m3K79L7k80M9j51P2O2
2192E5j37O5k3o8K15o2k70K65j84L6J53k05J33M6K04j41k15J39n7J78k8nJ4r4
2216A4l9J18l4j44O9J8j57J68j59J29L67j17k91J48k80J71j35R4J28k23J36J32
2238A13k24K30l37O5j06J11K87m64K18K12l07K70Mq2n9J18Q0j04j15N03k98k72
2260a57j07K47J63j95MK09k94K25k51J78j9pN9P0N3m00J89R6j2j1r9J22OK33m50
2285a48J1P3K91l44J09j02J83J54l04J59k95M22k04j18O4K43P6m53K06j02L48
2306B69k96j21J72P0Q4q4l00j48N37p7j70j12J79o4M06n84J37K01l81K33k54R6
2328b07L31m23N2K87j8p74N77J78Q8n93O24j06q39J150l02j19M9l04M8M27P7l99
$$ y = [-206, -242, -45, 169, 52, 34, -106, -30, 306, -82, -8, -60, 156, 110, -250, -18, 30, -13, 266, 303, 23, 72, -79, -7, 55, -82, -17, -40, -108, 107, 45, -225, 40, -144, -108, 45, -160, -27, 19, 223, 82, -133, 6, -51, 127, 99, 94, 108, 14, -25, 93, 59, -85, -16, 2, -155, 13, -146, -17, 350, 233, -58, 90, -190, -19, -154, -60, 68, -155, -19, 113, -111, 119, -218, -153, -259, -148, 139, -325, -107, 105, -202, 68, 72, -10, -69, 49, 129, 25, -90, 413, 115, -157, -264, -17, 146, -49, -45, 164, -130, 95, -156, 22, 3, -4, 55, 125, 178, -222, -33, 63, 51, 40, -59, 63, 69, 302, -148, -137, -64, 227, -117, -8, -110, 73, 227, -77, 82, -213, 209, 5, -113, -49, 194, 270, -183, 23, -79, 269, -27, -148, 24, 94, 178, 94, -206, -354, 183, 106, -64, -176, 3, -61, 345, -239, -102, 99, -282, -49, -303, -207, 124, -299, -247, 40, 22, -752, -175, 3, 91, -502, 122, 16, -823, 327, 25, -94, -45, -349, -301, 126, 203, -196]
2350a96p4J12L37L3m16Q1L07J85o17N63m1k97l98k79R97o10M69o6M4j84K37k6
2372A61l2j11l56N62k41m06k07K37L60n35Q58j55m9j38K89J13m24k00L27j05N1
2393aK59l77K23k01Q0R9k14J40J80k6l96J10L03k15j59K11J82l23O2j65K29L4
2415C5j57K66k12l27N35k39l4L01l26J98N7nM7Q5k01j41p2J89j37O4J96n6j43
2438g7j88o5N05k63j30J68k18m6K59L64j29j82p8j56K27j13L6J1K00o6k3j34K64
2461A66k64P2k38L64O9k38J61K1j06j1j34J30K0J53m43M15k3m8l2o7r1J2N9Q2
2485B9O6l5N6l19K15j29J53j67J65lq1j56J48J95k45j84K91oM3j63K29Pj33M1
2509A7l9l6K22j76J17r5nN6J78o06J90n3K26O2J1p7k30K67n68N58j24k6j07M36
$$ y = [-196, -270, -158, 179, 212, -204, -123, 184, 369, -248, 315, 274, -23, -421, -700, 297, -313, 156, 90, 134, -50, 187, 161, 129, 18, -338, 224, -17, -423, -630, -393, -33, -568, 290, 135, 86, -52, 237, 350, -74, -274, 53, -52, -1, 258, -119, 104, -97, -17, 82, -132, 8, 188, 162, -234, -124, 179, -36, -195, 16, 198, -125, -63, -228, 1, 35, -122, 144, -68, -395, 140, -99, -133, 168, -158, 40, 97, 92, 139, 224, 23, -118, -190, -1, -138, -74, 122, 66, -77, -265, -330, 175, -88, -218, -50, -268, -314, -55, 309, 180, -2, -80, -236, -9, -122, -86, -75, 125, 59, 36, -98, 166, -98, -26, -264, 100, 169, -69, 92, 113, 7, -4, -138, -8, 12, 165, -278, 137, 114, 66, 34, -33, -124, -112, -53, 29, 95, 60, 116, -203, 12, -117, 36, -131, 34, 31, -50, -206, -58, 137, -108, -292, -1, -7, 36, -127, 102, 109, -24, 17, -22, -58, 164, -12, 105, 10, 5, 61, 239, -367, -177, -230, -4, 58, 69, -8, -238, 29, -539, 19, -105, -131, -238, 198]
2533A98j02Q9r3j94j98K44%K20k67J01K1%L1J29k35m4Q4lj21J18j01K27j52m4
2557i2L4k9N8j30J84j44K14N9k48q4PN11k87q3J09J27N3k18J27k03j0Qj24L48
2581A87k78M9nl4L91p31L09Q4m3l4J61J95l43K15l1J41n14K38o9J3K27j54j24
2604a50J72j37M9K40j56l38J74J8J95J12k71K33m43M36k60O2N3J2K36m15K21r0
2626d7Q6k41M01J7k60O3k7k25K77j76J73k12J79M7q0R0k59K57j49nN6RJ63l91
2650b54J82L27k35O3Lj47M49k32j35J81j21K11l41N8k55P7K68K7Mj52k80l0L09
2673b3k02n9J91n9o0M00j60l0P6J73n32M26j52j30J73j32m14J40P73n07K54j95
2695d9k67L50k1nK53l3j09L27o90R7L43k96K79k39J74r7K02O9o99M86J92l08n3
$$ y = [198, 96, 185, 92, -102, -300, -56, -56, 164, -103, -2, 19, 19, 50, 179, -56, -100, -16, -19, -140, -22, -123, 104, -48, -92, -58, -87, -29, -159, 25, -119, 95, 154, -94, -178, -171, 340, 53, -30, 79, 206, 259, 41, 168, -35, -45, -37, -161, 187, -91, -42, -47, -81, 310, -421, -112, -28, -71, -105, 56, 251, -92, 123, 92, 233, -281, -43, -112, -99, 128, -26, -150, 22, -115, -66, 174, 18, -320, -146, -128, 67, 179, -92, 141, -302, 134, -126, -64, -11, 1, 237, -178, 43, -47, 39, -202, 199, 216, -44, 19, -8, -233, 44, -132, 41, -171, 8, 55, -25, 65, -194, 63, -86, -91, -35, -26, 137, -254, -72, 255, 20, 83, 86, -61, 388, 156, 21, 202, 81, 292, -49, 9, -246, -169, 99, 126, 130, -22, -302, -332, -23, -225, -284, -93, -152, -212, 188, 28, -2, 74, 247, -285, 141, -11, -141, 32, -100, -514, -374, 399, -108, 146, -49, -316, 34, 13, 8, 261, 228, 119, 446, -244, -147, 196, -100, 179, -60, 114, 17, 219, 288, -411, 75, 267, -41, -94]
2718i4j07M4O10m74r1J96N3l45K07K93O3l52M75m04L65j81j85k69K21l50L09o
2740b2J63K3k66K24k00j63K15k8j03L86k81L04k26lr8L0k0J91p7p3m3J86j34J6
2764Aj13P2j26n1O1K48q9rK7K8J60l70O5K14r8l0J05p6j10M01m11K8n8j35L49
2789H3j96K55k69J04p5K80k0k16J94o4j99K12m7k16J70m6M0O4k58j7M54l12O3
2812a6o5J51j57K1l66M19J56JJ16k74J61k11J24k44J9P3JK6J34L90l75j77K41
2835A48mj43j63j46L51k04J41k56K58J27k01N6j4l3M03k77j77L37M2l68J36j66
2857a53J98J2q7J11k43L37j59j23j6j86L5J23J40j06l2J83J58l09L95j10k05J32
2879I5k80M23k23jk45L27p2P9r0O9K6j74N3KL9N7j88J82Nl13L78j98j43J83o0
$$ y = [-94, -201, -157, 453, -21, -112, 84, 137, -208, -1, 292, 355, 3, 478, 74, 439, 258, 73, -196, 25, -325, -16, -22, 141, 164, -102, 122, -78, -241, -26, -54, -157, 229, -52, 252, 26, 23, -75, -45, -65, 126, 49, -24, -67, 119, -15, 1, -112, -40, -166, -217, -156, 92, 3, -6, 21, 49, 209, -161, -96, 118, 20, -10, 95, 19, -91, 310, -101, -73, -131, -266, 83, -113, 142, -127, -23, -98, 182, 162, -54, 140, 76, -123, 89, 42, -174, -4, -50, -10, 54, -204, -221, 233, -79, -16, -81, 70, -87, -66, -432, -13, 143, 144, 260, -14, 147, -64, 60, -184, -165, -92, -91, -65, 69, 459, 84, -93, 148, 144, 1, -162, -308, 43, -161, -20, -276, -18, 109, -92, -36, -50, -83, 320, 43, -134, 203, 245, -123, 13, -153, 45, 57, -30, 81, -162, 175, 16, -107, -123, -309, -274, -151, -11, -117, -149, 34, 192, -117, 278, 168, -37, 95, -185, 238, 15, 14, -231, 96, 24, 103, 13, 82, 108, -66, -13, -11, 28, 85, -103, 79, 84, -229, 149, -49, -192, -9, -69]
2904f9p0J69j26qL88k78J83l34J8P8J40m6J09J6j32k59N16k38J78q5l58K59o0
2927ij31J79O5p2L63m42N4j28J52j70L09K9j48k48J60J12j19L00k55l5N5M8k0
2950D9k50J80K25j16l86R0J44J53j6k61K84j12M3J71l31K52P0j48r2o4J41J05
2972A31k30J57j38j6j44L55J46l65p5J69Ml9k4J4J07r0n0KpK11j36k2L7J17k41
2997a27P7K61l86K43l30K87j38J40Oj86J87k95M19j18K61k93p3J75k0j18J93J61
3019C26k74j27q8K90o5m09K33L4K55j30j59q6K40l98K02mJ18p6K36p4j01j59K89
3042G3k03k4L21j18q9l34K75R9k27K93k99K27n8m1n2k72N49k92L90j72k95N29
3064B80m28J9O1o3O7Q9j09l0K01p9N0j40j39L24j30L06k45m1J45j09J83k31J24
$$ y = [-69, -139, 30, -96, -104, 284, 6, 189, -145, -127, -49, 91, 45, 154, 170, 38, -221, 295, 57, 235, 150, -208, 51, -9, -140, 39, 104, 32, 395, -47, 7, -121, 31, -139, 170, 199, 51, -197, -37, 75, -44, 256, 1, -34, 21, 69, 49, -201, -21, 204, 88, -298, -208, -64, 89, 73, -188, 96, -16, 27, 198, -133, 119, 189, 41, -51, -115, 26, 131, -99, 58, -80, -96, -240, 115, 261, -104, -179, -10, -6, -45, -69, -55, 52, -38, -88, -86, -93, 118, -18, -40, -3, 114, -127, -50, 211, -175, 68, -262, 25, -113, 27, 33, -153, 34, -261, 158, 40, 301, 8, -65, 110, 90, -28, 165, 326, 52, -75, -163, 127, 62, -347, -114, -80, 175, 45, -114, -200, 40, -358, -156, -160, -42, -118, 118, 44, -57, -216, 73, -130, -154, 167, 49, -40, -374, -99, 0, -227, 66, -233, -6, -64, -105, -157, -429, 120, -172, 218, 46, -249, 280, -148, -129, -68, -131, -64, 25, -84, -114, 87, 8, 58, -82, -221, 103, -27, 279, 34, -7, 138, 29, 212, -19, 105]
3087A05m06N60l84O6m1R6O1o7Q3R2k64J26J17m9K0k08l9k40M53J38k71j18K66
3110I6j00J23J41k99m0J84j32J14j72K9J32j45m6P7k05L30jk50J36K60j80K65
3132C17m46J26r1K61R1l11j28K2K77Pp8M4j74o0J08L5R2J09l66l4J43RP5m2L28
3157C14k50k19K12p3L1j91j6J15j46P8n9QO58m29J06l52K89n8O7k18q0K98j88
3180a03L8l1J70j19kJ01J80j70m09M47j23r8L06o4j19LQK38m06P4M6j34j04M06
3204A35r2Q1ql60L99n9N7l09J45l4J89m0l79M86j95N1k12NJ48j24J19j72J13M7
3228iJ31j76j97K36J20J14j49Kl74K39o6K7R8M3j85J54K75o8m48N57l73M6k18
3251b21K84J2l67M28J3j35J28k61J10j4L2M4j40k9K56M9J9O0l21k41p6L42l87
$$ y = [105, -301, 259, -125, -59, -100, -4, 57, -10, 73, 165, -99, 27, 144, 95, 115, -93, -132, -372, 81, 219, -52, -170, 96, -4, 119, 260, -39, -79, 105, -27, 87, -85, -56, 76, -69, -115, -38, -243, 87, 86, -164, -28, 232, 52, 317, -129, -3, -94, 167, 258, -53, -181, -159, 118, 125, 47, 91, -83, -143, -35, 0, 92, 201, -165, -199, -56, -47, 28, -14, 314, 64, -155, 57, -16, 15, -176, -192, -77, -223, -145, -204, -196, 462, 33, 139, -213, 76, 18, 85, -133, -213, 85, -103, -65, -96, 74, -45, -47, 54, 234, 64, -345, 102, -21, -119, 187, 123, 4, 7, 15, 253, -153, -79, -33, -167, -271, 135, 43, 124, 116, -244, 155, 96, 153, -156, -11, -45, 144, 104, -275, 211, 16, 67, -145, -140, 8, -116, 3, -169, -56, -9, 122, -54, -251, -15, 105, 219, 70, 72, -302, -63, -129, -102, -4, 39, -146, 8, 283, 215, -233, 324, -49, -3, -221, 63, 75, -292, 136, 149, 14, 142, -119, -9, -23, 9, 53, -87, -116, 140, 189, 208, 268, -53, -294, -370, -28, -415]
3274d15N53L4m72K93O8j23m83O06m96O27k43k71L65j31J30l94R7N26K63Ro35L84
3296B92q56O14n07L01J49k41M7L08k30l60Q40k18o05j93K24Q77m05r6K51k68k1
3317i7k25J103j54Q6j161K95J0R22j249j9L0M24K30r60K79N30L41m43R72p41K27
3338D00o02j36J160j407N58J0k31M02o13j97J276p33j98L93j74J55L51m67J096
3357A043r67l64L25l05Q36p77K38r0l79M00m45Q47N07j685N45k72J95O75J75m61
3377D1O36o55j25j62M20M02m56J63l99j8O24m97j82P60j068L85N4k04J24m25K52
3398c30M13j97L83j48J94p47M51k82L70l40K08k09O36n69j31j74J93K13J2j84
3418b38r5M92l44R93j023L11K42k13P2m3l2m48L51p33R43j072J057P1k98L37o55
$$ y = [-415, 138, 172, -300, -7, 61, -62, -545, 61, -435, 192, -51, -322, 43, -88, 42, -352, -255, 271, 534, 543, -92, 292, -564, 50, -457, -156, -7, -248, -201, 107, -123, -483, 357, 139, -466, -659, -435, 442, 37, -59, 192, -76, -97, -322, 781, 627, 713, -448, -153, -143, 779, -470, -489, -459, -35, 195, -765, -486, 44, 385, -58, 914, 173, 400, -202, -338, 822, -585, -27, -17, -248, 154, -459, -656, 620, -113, -311, 82, -92, 63, 414, -53, 1043, 76, -288, 37, -268, 568, -209, 29, -61, -440, -40, -485, 362, 869, -816, -271, -543, -348, 327, 502, 41, 677, 22, -103, -265, 155, 557, 101, 264, -135, -153, 471, -26, -208, 552, -516, -131, -77, -281, -157, -582, -330, 83, -114, 269, 121, 315, -432, 19, -263, 107, -233, -25, -234, 402, -167, -298, -472, -279, -66, -54, -238, -333, 159, -185, 808, -215, 96, 338, 125, 197, 154, 122, -326, 25, -708, 235, -837, 220, 291, -7, 330, -325]
3439c25j25Q35n82j10j0k9L14N46o03O57l86m58K10n9o37l6JJ072j40k8N31p37
3461i9MN4J04o58J381j257N49m85l74N06J82m06J70o10O02n6N11j89m41R16j73
3482B31k42M94j41n42k39J167j083Q54m38M13l11m3k85j1j79P03j24q4K24j073
3502g09M43R5M10k59L79j20QNm09J21L16q50J002k01m0J57q45K06K59j09J72M4
3524G5J00q18L50P77%r27M83K76n62J79m40L62J36j82L53N37j226M27m38O76p8
3545F0m88O06k98J95M21o26nQ87m27n07j07m1j04K33O43o35J35m70K00M70o89
3566e47M99O74m43l79M5J52l91Q03N6o01K4M76l80K04q11K48J034o03q80J021
3586B01om66M29L23q80J61l67O90j93J41K35j115J020o32L83O67o08l16K8J72
$$ y = [-325, -450, 385, -197, -307, -317, -346, -32, 514, -89, 568, 182, -276, -66, -125, -762, -798, -797, 275, 135, 107, 638, -99, -95, -41, 63, -595, 786, -471, 78, -407, -781, -275, -93, -499, -329, -939, -337, -393, 118, -71, -512, 404, 231, -11, 483, 342, -200, -439, 728, -355, 499, 61, 474, 163, 120, -165, -176, -355, 348, 224, 140, 364, -709, -266, -171, 239, -20, 359, 239, 247, 252, -157, -36, 280, -570, 432, 231, 191, 348, -497, -291, -32, -141, 31, 75, 175, -643, -293, 484, 484, -443, 40, 316, -246, -67, -507, -145, -9, -191, 162, 699, -527, -100, -538, 138, 60, -428, 178, -120, 75, 496, -130, -135, 752, 325, -182, -289, -330, -434, -201, 442, -193, -58, -528, -328, 142, -547, -48, 626, 183, -196, -151, 1, -390, 413, 469, -132, -108, 368, -12, 192, -619, -371, 663, 60, -820, 201, 195, -271, 158, 481, -399, -238, -605, 85, -108, 33, 268, -847, 173, -459, -76, 591, -17, -333, -305, -133]
3606a33r5M53k50K77k91j49m77O3L18k82O85n93n0J82l25O25K63n12R08p53N36
3627D00l09l23J172j546J243j062N57M11j53k82n19N72M12r56O51n8J75l72k88
3646b75N20m74L90k38O19n20K8k33q12P90j91Q7K54L26j283J155m14L79j92kk57
3667c43N79j34p8j18L94j39J27q74P36L3n74N56o07J060j88n57R6l0l68K88K09
3688F8j82k24Q93r35M31J81k29J04L10J9p66J307j341J190o11j204J226k93J97
3707A41k91q6K61m46Q38Q8k44r5k46K86j36K04m36L40k13K0K47k40P0J26j05l09
3729b26L36K0o7j50K20J91k11r9PJ81m84J66J09J6p1J02J49Jk72J17j57J05K4
3752Gj88J34J84k01J55n6L00j33j52N2m00L54j37K70l18J53M2j53K73m11j9K89
$$ y = [-133, -228, 225, -25, 252, -39, -188, -665, -602, -284, -566, 119, -474, -524, -342, -667, -42, 221, -291, 617, -136, 400, 91, -232, 940, -606, 637, -425, 132, 543, 390, 108, -411, 161, 573, -383, 268, 210, 385, 13, -275, 245, -229, 161, -77, 542, 22, 50, -183, -995, -205, -396, -309, -55, 271, -1012, 143, -271, 108, -84, -86, -343, 236, 102, 24, -94, 300, 161, 288, -586, 150, 183, -391, 165, -442, 618, 430, -127, -31, -61, -429, -141, 68, -114, -338, 555, -380, 51, 232, 3, 107, 417, 436, -330, 977, -364, 826, 215, -989, 237, -56, 141, -150, -236, 25, -421, 417, 505, 261, 166, -80, 206, 70, 274, -162, 178, -35, -15, 232, -8, 62, 188, 83, -226, 110, 130, 63, -87, 133, 324, 113, 14, 21, 202, -282, -116, -7, 9, -62, 40, 189, 190, -82, 35, -122, -17, 7, -181, -47, 137, -64, 91, 35, 335, 202, 50, 102, -298, 56, -81, 189, -129, 24, 66, -87, 186, -225, -244, 45]
3774D5j29J22j33pl3J73J12q5j72K13N2l42L48k22K29lj73rJ60l64O5q0L6J50
3798d7J68k69N8L3P7R6j32K22k58K13N9j32j7k07N9l1L77j30pK7k47J87Q6j29
3822E6ok31L48r2j9j29k52L02J51pk39K59L6k19L7J64n5k05j09J3J74J72k01m1
3846i3Q1L4j71M53k39l9j14J7J64k78J61J06j60j86K80kk08K57l09L46j98J77
3868G9L7k22K77k10j30K03k63N29m80L26j9Kk2k82J71R2k12R2J26J6j06J9J99
3891B22j05l2M2m9J0r2j65K56l4lpk51R7Q6J07k19P3L40k34r1L0N0M0j05j31n6
3917b21J02J57J67j35r2k7K39m07K08l0Q3J59q9k01J90k07kk09M07p8j8j46K55
3940A05k19L65k08K06k20l4j23K77m2n26J24K02o4M52o4j74O8l46L13R0m34L34
$$ y = [45, -84, 38, -95, -102, -135, 38, 150, 65, -107, 106, 158, -184, 164, -58, 171, 168, -5, -14, 146, -218, -153, -233, -197, -47, 121, -148, -90, -57, 20, 116, -16, 206, -52, 161, 220, 88, 71, -136, -77, -108, 269, 139, 132, 159, -88, 99, 185, 56, 50, -181, 167, 75, 56, -73, -325, -23, 128, 121, -118, 141, 177, -42, -5, 159, 104, -101, -210, -197, -23, 149, -52, -93, -12, 22, -149, 304, 65, 26, -88, -71, 93, -185, -24, 82, -78, -264, 16, 14, -194, 63, -246, 100, -98, 79, 116, -106, 171, -39, -169, 34, -229, 300, -180, 146, 127, 129, 107, -175, -4, 88, -124, -32, 94, 110, 4, 23, 222, 117, 85, 127, 78, 88, -4, -169, 87, 53, 50, 43, -208, -111, -25, 82, -137, -64, 276, 42, -49, -19, 31, 71, -34, -165, -221, -119, 38, 205, 70, -22, -49, 190, -217, -9, -39, 44, 203, 114, -87, 103, -104, -106, -315, 92, 14, -4, -150, 105, -114, 251, 43, 249, 29, -5, -128, 149, 107, -419, -295, -93, -157, 295, 231, 57, 125, -221, 92, 182, -252, 82]
3962H2J8l36l3K38j90N62j014M10J60m82M09O65K1k91Q8j59l95k87R52p87n18
3983h87K50L91Q01j169j95J013j091M90L84o3k51N3m90J101m30K94m45j4l21L41
4003b38m36N85n89L97m7M93j2M6l33kJ46Jr9J17P0k23K80j1k70Q8o0o6L99o8k16
4028d8K48k55J11Q0j59J94L2l35j39M74P8o6l54J27Q3j3K7q5j00nJ57l7Q1m5P2
4053A23l3j44J72k41o0K52k97J92J25j55L1j0J20K1l16J43j2O7K12k64J48j01
4075b7N4M2OP4Kl30J46Q8l8p0j84O7K1K27J81m15L74l87M35p8N6j57j37P6j12
4100h6J66q8J12O3l04J16r6j6k41L49K8q4J75j23K01k34J29J06k78J01j72J89
4122A3K82l25J58l16KL33j01o5j0K33m73j5L96l16J79Q4j6RJ27l01P2J99j42r9
$$ y = [82, 100, -236, -269, -31, -221, 341, -673, -263, -103, -585, -176, 489, 510, 219, 307, 148, -247, -534, 418, -369, -887, -637, -246, 555, -614, -809, 204, -887, -397, -13, -76, -327, -274, -764, 337, -93, 201, -244, -258, -579, -238, -674, -89, -678, -281, -328, 165, 153, 199, -134, -136, 10, 11, -88, 29, 99, -124, 156, 145, -125, -37, -97, -163, 236, 168, -48, 200, -55, 56, 136, -23, 171, 203, -132, -271, 203, 281, 215, -139, -12, 71, 58, 85, 0, -100, -105, 52, 15, 96, 51, 123, 90, -54, 118, -123, -183, 69, -228, -36, 89, -66, -35, -45, 75, 96, -220, -77, -89, -22, 190, -74, 74, -27, 27, 69, 75, 149, 151, -179, -33, 55, 17, -53, -237, -170, -149, 78, 259, -156, 218, -169, 266, 188, 244, 87, -50, 26, -86, 80, -8, 104, 167, -137, -21, -117, -133, -374, -25, 3, -81, 94, -29, 172, -62, 67, 173, -105, -4, -176, 13, 295, -30, 128, -188, -186, 147, 46, -19, -29, 204, -269, -284, 112, -204, -25, 59, 43, 52, 179, -122, -50, 149, 7, -92]
4146i2N9N3M39n22J05j88J95J43l55K48j89j37m57P82k55L33j55K8M2n9m3J19
4168I4k45J32k72Q9K52j64M4n4J98r9Q9j80L09j71M4K08k94j14L10j36p8K1l7
4191e4K02l30K90L3J79m78J74K64n14R7K49k27N0P4n2n3J09n9QK50j93k71L20
4214F8m5L8o3j57K25l0L9l68O49l79p2K60k58j9K94l5J3k48j1p0j27K91O4O4m8
4239G5j85L72n9k1k55j67J73KO9p6K52r1j68J03N5K3m7N9q9m17J95Q2L21j45k88
4264b27L49l18O4L00k52K44l60j36N53k11l45N39k39l59L35l0K22j90K43j61l4
4285a3K43m27R6J52k44L30l63K88l09J70J04J47j31P2j33M9L4n9L06l69K82l02
4307g7RK08r5j31L79k94L7k40J67R1K16m10m8r4K33j6N5k5J77n21L14o4M8q1O3
$$ y = [-92, -33, 20, 459, -63, 42, -146, 49, 192, -163, 85, -104, -241, -698, 84, -171, 162, 7, 35, 77, 18, -25, 94, -151, -19, -291, -202, 50, -114, -70, -124, 74, -25, 64, -116, 193, 22, 66, 274, -20, -134, 176, 40, -38, -17, -54, 148, -182, 108, 141, 320, -158, 16, 280, -234, -137, 112, -115, -65, 9, -43, -96, 13, -46, -38, 212, 19, -252, 68, 23, 61, -2, -159, 66, 36, 75, -293, 356, -23, -95, 165, -93, -112, 182, 147, 160, -88, -99, -169, -296, -5, 59, 123, 75, -110, 262, 203, 182, -73, -240, -67, -65, 4, -72, 180, 89, -79, 24, 79, 102, 55, 114, 25, -392, -197, -115, 206, 61, -227, 122, -196, -132, 168, -84, 160, -200, -336, 217, 6, -339, 200, -39, -398, -63, -93, 129, -61, 182, 21, -13, 230, -197, -101, 51, -193, 137, -226, 62, -247, -77, 27, 174, 43, 115, -18, 31, 65, 6, 312, -57, 225, -77, -68, 140, 45, -86, 293, -1, 36, -204, -37, 54, 270, -140, -188, -282, -49, -65, -10, -35, 142, -379, -65, -129, -81, -162, -99]
4332i9L29L9l12R7r8K42l66N6N75l52K5j26J70k38Rj28O3J78J46j82k30K72R6
4355A66k77R0j00L1K4J84mk77k3K48J15k76J5K65j10k60K2J41J25j83j37K10J22
4378A11k38K23pJ00j50k19L22l5k09P1j89L45P1k79K93j52ql7Q3Q0l8j69J11l19
4402b39J14j45J34M24k09k82R4O1J35n0ok08K58j05L6n7J05j91R2r3P5K06l87
4425b38K40q6K63j21j65J94o5k57L16J3j21Q9k48k6K12O1j99L8J36o5J24j95l
4448a03L16p9j40k06J41J16J1j76K00j75J1j0J09J16k85M8OK53r7q9kP0k16J90
4472Il4K32k48q9J69%J66j67k25J52K73l11J75o6l5J75k1j77k4N6r8L10m39J72
4496d5J12l79J23j87K64Q1j6L7k5J5K63p9k57J94l28K38q3J00j69k1O0j2L24j29
$$ y = [-99, 230, 269, -43, 54, -44, 198, -168, -112, 463, 111, 136, 10, 180, -58, -49, -177, -114, 64, 210, 28, -202, 70, 166, -111, -21, -121, -90, -66, 118, 114, -163, -186, 62, 177, -99, -84, 181, 71, -189, -167, -26, 99, -84, -221, -11, 111, -127, 96, 89, 189, 39, -180, 142, 107, -102, -31, -220, 125, 196, -83, 210, 58, 50, 13, 96, 176, 138, -31, 80, -239, -125, -270, -136, 288, 79, -203, -109, -48, 87, 37, 31, -177, 81, -24, 12, -45, 60, -131, -39, -132, -57, 149, -238, 2, -84, 179, 58, -107, 87, 22, -235, 81, 94, -27, 62, -186, -212, 0, 61, -138, -100, 36, -29, 95, -100, -103, 213, 134, -6, -212, -71, 45, 56, -120, 80, -95, -84, -94, 15, 131, -154, -106, -100, 153, 56, -33, -35, 35, -181, 9, -25, 207, -41, -130, 39, 39, 205, 38, -187, -35, 238, -73, 102, 36, 1, 176, 155, -22, -46, 10, -88, 222, -217, -45, 67, -312, -189, -376, -112, -31, -47, -10, -35, -20, 243, 164, -93, 101, -227, 11, -72, 28, -141, -162, -102, -114, 210, 81]
4520H1k82J64J9j42p3O5K21N2K9j82J69k31J89j06o8m4j26M22j41n8PK57j30o4
4544B8q7m8K98l5j63R6j81M8K59K3l12J96M8k20k1k6J11k49K21O2r9k12L99Rl37
4569a92K29lQ2k94L16j35J23J7j86M3j72K01n9K31l12J74k23j43L20L1k4l8%j75
4593a89k1K70j15L28L1l2j06k67P4j31J87l6J38l68O05l66j22N9J99j77J6L51
4615C28n18L00k08J24k95K13P4L8k35O6J47j62K14k62K89r6k3j65M07l73N9J35
4637E7j19n6N7J15k56L1L24k43N4j91M62m00K77j40j96L80m79K40J74r3J7k22
4659b07K16l0j57K82N8j35j87%K55k6l03K60o3k1J27O0k47L67l51m4Mj33M7K37
4683Io6qJ0k88L73j08R9r3K36l20nJ15K0K94j83o5k12K87L8P4j28l99N16j72q2
$$ y = [81, -201, -37, -18, -160, -233, -168, 53, 105, 134, -48, 121, -110, 79, -27, -95, -139, -265, 157, 16, -42, -35, 222, 92, 28, -59, -107, 191, 156, -7, 89, -92, -44, 215, 238, -74, 122, 170, -50, -71, -97, 14, -235, -14, 48, -51, -263, 136, 145, -192, 37, 34, 116, -178, 138, 3, 126, 143, -43, 0, -172, 29, -30, 201, -111, 63, -160, -303, 17, 48, 24, -14, -14, -189, -210, 60, -55, 273, 304, 272, 166, -101, -27, -158, 29, -7, 131, -237, 368, 2, -120, -61, 138, -39, -23, 328, -190, 110, -98, 26, -269, -56, 18, 56, -179, -113, 34, -128, 86, -176, 113, 17, -6, -171, 236, -137, -78, 57, -62, -118, -61, 54, -202, -171, 153, -90, -36, -227, 235, -165, 112, -28, -224, 156, -323, -83, 91, -2, 15, -207, 9, -21, -178, 104, 162, 27, -160, -160, 95, 69, -234, 26, -37, -58, 69, 129, -118, 249, -102, -146, -142, -275, -228, 9, -57, -65, -55, -343, 30, -78, 21, -72, 164, -156, -161, -46, -26, 268, 85, 20, -192, 95, 133, 207, 79, -320, 196, 24, -58]
4708e8J90kMN1j92J35p3m99M24O3j99K32q9rR0k5K33l02p8J83n1j2K76j94k47
4733a49J20j78J94J6j19N13m33J11j21J7j7M93j83j59j20K85k82k9jL8J24m8j83
4756a11J70j85L25k10l65M46j9Lj31P5J6m6j35K13j95J61o3J32j45l7J66j33J55
4779H7Q0K37n00J24j64K68n8J32J78n27L19k05j71J04L34k38l51O77p0n74PP58
4801D47n04l09k66N14L08L40n63j18q7l13J342p58O2r67O13o7O99J71j061J12
4821d05J251q12K17r4L69j151P69L52r3k88J175j349j05l37K2N47n51Q83j090
4840f90J144j580J041mn30J418o42J63M9r66M22O86q27O83n68m14O82o94L59M53
4860A85p73L00l79M52N32n95N62m95j12J80k59K28K26o4n54J065q68M00K31j49
$$ y = [-58, 132, 130, 134, 185, -7, 128, 55, -444, -20, 43, -156, 76, -13, -22, 68, 43, 276, -26, -104, 79, 28, 16, 292, 98, -149, -29, -207, -13, 3, -116, 397, -36, 75, -46, -29, -46, 447, 264, 105, -15, 270, -12, -41, -42, -4, 120, 72, -111, 59, -126, 199, -11, -376, 70, 51, 54, -77, -2, 14, -32, -167, 46, -149, 12, -51, 81, -64, -101, 65, -68, 87, 167, 404, -96, 28, -136, 132, 74, 206, 384, -143, 176, -29, -200, -96, 238, 0, -351, 326, 256, -318, -311, 447, -57, -366, -632, -118, 190, 530, -33, -151, -238, -551, 791, 33, 95, -872, -259, -326, 373, 544, -517, -405, 846, 34, 251, 157, 526, -625, 144, 496, 403, 115, 1290, -59, -164, -501, -479, 68, -483, 400, -690, 454, -1126, -85, -89, -619, 799, 157, 320, 369, -597, -175, 511, -316, 367, -201, -615, 67, -627, -268, 185, -588, -288, -667, -215, 317, -278, 284, -211, -323, -143, -402, -174, 52, -12, -566, 499, -369, 31, 262, 113]
4880A13K84l01k30O82q10M67j78OL57o00J12O4%M28m70j11J93l36J25K42J57l97
4902b03j1K05L99n51j62Q9L2M48j23kN4m0m7j68J89q6j30J28k1j10L76l21J21
4925F6J98l61J7L28l05k8J00J32l21O4J30n2P1m4j57K01n4J56j10p4k96L96K3
4948H0O7j03L5j69nK41k30M8J42m6j76n9k7N33k48P0Q1j81L20m01J47j36p0M28
4972C41m39M40j075L49M99m24N3K02K84k8k83R5L28l56O05r13L37q50J021j49
4992C7P25p13J72M83j127J228m57L94p25n25O81Q26o81k33k97K57l69L15O8j65
5012a06K68k3P2l43K8L84l01j4k2O8O4n2j21j4K42K8m56N16k77K32j17j61J34
5035B9j10J1J29r2RQ8k13K17l9k3q2K5J43Mk70N2J07p2J52N5J00k73Lm8pK01j23
$$ y = [113, 397, 96, -134, 548, -262, 205, 27, 33, 390, -210, -98, -34, -34, 394, -76, -187, 6, -330, -205, 37, 194, -203, -214, -9, 390, -161, -323, -234, -202, 246, 123, 121, 175, 135, 88, -80, 109, 23, -107, 21, 0, -110, 266, -55, 66, 264, -97, -80, 248, -57, -85, 15, 147, -174, -110, 20, -32, 39, -5, -162, 39, -15, 141, 31, -43, -339, 57, 80, 147, 44, 79, -90, -95, 146, -84, -36, 106, 60, -116, -175, -202, 331, 83, 153, 234, 53, 373, -28, 119, -17, -87, 341, -98, 342, -733, -384, 115, -309, -256, -54, 230, 202, -81, 14, 342, -14, 591, -322, 15, -835, 186, 37, 762, 49, 221, 704, -423, 805, 348, 742, 17, -508, 173, 999, 318, 85, -212, 45, -324, -9, 59, -106, 162, 139, 211, -132, -104, 280, -21, -35, -57, 11, 75, 23, -98, -112, 130, 158, -298, 218, -59, 173, 56, -105, 29, -81, -70, 59, -33, -24, 64, -149, 68, 29, 6, -76, -51, 92, 96, -174, -122, -15, -87, 65, 120, 220, -53, -50, -98, -105, 96, -27]
5062b7L02j84k93K93l2N1Oj9j65Q1K80l10j98J85j21J7K68k45P3j80l8K7L98j7
5086A52l00L5Q3o3K96k38L11j91j66J22l01K71j52K16j22n9K5J02J90k57J11J19
5108A84l43L77ll23j21M27l19K32q9j26Q7J05j17J00N6j54J91q8M7q1j59J81Q8
5131A52j63l35M11n1Po0L00l35rK41k44j29M20m41K10K42j86k39J97J96j56J46
5153A74Pk91J11J3N6j54J32k37K49P8l76K50J03K88m0k16jM0k46N10l6m83j79
5176b48j17M94l4k5p21R23j53M76q34K69j81J83j05J4n8K60J72R8j20j83j93K91
5198B08l56J42j00k03K85j1k61R0L41j33Kk05N09k92k16J42J20lj13m8r0M50l59
5221a01J77k01J69j48J93J03j07j98%j17J08O8K78J4p1L0j07k26J86L7Q5k63K21
$$ y = [-27, 275, 91, -202, 91, 59, 110, 116, 97, -68, 13, 293, -17, -215, -30, -151, -134, 134, -111, -38, -218, -256, -229, 169, 152, -148, -113, -30, -93, 203, -35, 276, 85, -81, 41, -260, 11, -141, 75, -47, -106, -81, 21, 211, -46, 65, 184, -159, 218, 215, -108, -229, 198, -121, 111, 22, -104, -17, 88, -29, 71, 127, -27, 164, 76, 123, 42, -117, 64, 152, -11, -346, 65, 14, 21, -39, 261, -74, -83, 158, -86, -215, 205, -236, -26, 216, 30, -209, -12, 184, 28, 174, 181, -110, 1, 14, 70, -84, 48, -189, 60, 138, -238, 12, 115, 403, 363, 147, 146, 186, -60, 450, 414, -69, -248, -365, 129, 95, 70, -651, 272, 119, 595, -239, 30, -151, 32, -73, -59, -117, 143, 315, 413, 293, 110, -83, 208, -148, -6, -106, -309, -24, -35, -296, -206, 135, 2, 4, -201, 308, 16, -200, -58, 62, 59, -54, -102, -192, 258, -101, 76, -125, 44, -104, 89, 192, 85, -113, -113, -230, -122, -54, 224, 238, 167, 197, 90, -136, 50, 87, 172, -91, 130]
5244A30j38R2Q0j43M3J0m3kj19k3K07o7K00j80J78l11j80M71l91J21J37J02k29
5267e5q9O1rJ51k5j48O2K0j37J18l6j40K21K5O9j43K9M5K00l60J76J15j93J25
5291H2p1K4j19Jm4j88K43J38K39j20j75K65m08P0M2kJ08m8k12K13m6J64l39J23
5315f0p2qK18J5R2l12M47n15K02L0j90L81l68K1J34k1o7J42K04l01l0R2l48L51
5339C7N7k15L94l90K46j03J85k61J8J36j24J71P0l61L23j95J07k86J01m3K33k55
5361a55J68J88k04Q3K2n2m83K59R7p8J44j3L7k6K30l24K25j56K32M6m53J76K3
5384a4j51J80J23k02J79J54j65j69J54j42J81l6j16K20l24K54k19L16k03j80O07
5405D47l92J7j31J66k34L37j30R4j32P2l68L81l4k61L51k84n3J17J34k29K11Q1
$$ y = [130, -8, 84, 164, 21, 64, 74, 31, 29, -90, -113, 94, 27, 227, 47, 225, -86, -266, 205, -186, -65, 72, 174, -55, -144, -83, -92, 59, 34, -114, -52, -32, -169, -51, -87, -227, -6, 19, 88, -55, -26, 19, 219, -141, 35, 150, -43, 82, 11, 35, -84, -83, -127, -315, -72, 66, 305, 185, 10, 275, -133, -63, -21, -23, 85, 37, -175, 38, -8, 156, -183, -60, -132, -140, 78, 93, 185, -127, 320, -195, 7, 37, -153, 228, -140, -119, 15, -6, -73, 69, 273, -28, -58, 34, -314, 37, 94, -121, 273, -117, 129, 26, 211, -50, -32, 104, -20, 151, 221, -140, 183, -12, 95, -191, -90, -133, 100, -155, 13, 201, -3, 80, 102, 50, -433, -174, -77, -155, -11, -24, 13, -13, 217, -107, 118, -38, 194, 240, -213, -37, -14, -165, 15, 138, -64, 115, 269, 104, -65, 89, -53, 128, 92, -24, 196, -128, 126, -93, 223, 20, -160, 447, 55, 72, -59, 107, -127, 210, 80, 174, 42, 114, -254, 127, 93, -168, 183, -101, -154, -37, 97, -132, 79, 160]
5427A60k1l72K53Lp7J40k65L32k8l04M07j12k85L66j64j96K20O0j03k32M87j29
5449A40J56j08p3l53L18Q4k39j47M70n2J0P7k84L31n70L68J2n8k63K12l56K97
5471b8M6P5OK24n31R5O9N9j30J00M6N0J6j03j25J55k7j62M88j73n49O33l02l17
5495c85J00J00J44k7l75J85K48M89m30P0K94n84q7L28O2L12k98M40p63L0K20l73
5517c00J36L45l13J32LL79o12L12j2n76L7K7J40K43J63q95J183j070O66k62L00
5538B6K72r00jN39k10L44L87R7O3p45N11j41L77n38n78J78K3J57J02n71P83j61
5560A4K32o28P88n50M84j26k11j48j82N8M27K61q46k48O76O3j33J21K45j19J14
5581B92nj062M20K36k31N25k5k39J87J94m16K11J62k05N9P7K26m52j07M2m01R82
$$ y = [160, 139, -233, 20, 23, -54, 86, -179, 153, 125, -179, 228, 116, -169, 197, 33, -163, 57, 117, 14, -218, 269, 140, 296, 188, 115, -238, 80, 164, -75, -222, 248, 196, 206, 283, -1, 330, -240, 128, 140, 82, -181, 31, -325, -28, 18, 93, 99, 323, -208, -113, -44, 15, -115, -15, 31, 81, 97, -6, -131, 24, -3, -165, 323, 150, -399, 234, -68, -385, -285, -185, -41, -68, -443, -258, -10, 479, 49, 119, 413, -171, -258, 70, 132, 444, 146, 586, -177, -147, 73, -300, -164, 181, -132, 0, 3, 382, -230, 82, 70, -506, -469, -442, -302, -59, 104, -791, 392, -678, -12, -274, 26, 298, -602, -603, -64, -274, 70, 457, 554, 617, -128, 383, 242, 619, 81, -497, -319, -296, -139, -37, -608, 175, 14, 246, -382, 406, -144, 340, 214, 3, -145, -327, -269, 158, 419, -427, -675, 1, 64, -69, 52, 297, 178, 292, 287, -775, -355, -119, -350, 175, 150, -89, 98, 292, -124, 87, 249, 44, 103, 180, 406, -46, -153, -111, -512, 470]
5603D70q83P17k41P01r51M1QO82j86n97M36l09J94J95j87j30P67r56N67n3l48
5624f3M6k11K73j08O71l98J20k85R1l34j19K10j16J64m6j00m87L33O63l14n77
5645e87N58n0m4P82n98o0Q00j014j4N2q3P26l99k22j81J086o50j87M21k34m87
5666c85N81o3l29K30n13O02R4j33K99J0l00j57K85l60LJ0J26M98r38J60J20l2
5688a92M52k87K20q98O4J83M84k64r81O68Q78n21K1K30j79K69J61p07Q76o75J61
5709c7M23Q95j385J44l49m01Q89m03N41j181J277j58p34M17P59q45JJ211k064
5728a000Q07q9K22L08l84N80M90m41n51K29L41l53l1M17l64M24j381P05Q3L54
5748C66p60K84p56J098j42j26l16L85l78j35P16L87j490J854p06j043L04N11j74
$$ y = [470, -413, 304, 63, 764, -187, -146, -138, 544, 358, -239, 197, -112, 82, 277, 90, -40, 727, -229, 338, 285, -63, -17, -228, 45, -63, 608, 210, 330, 45, 136, -198, -317, -107, -223, -59, -105, -205, -692, -359, 304, -10, -587, -29, -79, -123, 659, 61, 1, 801, -213, -227, -175, -258, 468, 69, -153, -334, 752, 102, -85, 336, 102, -385, 196, 133, -196, 34, -479, 123, 217, 84, 383, 393, 93, -64, 221, -139, -136, -126, 0, 498, -440, -280, -160, -192, 260, -27, 193, -705, -641, -458, 26, -238, -1219, -551, 327, -194, -173, 57, -122, 147, 308, -399, 477, -198, -37, 386, 1281, -104, 40, -309, -710, 179, -224, 317, -864, 413, 255, -479, -62, 697, -148, -147, 1064, -1000, -193, -282, -60, 248, -136, 444, 934, 493, -58, 171, 512, 159, 128, 545, 181, 605, -776, -71, 12, 366, -394, -110, -866, 232, 90, -36, -352, 33, -345, -480, 236, 623, -867, 987, 281, -762, -458, 53, -121]
5767a21J128p71n86M34J030j32j041l96K69L38J57J09l90l79j28N99L22l83k46
5786a87R64j045J226r59k7k7j19j249J367P01j244p3J159K45j103J182l03o71
5804a63k0L51k07K06Kp9j178Q85O37n73J162j129O05k99k39j26L30K24k04J03
5824B88k71N41k94k45J43n7j24M57p16J55K36M70n87J95K28R3m76O5n52M17m93
5845e27O04j42j88J91M31l01m72N22r9n21N03K54k58L03k91M08n18K4K68k84J34
5866D1p6J47l8R7j05k55L9m5p9K53p7J16j89K37K61l64J42k79P1n3J26J19O4Q7
5890B40m24J62Q3J7j85k7M31k25m1n1J16j61K8k5q7K43j68L3j79K06J54l17R3
5913h4RL3k0n1N6l1J66K03m86M83k49J20j52J10rk00J97j96m6J15k15L19l8j33
$$ y = [-121, 1007, 236, -350, 84, 1114, 982, -59, -455, -186, 152, 309, 418, 28, -351, -479, 120, 442, 59, -187, 777, -268, 958, -1, -28, -55, -174, -1423, -56, 645, -599, -672, 487, 732, -371, 811, 508, -163, -183, 168, -39, 167, 169, 90, -1088, -203, 434, -139, 1023, -106, 499, 200, -39, -165, 165, 389, 185, 288, 17, 558, 264, 19, 162, 105, -19, 438, -278, -123, 113, 583, -4, 191, 419, 512, 36, 101, -451, -34, -527, 77, -65, -253, -62, 369, 68, -404, 118, 19, -502, 1, 255, -3, 300, 9, 417, -101, -77, 191, -93, 41, -35, 112, 74, 171, 66, -189, -150, -195, -274, -21, -98, 18, -171, 66, 327, -37, 105, -174, -103, -156, -30, 89, 153, 240, -184, -22, 61, 78, -107, -134, 297, 72, 31, -20, 96, -65, -37, -62, -149, 94, -74, -41, -220, -14, 140, -177, -84, -75, -42, -62, -113, -57, -88, 78, 281, -205, 278, 29, 149, -3, 107, 98, -102, 95, -101, -147, -32, -247, 72, 34, -99]
5937i9K20k44r2L27k03J77j57N1j57J49j33K04k52J80R5j75o1Q5K47k09j1j8L1
5960d5j59Q6L77l39K21j06N0p8K7J9J17l86L34o8k69J29L9k8k5J4Mj10M85l08
5984a9J49l82K69o2k21K46m3J04p7J57oo0O5J22l04K14j7j45N0J38k57K16k4j33
6008b0k8J03j4J41q0j40K2J77l16J42J20l2n8O5q7K44m36K31k70L28j6n8O2L28
6032D08k80m25K94L4j16K83j56j56K46J40k86o4J28j52O2J67k3J87r9q9l26L44
6054A21P4j39J50k91J53k29K98l2k45j96J45L33k08J02o6L8Pq3O3K10p9P2k22
6077b4j0J07J62k83rl12M79k51j88N28j75n6K5j9k7n7J23k09l1K74O3k54J25J49
6101A30o7j61J83j15O1l8l8P3j64K20J14k58K51j94j4p3J48P3k89K5K6Q0K6p9
$$ y = [-99, 121, -123, -215, 112, -91, 86, -71, -20, -177, -28, -161, 43, -209, -29, 66, -109, -170, -85, 162, -47, -58, -76, -45, -204, -118, 259, -80, 141, 35, 85, 7, 34, 53, 170, -216, 118, 50, -219, -90, -51, -79, -104, -90, -86, -196, 289, -19, 130, -252, 17, -45, -266, -20, -63, 41, -36, 121, 115, 55, 120, 242, -62, 152, 135, -10, 40, 178, -79, 137, 113, -20, -48, 55, 41, 182, 102, -38, -16, 161, -155, -13, 107, 75, 17, 82, -5, 239, -197, 34, -236, 92, 76, 18, 80, 408, 128, -297, -3, 31, -85, 198, 42, -114, 132, 272, -14, -78, 50, -102, -40, 127, 104, 291, 192, 103, -223, 121, 195, 56, 206, -85, 68, -161, 137, 105, -140, -336, -191, 142, -66, 36, -30, 8, 15, -68, -5, 205, 126, 198, -24, -34, 73, 235, -48, -57, -369, 110, -141, -329, 199, 24, -32, -7, -26, -53, -110, 13, -196, -227, 47, 110, -144, -19, 130, 63, -98, 85, -30, 31, -7, -45, 28, -136, 84, 198, -60, 191, -3, -17, -90, 58, 131, -158, -133, -107, -27, -1, -80]
6125h0O4OM0k81J67K15j93K37k67K0K42j95q8L66l61M2q1J94k5k55M2J63J6O8
6149E6L5N8j35J66k89L86N8m84PJ28K66k96k42M47k09p8K86J24l72pK60l13J10
6172c8r4K33r6q7J97j48O3L6k15M06l20j7n7J46j25K48J13m69L00N0k83J56k68
6195b69L82j52lMJ45j53J12Ll3l8k41K93l31L01J73j34k87L11r4L5J62l65M38
6218B59p8k75J53p8K20pl21N4o4L46j27M9o4j21J75P5l59J12l0J37J81j89j04
6241e6J49k65OJ48L9m3p0L88o5j86l06J8Q8M2n6K73n2R6O3k31l07L09l4l0J78
6266I6o4P3Qj0l80K39m0p8K23r0P9l4p4P0J37m22K36K7J40j12j25J11Nj87J49
$$ y = [-80, -16, -10, 30, -251, -84, 131, -62, 175, -92, -72, 170, -25, -113, 253, -108, -66, -147, 47, 22, -233, -191, -28, -12, 56, 91, 149, 14, 180, -109, 277, 335, -149, -142, -14, 252, -44, -286, 161, -48, -126, 160, 284, -88, -95, 165, -148, -38, -132, 101, 5, -82, 115, -33, 30, 66, -149, 257, -63, -80, -137, 9, -116, 132, 245, -224, 76, 126, -157, -1, -269, 113, -39, -42, -38, 107, -46, 66, 69, 36, -2, -243, 50, -281, 20, 193, 59, -228, 83, -11, 24, 186, -179, 259, 181, -94, 59, -19, 201, 194, -127, -73, -137, 209, 82, 131, 67, -54, 121, 196, -163, -51, -81, 56, 237, 48, -56, 93, -172, -166, -18, 21, -22, -92, 296, 231, 45, -261, -243, -155, -113, -169, 104, 52, 148, 211, -20, -327, -18, -52, -82, 96, 32, 105, 113, 103, -277, -38, -78, -156, 67, -23, 56, 22, -52, 18, 155, -267, -31, -4, 136, 24, -101, 10, 15, -172, -23]
$$ [...]
8191a16
##END NTUPLES=NMR FID
##END=
