##TITLE=1H_42-2026-Bay
 200.13Hz, CDCl3.
 8 sc
 
 28.4.2026
##JCAMPDX= 6.0         $$ Bruker NMR JCAMP-DX V2.0
##DATA TYPE= NMR FID
##DATA CLASS= NTUPLES
##ORIGIN= UXNMR, Bruker Analytische Messtechnik GmbH
##OWNER= pz
$$ XWIN-NMR		Version 3.5
$$ Tue Apr 28 14:39:04 2026 Russian Standard Time (UT+4h)  she@DPX200
##.OBSERVE FREQUENCY= 200.131
##.OBSERVE NUCLEUS= ^1H
##.DELAY= (6, 6)
##.ACQUISITION MODE= SIMULTANEOUS
##.ACQUISITION SCHEME= undefined
##.AVERAGES= 8
##.DIGITISER RES= 18
##SPECTROMETER/DATA SYSTEM= spect
##.PULSE SEQUENCE= zg30
##.SOLVENT NAME= CDCl3
##.SHIFT REFERENCE= (INTERNAL, CDCl3, 0, 14.3821)
##AUDIT TRAIL= $$ (NUMBER, WHEN, WHO, WHERE, WHAT)
$$ ##TITLE= Audit trail, XWIN-NMR		Version 3.5
$$ ##JCAMPDX= 5.01
$$ ##ORIGIN= Bruker BioSpin GmbH
$$ ##OWNER= she
$$ F:/spectra/data/she/nmr/H-C/1/audita.txt
$$ ##AUDIT TRAIL=  $$ (NUMBER, WHEN, WHO, WHERE, WHAT)
(   1,<2026-04-28 14:37:41.67 +0400>,<she>,<DPX200>,
      <created by zg, POWCHK disabled, PULCHK disabled
       configuration hash MD5:
       00 E9 B6 7A A2 85 ED C7 34 08 36 98 17 FE 4E 26
       data hash MD5: 16K
       C8 78 3B 0D D3 95 63 82 7F F4 7C 40 00 4A 84 49>)
$$ ##END=
$$ 
$$ hash MD5
$$ E9 BA 46 60 4E 56 AB 06 82 FC 7A 54 7A 2D D8 D1
##$RELAX= 
##$RELAX= 
##$RELAX= 
##$RELAX= 
##$RELAX= 
##$RELAX= 
$$ Bruker specific parameters
$$ --------------------------
##$DU= <F:/spectra>
##$EXPNO= 1
##$NAME= <H-C>
##$PROCNO= 1
##$TYPE= <nmr>
##$USER= <she>
##$AMP= (0..31)
100 100 100 100 100 100 100 100 100 100 100 100 100 100 100 100 100 100 
100 100 100 100 100 100 100 100 100 100 100 100 100 100 
##$AQSEQ= 0
##$AQ_mod= 1
##$AUNM= <au_zg>
##$AUTOPOS= <>
##$BF1= 200.13
##$BF2= 200.13
##$BF3= 200.13
##$BF4= 200.13
##$BF5= 200.13
##$BF6= 200.13
##$BF7= 200.13
##$BF8= 200.13
##$BYTORDA= 1
##$CFDGTYP= 0
##$CFRGTYP= 5
##$CHEMSTR= <none>
##$CNST= (0..31)
1 1 145 1 1 1 1 1 1 1 1 1 1 1 1 1 1 1 1 1 1 1 1 1 1 1 1 1 1 1 1 1 
##$CPDPRG= <>
##$CPDPRG1= <>
##$CPDPRG2= <>
##$CPDPRG3= <>
##$CPDPRG4= <mlev>
##$CPDPRG5= <mlev>
##$CPDPRG6= <mlev>
##$CPDPRG7= <mlev>
##$CPDPRG8= <mlev>
##$CPDPRGB= <>
##$CPDPRGT= <>
##$D= (0..31)
0 0.7 0 0 0 0 0 0 0 0 0 0.03 0 0 0 0 0 0 0 0 0 0 0 0 0 0 0 0 0 0 0 0 
##$DATE= 1777372661
##$DBL= (0..7)
120 120 120 120 120 120 120 120 
##$DBP= (0..7)
150 150 150 150 150 150 150 150 
##$DBP07= 0
##$DBPNAM0= <>
##$DBPNAM1= <>
##$DBPNAM2= <>
##$DBPNAM3= <>
##$DBPNAM4= <>
##$DBPNAM5= <>
##$DBPNAM6= <>
##$DBPNAM7= <>
##$DBPOAL= (0..7)
0.5 0.5 0.5 0.5 0.5 0.5 0.5 0.5 
##$DBPOFFS= (0..7)
0 0 0 0 0 0 0 0 
##$DE= 6
##$DECBNUC= <off>
##$DECIM= 32
##$DECNUC= <off>
##$DECSTAT= 4
##$DIGMOD= 1
##$DIGTYP= 9
##$DL= (0..7)
0 120 120 120 120 120 120 120 
##$DP= (0..7)
150 150 150 150 150 150 150 150 
##$DP07= 0
##$DPNAME0= <>
##$DPNAME1= <>
##$DPNAME2= <>
##$DPNAME3= <>
##$DPNAME4= <>
##$DPNAME5= <>
##$DPNAME6= <>
##$DPNAME7= <>
##$DPOAL= (0..7)
0.5 0.5 0.5 0.5 0.5 0.5 0.5 0.5 
##$DPOFFS= (0..7)
0 0 0 0 0 0 0 0 
##$DQDMODE= 0
##$DR= 18
##$DS= 0
##$DSLIST= <SSSSSSSSSSSSSSS>
$$ [...]
##$SUBNAM0= <"">
##$SUBNAM1= <"">
##$SUBNAM2= <"">
##$SUBNAM3= <"">
##$SUBNAM4= <"">
##$SUBNAM5= <"">
##$SUBNAM6= <"">
##$SUBNAM7= <"">
##$SUBNAM8= <"">
##$SUBNAM9= <"">
##$SW= 18.0517599122864
##$SWIBOX= (0..15)
0 0 2 0 0 0 0 0 0 0 0 0 0 0 0 0 
##$SW_h= 3612.71676300578
##$TD= 16384
##$TD0= 1
##$TE= 0
##$TE2= 300
##$TE3= 300
##$TEG= 300
##$TL= (0..7)
0 120 120 120 120 120 120 120 
##$TP= (0..7)
150 150 150 150 150 150 150 150 
##$TP07= 0
##$TPNAME0= <>
##$TPNAME1= <>
##$TPNAME2= <>
##$TPNAME3= <>
##$TPNAME4= <>
##$TPNAME5= <>
##$TPNAME6= <>
##$TPNAME7= <>
##$TPOAL= (0..7)
0.5 0.5 0.5 0.5 0.5 0.5 0.5 0.5 
##$TPOFFS= (0..7)
0 0 0 0 0 0 0 0 
##$TUNHIN= 0
##$TUNHOUT= 0
##$TUNXOUT= 0
##$USERA1= <user>
##$USERA2= <user>
##$USERA3= <user>
##$USERA4= <user>
##$USERA5= <user>
##$V9= 5
##$VALIST= <valist>
##$VCLIST= <CCCCCCCCCCCCCCC>
##$VD= 0
##$VDLIST= <DDDDDDDDDDDDDDD>
##$VPLIST= <PPPPPPPPPPPPPPP>
##$VTLIST= <TTTTTTTTTTTTTTT>
##$WBST= 1024
##$WBSW= 4
##$XGAIN= (0..3)
0 0 0 0 
##$XL= 0
##$YL= 0
##$YMAX_a= 170666
##$YMIN_a= -566299
##$ZGOPTNS= <>
##$ZL1= 120
##$ZL2= 120
##$ZL3= 120
##$ZL4= 120
##$ABSF1= 10
##$ABSF2= 0
##$ABSG= 5
##$ABSL= 3
##$ALPHA= 0
##$AQORDER= 0
##$ASSFAC= 0
##$ASSFACI= 0
##$ASSFACX= 0
##$ASSWID= 0
##$AUNMP= <proc_1d>
##$AZFE= 0.1
##$AZFW= 0.1
##$BCFW= 1
##$BC_mod= 2
##$BYTORDP= 1
##$COROFFS= 0
##$CY= -3
##$DATMOD= 1
##$DC= 2
##$DFILT= <>
##$DTYPP= 0
##$F1P= 0
##$F2P= 0
##$FCOR= 0.5
##$FTSIZE= 0
##$FT_mod= 4
##$GAMMA= 1
##$GB= 0.15
##$INTBC= 1
##$INTSCL= 1
##$ISEN= 128
##$LB= 0.25
##$LEV0= 0
##$LPBIN= 0
##$MAXI= 10000
##$MC2= 0
##$MEAN= 0
##$ME_mod= 0
##$MI= 1.114404
##$NCOEF= 0
##$NC_proc= 0
##$NLEV= 6
##$NOISF1= 3.799351
##$NOISF2= 2.8
##$NSP= 1
##$NTH_PI= 0
##$NZP= 0
##$OFFSET= 14.38212
##$PC= 1
##$PHC0= -4060.637
##$PHC1= 8.392291
##$PH_mod= 1
##$PKNL= yes
##$PPARMOD= 0
##$PSCAL= 0
##$PSIGN= 0
##$REVERSE= no
##$SF= 200.129724274929
##$SI= 16384
##$SIGF1= 3
##$SIGF2= 2
##$SINO= 400
##$SIOLD= 16384
##$SREGLST= <1H.CDCl3>
##$SSB= 0
##$STSI= 0
##$STSR= 0
##$SW_p= 3205.1282051282
##$SYMM= 0
##$S_DEV= 0
##$TDeff= 0
##$TDoff= 0
##$TI= <>
##$TILT= no
##$TM1= 0
##$TM2= 0
##$TOPLEV= 0
##$USERP1= <user>
##$USERP2= <user>
##$USERP3= <user>
##$USERP4= <user>
##$USERP5= <user>
##$WDW= 1
##$XDIM= 8192
##$YMAX_p= 0
##$YMIN_p= 0
$$ End of Bruker specific parameters
$$ ---------------------------------
##NTUPLES= NMR FID
##VAR_NAME=  TIME,          FID/REAL,        FID/IMAG
##SYMBOL=    X,             R,               I
##VAR_TYPE=  INDEPENDENT,   DEPENDENT,       DEPENDENT
##VAR_FORM=  AFFN,          ASDF,            ASDF
##VAR_DIM=   8192,          8192,            8192
##UNITS=     SECONDS,       ARBITRARY UNITS, ARBITRARY UNITS
##FACTOR=    0.0002768,     1,               1
##FIRST=     0,             0,               0
##LAST=      2.2672688,     0,               0
##MIN=       0,             -566299,         0
##MAX=       2.2672688,     170666,          0
$$ Real data points
##PAGE= N=1
##DATA TABLE= (X++(R..R)), XYDATA
$$ [...]
1839D85J32O68j15l12k54r7R04m61k15M15q19J222p17J8O7m48R47m23j77m92L02
$$ 485 617 1285 1170 858 604 507 1411 950 735 1150 331 1553 836 854 921 473 1420 997 820 328 630
1860F30L70K6k02m41J15l46J97J72p65Q46o51J50M16j125Q22l01J8J61j46j92
$$ 630 1000 1026 824 383 498 152 349 521 -244 602 -49 101 517 -608 214 -87 -69 92 -54 -246
1880b46j02N06n20M77n92M0L15m86Q35o18M9O70q04L94k49j24K00J42k39j4K60
$$ -246 -348 158 -362 115 -477 -437 -122 -608 227 -391 -342 328 -476 -82 -331 -455 -255 -113 -352 -366 -106
1901a06p6J23l60M44m9l04O78n86P4N49l10L33n16r7M67l15Q9K61k07j76K79m34
$$ -106 -182 -59 -419 25 -24 -328 350 -236 -162 387 77 410 -106 -203 264 -51 38 299 92 -84 195 -239
1923b39J07L98o11O45j37n81O52n64P72n86j64O06l66j45J47k20Q7j35J64k14
$$ -239 -132 266 -345 300 163 -418 234 -330 442 -144 -308 298 -68 -213 -66 -286 -199 -334 -170 -384
1943c84N24m15M54o93K73N81j052P47j49j02L48m53j16M90l50l2N10l97N8J25
$$ -384 140 -275 179 -514 -241 340 -712 35 -114 -216 132 -321 -437 53 -297 -329 181 -216 -158 -33
1963c3o88P44j23l88P08n77O23j68n83Q86n75L35R4l51N6L20k10r8M34n26M92
$$ -33 -721 23 -100 -488 220 -357 266 98 -485 401 -174 161 255 -96 -40 280 70 -28 406 -120 372
1984C72k03k69Q82j183M77o2j97L07l49J2J06j59M7M5j96J47M75l84J09k93j30
$$ 372 169 -100 782 -401 76 14 -183 124 -225 -213 -107 -266 -219 -174 -370 -223 252 -132 -23 -316 -446
2005d46P76o39L65K33o91P34l98J23K74j46k9J11j91J7j17m4M63k33k92N13n85
$$ -446 330 -309 56 289 -402 332 -66 57 331 185 156 267 76 93 -24 -68 395 162 -130 383 -202
2026b02N36O6m16M12m49J63J61m14M74M1m65K99J94l13L87j74j50O64j067M39
$$ -202 334 400 -16 396 -53 110 271 -143 331 372 -93 206 400 87 474 300 150 814 -253 186
2046A86J72m41M84k19k95M10k3K0k65j25K30L6k41K26J7l22O97m98k24L51o55
$$ 186 358 -83 401 182 -113 297 274 294 29 -96 134 170 -71 155 172 -150 547 49 -175 176 -479
2067d79N89p5mK80o86N08M6m22J23K54n9N3Q8k49O83p27M45J03n10M54l06K24
$$ -479 110 35 31 311 -375 133 179 -243 -120 134 75 128 216 -33 650 -77 368 471 -39 415 109 333
2089C33p4r3O3P1l60M39l99K22J33rj87L12k85r9L66n11K67k92J42N18m43Q5k00
$$ 333 259 166 229 300 -60 379 -20 202 335 326 139 451 166 67 433 -78 189 -103 39 557 114 199 -1
2112aK06P0l7J35Qq4j16L80q28M55L8K3N7l44J42J90j54J55m33RN69k83j59J39
$$ -1 205 275 238 373 381 297 181 561 -267 188 226 249 306 -38 104 294 140 295 -138 -129 440 157 -2 137
2136A37k64Q2K87K1m04L98n17N24m72K73l2J02L99m58J07k67M0K02j10j67K4K82
$$ 137 -127 -45 242 263 -141 257 -260 264 -208 65 33 135 534 76 183 -84 -44 158 48 -119 -95 187
2158A87k64K25j27k79N39k96j24K06l91N13j06l35J33l3P7n7J21J49k11q9K10
$$ 187 -77 148 21 -258 281 -15 -139 67 -324 189 83 -252 -119 -152 -75 -132 -11 138 -73 -162 48
2179D8J62m42L16k91K0K89m96N59l75J09M69p08N23m20K9k78L94K41m14N69r1
$$ 48 210 -232 84 -207 -187 102 -394 165 -210 -101 368 -340 183 -237 -208 -486 -92 149 -265 304 213
2200B13R6l74j39K43k30K07j50r6N70m41J84K96m82j27J85R7r2j4p9J69K10n85
$$ 213 309 -65 -204 39 -191 16 -134 -230 340 -101 83 379 -103 -230 -45 52 -40 -54 -133 36 246 -339
2222c39L12l64K98M55j63N3n11J7L78J02j67m12M89J08J32n23J03M05l96K28l55
$$ -339 -27 -391 -93 362 199 252 -259 -242 136 238 71 -341 148 256 388 -135 -32 373 -23 205 -150
2243a50K04K7n1O4k82L93o5q0J9j53J41R0j71R9k97Q6j6K25k30J10j37k35M68
$$ -150 54 81 30 94 -188 205 140 60 79 -74 67 157 -14 85 -212 -126 -142 83 -147 -37 -174 -409 59
2266E9J00k47O8N3n6J03P2P5k88R7J30R3o22M11k99M57j52n5J80m75L11J91k31
$$ 59 159 -88 -20 33 -23 80 152 227 -61 36 166 259 -363 48 -251 206 54 -1 179 -296 15 206 -25
2289b5LJ51k33J70j90L0K1K72l02L44o63K40J40j0J40l81K75r0j67K71o7K46J74
$$ -25 -22 129 -104 66 -124 -94 -73 199 -103 241 -422 -182 -42 -52 88 -293 -18 -108 -275 -4 -71 175 349
2312C49l59k0q6J91k23L64l59J99K12n15N65n58J85r4J98L6Mr0J30pN1k21j2J8
$$ 349 -10 -30 -116 75 -148 216 -143 56 268 -247 318 -240 -55 -149 49 85 89 -1 129 122 173 -48 -60 -42
2336d2J79k8m3n5j37M03l06K77n76L7J93L08j46l31J86j23L04R3m77OL76L3n8
$$ -42 137 109 66 11 -126 277 -29 248 -328 -291 -98 210 64 -267 -81 -204 100 193 -284 -278 98 131 73
2359G3l9K3l43M81o7j83K58l53j04K82j8L8r7O8J50k42r8K99J24k60n3K4K85k09
$$ 73 34 57 -286 195 128 -55 203 -150 -254 28 10 48 -49 19 169 -73 -171 128 252 -8 -61 -37 248 39
2383C9n6J94j87p5J90J57l66K07k1p5J46k58L66k23K50L2j27j55q7Mj39K39L1
$$ 39 -17 177 -10 -85 105 262 -104 103 82 7 153 -105 261 38 288 320 193 38 -49 -45 -184 55 86
2406H6R8k11R6j88J8L19j79N4l3q2L1K1j01J25j2j31J2J28n6m4j60M47o32K88
$$ 86 184 -27 69 -119 -101 218 39 93 60 -22 9 30 -71 54 42 -89 -77 51 -5 -49 -209 238 -394 -106
2430a06M3kJ8K33k39l3J19k58M65j53j64L06m00J80Pj29J35k38J88P2o16L56K55
$$ -106 -63 -65 -47 186 -53 -86 33 -225 240 87 -77 229 -171 9 16 -113 22 -216 -28 44 -572 -216 39
2453C9nj95K37r1j28K18N0j29l76L99J64k40J01p4j40P9k37K31L79m56K25q5k47
$$ 39 34 -161 76 -15 -143 75 125 -4 -380 19 183 -57 44 -30 -170 -91 -328 -97 282 -174 51 -34 -281
2476b81M46K2n11K16j78N0J77k80M53l42L17L38m07j69L89k83j89N23k56j17l4
$$ -281 165 187 -324 -108 -286 -236 -59 -339 114 -228 89 427 20 -149 240 -43 -232 291 35 -82 -116
2497a16n5K51m98L96K4q6J42k30P6J4j96L56l32M95k27N0k30O0ML0O5m3K19l3
$$ -116 -171 80 -418 -22 2 -84 58 -172 -96 -82 -278 78 -254 241 14 64 -166 -106 -102 -72 -7 -50 169 136
2521A36k8q7j91K93P2l34N30o92J61J32k5N9j16N08n23K68k49O0L27m90K78l53
$$ 136 108 21 -170 123 195 -139 391 -301 -140 -8 -33 26 -90 418 -105 163 -86 -26 301 -189 89 -264
2543b64L05J58j30J0j38j33L59j78k55K84Q3p9J75m06K28o6j26L45k44o9K41k03
$$ -264 41 199 69 79 -59 -192 167 -11 -266 18 101 22 197 -209 19 -47 -173 172 -72 -141 100 -103
2565a03LJ73q7j41o8J73P4j36K74j15J30m50L21p4m7l5n2L24m38M3J57R2p1K24
$$ -103 -100 73 -14 -155 -223 -50 24 -112 162 47 177 -273 48 -26 -73 -108 -160 164 -274 -231 -74 18 -53 171
2589A71k80J5J29j59R0Ok31L24j04p2J58q1K10l93j22L53l09L28j98m0J56N3K4
$$ 171 -109 -94 35 -124 -34 -28 -259 65 -39 -111 47 -34 176 -217 -339 14 -295 33 -165 -205 -49 4 28
2612B8r6J29j85K98j39j75R3K13k26j7n8K56q6K04l61J12K86j94l81L38k8O8J28
$$ 28 -68 61 -124 174 35 -140 -47 166 -60 -77 -135 121 35 239 -122 -10 276 82 -299 39 11 79 207
2635B07Lj98j30J1L45o34O66k54J8P2j50J66l39j5K61J41l32L09k13J93O2m4k87
$$ 207 210 12 -118 -107 238 -396 270 16 34 106 -44 122 -217 -232 29 170 -162 147 -66 127 189 145 -142
2658a42L38l41M1L8q2M10j21m44J33R7J04K11j83j74R5J17n7J34j38j67K84p0
$$ -142 196 -145 -104 -66 -148 262 141 -303 -170 -73 31 242 59 -115 -20 97 40 174 36 -131 153 83
2680H3J3j64m0J74n5L58m97K71o0o3R2q1l6M0J87k90J06r5J65Jk64K76n6k54k43
$$ 83 96 -68 -108 66 11 369 -128 143 83 20 112 31 -5 35 222 -68 38 -57 108 109 -155 121 65 -189 -432
2705d32N36j42j94J84p0RR1LJm3J7J64n2j83r0M1L8J27J4q2J78j51L77l74q9P1
$$ -432 104 -38 -232 -48 -118 -109 -18 -15 -14 -57 -40 124 72 -111 -201 -160 -122 5 19 -63 115 -36 341 -33 -122 -51
2731e1k25K06j42K37j33J88M4k54M4J92J7r9l17J36m3K25r3K61j37j1j00PQ9J4
$$ -51 -276 -70 -212 25 -108 80 124 -130 -86 106 123 24 -293 -157 -200 25 -68 193 56 45 -55 -48 41 55
2755E5j26L6j60J51L4o7M7j86L32l69J46J38J52j68q7L38n7l00K16R3J12k07K25
$$ 55 -71 -35 -195 -44 -10 -77 -30 -216 116 -253 -107 31 183 15 -72 266 209 -91 125 218 330 123 348
2778C48n39K69Q2l30K53K1j3nj75o2J34L87j89l04J6j5K82m40K24J6P5l86K09
$$ 348 -191 78 160 -170 83 104 91 86 -89 -151 -17 370 181 -123 -107 -122 160 -280 -56 -40 35 -351 -142
2801a42l2K84l12K2J90j72R2r2K50K6l63J2K13j27J36M4j30Q7Q6mj49N7J9m0K61
$$ -142 -174 110 -202 -180 10 -162 -70 -162 88 114 -249 -237 -24 -151 -15 29 -101 -14 72 68 -81 -24 -5 -45 216
2826B16K7k32J25l06K81k61K66j87K97k53k42K09J03K04l71J32J24j69J63m9P8
$$ 216 243 11 136 -170 111 -150 116 -71 226 -27 -269 -60 43 247 -124 8 132 -37 126 77 155
2847A55k93J85P5j01pk70k6M24j87P9J55j45J25j45L69o82L7J76k2M05n07K95
$$ 155 -138 47 122 21 14 -256 -282 142 -45 34 189 44 169 24 393 -289 -252 -76 -98 307 -200 95
2869I5r0O4j4J2L09m17L6M5jj53q8J22J06r6J42l53J69k6J86j61M6J15k0O7J4
$$ 95 5 69 55 67 376 -41 -5 40 39 -114 -202 -80 26 -70 72 -281 -112 -138 48 -113 -67 48 28 95 109
2894A09J93k31q0J03k52L76l31J05K87j20k32R0J9j50J36J74J65m33Q1r0q8J46
$$ 109 302 71 -9 94 -158 218 -113 -8 279 159 -73 17 36 -114 22 196 361 -72 9 -81 -169 -23
2916b3j39o4M57j95K8O7m59L26n4K56l17j72N85j54k73N2L04m17O9K25K6k36J98
$$ -23 -162 -226 231 36 64 131 -328 -2 -56 200 -117 -289 296 142 -131 -79 225 -192 -123 102 128 -108 90
2939I0j47M2p2K97J04j10l75L83j62q6j94K49J10p9n1J25k32KP7j29K56j20N3
$$ 90 -57 -15 -87 210 314 204 -171 212 50 -36 -230 19 129 50 -1 124 -108 -106 -29 -158 98 -22 31
2962C1j54q4M09k65l15L57R6M8k24mj69M26k21l03K87J70Q5j19j64K75l86L28
$$ 31 -123 -207 202 -63 -378 -21 75 123 -101 -105 -274 152 -69 -372 -85 85 170 51 -113 162 -224 104
2984A04O7k41k1K38k54PQ2p5j75M77l35J69j25K74j37Q2j39J93P5o5l39M51m9
$$ 104 171 -70 -91 147 -107 -100 -18 -93 -268 209 -126 43 -82 192 55 137 -2 191 266 201 -138 313 264
3007B64l55j35J44p8K07p7m8k5m1N54l64J38l48J68J26J48l86K02j77K23n2k28
$$ 264 -91 -226 -82 -160 47 -30 -78 -103 -144 410 46 184 -164 4 130 278 -108 94 -83 140 88 -140
3029a40K0J93n9n4R6k97N28n8r6j69K27l6k87J29j59Q1J35K43n15R0J11j94L50
$$ -140 -120 73 14 -40 56 -241 287 229 133 -36 191 155 -132 -3 -162 -81 54 297 -218 -128 -17 -211 139
3052A39j14M7r6O3j63P1K49j42j14K32l32R0K67j21j19K60k80Q1j46K51j8J00
$$ 139 25 72 -24 39 -124 -53 196 54 -60 172 -160 -70 197 76 -43 217 -63 18 -128 123 105 205
3074B05n9q4J05j49O1l33K21K2k35K55K89j68j9k06K02j7j31J23j90K03k20J71
$$ 205 146 62 167 18 79 -254 -33 -11 -246 9 298 130 111 -95 107 90 -41 82 -108 95 -125 46
3096D6k51K00l7n7L08m66K03Q7j28P9j56K00l28K83l37M06J34l1J8q7k54j08K89
$$ 46 -205 -5 -42 -99 209 -257 -54 33 -95 -16 -172 28 -300 -17 -354 52 186 155 173 86 -168 -276 13
3119A3R3k05J86Q6j29J9j9j89K05K26j20O6k64J73o4K08k81L8J8L8k12J6K06k59
$$ 13 106 -99 87 173 44 63 44 -145 60 286 166 232 -32 141 77 285 4 42 60 98 -114 -98 108 -151
3143a51K29K01k45j29L64l77Q6J58k13J89k25p7J55J50m9j7k63M03m2k76k28M96
$$ -151 78 279 34 -95 269 -108 -22 136 -77 112 -113 -190 -35 115 66 49 -214 189 147 -129 -357 139
3165A39o8j61l20O12R4m23o9L74l8k06J37O7k26L39k6l11K8L88j35m13K71j46
$$ 139 71 -90 -410 202 296 -127 -196 178 140 -66 71 138 -88 251 225 -86 -58 330 195 -218 53 -93
3187i3J38J57m52M23j19j26L6j76L88k78J11m2L20k20j98J80r1J68j49K50M9j64
$$ -93 45 202 -250 173 54 -72 -36 -212 176 -102 9 -33 287 67 -131 49 -42 126 -23 227 276 112
3209A12K8k21kJ47j13R3l02K80J34j40o7J62r8M6j86pO6Kj01K3K18j70L9K77k53
$$ 112 140 -81 -83 64 -49 44 -258 22 156 16 -51 111 13 59 -127 -134 -68 -66 -167 -144 74 -96 -57 220 -33
3234c3J16j76j42K27q5m6Q6P7N1j24RJ40q4rN5J51l35L23k40o0K58L9o4K1n39
$$ -33 83 -93 -235 -8 -93 -139 -53 24 75 -49 -40 100 16 7 62 213 -122 201 -39 -99 159 198 134 155 -384
3259c84N06J05k31mj67J1lK83k09n7J1L04m73L06J92k26J85N4j93O4J81k69n3
$$ -384 122 227 -4 -8 -175 -164 -167 116 -93 -150 -139 165 -308 -2 190 -36 149 203 10 74 255 -14 -67
3282f7l8K51m5L4nj66j90K51j57L77m13J45j01K63q4q1ok54L34n9j43K31k25K33
$$ -67 -105 146 101 135 130 -36 -226 25 -132 245 -168 -23 -124 139 55 -26 -32 -286 48 -11 -154 77 -148 85
3306H5j82M4m2o9K73M8j09j75K48k25k6K54k60K18p6j46NJ36J24j75L7L17m76
$$ 85 -97 -53 -95 -164 109 157 48 -127 121 -104 -130 124 -136 82 6 -140 -135 1 125 -50 -13 304 -172
3329a72M49q0k28o8K90l20J72J15k33K10k71K17j39K04j99J42Nj09oj24J67L4
$$ -172 277 197 -31 -99 191 -129 43 158 -75 135 -136 81 -58 146 -53 89 94 -15 -21 -145 22 56
3351E6P7j52J77k43k06J88r8J20L45m70J14K77j62j89J91k08L86k75L4j99L31
$$ 56 133 -19 158 -85 -291 -103 -201 -81 264 -206 -92 185 23 -166 25 -183 203 -72 -38 -237 94
3372I4p1M2n9J37L7m4j86j98L56m9M3l6j30j40M96rk26Pk81K57j27O5P0l29K21
$$ 94 23 65 6 143 180 136 -50 -248 108 59 102 66 -64 -204 292 283 57 64 -217 40 -87 -22 48 -281 -60
3397f0K0K99k65q5j60K89K12n88K36J30j51J96j44J22j33m1K65n4k58J47N3R4
$$ -60 -40 259 -6 -91 -251 38 250 -338 -102 28 -123 73 -71 51 -82 -123 142 88 -170 -23 30 124
3419A24O2k68L6J68k28J2Q0M6o7l3K5J20j82%J22K29m52J74j21J14n0Q2o6K81
$$ 124 186 -82 -46 122 -106 -94 -14 32 -35 -68 -43 77 -105 -105 17 246 -206 -32 -153 -39 -89 -7 -73 208
3443B08j14k75L47j33k4k14J67k33M59OM0m33R8J99L73k26k32L0k16K59p3K47
$$ 208 94 -181 166 33 9 -205 -38 -271 188 194 234 -199 -101 98 471 245 13 43 -173 86 13 260
3465B60k57j48j47J63L47j20j99J15Mq1kK3K8l8J94j99J28m0J61L2k97J81n3N5
$$ 260 3 -145 -292 -129 218 98 -101 14 18 -63 -65 -42 -14 -52 142 -57 71 31 192 224 -73 108 55 110
3489A10m04j3J91Q3J0l41J61q0Q3q4L30k05K56O4k56L5k8J96K9l6n8jk35J80m40
$$ 110 -294 -307 -116 -33 -23 -364 -203 -283 -200 -284 46 -159 97 161 -95 -60 -88 108 137 101 43 42 -193 -13 -453
3514d53K52j17o2M63j24R5R8m24J28J19J0Rl09K98J76k9J79k54o1j48J57J1M3
$$ -453 -201 -318 -380 83 -41 54 152 -272 -144 -25 -15 -6 -315 -17 159 130 309 55 -6 -154 3 14 57
3537E7k41L85k53P2J28N2k84J57j68K91k07k49L27j04lj56K02j17K95r4lk87K23
$$ 57 -184 201 -52 20 148 200 -84 73 -95 196 -11 -260 67 -37 -40 -196 6 -111 184 90 87 -200 23
3560B3p6l7L9J54j13j62K26K17o5l46J44M6m7n5j2R0nJ99k60j6J1L9k15J67K49
$$ 23 -53 -90 -51 103 -10 -172 54 271 206 -140 4 50 3 -52 -64 26 21 220 -40 -56 -45 -6 -221 -54 195
3585A95J5j04l02L28K42l34L8j22J52mo5Q2N2j29L5j40M2j80L59j70O4K80m19
$$ 195 210 106 -196 132 374 40 78 -44 108 104 39 121 173 44 79 -61 -19 -199 160 -10 54 334 -85
3608h5R1K7p2L7M5k49L96m39K50K69l56O0J20J33j15O8j29R8l79M09J09k65k4
$$ -85 6 33 -39 -2 43 -206 190 -249 1 270 -86 -26 94 227 112 180 51 149 -230 179 288 23 -1
3631aJ73m47K94O3J28k78O8k50L16j75M2J52m01J60K16l15j68O32j73j03j70L57
$$ -1 172 -275 19 82 210 -68 0 -250 66 -109 -67 85 -316 -156 60 -255 -423 209 36 -67 -237 120
3653A20j34Q9k18MKJK6p1J75k13J39R9K99k79n8J87k65J60PJ45j45P6j50M9J3
$$ 120 -14 75 -143 -139 -137 -136 -110 -181 -6 -219 -80 19 318 39 -19 168 -97 63 70 215 70 146 -4 45 58
3678E8j5r3N1O1J51l83K45j2N8r6O3j13lm0L37j83j24O2J57k26j50J89k8p4m8
$$ 58 43 -50 1 62 213 -170 75 63 121 25 88 -25 -28 -68 269 86 -38 24 181 -45 -195 -6 -34 -108 -156
3703a56L63j61N7j88Q2l52N54k60L3N2k27J18j76J14K25j26K02o5j06O7k64L47
$$ -156 207 46 103 -85 -3 -355 199 -61 -28 24 -203 -85 -261 -147 78 -48 154 89 -17 50 -214 133
3725A33K02m79o6L84n7k28j56J49J08k99K94j86L44L8o5m31J06L51j10k7j25k1
$$ 133 335 -144 -210 174 117 -111 -267 -118 -10 -309 -15 -201 143 181 116 -315 -209 142 32 5 -120 -141
3747a41K22L35m43o9R5l11J06p6K69R5k6J20k14J18k23j38K97J15l29J52j3K7
$$ -141 81 416 -27 -96 -1 -312 -206 -282 -13 82 56 176 -38 80 -143 -281 16 131 -198 -46 -59 -32
3769c2nOJ3j26K23p7j81m8J91Q7q6J29P8k04j4k39N05l84K25r2p8M08l99J54n1
$$ -32 -37 -31 -18 -144 79 2 -179 -227 -36 51 -35 94 172 -32 -46 -285 220 -164 61 -31 -109 299 -100 54 3
3794CL7M2l38L35k15J13k3j02J02O7n8k41M98m29m2L18m15L78J58k25k32K55M4
$$ 3 40 82 -256 79 -136 -23 -46 -148 -46 21 -37 -278 220 -209 -251 67 -348 30 188 -37 -269 -14 30
3817C0N2l66K83l92M64K43k60N7k79J62J23j96K46j30m5m5J68J88m78K10J6j54
$$ 30 82 -284 -1 -393 71 314 54 111 -168 -6 117 -79 167 37 -8 -53 115 303 -175 35 51 -103
3839a03R3L18k71q5m1PRK90M3l37j62J63l7L3Q1j5k8k6N6r5J42k2R6k56J02J80
$$ -103 -10 308 37 -48 -89 -82 -73 217 260 -77 -239 -76 -113 -80 1 -14 -42 -68 -12 -107 35 13 109 -147 -45 135
3865A35j33O3r7o8L42j77qj93K35o4j72l1L96J15n33M10k34J64k04R4J11k28n6
$$ 135 2 65 -32 -100 242 65 57 -136 99 35 -137 -168 228 343 -190 220 -14 150 -54 40 151 -77 -133
3888a33n8J06J80k94J32m0M76l80mJ34j76q8K28l25L79m04J72k28K19K76l21j82
$$ -133 -191 -85 95 -199 -67 -107 369 -11 -15 119 -57 -145 83 -242 137 -267 -95 -323 -104 172 -149 -331
3910c31J82Q1n2P3oQ3r6J29J84j93k52J87L03k03k0lm1n8R0k49J72J34J0j43K05
$$ -331 -149 -68 -120 -47 -53 30 -66 63 247 54 -198 -11 292 89 69 66 25 -33 57 -192 -20 114 124 -19 186
3935A86m26K90K6j03n6J31Q2j43J21j09K0m6K38j99k0K2j31k2L4J09k09KK94k15
$$ 186 -240 50 76 -27 -83 48 130 -13 108 -1 19 -27 211 12 -8 14 -117 -139 -105 4 -205 -203 91 -124
3959a24J54J14J54m07L3j49J15K72p3P2k68R0K09q2M5k03N6l0j00K32m65M74l4
$$ -124 30 144 298 -109 -76 -225 -110 162 89 161 -107 -17 192 110 155 -48 8 -22 -122 110 -355 119 85
3982H5j92K32j35P4r3k68J08K53P8k14K00j51O8j72q4L76n2j35P4j45J34J4J0
$$ 85 -107 125 -10 64 -29 -297 -189 64 142 -72 128 -23 45 -127 -211 165 113 -22 52 -93 41 55 65
4005F5k97M26k26k15L40J34l87J98Q3q6J4Q8k63O7k21m9K68k73N76k67m6r4K26
$$ 65 -232 194 -32 -247 93 227 -160 38 121 35 49 137 -126 -59 -280 -329 -61 -334 242 -25 -71 -165 61
4028F1j3m5J35R8k48R0K0m19N10k36J24k03K21j25l1N3k39K58K32k76P2o5j85
$$ 61 48 3 138 236 -12 78 98 -321 189 -47 77 -126 95 -30 -61 -8 -247 11 243 -33 39 -26 -211
4051b11M26j55K84n53KJ02l2K32K0p3k10K50m20L36p0Q5O3K1q4J03M5k80o9K3
$$ -211 215 60 344 -209 -207 -105 -137 95 115 42 -168 82 -338 -2 -72 13 76 97 13 116 161 -119 -188 -165
4075a65K8K06j51J42K5k82K55j44K49j60K41k31J38q8l34M31j83o7J15n0K26m49
$$ -165 -137 69 -82 60 85 -197 58 -86 163 3 244 13 151 63 -271 160 -23 -90 25 -25 201 -248
4097b48M67O5l35J53j64J30p9K96n08J56J39k35K66j58kR2J77n09N05k48J69k47
$$ -248 219 284 -51 102 -62 68 -11 285 -223 -67 72 -163 103 -55 -57 35 212 -297 208 -40 129 -118
4119a18J63m6J91l0k37J99k46L03j39J19j80P9J11j71J20r6J6L1j18Lj78J85N7
$$ -118 45 -1 190 160 -77 122 -124 179 40 159 -21 58 169 -2 118 22 38 69 -49 -46 -224 -39 18
4142A8l6k7M9k8J73j54J15q8p2O2k3R5K12l99n2M4L22l57L48l63J23J61j72O3
$$ 18 -18 -45 4 -24 149 -5 110 22 -50 12 -11 84 296 -103 -155 -111 211 -146 202 -161 -38 123 -49 14
4166A4R8J25k64N6K33k53j39J29j66j01J10J2m4R3K49J42n20K27o7j44J57K54
$$ 14 112 237 -27 29 262 9 -130 -1 -167 -268 -158 -146 -190 -97 152 294 -226 1 -66 -210 -53 201
4188B01k39K86j05P3l72J71n5J33J21k51K23n6q5o0j61L89q5m30m7J65R2K18m7
$$ 201 -38 248 143 216 -156 15 -40 93 214 -37 186 130 45 -15 -176 213 128 -302 -349 -184 -92 126 79
4211G9k92L33l12K77k27R9N6J88r8J46j14l87L04k6j06J65r4L57l87K00j92n2
$$ 79 -213 120 -192 85 -142 -43 13 201 103 249 135 -252 52 26 -80 85 -9 348 -39 161 -31 -83
4233h3J9K4L8J80j61Q2l69L38K53k52L8N1J6m31L20m1k81K72KK60Kp3N9j30k41
$$ -83 -64 -40 -2 178 17 99 -270 68 321 69 107 158 174 -257 63 22 -259 13 15 275 277 204 263 133 -108
4258a08K25p4M6l11M11j86k0Q8j82L2Kl3L6L75n11J99J26j32r8K82j38n7K3Lm
$$ -108 117 43 89 -222 189 3 -17 71 -111 -79 -77 -110 -74 301 -210 -11 115 -17 -115 167 29 -28 -5 -2 -6
4283fL4j0K54m74J70J90r8K28j78n1k2q0k65O6K02k92L80K19r1n9k04j55K37M3
$$ -6 28 18 272 -202 -32 158 60 288 110 59 37 -43 -308 -242 -40 -332 48 267 176 117 -87 -242 -5 38
4307C8p2O2j15O8J32k12L47l07o1J09P8k88K31k95J02K53l69L58p7q2LK05L7k54
$$ 38 -34 28 -87 -19 113 -99 248 -59 -120 -11 67 -221 10 -285 -183 70 -299 59 -18 -100 -97 108 145 -109
4331a09K01k9k09J90M3k16K3L70k65k21J45J08J50j43Q9k9J29l78K48J82k39k25
$$ -109 92 63 -146 44 87 -129 -106 264 -1 -222 -77 31 181 38 127 98 227 -151 97 279 40 -185
4353a85J38q4Q5K69l32j85M01k5q8Q4J46q1j52k02K52r4K5M9j24n6K26j10OJ24
$$ -185 -47 -131 -46 223 -109 -294 107 82 -6 78 224 143 -9 -211 41 -53 -28 21 -103 -159 67 -43 -37 87
4377H7p1J38p0m0j17q2K33J19J39m16j33L61q9J20p5q1j91K74J9j15n4o6Q6P8
$$ 87 16 154 84 44 -73 -155 78 197 336 -80 -213 148 59 179 104 23 -168 106 125 10 -44 -110 -24 54
4401E4O1l50K31m2j07J37j71L10J89l68P3Q3j09j57L40m6k48K57o1j10J02m64
$$ 54 115 -235 -4 -46 -153 -16 -187 123 312 -56 17 100 -9 -166 174 128 -120 137 76 -34 68 -396
4423c96L73k22J91Kr3L91k64j98L03Pr5K59m15K10N7j01J88j66j9P9l72O4J12
$$ -396 -23 -245 -54 -52 -145 246 -18 -216 87 94 -1 258 -157 53 110 9 197 31 12 91 -281 -217 -105
4446a05K03j58L25l49l3L72rj9k59M5J7J37j01j5K30Qj98k08k71J70J26Q5R4N8
$$ -105 98 -60 265 -84 -117 255 246 227 -32 13 30 167 66 51 281 289 91 -117 -388 -218 -92 -7 87 145
4470A45k7j23L14p82M92l8n3K21l41K83k32K02K77m96L83j54l2K63n8k29O0O0
$$ 145 118 -5 309 -473 19 -19 -72 149 -192 91 -141 61 338 -158 225 71 39 302 244 15 75 135
4492A35K8k90L13j33J16n4k3k59J07J80q8k79K79k1o6N6P9q6j5N1j1P2j77%J74
$$ 135 163 -127 186 53 169 115 92 -167 -60 120 32 -247 32 11 -55 1 80 -6 -21 30 19 91 -86 -86 88
4517H8L0r4m0m9k9P8m9L2k40J75J92J5l61K38P0j91L6r6O4R7K35P2o33L66P2k30
$$ 88 118 24 -16 -65 -94 -16 -65 -33 -273 -98 94 109 -252 -14 56 -135 -99 -195 -131 -34 201 273 -360 6 78 -152
4543a52L47j06k4l7l66M71K2j3j02j46J45j32M2n4K27o7J23l86N71l21j39Q8Q4
$$ -152 195 89 65 28 -338 133 155 142 40 -106 39 -93 -51 -105 122 55 178 -208 363 42 -97 -9 75
4566G5j6j53J58J44k05j36L13l9l09J68o2J06K3n0j47j13J44L38j38J19j90O2
$$ 75 59 -94 64 208 3 -133 180 141 -168 0 -62 44 67 17 -130 -243 -99 239 101 220 30 92
4588I2J65j94L6j35J68k74J39O0l50N72j28l11J53j51K40j26J2oK45n2j99P4q3
$$ 92 257 63 99 -36 132 -142 -3 57 -293 279 151 -160 -7 -158 82 -44 -32 -38 207 155 -44 30 -53
4611e3P7l89K53N19m44J51k07K15j01J72j99K6k4l60M46j90K3J96k7j30J15J61
$$ -53 24 -365 -112 407 -37 114 -93 122 21 193 -6 20 -4 -364 82 -108 -85 111 84 -46 69 230
4633B30k32J7j07K37j46J06nj65J62k56K48k49L29k91L91k80j18M7P0J36j80j8
$$ 230 -2 15 -92 145 -1 105 100 -65 97 -159 89 -160 169 -122 269 -11 -129 -82 -12 124 -56 -74
4655g4k33J45J77j55K80l50M06L4l63J21j13J20J99q6l4l98K10L00k11M1k03K58
$$ -74 -307 -162 15 -140 140 -210 196 230 -133 -12 -125 -5 194 108 74 -324 -114 186 -25 16 -187 71
4677G1j23l3Q5J06k45J56J79j91J18J5j90p0P8j75J62l8P4j93J59J13m6K81k04
$$ 71 -52 -85 0 106 -139 17 196 5 123 138 -52 -122 -44 -219 -57 -95 -21 -214 -55 58 12 293 89
4700H9j12l8k9J36r3J88p6Q3j29M31l28k83K76l12K26K16m33M29l2j5K3r7l5m27
$$ 89 -23 -61 -90 46 -47 141 65 148 19 450 122 -161 115 -197 29 245 -188 241 209 194 217 120 85 -342
4724c42K61O9j10K97l97K51R5j65j93K91m4j57J99o6k15K65k56J45J02k49K11
$$ -342 -81 -12 -122 175 -222 29 124 -41 -234 57 13 -144 55 -11 -226 39 -217 -72 30 -219 -8
4745hL88m40m0k14N27k67o9K10j09m7n3J72O0l21K34L08n15K21r9J77j47J81n5
$$ -8 380 -60 -100 -314 213 -54 -123 87 -22 -69 -122 50 110 -211 23 331 -184 37 -62 115 -32 149 94
4768I4nj47N7J34k24K91j76%J98O2q2m33J70J58l51K65n7k15K78J08j50J7J14
$$ 94 89 -58 -1 133 -91 200 24 24 222 284 202 -231 -61 97 -254 11 -46 -261 17 125 -25 -8 106
4791A06j85j92N07l31J02qp5R3p5J54P1k91K57l28L49r2R7k27j80J68j76J7J41
$$ 106 -79 -271 236 -95 7 -1 -76 17 -58 96 167 -124 133 -195 154 62 159 -68 -248 -80 -256 -239 -98
4814i8K83j22j50N7j01K17p9N9k80J17R5J57q1j38J03k11N2MK21J92k58k49o8
$$ -98 185 63 -87 -30 -131 86 7 66 -214 -97 -2 155 74 -64 39 -172 -120 -116 105 297 39 -210 -278
4837b78M44n48L73K3j51K57k67M58l35p6K29l70L58j40j74J56J08j71O7k4J03
$$ -278 166 -382 -9 14 -137 120 -147 311 -24 -100 129 -241 117 -23 -197 -41 67 -104 -37 -61 42
4858D2r2k03L99l9n6r4J28j50L4k4L9jj68M9q2J19L2K68m92N66n0k53J21j17k08
$$ 42 -50 -253 146 107 51 -43 85 -65 -31 -55 -16 -17 -185 -136 -218 -99 -67 201 -291 275 225 -28 93 -24 -232
4883b32J47L8J95o2J6L2j94K76m59N7K00Q5j90L31l48L1R0jJ27j53n0KK10p7p5
$$ -232 -85 -47 148 86 102 134 -60 216 -243 -186 14 99 -91 240 -108 -77 13 12 139 -14 -64 -62 148 71 -4
4908dJ71l11K03o5k10J32%M7Lj99M17j43J74k39q7J18q8m5ML30p0l32M6n3K45
$$ -4 167 -144 59 -6 -216 -84 -84 -37 -34 -233 184 41 215 -24 -111 7 -81 -126 -122 208 138 -194 -148 -201 44
4933D4p5j26O8O9Q4R1k36J22n6J56l31K68K3j7M0Ol38O8N3J52j42K09L0R3j15
$$ 44 -31 -157 -89 -20 64 155 -81 41 -15 141 -190 78 101 84 124 130 -208 -140 -87 65 -77 132 162 255 140
4958A40l3J63m11K57j3p3%J72r7j30m8K03j9k54J55L85l43l16M14P4j34m9m8K20
$$ 140 107 270 -141 116 103 30 30 202 105 -25 -73 130 111 -143 12 397 54 -262 152 226 92 43 -5 215
4982B15l85K23k17m0J54K29j35m0rR6k74J92p8J04Rk28K41J21k47K70k87k3L43
$$ 215 -170 53 -164 -204 -50 179 44 4 -5 91 -183 9 -69 35 44 -184 57 178 -69 201 -86 -109 234
5005B34l89K45K4k31k7M61l78J81M5m5k74J12j33L88m25J82K58m44J97J12j96
$$ 234 -155 90 114 -117 -144 317 -61 120 165 120 -154 -42 -175 213 -212 -30 228 -216 -19 93 -103
5026a03J39K0M1L2j39k21M95j07r7J21j56k68M17j73p3L65l92J20J31j96K13M7
$$ -103 36 56 97 129 -10 -231 264 157 60 181 25 -243 174 1 -72 293 -99 21 152 -44 169 216
5048B16k98K60J8l58J29Q6m2j08k5K76j70Q3J4j65n8J63j33K42m43L00L9l3K05
$$ 216 -82 178 196 -162 -33 53 11 -97 -122 154 -16 67 81 -84 -142 21 -112 130 -313 -13 26 -7 198
5071A98j24K14l14np5Q2J8J25m5q6J8L6K00m8o4j39R5j13k67K40lJ62j13M9K14
$$ 198 74 288 -26 -31 -106 -24 -6 119 74 -12 6 42 242 194 130 -9 86 -27 -294 -54 -57 105 -8 41 255
5096B55l03j9r7J19J88k94L13o7m14L21K53m67p3M50k69J22n2r7M80n00K10j23
$$ 255 -48 -67 -164 -45 143 -151 162 95 -319 2 255 -212 -285 165 -104 18 -34 -131 349 -151 59 -64
5118f4L70p38L85J9R2j63N2q0j99L17j9K25l83K30k6J51j67K08m1l49R3M32k85
$$ -64 306 -432 -47 -28 64 -99 -47 -127 -326 -9 -28 197 -186 44 18 169 2 210 169 -180 -87 345 60
5141F0o4J41J31l71k5J08r4J90k37L53r1Kpj74L06m5o7j65n5O9Nmo2K21L8p4O
$$ 60 -4 137 268 -103 -128 -20 -114 76 -161 192 101 103 96 -78 228 183 116 -49 -104 -35 -30 -34 -96 125 163 89 95
5168I5n4o3O5k28L30k33J90j6k01J67K7l36M2K85O8k15j3K06j75K82M3m2k32N6
$$ 95 41 -22 43 -185 145 -88 102 86 -115 52 79 -257 -215 70 138 -77 -90 116 -59 223 266 224 -8 48
5192D8j91pj1k0M17m7k65l5J49j51J15r2J68N1J18k18k51J71K24l14K18q4JJ26
$$ 48 -143 -150 -161 -181 236 189 -76 -111 38 -113 2 -90 78 129 247 29 -222 -51 173 -141 77 -7 -6 120
5216A20R7m48L8K21J65r5n5k20L03j95N9J62j64m4J39l23L15P8n3L02l98n9l3
$$ 120 217 -231 -193 28 193 98 43 -177 126 -69 -10 152 -12 -56 83 -240 75 153 100 402 4 -55 -88
5239h8L66m92L34k59K40j47L02k01j93M33k79N9m07M90K60l59n06M34J84k07j73
$$ -88 278 -214 120 -139 101 -46 256 55 -138 295 16 75 -332 158 418 59 -447 -13 171 -36 -209
5260b09N95j31m50O9P2Rr5J57p7J4J55j77K46m39L95J18q6J30l81j28L46l15K07
$$ -209 386 255 -195 -126 -54 -45 -140 17 -60 -46 109 -68 178 -261 134 252 166 296 -85 -213 133 -182 25
5283B5N6N1k35Q9J20l72K82pP0K0j41Q9j70K54k17L1p9L3P3O2L61l08k13L05j37
$$ 25 81 132 -103 -14 106 -266 16 9 79 99 -42 47 -123 131 -86 -55 -134 -101 -28 34 395 87 -126 179 42
5308D2J0j26J01r7K5J15n2L11k22j30l62M18J26j40L56l04r3K35j98J02j11r8
$$ 42 52 -74 27 -70 -45 70 18 329 107 -23 -385 33 159 19 375 71 -22 213 15 117 6 -92
5330i2J48j86K56p6k34J91O9j41n7N2Q6Q7J9j17L42l38K26Ll86RN9J16j34L39
$$ -92 56 -130 126 50 -184 7 76 -65 -122 -70 16 103 122 5 347 9 235 238 -148 -139 -80 36 -98 241
5354B41l50q3J45n5J65k90M2L34o9j98J41m0j4j2k14K57R6q7p9L32j72j26k8L38
$$ 241 -109 -192 -47 -102 63 -227 -185 149 80 -118 23 -17 -31 -43 -257 0 96 9 -70 262 90 -36 -64 274
5378B74k09J79J18m82L47m3k01R2j02j38J18n6m3P4oJ73Q2J04k22J61j05j88k0
$$ 274 65 244 362 -120 227 184 -17 75 -27 -165 -47 -103 -146 -72 -78 95 177 281 59 220 115 -73 -93
5401i3j39N10m09K31k96J75J08oJ53m20J4K35O4j46J3p9J0nq4K57j5Q9r5k04L26
$$ -93 -232 278 -131 100 -196 -21 87 81 234 -186 -172 63 127 -19 -6 -85 -75 -80 -164 93 78 167 72 -132 194
5426A94n7J84m28K32J06J43k85o6L8k8m4J57j75M06l53M7l16O2K3N5J24P5j35
$$ 194 137 321 -107 125 231 374 89 23 61 33 -11 146 -29 377 24 71 -245 -183 -160 -105 19 94 -41
5449d1j81L3J40jK6O2K4k05j72L51k39L14j50J9L74j09l31J82j36R0n5k8L7l7
$$ -41 -222 -189 -49 -50 -24 38 62 -143 -315 36 -203 111 -39 -20 354 245 -86 96 -40 50 -5 -33 4 -33
5473c3K19j40K66l47K59j39j44K93l98L15j19j4K81j90j13l03M46j10nq5J1p0
$$ -33 186 46 312 -35 224 85 -59 234 -164 151 32 18 299 109 -4 -307 139 29 24 -61 -50 -120
5495a20ONK02lJ41k87J19j56P2q2Q8p6n4K33j32J8r1J05k8O6l2K66j99j35J88
$$ -120 -114 -109 93 90 231 -56 63 -93 -21 -103 -15 -91 -145 88 -44 -26 -117 -12 -40 26 -6 260 61 -74 114
5520A14p5j06K99j60k35L11o1r9k73M00k32K23J00k05j47j83L38l04M30j03m1
$$ 114 39 -67 232 72 -163 148 87 -12 -285 115 -117 106 206 1 -146 -329 9 -295 135 32 -9
5541ik1R8O1l00J15J16qL6k3p8K55j04j11m9J16o4l8J4K13j55pJ01k53L51j75
$$ -9 -30 68 129 -171 -56 60 52 88 65 -13 242 138 27 -22 94 30 -8 6 219 64 57 158 -95 256 81
5566H1Ok09m7L34j73J02k07J03l49K49M60n37L71l32Q9o4M4j20J85J1J37j2k3
$$ 81 87 -122 -169 165 -8 94 -113 -10 -359 -110 350 -187 184 -148 -59 -123 -79 -199 -14 -3 134 122 99
5589I9O9l75P0L63K6k29J39n2k34L08j75k34K42k44K24J56o5l22K87N8j68M2l51
$$ 99 168 -207 -137 226 252 23 162 110 -124 184 9 -225 17 -227 -3 153 88 -234 53 111 -57 -15 -366
5612c66M08L6k02N3L47k46L4k61q9N38m33K72J0L10n24R0j14Q2k29K45R3O3j60
$$ -366 42 78 -124 -71 276 30 64 -197 -286 252 -181 91 101 411 -113 -23 -137 -55 -284 -39 54 117 -43
5635d3O2J3N6j23M7o2J90M5k25J54L4k74J5L07j46nk17K06o4L11n19L32L8k20
$$ -43 19 32 88 -35 12 -50 140 185 -40 114 148 -126 -111 196 50 45 -172 34 -30 281 -238 94 132 -88
5659h8J80K58j31k78j2j79L23l94L49J33k85J28j43K68k47M5J08n8Q4L5J50j0
$$ -88 92 350 219 -59 -71 -250 73 -321 28 161 -124 4 -139 129 -118 -73 35 -23 61 96 246 236
5681B36l89R9l91M12P8j68k9M47m50J28k4J40j05J04j17l8K40k52J29q3J50j68
$$ 236 -153 -54 -445 -33 45 -123 -152 295 -155 -27 -51 89 -16 88 -29 -67 173 -79 50 -33 117 -51
5703e1J21j85r1J81L19l69J85k26L32j95Q2j44P3l6k0L8K84m36J46P5j44N2j32
$$ -51 70 -115 -206 -25 294 -75 110 -116 216 21 103 -41 32 -4 -24 14 298 -138 8 83 -61 -9 -141
5726a41K1k2L01m42L46o8l8J5J89j75lK12k67J99j48q5j13j21N89l70L77J03l34
$$ -141 -120 -142 159 -283 63 -5 -43 -28 161 -14 -17 195 -72 127 -21 -106 -219 -340 249 -121 256 359 25
5749B5k1J56j22nN8o7pNp2mm6K75j61N2j89m1J60K4n7J37K06k53l2j53J85K65
$$ 25 4 160 38 33 91 24 17 22 -50 -54 -100 175 14 66 -123 -164 -4 20 -37 100 306 53 21 -132 53 318
5775C18m38K02j09J39k37K21j21J28k54M75l42K13m63L40J10m92L49j59K62n3
$$ 318 -120 82 -27 112 -125 96 -25 103 -151 324 -18 195 -268 72 182 -310 39 -120 142 89
5795H9j9n8J04j48R7RJ1m7k62L82o34N18l06J81M06l90J77j35M8K22q7K3l37K12
$$ 89 70 12 116 -32 65 74 85 38 -224 158 -476 42 -264 -83 323 -67 110 -25 23 245 158 181 -156 56
5819E6J85j62Kl12K84j31L78k99o3k3M9k7j20kJ88J23K3k82K64k14J33k5r5k4
$$ 56 241 79 81 -231 53 -78 300 1 -62 -85 -36 -63 -183 -185 3 126 149 -133 131 -83 50 25 -70 -94
5843i4K22k32j00K46r1r5J55J26m42K31J75j60j54K27j61L27k16j46lk33O56l43
$$ -94 128 -104 -204 42 -49 -144 11 137 -305 -74 101 -59 -213 14 -147 180 -36 -182 -185 -418 238 -105
5865a05L94j76j26k9k3N0L90m54J99k57J0K9P4j09p0Q8J18J30k56L28j45P5j86
$$ -105 289 113 -13 -42 -65 -15 375 -79 120 -137 -127 -98 -24 -133 -203 -115 3 133 -123 205 60 135 -51
5888e1J6k21K54j05K07k07L18l57L2%M9j9o0K01R1J83m05n9jJ12j32J37O0j55
$$ -51 -35 -256 -2 -107 100 -107 211 -146 -114 -114 -65 -84 -144 57 148 331 -74 -133 -134 -22 -154 -17 43 -112
5912a12K9J56J23l2j21j89J20j67J39j24O4K90N4j40q8k00K37J05j38p5K76r1
$$ -112 -83 73 196 164 43 -146 -26 -193 -54 -178 -114 176 230 90 2 -198 39 144 6 -69 207 116
5934A16%j12J65j20p5J4n5K4J49j94K40o2J71k86l77N36j27J68l59K80k84J11
$$ 116 116 4 169 49 -26 -12 -67 -43 106 -88 152 90 261 -25 -402 134 7 175 -184 96 -188 -77
5956g7K27k34J17J59j62j7j8k9M2J48j33J53l29J25k51R6K05j3J52kj8k54K22
$$ -77 150 -84 33 192 30 13 -5 -34 8 156 23 176 -153 -28 -279 -183 22 9 161 159 141 -113 109
5979A09j42j29K85L4m16MK66j24K2j7j77M31m4K21k69q4J96k96J06J68k76K72
$$ 109 -33 -162 123 157 -259 -255 11 -113 -91 -108 -285 146 102 323 54 -30 166 -130 -24 144 -132 140
6001A40j89K74k17ln1J33j27p0J4K21kk83K96k55J38n6N3Q4j68J02P2j14L9l6
$$ 140 -49 225 8 5 -46 87 -40 -110 -96 125 123 -160 136 -119 19 -37 16 100 -68 34 106 -8 31 -5
6025eP8J22k64j49K28j21K65r5R2k55K9j5O5o7K87J84n33l6R9nK72m31J60J22
$$ -5 73 195 -69 -218 10 -111 154 59 151 -104 -75 -90 -25 -92 195 379 -154 -190 -91 -96 176 -255 -95 27
6049B7R1J87k21J63l17J3J23m5L1J44k05j30J94J95k86oJ69k24R4K32o2j54j87
$$ 27 118 305 84 247 -70 -57 66 21 52 196 -9 -139 55 250 -36 -42 127 -97 -3 229 167 13 -174
6072a74n5J02J26n1J56k31M10j88k54M45k4m77L29k25J83J23r9k22L51J4l24K01
$$ -174 -229 -127 -1 -52 104 -127 283 95 -159 286 262 -215 114 -111 72 195 96 -126 225 239 -85 116
6094A16j25j75P5J92J74j86j09O4p5P5j10k21K40K20j57j37L69k96j54K02j93
$$ 116 -9 -184 -109 83 257 71 -38 26 -49 26 -84 -305 -65 155 -2 -139 230 -66 -220 -18 -211
6115b11K35J45p2k12K27k8r7N6o2j1K21k50l5j82J31L52k57J15L6j78l8m3J69
$$ -211 24 169 97 -115 112 84 -13 43 -19 -30 191 -59 -94 -276 -145 207 -50 65 101 -77 -115 -158 11
6138A1K47l16J31mj05K27k18L12k23k04m0J96j93j68M09j63K38j85n8J31j7j25
$$ 11 258 -58 73 69 -36 191 -27 285 62 -142 -182 14 -179 -347 62 -101 137 -48 -106 25 8 -117
6160a17M8r5L51l09j34Q2j2j31K45L90n55L48k3j83m4J40j2j9j62L00j07k70L78
$$ -117 -69 -164 187 -122 -256 -174 -186 -317 -72 318 -237 111 88 -95 -139 1 -11 -30 -192 108 1 -269 109
6183A09j12L54l17j46L5lmp8R7K8J15q4l6o6L07j90p4j43K31J2j86K57r7p5j3
$$ 109 -3 351 34 -112 -77 -80 -84 -162 -65 -37 78 -6 -42 -108 199 9 -65 -208 23 35 -151 106 9 -66 -79
6208g9j21L75l24K01j34lr9j6L96m7Rj46J48j6n7j14j67K02R7o6k97K88l2N3O2
$$ -79 -200 175 -149 52 -82 -85 -184 -200 196 149 158 12 160 144 87 -27 -194 8 105 39 -258 30 -2 51 113
6233A13o2L9JJ1M5l26L10k28K1L5L43j12k62J9Mp8j9L9r5q9M07l1j80P9l46K21
$$ 113 51 90 91 102 147 -179 131 -97 -76 -41 302 190 -72 -53 -49 -127 -146 -107 -202 -291 116 85 -95 -16 -362 -141
6259a41K98j16L3J86n69L95k6J94l87J06m6k53L25J1k01J70k4J86J0j13J47l67
$$ -141 157 41 74 260 -309 86 60 254 -133 -27 -73 -326 -1 10 -191 -21 -45 141 151 38 185 -182
6281a82J39nP6r0J54j26k48R8oM57k57n1K25k35K17l75L87L0n25O62l63L8P7k25
$$ -182 -43 -48 28 -62 92 -34 -282 -184 -190 267 10 -41 184 -51 166 -209 178 208 -317 345 -18 20 97 -128
6305a28K11K82n84R2K09k29M23k29L8j61J39P5k23j09J62m5K16p3j03K24j68L8
$$ -128 83 365 -219 -127 82 -147 276 47 85 -76 63 138 -85 -194 -32 -77 139 66 -37 187 19 57
6327E7N0r9p3J31j24j12O1J97q9r3J87J9l6j00L1j24j29L85p3J33j58J76l36L70
$$ 57 107 8 -65 66 -58 -170 -109 88 -1 -94 93 112 76 -24 7 -117 -246 139 66 199 41 217 -119 251
6351B51m95N99l39M2O5o3k5r6J74K05l59M4L2l48J89k77O23n96L22J53P3l66M27
$$ 251 -244 355 16 58 123 60 35 -61 113 318 -41 3 35 -313 -124 -401 222 -374 -52 101 174 -192 235
6374B35n3l18J9J30j68L03j39r7K63p1j40j6n1L29l7j23k17K7M6P7on3J15rq9
$$ 235 182 -136 -117 13 -155 148 9 -88 175 104 -36 -52 -103 226 189 66 -151 -124 -78 -1 -7 -60 55 46 -43
6399d3J75r2K12m71K30j36R5J23k39J12k2O3j62L10j25nJ17l47J63j49l5K57L63
$$ -43 132 40 252 -219 11 -125 -30 93 -146 -34 -56 7 -155 155 30 25 142 -205 -42 -191 -226 31 394
6422C94m91J44J60k58k33K27J5L04k76J42M8k26M7Q9l11K15K4l1j3M1N2l69M61
$$ 394 -97 47 207 -51 -284 -57 -42 262 -14 128 176 -50 -3 86 -225 -10 14 -17 -30 11 63 -306 155
6445A55j25J0j45L17l22k58K34r6M36j48k01L83r2j27j54M3J32k24K11j9K0j98
$$ 155 30 40 -105 212 -110 -368 -134 -230 206 58 -143 240 148 21 -133 -90 42 -182 29 10 30 -168
6467a68J38K3J56m57L96J63l10n7K86k70k9L8o3J28Ml1J38r0K42n08K60K25m73
$$ -168 -30 -7 149 -308 88 251 -59 -116 170 -100 -129 -91 -154 -26 -22 -53 85 -5 237 -271 -11 214 -259
6490b59J55P8K57k71K60p6l16J79n13Q07k90rL4P5k52k6K69JJ45m03J01J21o8
$$ -259 -104 -26 231 -40 220 144 -172 7 -506 301 11 2 36 111 -141 -167 102 103 248 -155 -54 67 -1
6513al8J63m4o7K03k51j64K01J08j00n9J86j37M3jJ33L1k26r5R0L2Mm0j27K28
$$ -1 -39 124 80 13 216 -35 -199 2 110 10 -49 137 0 43 42 175 206 -20 -115 -25 7 11 -29 -156 72
6538G2j20l47O25k79J25L7j37q0M5O6J60M35o15mj76J61K11k13J70k31O4r5L89
$$ 72 -48 -395 230 -49 76 113 -24 -104 -59 7 167 602 -13 -17 -193 -32 179 -34 136 -95 -31 -126 263
6561B63l45J32J2j75J04Q9n4k6k61K40Q8k33N8j93N15l89J54J01k47J96k1J53
$$ 263 -82 50 62 -113 -9 80 26 0 -261 -21 67 -166 -108 -301 214 -175 -21 80 -167 29 8 161
6583A61j72J9J86j82Q8J04k16q7K41l04j26J56J2P4o2K05n3K79m27j5K4L21o0
$$ 161 -11 8 194 12 100 204 -12 -99 142 -162 -288 -132 -120 -46 -108 97 44 323 -104 -119 -95 226 166
6606A66k4Pp2l30J43L5p4L08m38K51J15r4j49q6K4L3pK8J82j51J2N4K74l27J66
$$ 166 142 149 77 -253 -110 -75 -149 159 -279 -28 87 -7 -156 -242 -218 -185 -192 -164 18 -133 -121 -67 207 -120 46
6631D6k82K05K7r2L63n24n4J44K60K7k63K37j46jn9j39L77Nl9q8qp6J60K6k49
$$ 46 -236 -31 -4 -96 267 -257 -311 -167 93 120 -143 94 -52 -53 -112 -251 126 131 92 4 -4 -80 80 106 -143
6656a43J51k55R6L50m87J92K11j98J05q5j41J88j61N8K0J10J7p3K54k98p8J99
$$ -143 8 -247 -151 199 -288 -96 115 -83 22 -63 -204 -16 -177 -119 -99 11 28 -45 209 -89 -167 32
6678C2j38j40L24j47L14k57j00K21k7j54K19N4k79j12K21j21NO9k03J75k08J68
$$ 32 -106 -246 78 -69 245 -12 -112 109 82 -72 147 201 -78 -190 31 -90 -85 -16 -219 -44 -252 -84
6700h4Q7k79K92m9P3l48L67j08j05J61j91P2Q2J31j76L6J73l01q2J80J33j45j74
$$ -84 3 -276 16 -33 40 -308 59 -49 -154 7 -184 -112 -30 101 -75 -39 134 -167 -249 -69 64 -81 -255
6723b55J51M59m45n0K15k02J51J73l62L31k23K8m0p5J49J15j99N08l72k24N2K99
$$ -255 -104 355 -90 -140 75 -127 24 197 -165 166 -57 -29 -69 -144 5 120 -79 429 57 -167 -115 184
6745A84J32m73J43J6J99l18J15j30K54l03J14j34L78k41K26j5m01L86M2k9o1J8
$$ 184 316 -157 -14 2 201 -117 -2 -132 122 -181 -67 -201 177 -64 162 147 -254 132 174 145 84 102
6767A02k85L85n0l90K24j07m5J76j16L14q9k87L42j58J87k0j24j85r6K57p6m1
$$ 102 -183 202 152 -238 -14 -121 -166 10 -106 208 119 -168 174 16 203 183 59 -126 -222 35 -41 -82
6789h2j04K31L2l67L05J92k09j91K91j82R5L7O0j69N1K58k30J3lm04M76L6n7j65
$$ -82 -186 45 77 -290 15 207 -2 -193 98 -84 11 48 108 -61 -10 248 18 31 28 -376 100 136 79 -86
6813h6NJ09J38n6k53J96k6k71J34K82j68k21J39J60J89J64l49k90J89j13Q7K08
$$ -86 -81 28 166 110 -143 53 27 -244 -110 172 4 -217 -78 82 271 435 86 -204 -15 -128 -41 167
6835A67j85j04J72J4P3l72J60P7K08l3j78J51j55m42L93K40N9l35j5J82p2N7J74
$$ 167 -18 -122 50 64 137 -235 -75 2 210 177 -1 150 -5 -447 -54 186 245 -90 -105 77 5 62 236
6858B36l59J1r2o0K70m0q0K63J07l22J11jM6j36qR0M9j97m9J40j25J43R0k2o9
$$ 236 -123 -112 -204 -264 6 -34 -114 149 256 -66 45 44 90 -46 -54 36 85 -112 -161 -21 -146 -3 87 65 -4
6883do9O1j5Q4j38K1K58k14M2p0O4J53q9k14k58N04J89j93j29K73p3M5m13K03
$$ -4 -73 -12 -27 57 -81 -60 198 -16 26 -44 20 173 84 -130 -388 116 305 112 -17 256 183 228 -185 18
6907A8o9K9L85l51r1q3K39j08K86j01k19j28M17n87O06l99J86K40l88K36J51l80
$$ 18 -51 -22 363 12 -79 -162 77 -31 255 154 -65 -193 224 -363 243 -156 30 270 -118 118 269 -111
6929a11o2K64j87M4M8J2P1k09J11J81k32q0j06N35k45k15N9k61K14K26l59M03
$$ -111 -173 91 -96 -52 -4 8 79 -130 -19 162 -70 -150 -256 279 34 -181 -122 -383 -169 57 -302 101
6951A01K7o7j70j78N84l60J16j79l9Q8J46L7R1k75L07n28M3Q3K23N8j67p1J16
$$ 101 128 61 -109 -287 297 -63 53 -126 -165 -77 69 106 197 -78 229 -299 -256 -173 50 108 -59 -130 -14
6974a4k1R6j72J58K0j58J60J62j35j11J62j03J99l24K76q0m0j6L7M4j42p5K14
$$ -14 -35 61 -111 47 67 -91 69 231 96 -15 147 44 243 -81 195 115 75 59 96 140 -2 -77 137
6997A37l0Nk61q0L49p7N9j5R7k75o8L7J23P9j43J32k11J60J01l00K98j72M8q6
$$ 137 107 112 -149 -229 120 43 102 87 184 -91 -159 -122 1 80 -63 69 -142 18 119 -181 117 -55 -7 -93
7021i3L1J2j90L01K07j66j63Q5J90l47K86k93j04K70l82J55k4L78j33J83l29o4
$$ -93 -62 -50 -240 61 268 102 -61 24 214 -133 153 -140 -244 26 -356 -201 -225 153 20 203 -126 -190
7043a90N44m74j78M06K56m29o6P7M3o2K9O8j6J03k56R7L1K28k04J7O6L9k83K54
$$ -190 354 -120 -298 108 364 -65 -131 -54 -11 -73 -44 24 8 111 -145 -48 -17 211 7 24 90 129 -154 100
7067A00k25J97rp6lJ04j49K6J61mj21L7O9j14j53J85J57k6k44Q9P5Lm9P2K1k67
$$ 100 -125 72 63 -13 -16 88 -61 -35 126 122 1 38 107 -7 -160 25 182 156 -88 1 76 79 30 102 123 -144
7093a44Q8K92l07N5P4P1n6o4J92k15N5mK08j73R8j49j19K38k7j44N7K01n1k84
$$ -144 -56 236 -71 -16 58 129 73 9 201 -14 41 37 245 72 170 21 -98 140 113 -31 26 227 176 -108
7117a08L74k61j00J11nK97k85l8q4K19l27M20j92k49K79K9P8l7j46M9%pj61J22
$$ -108 266 5 -95 16 11 308 23 -15 -99 120 -207 213 21 -228 51 80 158 121 -25 24 24 17 -144 -22
7141b2M7l49Q67n08j8J43P5l29J31oj10P4j1J33l01L59m82K92n5k19M47j32P5
$$ -22 25 -324 543 35 17 160 235 -94 37 31 -79 -5 -16 117 -184 175 -307 -15 -70 -289 158 26 101
7164A01J12l61j12L29l14L34Rj28K43k02QK44j75J38k53o2k17K82K96j95k56J09
$$ 101 213 -148 -260 69 -245 89 98 -30 213 11 19 263 88 226 -27 -89 -306 -24 272 77 -179 -70
7186g0K19l0l66R9O0K6l6L8J60k15M11k32p6j9M5m2p1K35P9j34K25l51j1M7lJ67
$$ -70 149 119 -247 -148 -88 -62 -98 -60 100 -115 296 64 -12 -31 14 -28 -99 136 215 81 306 -45 -56 -9 -12 155
7212A55k14M5n8J2K13l24J56L3j20J76N0j31j0M5k1j5PR1k77M05k28N9l5m9k31
$$ 155 -59 -14 -72 -60 153 -171 -15 18 -102 74 124 -7 -17 28 7 -8 -1 90 -187 218 -10 49 14 -35 -266
7237b66L8J90m3J0J4J90k76J87l10L57Q6k20K84j72m8j04j22M30j40k76O8J4J9
$$ -266 -228 -38 -81 -71 -57 133 -143 44 -266 91 177 -43 241 69 21 -83 -205 225 85 -191 -123 -109 -90
7260i0k38M36j54k05M72k56q5J45M6K6k7q9J01j62J80l26P3K78Ol12K24rn8J5
$$ -90 -328 108 -46 -251 221 -35 -120 25 71 97 70 -19 82 -80 100 -226 -153 125 131 -181 43 34 -24 -9
7284iJ42j25J0K8Q2mO5l21L91k07m1p9l2N9l5O7J20j44J47q5j26K36m51O5N94
$$ -9 133 8 18 46 128 124 189 -132 259 52 11 -68 -100 -41 -76 -9 111 -33 114 29 -97 139 -312 -247 347
7309C47l22k71j3j35L87j1K04r3j90M73j67K08k71j56l07L95o3K09ok26m3J8J18
$$ 347 25 -246 -259 -394 -7 -18 186 93 -97 376 209 417 146 -10 -317 78 15 224 218 -8 -51 -33 85
7332H5Q8m2k8k32Q1j2J30k17%l6K02J85l59M6K18k37Q6J37r8K65l1k28j05j52
$$ 85 173 131 103 -129 -48 -60 70 -147 -147 -183 19 204 -155 -109 109 -128 -42 95 -3 262 231 3 -102 -254
7356b54K30J56k52J99j35k12K06K3J30j73n0j1j3Q1j8K03j88Q4r8J25k9J33l41
$$ -254 -24 132 -120 79 -56 -268 -62 -39 91 -82 -132 -143 -156 -75 -93 110 -78 6 -92 33 4 137 -204
7379b04qJ88P1k35K48J09j69M1j82R2J73L8J84k31o6l4k2L2R4l25Q2L68q2l38
$$ -204 -212 -24 47 -188 60 169 0 41 -141 -49 124 162 346 115 49 15 -7 25 119 -206 -124 244 162 -176
7403a76L26j67j58M10l34J09k3m37M89j6o5K08l48J94k0k7Ok55L61m11J78J70
$$ -176 150 -17 -175 235 -99 10 -13 -450 39 23 -42 166 -182 12 -8 -35 -29 -284 77 -334 -156 14
7425A4j47q0J91L6rn0R6j8J27K45l18j22J99j00K41m17K73j57p9J35l1j72J82
$$ 14 -133 -213 -22 14 5 -45 51 33 160 405 87 -35 164 64 305 -112 161 4 -75 60 29 -143 39
7448C9J66j94J48J13j36l22K65m01K15R8j93K85k12J61O4l8p9k47M22k06L26k86
$$ 39 205 11 159 272 136 -186 79 -322 -107 -9 -202 83 -129 32 96 58 -21 -268 154 -52 274 -12
7470a2Nj79K90j13J26m87M09J94l69K29l8k0l0j6J98j90r2k81M52k65K4k14K77
$$ -12 -7 -186 104 -9 117 -370 39 233 -136 93 55 35 5 -11 187 -3 -95 -376 76 -189 -165 -379 -102
7493a02J59K89m22M3M1j76O1j67K61j65J91k5J67k96J81k92m1L17k09K32p3j97
$$ -102 57 346 -76 -33 8 -168 -107 -274 -13 -178 13 -12 155 -141 40 -252 -293 24 -185 47 -26 -223
7515b23K53M2k39P9J82j85J86k55M38l32K85l03j0O0l20J71K17L1k72J04L8j17
$$ -223 30 72 -167 -88 94 -91 95 -160 278 -54 231 -72 -82 -22 -342 -171 46 77 -195 -91 -53 -170
7537a70K13O0j59r4J88O2K45k76j76K89j37J44l57J58J30k25l2M91m91M35n65
$$ -170 43 103 -56 -150 38 100 345 69 -107 182 45 189 -168 -10 120 -105 -137 354 -137 298 -267
7558b67K02K57m84M43j17K03l23j69M75j33j63mJ58k43J65K8M5M01l51J0l08J79
$$ -267 -65 192 -292 151 34 237 -86 -255 220 87 -76 -80 78 -165 0 28 73 474 123 133 -175 4
7580DO8j29k81K50J45l9p4J29k23l8L03l2j2J07l95L22o5l03M20Q4q8M6k44K96
$$ 4 72 -57 -338 -88 57 18 -56 73 -150 -188 115 83 71 178 -217 105 40 -263 157 241 153 199 -45 251
7604B51k46k06J46k38L03l51K76K31j24k08l4J40J68m4K42j82lj06q4J28R3r7
$$ 251 5 -201 -55 -293 10 -341 -65 166 42 -166 -200 -60 108 64 306 124 121 15 -69 59 152 55
7626E5n1j22J0k94J98L12K1j99J71R3l79R6J97j67k53K69J07k25K67q1j02lJ28
$$ 55 4 -118 -108 -402 -204 108 129 -70 101 194 -185 -89 108 -59 -312 -43 64 -161 106 25 -77 -80 48
7649D8l53L25K24l41Q6L5m8K21q9j71J43k45K54j72R0j10O1K42m47L32P0o8m7
$$ 48 -305 20 244 -97 -11 24 -24 197 108 -63 80 -165 89 -83 7 -103 -42 200 -247 85 155 87 40
7672D0J15m65L73p4J1N8j67N1M5j57K9J16p0m6K60p0k39L75j50j21M05j05m88
$$ 40 155 -310 63 -11 0 58 -109 -58 -13 -170 -141 -25 -95 -141 119 49 -190 185 35 -86 319 214 -274
7695b74N34m42M19k26K09k20J10p3n4J20j20k4k35K96j24jK11N2j90J48m36L97
$$ -274 260 -182 237 11 220 0 110 37 -17 103 -17 -41 -276 20 -104 -105 106 158 -32 116 -320 77
7717G7k29K4QJ10pK55O4j66n2j51J7j40J11J26Koj6k04j63K82M9kK69l64K47k43
$$ 77 -152 -128 -120 -10 -17 238 302 136 84 -67 -50 -190 -79 47 49 43 27 -177 -340 -58 -9 -11 258 -106 141 -102
7743a02J24l1j98j03M33j10k00K9K03Q5k16J9j13L02q7l05L38J01j59O3j25J46
$$ -102 22 -9 -207 -310 123 13 -187 -158 45 130 -86 -67 -180 122 35 -270 68 169 10 73 -52 94
7765I4j27r0J48l7J55k57L18l53J88m4J29j88J22j04J96m39L31K63k51j11K16
$$ 94 -33 -123 25 -12 143 -114 204 -149 39 -5 124 -64 58 -46 150 -289 42 305 54 -57 159
7786A59j18k95N03K9k08j40J13p6P9j5m0n6O2oK27n51M51j35P0N5j42M0k45K21
$$ 159 41 -254 249 278 70 -70 43 -33 46 31 -9 -65 -3 -9 218 -333 118 -17 53 108 -34 6 -239 -18
7810a8J6k28K68J85j02k55J15R2l41L06j22O27o93K89q9K7k03K17j03J49j5r4
$$ -18 -2 -230 38 223 121 -134 -19 73 -268 38 -84 543 -150 139 50 77 -126 91 -12 137 122 28
7832B8k0J48l10R7J57j26j62K32l8k49L38N6l7p5j95R1M3J5pK3RJ63l39J05J06
$$ 28 8 156 -154 -57 100 -26 -188 44 6 -243 95 151 114 39 -156 -65 -22 -7 -14 9 18 181 -158 -53 53
7857E3kM8j49k09L38J55j32k25K28k68K64k50J35J33J02k70j54J97J09K33o95
$$ 53 51 99 -50 -259 79 234 102 -123 105 -163 101 -149 -14 119 221 -49 -203 -6 103 336 -359
7878c59L44l58K43M8J91M9k67P8J86q3j18J1J74m5j08j2r4J39k37K29n4K42j51
$$ -359 -15 -373 -130 -82 109 158 -109 -31 155 72 -46 -35 139 94 -14 -26 -120 19 -218 11 -43 199 48
7901D8L3o4J31J5k94K57n2m7q2j7K64J22m76P6n8M17k88J03Nj05mj39M98l23o1
$$ 48 81 17 148 163 -131 126 74 27 -55 -72 192 314 -162 -86 -144 273 -15 88 93 -12 -16 -155 343 20 -41
7926d1M8k36J88K83l8r5J18q7M9l53q0L25j73L6P6M1j63P4L1J97j18l15L30J14
$$ -41 7 -229 -41 242 204 109 227 140 189 -164 -244 81 -92 -56 20 61 -102 -28 3 200 82 -233 97 211
7950B11k86J15J24r6p8kJ11r6k21K08o5L64j56j06K4jKK7j13K22k77l2L5J49k61
$$ 211 -75 40 164 68 -10 -12 99 3 -218 -10 -75 289 133 27 51 50 52 79 -34 188 -89 -121 -86 63 -198
7975a98L85j6k41j49l0K84k57L98J89j70M0k50j27J21J82K91m61P2j60J95m52
$$ -198 187 171 -70 -219 -249 35 -222 176 365 195 235 -15 -142 -21 161 452 -9 63 -97 98 -354
7996c54O58P5n13J7P3k7L69l75K6k2m7J64L03m21%J21l4Q6o2j69J25j28m3L54
$$ -354 304 379 -134 -117 -44 -71 298 -77 -51 -73 -120 44 347 -74 -74 47 13 99 37 -132 -7 -135 -178 176
8020A76J35m16J45K3j99K29J90l87R3j03n1N22m18L93j83k76J41j43M13k15j2
$$ 176 311 -105 40 63 -136 93 283 -104 -11 -114 -165 357 -61 332 149 -127 14 -129 284 69 57
8041E7k48L56ok40O5L16l35R8m2L8J01n6o0q0rO6j3l18N42q6m4o6r4m1J32O0K41
$$ 57 -191 165 159 -81 -16 300 -35 63 21 59 160 104 44 -36 -45 21 8 -310 232 146 102 36 -58 -99 33 93 334
8068C34l11K59k77k08N3M9m0j51K95j10J71j55K06j72O0P7j33O1o7R0J20r2r8
$$ 334 23 282 5 -203 -150 -101 -141 -292 3 -107 64 -91 115 -57 3 80 -53 8 -59 31 151 59 -39
8091c9j26J55L3J13j80J16j26J35k59J79j99J31j42K99j68J18k16L64l12J78p6
$$ -39 -165 -10 23 136 -44 72 -54 81 -178 1 -198 -67 -209 90 -78 40 -176 188 -124 54 -22
8112b2k44J60Q3J89k00PJ19J07j24Q7j54n8k55q3M20o1r3p1M9N5L64m16O9J6j
$$ -22 -266 -106 -23 166 -34 -27 92 199 75 162 8 -50 -305 -388 32 -29 -122 -193 -144 -89 275 -141 -72 -56 -57
8137e7n8L40m03M7K60k42J3q4K10m82M38K25k40J82L7j22j15J02j48K72j88k72
$$ -57 -115 225 -178 -131 129 -113 -100 -184 26 -456 -18 207 -33 149 186 64 -51 51 -97 175 -13 -285
8159b85K72j39O6J04K18r2j78mNMK4kJ16J36l23K6J84p3p8k21M6qL04n9K6n8Q3
$$ -285 -13 -152 -86 18 236 144 -34 -38 -33 -29 -5 -7 109 245 -78 -52 132 59 -19 -240 -194 -202 102 43 69 11 94
8186I4O6r0j14K40k59
$$ 94 160 70 -44 196 -63
8191f3
$$ Imaginary data points
##PAGE= N=2
##DATA TABLE= (X++(I..I)), XYDATA
0@%%%%%%%%Qj6J6j6K4l2M0n6P2q7J03j21J46j77K09k50K98l46M02m66N37o17P06
$$ 0 0 0 0 0 0 0 0 0 8 -8 8 -8 16 -16 24 -32 40 -47 56 -65 81 -96 113 -137 161 -185 217 -249 288 -329 377
31C77q06R19j044J179j326J491j676J877k096K336k599K882l193L535l908M315
$$ 377 -429 490 -554 625 -701 790 -886 991 -1105 1231 -1368 1514 -1679 1856 -2052 2263
47B263m759N246n779O366p014P728q521R408j0404J1532j2819J4304j6043J8111
$$ 2263 -2496 2750 -3029 3337 -3677 4051 -4470 4938 -5466 6066 -6753 7551 -8492 9619
61I619k0616K3726k7707L3012m0477N1855p1560J15420l93129q8549J35289k93182
$$ 9619 -10997 12729 -14978 18034 -22443 29412 -42148 73272 -319857 -408406 -273117 -566299
73e66299K99170k06120k5099K61866m6459j27460J07426l8535P9108Q6851p5218
$$ -566299 -267129 -473249 -498348 -236482 -282941 -410401 -302975 -341510 -262402 -175551 -250769
84b50769l7389J4090J26059J9455j18944J13696j27721R3464J84065k37754N5895
$$ -250769 -288158 -274068 -148009 -128554 -247498 -133802 -261523 -168059 16006 -221748 -165853
95a65853P9229q8209J75185l0352j44855J18346L8875J275Q5314j54083N7587
$$ -165853 -86624 -174833 352 -30000 -174855 -56509 -17634 -16359 68955 -85128 -27541
106b7541J10864q7646J48428j34187p6754K37502j17265J5946M9519j59646J07471
$$ -27541 83323 -4323 144105 9918 -66836 170666 53401 69347 118866 -40780 66691
117F6691R6758j16284j985R254m5743J06771j8727q1180L926r60R6707p7864q532
$$ 66691 163449 47165 45180 54434 8691 115462 96735 15555 19481 18521 115228 37364 28832
130B8832K7541j25695J90004k0555j75252J50669n4358m4256J67687j18427r6831
$$ 28832 56373 -69322 120682 100127 -75125 75544 21186 -23070 144617 26190 -70641
141g0641J73943o3010j3121R8411j55352O5971P6610n9231M3514o9377K8835L8754
$$ -70641 103302 40292 27171 125582 -29770 36201 112811 53580 97094 27717 56552 95306
153I5306j3407L1456q1828J8090O7646m3133L977J0853p5757O5943N7298j16273
$$ 95306 81899 113355 31527 49617 117263 74130 78107 88960 13203 79146 136444 20171
165B0171O1037j6333l9716J13590q4144k78K2587l6601Q2163m7059k9398L9987
$$ 20171 81208 64875 25159 138749 54605 54327 76914 40313 122476 75417 46019 86006
177H6006l0812J9743L4926p5403K308N7216o9617N0424j9532p4595Q9393m9218
$$ 86006 55194 74937 109863 34460 36768 93984 24367 74791 55259 -19336 70057 20839
189B0839l75J8452o0958M1864n900l031l272k2773K1077N025j0850P268J91l4578
$$ 20839 20464 38916 -22042 19822 13922 10891 7619 -15154 5923 10948 98 7366 7557 -27021
203b7021N9173j6191m5443P0411o2072K0301L7983o3712L8958j4044p191K1592
$$ -27021 32152 15961 -29482 40929 -21143 -842 37141 -26571 12387 -1657 -8848 12744
215A2744j9761q54N702n91p729J9000k4547J1869R874k6225L9874l8739J7288
$$ 12744 -7017 -7871 -2169 -2760 -10489 8511 -16036 -4167 5707 -20518 19356 -19383 -2095
228b095J8204m5648M7770k3516q341K2328k0225L947J355K932j4963J0751j1626
$$ -2095 16109 -29539 18231 -5285 -13626 8702 -11523 -7576 -6221 -3289 -18252 -7501 -19127
241a9127L561J1030l1397L0747k5485M178K3083l7772K5724j6636P033J1705k1554
$$ -19127 -15566 -4536 -35933 -5186 -30671 -26493 -3410 -41182 -15458 -32094 -25061 -13356 -34910
254c4910J4234j1133J0137q26L756j0846l377K5569k3952J9150j3774m983K3734
$$ -34910 -20676 -31809 -21672 -22498 -18742 -29588 -32965 -7396 -31348 -12198 -25972 -30955 -7221
267g221k0033K2513k3212K466J9537j3032J3135j7655J0168o41P342N515k0922
$$ -7221 -27254 -4741 -27953 -25487 -5950 -18982 -5847 -23502 -13334 -13975 -6633 -1118 -22040
280b2040J6933q877J9110q540j2955J9233j8879K5420r799j0080O381o398K2305
$$ -22040 -5107 -13984 5126 -3414 -16369 2864 -16015 9405 -394 -10474 -4093 -10491 11814
293A1814k0651M688n255j443J7641j8037R436j9227J3174R974j6140J0112j9226
$$ 11814 -8837 -4149 -9404 -10847 6794 -11243 -1807 -21034 -7860 2114 -14026 -3914 -23140
306b3140J7916k410k60K746k1889K5211p505N707o753r893J9825j2915J6787j5467
$$ -23140 -5224 -7634 -7894 -5148 -27037 -1826 -9331 -3624 -10377 -20270 -445 -13360 3427 -12040
320a2040m692J1927m408J4034k3781J0419p02o27J4152k3395J2091q756J3794
$$ -12040 -16732 -4805 -9213 4821 -18960 -8541 -9243 -9870 4282 -19113 -7022 -15778 -1984
333a984L498j9893J4623j0358J5900l663n841K909r248K4742j4124J731l557k426
$$ -1984 1514 -18379 -3756 -14114 1786 -1877 -7718 -4809 -14057 10685 -3439 -1708 -5265 -7691
347g691J9202j8286J2653j4739J146J8057j5554P087j5624J0724L558m714L419
$$ -7691 11511 -6775 5878 -8861 -7715 10342 -5212 1875 -13749 -3025 533 -4181 -762
360g62j6085J5062o136J1685q683j2991K4991j6176J7434p597j0478J9755j0005
$$ -762 -16847 -1785 -7921 3764 -4919 -17910 7081 -9095 8339 742 -9736 10019 14
373A4J6966j0389m264J0188K991M433j0057J0290j3089J7600K836j8835J8904
$$ 14 16980 6591 2327 12515 15506 19939 9882 20172 7083 24683 27519 8684 27588
386B7588k0126K1737o63j9188K0454j8380J4195N170j2722J687J199O944l679
$$ 27588 7462 29199 28536 9348 29802 11422 25617 30787 18065 19752 20951 27895 24216
399B4216N041j6469J4259J794j2055K2250l3875J7742J1355k5219K2647k2849
$$ 24216 29257 12788 27047 28841 16786 39036 5161 22903 34258 9039 31686 8837
411H837N345J1026j4030M726q147k045O157L533k0240J1148l076j1273K7697l6531
$$ 8837 14182 25208 11178 15904 7757 5712 11869 15402 -4838 6310 3234 -8039 19658 -16873
425a6873J2806Q933k5823L7105l2383k810K5819k3549J1991K443j8131R970J5672
$$ -16873 -4067 4866 -20957 16148 -16235 -19045 6774 -16775 -4784 -2341 -20472 -10502 5170
438E170k0560J0495q12j4293L6277k9072P022J0670k7665M3258k3289q477K0581
$$ 5170 -15390 -4895 -5707 -20000 16277 -12795 -5773 4897 -22768 20490 -2799 -11276 9305
451I305k3753K4199q74k2834J4019K482j0055K1637j8538j8461M1666k9927J3556
$$ 9305 -14448 9751 8877 -13957 62 2544 -7511 14126 -4412 -22873 18793 -11134 2422
464B422Q430m4142N0555j8123q406K7330m7276K7431K0226l4033J4273m98k4281
$$ 2422 10852 -33290 17265 -858 -9264 18066 -29210 -1779 18447 -15586 -1313 -1811 -26092
477b6092L6053k947l8065L0920k0605R696K1480m3924K2993j2288Q840K3405m6536
$$ -26092 9961 7014 -31051 -131 -20736 -11040 10440 -33484 -10491 -22779 -13939 9466 -37070
490c7070K3852l268r367M0434l5476j9665M5689k1941k758L9818o8570K4180N0215
$$ -37070 -13218 -16486 -25853 14581 -20895 -40560 5129 -16812 -19570 20248 -48322 -24142 26073
503B6073o3375M0663j5464l3049O1333k3081p724L866j6727K9079M901j6631J814
$$ 26073 -37302 3361 -12103 -45152 16181 -6900 -14624 -10758 -27485 1594 6495 -10136 -8322
516h322q790J2912L0768l8675N646J0964k5252N9801l5183k9872M5532l6249L4522
$$ -8322 -17112 -4200 26568 -12107 -6461 4503 -20749 39052 3869 -26003 19529 -16720 17802
529A7802N804n3732L1633j159j233K5138m4906m524M6541l3825K1192O504o7781
$$ 17802 23606 -30126 1507 348 -885 24253 -20653 -25177 21364 -12461 8731 15235 -52546
542e2546P1943J896m2354M7217m9345J0271M9497l3422l598k313j133K2343J672
$$ -52546 19397 21293 -21061 26156 -23189 -12918 36579 3157 -441 -2754 -3887 18456 20128
555B0128j7423q624j015L2727m055l4228L1426l4637J9294N5435q5788K6411K7869
$$ 20128 2705 -5919 -6934 25793 21738 -12490 18936 -15701 3593 59028 -26760 -349 27520
568B7520m7296O2583j8513n4861N0383L623j6342K7442l7805n724M5713k2481
$$ 27520 -19776 42807 24294 -30567 19816 23439 7097 34539 -3266 -8990 36723 14242
580A4242J0899j8841j7299M6512k3596J1833j0120l5365N3167r624j7582J4343
$$ 14242 25141 6300 -10999 35513 11917 23750 13630 -21735 31432 21808 4226 18569
592A8569l2126J4203L4945l3237p368Q491j9982M1014j3630l0846K5978k9950
$$ 18569 -13557 646 35591 2354 -5014 3477 -16505 24509 10879 -19967 6011 -23939
604b3939L7619P463n4952L7218j2631k248M0303m2821j2638L7318j3138O119J3359
$$ -23939 13680 21143 -33809 3409 -9222 -11470 28833 -13988 -26626 10692 -2446 3673 17032
617A7032m4738K5618K1280k0915J8527l0058Q749K2781j3361J6432l2284N444
$$ 17032 -27706 -2088 19192 -1723 16804 -13254 -4505 18276 4915 21347 -10937 -5493
629e493L1976k1702J0922l274k6386L3749J4555l6266K0915p401j3825M8892l2032
$$ -5493 26483 4781 15703 12429 -13957 19792 34347 -1919 18996 11595 -2230 46662 14630
642A4630q516J8958k0531L3627j0858j9118J3583r570J6768L797k3962L719Q180
$$ 14630 6114 25072 4541 38168 27310 8192 21775 12205 28973 32770 8808 12527 20707
655B0707o026J7057j6663k1909L2625j6545O415P588l7918K6877J048p992R502
$$ 20707 14681 31738 15075 -6834 25791 9246 15661 23249 -14669 12208 13256 5264 14766
668A4766k3470P306J1195n274J9p537r515J8218K174j7086J2037j8244R865J8405
$$ 14766 -8704 -1398 9797 4523 4542 -2995 -12510 5708 7882 -9204 2833 -15411 -5546 12859
682A2859k6973J3434j1286n93K3177k0487J281J097n373J3118J527j5143L570
$$ 12859 -14114 -680 -11966 -12559 10618 -9869 -8588 -7491 -12864 254 1781 -13362 -9792
695i792N888n085J6384j6677n035J6975j2942J7463r602j1593J5835o431J0512
$$ -9792 -3904 -8989 7395 -9282 -14317 2658 -10284 7179 -2423 -14016 1819 -4612 5900
708E900n444r018P114K299K245M87n937o792J7359n423m311P501j8009J6511K122
$$ 5900 456 -8562 -1448 851 3096 3583 -2354 -9146 8213 2790 -1521 5980 -12029 4482 6604
723F604q648N423j2837J1006K406l762l8p374M993M717P54q908K621j431J947
$$ 6604 -2044 3379 -9458 1548 3954 192 154 -7220 -2227 2490 3244 -5664 -3043 -4474 -2527
738b527J1146j8331O775O90l522J3574j2885j40N76M375L468o941J958n117O750
$$ -2527 8619 -9712 -2937 -2247 -5769 7805 -5080 -5220 -4644 -269 3199 -3742 -1784 -6901 -151
753a51K945k936m822j660J0604p427O876n469q049J5646o577K455k918m387O458
$$ -151 2794 -142 -4964 -6624 3980 -3447 3429 -2040 -10089 5557 -1020 1435 -1483 -5870 588
768E88Q82L042r468L526R68J463N470r639K700r89P114j584o785O522q629R991
$$ 588 1470 4512 -4956 -1430 -462 1001 6471 -3168 -468 -1457 5657 4073 -2712 3810 -4819 5172
784E172Q81r407L877k680O355l394O74m682j808J0359o505K269n102M05N547k782
$$ 5172 6053 -3354 523 -2157 4198 804 1478 -3204 -5012 5347 -1158 1111 -3991 -3586 1961 -821
800h21L476r556O239J578j764N091j0532N835J769J297p37m883M731l695P498
$$ -821 2655 -6901 -662 916 -848 4243 -6289 -454 1315 2612 1875 -3008 1723 -1972 5526
815E526m203m541M663k693O302o003P42j094j462Q584q941K720j821N11N410n691
$$ 5526 1323 -3218 1445 -1248 5054 -949 -207 -1301 -2763 5821 -3120 -400 -2221 -1710 3700 -1991
831a991K383m193N325R6j382J395o012Q553k895Q05j5m897Q020m897L878l040
$$ -1991 392 -3801 1524 1620 238 1633 -4379 4174 1279 2084 2069 -2828 5192 295 4173 1133
847A133l789P282l919J989l611O58N10K18K969p622N287l396K816K391q496P939
$$ 1133 -2656 4626 707 2696 -915 -257 253 471 3440 -4182 1105 -2291 525 2916 -5580 2359
863B359n110M127J237o142N545l203M675j023j981M10Q07L303m210M667o530K983
$$ 2359 -2751 1376 2613 -3529 2016 -1187 3488 2465 484 894 1701 5004 794 5461 -1069 1914
879A914N544r163P529p025J824N291p469M815m826J317L200k238j237p94K671
$$ 1914 7458 -1705 5824 -1201 623 5914 -1555 3260 -1566 -249 2951 713 -524 -1318 1353
894A353k429N505o439R86M972o873R984q202p52Q451q701P654l555l641N163q58
$$ 1353 -1076 4429 -2010 -1024 3948 -2925 7059 -1143 -1895 6556 -2145 5509 1954 -1687 3476 2618
910B618j368j95n14l011P482o386l98M869r691J1605n392m072P426q500Q707j865
$$ 2618 1250 1055 541 -2470 5012 -1374 -1772 3097 -6594 5011 -381 -4453 2973 -5527 3180 1315
926A315m858N676l837K227K956m097k070P022n356K698L120j1698J2712n157l143
$$ 1315 -3543 2133 -1704 523 3479 -618 -2688 4334 -1022 1676 4796 -6902 5810 653 -2490
941b490R656j4682R187K065q265P203m997j042N333k066m153M722m542K472N163
$$ -2490 7166 -7516 1671 3736 -4529 2674 -2323 -3365 1968 -98 -4251 471 -4071 -1599 3564
956C564j1650R258m339k110J0648j4247P519K86o402J1437r585j499P576n171
$$ 3564 -8086 1172 -3167 -5277 5371 -8876 -1357 -1071 -7473 3964 -5621 -7120 456 -4715
970d715Q73N207j0697M445Q595j3916J0826n024o568J5912j2859M254J804r223
$$ -4715 -3842 1365 -9332 -4887 3708 -10208 618 -4406 -10974 4938 -7921 -3667 -1863 -11086
984a1086J2144m904k778L741m300L749L666o817K204L476o874J2620p636n529
$$ -11086 1058 -3846 -6624 -2883 -7183 -3434 232 -6585 -4381 -905 -7779 4841 -2795 -8324
998h324J4491j4080J0691K148j4944J4549m859j344P861j1006K109Q236p673K923
$$ -8324 6167 -7913 2778 4926 -10018 4531 -328 -1672 6189 -4817 -2708 5528 -2145 778
1012G78K691j1745J3355j283r183J2385j2725O497P377j1853R066o527J656Q117
$$ 778 3469 -8276 5079 3796 -5387 6998 -5727 770 8147 -3706 5360 -1167 489 8606
1026H606p272J212K30k692O910q73r153R043n513j125J3696k0178P806P101j4629
$$ 8606 1334 2546 2776 84 6994 6121 -3032 6011 498 -627 13069 -7109 697 7798 -6831
1041f831J7053q782q585J3696n969P45M285q944K974P522o936L926l163m396J2587
$$ -6831 10222 1440 -7145 6551 582 1327 5612 -3332 -358 7164 228 4154 991 -3405 9182
1056I182r407L339N88j0645J6235p382l297P410j1840Q222M931r749L117J238
$$ 9182 -225 3114 3702 -6943 9292 1910 -1387 6023 -5817 2405 7336 -2413 704 1942
1070A942n122J0255l683q308J0884q825O760M587j5856J2774m762j606J1002j3932
$$ 1942 -3180 7075 3392 -4916 5968 -2857 3903 8490 -7366 5408 646 -960 10042 -3890
1084c890K224O369n499M378m78q950P776K340o022O690r256K472Q111q667P182
$$ -3890 -1666 4703 -796 3582 3104 -5846 1930 4270 -1752 4938 -4318 -1846 6265 -2402 4780
1099D780q279k08J0944j0141N412k328p017J0548m20p297M504l075k251J1776
$$ 4780 -3499 -3707 7237 -2904 2508 180 -6837 3711 3291 -4006 498 -2577 -4828 6948
1113F948j0279j500O210q683J2244n050o671Q023p090P797Q13q974M245R03p10
$$ 6948 -3331 -4831 1379 -7304 4940 -110 -6781 1242 -5848 1949 2762 -6212 -1967 -1064 -1774
1128a774N018m878n543R187l202M35L533j1423Q493R93k798M621r828N700K911
$$ -1774 3244 -1634 -7177 2010 -1192 -757 2776 -8647 -154 839 -1959 2662 -7166 -1466 1445
1143A445k657L466o327j12P434j567l351K773o035M649P149j1214N210k568k020
$$ 1445 -1212 2254 -4073 -4185 3249 1682 -1669 1104 -4931 -282 6867 -4347 863 -1705 -3725
1158c725J0885q935m5J020j954O864k602m127O22J734J297L039o140j676O167
$$ -3725 7160 -1775 -1820 -800 -2754 4110 1508 -2619 -1997 -263 1034 4073 -2067 -3743 2424
1173B424l621N398l775n879P684k446L395k476n360N258m41K138q85n087J380
$$ 2424 -1197 4201 426 -5453 2231 -215 3180 704 -4656 602 161 2299 1414 -3673 -2293
1188b293N573j825j604P15o201Q932Q38p012M618n141L741N243n526k80j627L566
$$ -2293 3280 1455 -149 566 -5635 3297 4135 -2877 1741 -3400 341 5584 58 -222 -1849 1717
1204A717J456p23k735j453K911J794N31n713K118J087K29N068q560Q28M323j889
$$ 1717 3173 2450 -285 -1738 1173 2967 3498 -2215 -97 990 1219 6287 -2273 -1445 2878 989
1220I89L537m193j651K034K605N42l490r87Q4M715j602j056k127j471P568m070
$$ 989 4526 333 -1318 716 3321 3863 373 -614 -530 4185 2583 1527 -600 -2071 5497 1427
1236A427k03k78l959O736p06k754j277J30K355Q11L68n597J998K466L14J5m206
$$ 1427 1224 946 -3013 3723 3017 263 -1014 -884 1471 2282 2650 -2947 -949 1517 1831 1846 -2360
1253b360J963l44L394l06o183M166j073J718J284m213jJ529K656k935J41j466
$$ -2360 -397 -741 2653 2347 -3836 330 -743 975 2259 -1954 -1955 -426 2230 -705 -564 -2030
1269b030J02M776l011o69j613J201K584k042J565m270K475L098k894O61j954Q35
$$ -2030 -1928 2848 -163 -832 -2445 -1244 1340 -702 863 -3407 -932 2166 -728 -67 -2021 -1186
1285a186J647J216k286k227L582j564K331j306k457K015K35K547l509m7R23p25
$$ -1186 461 1677 -609 -2836 746 -818 1513 207 -2250 -235 0 2547 -962 -1009 -86 -811
1301h11L868l554o68J006M59J237j036j18k116L433j13j951J443k408K530P9k60
$$ -811 3057 -497 -1165 -159 300 1537 501 383 -1733 1700 1587 -364 1079 -1329 1201 1280 1020
1318A020o12j784L489j796O77k73k190K588j42o7j828J260l22j82J948l682K019
$$ 1020 408 -1376 2113 317 994 721 -1469 1119 977 910 -918 342 20 -162 1786 -1896 123
1335A23q7o5J326k609J566j360J954l03k358J581n55P59o62J02n45k90K054k995
$$ 123 36 -29 1297 -1312 254 -1106 848 545 -1813 -232 -787 -28 -690 -588 -1133 -1423 631 -2364
1353b364K117j492n31K737k724J462q67J05J345j730J452j572J121K27Ml33l28
$$ -2364 -247 -1739 -2270 467 -2257 -795 -1662 -1557 -212 -1942 -490 -2062 -941 -714 -710 -1043 -1371
1370a371J529j473J735j656q15K877k751K007o56j306K100j200N53m83m5j6K75
$$ -1371 158 -1315 420 -1236 -2051 826 -1925 82 -574 -1880 220 -980 -427 -910 -955 -971 -696
1387f96K28j200J505j469J964p98j064K508k864L062j027j982K614j775R90N91
$$ -696 -468 -1668 -163 -1632 332 -466 -1530 978 -1886 1176 149 -1833 781 -994 -4 587
1403E87j454O03N90l47n59J138k304K537o19j529K779m030K773L80k558K997k480
$$ 587 -867 -264 326 -21 -580 558 -1746 791 172 -1357 1422 -2608 165 545 -2013 984 -1496
1420a496R27J300j417O88O6j5J92Q73k178J856l56r03K956l206J394J107k477
$$ -1496 -569 731 -686 2 68 53 245 1118 -1060 796 440 -463 2493 -713 681 1788 -689
1437f89L460k585J84J874k055J187j6j326J065Q81k395J778m97j542L464l177
$$ -689 2771 186 370 2244 189 1376 1360 34 1099 1980 -415 1363 866 -676 2788 -389
1453c89J053R93l027L804k560K98J354k432K041l72r42P24J74j209J950j344j343
$$ -389 664 1657 -1370 2434 -126 172 1526 -906 1135 763 -179 545 719 -490 1460 116 -1227
1470a227L524l572J496R74l993M463k076p61K242l089J783J68j274Q13K41j068
$$ -1227 2297 -1275 221 1195 -2798 1665 -411 -1172 1070 -2019 -236 -68 -1342 -529 -288 -1356
1486a356J298m38r12K849l163K071J177l088L702k432r7K706l067K068j01j422
$$ -1356 -58 -496 -1408 1441 -1722 349 1526 -1562 2140 -292 -389 2317 -750 1318 1217 -205
1502b05K094n11j640J906q23q74K757l345J377J867l340K927j699r15L086k716
$$ -205 1889 1378 -262 1644 821 -53 2704 -641 736 2603 -737 2190 491 -424 2662 -54
1518e4J616k75j374J809o29p99P11o20n71K244k976J104R90l191L709k276o73
$$ -54 1562 1287 -87 1722 1093 294 1005 385 -186 2058 -918 186 1176 -2015 1694 -582 -1255
1535a255K967l649K187K27k513K099n47r72J356o50j149K355k115M01J669l139
$$ -1255 1712 -1937 250 477 -2036 63 -484 -1456 -100 -750 -1899 456 -1659 -1258 411 -2728
1551b728K815j226p53K673l492K213N41j675J856j357l43J831j142j12J686k288
$$ -2728 87 -1139 -1892 781 -2711 -498 43 -1632 224 -1133 -1476 355 -787 -899 787 -1501
1567a501J128J573k779K864j406r82L159l219J963Pj820K561j298m05J164q37
$$ -1501 -373 1200 -1579 1285 -121 -1103 2056 -1163 800 807 -1013 1548 250 -155 1009 172
1583A72r5J672j928K10J178k186K738r46j435K187k423J722M45k495J763o41J94
$$ 172 77 1749 -179 31 1209 -977 1761 815 -620 1567 -856 866 1311 -1184 579 -62 132
1600A32R56j436J31Q32r31N30N59k498K333l61p28J691l043J509J137k060J949
$$ 132 1088 -348 -217 615 -316 214 773 -1725 608 247 -481 1210 -1833 -324 813 -1247 702
1617G02j406j25J555o81j94J63q14O04J150k273J743o87r28K978k380J84R10j732
$$ 702 -704 -829 726 45 -149 14 -800 -196 954 -1319 424 -263 -1191 1787 -593 -409 501 -1231
1635a231K699j307q56P30k36P50J47j044p07J420m80J101j256r75K089j271J309
$$ -1231 1468 161 -695 35 -201 549 696 -348 -1055 365 -115 986 -270 -1245 844 -427 882
1652H82p07k216K595n89j3N87j944M96J831j171m52N03r76J418M43j854J208j281
$$ 882 175 -2041 554 -35 -48 539 -1405 -909 922 -249 -701 -198 -1174 244 687 -1167 41 -1240
1670a240J200R07j820L97o73J070R76j140n33l6M75P19j25j222M49N41l51J126
$$ -1240 -40 867 -953 -556 -1229 -159 817 -323 -856 -892 -417 302 177 -1045 -596 -55 -406 720
1688G20j911J26J456p82J451j699o21J575k01J67n97o82P63J010n54n73j22m27
$$ 720 -1191 -1065 391 -391 1060 -639 -1260 315 114 281 -316 -998 -235 775 221 -352 -474 -901
1706i01K096q97n81K00o61J583m77p13q9j49J042K4p34l80N7P60N17o38j017O03
$$ -901 1195 298 -283 -83 -744 839 362 -351 -440 -589 453 477 -257 -637 -580 180 697 59 -958 -355
1726c55K52N37K99j995J164K50p3M96j567L16Q12M63m83o59j07L93J001n77m98
$$ -355 -103 434 733 -1262 -98 152 79 575 -992 -676 136 599 116 -543 -650 -257 744 167 -331
1745c31m30L06J491j352J79n20K13J524j229j18k87L08P74j49k86p62P82M6L91
$$ -331 -761 -455 1036 -316 -137 -657 -444 1080 -149 -267 -554 -246 528 379 93 -669 113 159 550
1764E50p00q12J173L23K38q84l41P16K6L97l51j058Q83K17N08n26l13k23O35K69
$$ 550 -150 -962 211 534 772 -112 -453 263 289 686 335 -723 160 377 885 359 46 -177 458 727
1784G27m34K08m96P85k0n57L58n94Q52j39l8k58m75O32J87J08o66M5M90q5L60
$$ 727 293 501 5 790 770 213 571 -23 829 690 652 394 -81 551 738 846 180 225 715 630 990
1805I90q32n3K04m14J061j233M25l07L08M52q07k1j6K75K07l49j36k96O81n18
$$ 990 158 105 309 -105 956 -277 148 -159 149 601 -206 -227 -243 32 239 -110 -246 -542 139 -379
1825c79Po3k55P08o99K85k83k43N55r7R0m01m6M77j76J89m05J46m4K95K89n63
$$ -379 -372 -435 -690 18 -681 -396 -679 -922 -367 -464 -374 -775 -821 -344 -520 -331 -736 -590 -634 -339 -50 -613
1847f13O38m94L12J14o81P56j55L20j14j17K82m68Q13n83L25j75n8L81l56P62
$$ -613 25 -469 -157 -43 -724 32 -123 197 83 -34 248 -220 593 10 335 160 102 483 127 889
1867H89q87M85O4m75O38n74L05K71o18L59k98k3K99l0l41j99J37n6M33o56J85
$$ 889 2 487 551 76 714 140 445 716 98 457 159 136 435 405 64 -135 2 -54 379 -277 -92
1888i2K6m35Q58o24J81n1m57O87q7k53j85K27Ok67L81r7K45o45J07J74m10P62
$$ -92 -66 -501 357 -267 -86 -137 -594 93 6 -247 -432 -205 -199 -466 -85 -182 63 -582 -475 -301 -711 51
1910E1j79k21L6l77P84m29J32J36l82K84n5L33j67L67o47J48M56n18N97l46o1
$$ 51 -128 -349 -313 -690 94 -335 -203 -67 -449 -165 -220 113 -54 313 -334 -186 270 -248 349 3 -58
1931e8N74o74N21P3q81O38j41m5J77j00R6M24n52L71j57j29J86Rj84J34n88M00
$$ -58 516 -158 363 436 -445 193 52 7 184 84 180 604 52 423 266 137 323 332 148 282 -306 94
1953I4P2j85M09q53K67L48j09l1J70m85N54J07q65Q11l16j75P56p16N96l99j05
$$ 94 166 -19 390 -463 -196 152 43 12 182 -303 251 358 -507 304 -12 -187 569 -147 449 50 -55
1974e5M37m04l7J73j05l51O24m01N5M89n20M80k94k15N74p46O58j66j08L25n90
$$ -55 382 -22 -59 114 9 -342 282 -119 -64 425 -95 385 91 -124 450 -296 362 196 88 413 -177
1995a77K62J63j40L49p1l13L37J1p81O73K0m15P13q77M75J59n05P14n87L78k72
$$ -177 85 248 108 457 386 73 410 421 -360 313 333 -82 631 -246 229 388 -117 597 10 388 116
2016A16Oo6qk55M94m2m28M32k59k78M70o67P53j89l21P75p96K72L48k31O1j17
$$ 116 122 56 48 -207 287 245 -183 249 -10 -288 182 -485 268 79 -242 533 -263 9 357 126 187 70
2038G0j79J68R1k01K53j7m2N05p01K36q9l88P72l16j21M10o13N07k07mq7O7J15
$$ 70 -109 59 150 -51 202 185 143 648 -53 183 94 -294 478 162 41 451 -162 345 138 134 47 114 229
2061B29L48m96p0L24p50Q64j33k99N41n46p7L32l19M91m08Q9j74K9O5Q4No02N40
$$ 229 577 81 11 335 -415 449 316 17 558 12 -65 267 -52 439 31 120 -54 -25 40 124 129 -473 67
2084F7k39J1J26m72J112j135L44J26j47J49j28P9j96K90k08L18m30K94K51o23
$$ 67 -172 -161 -35 -507 605 -530 -186 -60 -207 -58 -186 -107 -303 -13 -221 97 -333 -39 212 -411
2104d11K94O9n89J043o38J48P1l94K95Q3j39N4N3m20K57k5k83Q15o88M54m6k71
$$ -411 -117 -48 -637 406 -232 -84 -13 -407 -112 -29 -168 -114 -61 -481 -224 -249 -532 283 -405 49 3 -268
2126b68O78n53k02K86l67L39M3j81k1J23N5j03k5K6J80k36K05n0k09L41J5j01
$$ -268 410 -143 -345 -59 -426 -87 -44 -225 -246 -123 -68 -171 -196 -170 10 -226 -21 -71 -280 61 76 -25
2148b5k10k59M62m36P7K89p3k15N78m37O0M27o49M69M7k25J45k08J25N21m80K61
$$ -25 -235 -494 -32 -468 -391 -102 -175 -390 188 -249 -189 238 -411 58 105 -120 25 -183 -58 463 -17 244
2170B44m21n5K67p6J78j81J52O2L28k32l31p0j24P09m18k20N7l9N57n47L5L9J39
$$ 244 -177 -232 35 -41 137 -44 108 170 498 266 -65 -135 -259 450 32 -188 -131 -170 387 -160 -125 -86 53
2193E3J35O6l04p9K93Q7k18J64j76M29j70j23J37n67J79M08j37l31N0K83k52L05
$$ 53 188 254 -50 -129 164 251 33 197 21 450 280 157 294 -273 -94 314 177 -154 -104 179 -73 232
2215B32k60J7J30m8Pj41R7k1P6K31l65o3j92M86M3l05j3M9M72m52K26j76j13M32
$$ 232 -28 -11 119 71 78 -63 34 13 89 320 -45 -108 -300 186 229 -76 -89 -40 432 -20 206 30 -83 349
2239C49n1R8m58j86K85r0R8j26j95L70J06k73n3J81k18K03j57J15L5m6L56k30
$$ 349 298 396 -62 -248 37 -53 45 -81 -276 94 200 -73 -126 55 -163 40 -117 -2 33 -13 343 113
2261A13k8k10j96L81o3r2L19m26L79j40P7j58o2l2M8k38O4Q3Q8J3M7l27M75j9
$$ 113 85 -125 -321 60 -3 -95 224 -202 177 37 114 -44 -106 -138 -90 -328 -264 -181 -93 -80 -33 -360 115 96
2285I6j82K66o50M95r5J97j22k01L20l02L23k28rK3j87N70l90P2j69j00O95m18
$$ 96 -86 180 -470 25 -70 127 5 -196 124 -178 145 -83 -92 -69 -256 314 -76 -4 -173 -273 422 4
2307Dk19q1K07M8J6j15P7M0J76k47l66L05J83k8J02j84j69K15J94j36J46m86J93
$$ 4 -215 -296 -89 -41 -25 -140 -63 -23 153 -94 -460 -155 28 0 102 -82 -251 -36 158 22 168 -318 -125
2330a25Q7K91l26j15P0K3J18k05L26l86J22O9j13K9R7O1j8k56L04l31M03J25k21
$$ -125 -38 253 -73 -188 -118 -95 23 -182 144 -242 -120 -51 -164 -135 -38 23 5 -251 53 -278 125 250 29
2353B9j48K22J06l58N04k80q8O5j56J59l17K34q9J4J37k83J49J68j41k29Q2J20
$$ 29 -119 103 209 -149 355 75 -13 52 -104 55 -262 -28 -117 -103 34 -249 -100 68 -73 -302 -220 -100
2375a00R2Q4k12J41Qj01QR4l5Qk6P2l55P0J0K50M6j25k56J21oK66kq2P9K23k61
$$ -100 -8 76 -136 5 13 -88 -80 14 -21 -13 -39 33 -322 -252 -242 8 54 -71 -327 -206 -212 54 52 -30 49 272 11
2402A1j06m2L9J47K7pk52L0M66l31n7K48q0J45j87L4q6J91m7j46K2N7K45j44j75
$$ 11 -95 -137 -98 49 76 69 -183 -153 313 -18 -75 173 93 238 51 85 -1 190 143 -3 19 76 321 177 2
2427BK04k14J14r4m4Q0P0J79j1J2k42q2K9K1K50k62j6k33M05k7l16J91P5j75J22
$$ 2 206 -8 106 12 -32 48 118 297 286 298 56 -26 3 24 274 12 -4 -237 168 141 -175 16 91 -84 38
2452C8j00l8Q5j17j00J25P5J7p5N8J97j88j38K81l10N11l68nL28k85p7j7J87R7
$$ 38 -62 -100 -15 -132 -232 -107 -32 -15 -90 -32 165 -23 -161 120 -190 321 -47 -52 276 -9 -86 -103 84 181
2476A81J15k43J24J35k74Q3J12j21j89J92kk02J56J35k99K11j74j01J65Q6k83
$$ 181 296 53 177 312 38 121 233 112 -77 115 113 -89 67 202 -97 114 -60 -161 4 90 -193
2497a93L76l91J10K88j90k14L68j23J40l44K05M0k4j06J3m8J9M36k74ok17K18
$$ -193 183 -208 -98 190 0 -214 154 31 171 -173 32 72 48 -58 -45 -93 -74 362 88 82 -135 83
2519H3m2l35J13N4j53K52M1m1K85r4j31%k6l20L54l32O3L48j32K49l06n6J00O4
$$ 83 41 -294 -181 -127 -280 -28 13 -28 257 163 32 32 6 -314 40 -292 -229 119 -13 236 -70 -126 -26 38
2543C8K21m01J13J09k77L32m9j2j00o6J26l2J19j61R7k80K78L78n63J08P7j61
$$ 38 259 -142 -29 80 -197 135 86 74 -26 -92 34 2 121 -40 57 -223 55 433 -130 -22 55 -106
2565a06L5J24P6N5j94L4o5J08K47k87n0J16j87J99L04n13K75r2o2J35k24K6L51
$$ -106 -71 53 129 184 -10 24 -41 67 314 27 -23 93 -94 105 409 -104 171 79 17 152 -72 -46 305
2588C05m47L77l86L52k38J86j72K32j94R6L24m99J70K26l66J40N3m54L21j21K96
$$ 305 -142 235 -151 201 -37 149 -23 209 15 111 435 -64 106 332 -34 106 159 -295 26 -95 201
2609B01k02K40k52J24m06K86LJ50j21K3jk1l12L55j85K22O6n26N89k37q8J83q2
$$ 201 -1 239 -13 111 -295 -9 -6 144 23 46 45 24 -288 67 -118 104 170 -356 233 -4 -92 91 9
2632IP7j33J1l7K91n76K97M29n10N3K69j98j52K87P4l35J74m1J63n6r1l02M11
$$ 9 86 -47 -36 -73 218 -358 -61 368 -142 -89 180 -18 -170 117 191 -144 30 -11 152 96 5 -297 114
2655A14j05j38k6oL16L8k00K89m26J78Q7k13K28j60r6j05k3M14k52K18q0Jp2j14
$$ 114 9 -129 -155 -161 155 193 -7 282 -144 34 121 -92 136 -24 -120 -225 -248 166 -86 132 52 53 -19 -133
2679a33r4Q8J52l02K93J29k10K5l86R4J25J97J73j72J3j16q7L32j01M5j31J08
$$ -133 -227 -139 13 -289 4 133 -77 -52 -438 -344 -219 -22 151 -21 -8 -124 -211 121 20 65 -66 42
2701D2o4J00K51o09K00lK06j26J04j03K49j80J84j61j11J60j70p4J29R8k08M17
$$ 42 -22 78 329 -280 -80 -83 123 -3 101 -2 247 67 251 90 -21 139 -31 -105 24 122 -86 331
2723C31m08j64J20L50j72O3j29J43N1J71l12MQ1L5j92J66j40J8J84k55k30L58
$$ 331 -77 -241 -121 229 57 120 -9 134 185 356 44 48 129 164 -28 138 -2 16 200 -55 -285 73
2745G3N9j43k10O0j17J2M47k79K03k40nJ47Q7K85o04L03j74J4K28r7j91L16j72
$$ 73 132 -11 -221 -161 -278 -266 181 -98 105 -135 -140 7 94 379 -225 78 -96 -82 146 49 -142 174 2
2768Bj79M2J16J77l80J46J20rk02L7K58l62L1K39J37m89L25p5L26l55K52l86P0
$$ 2 -177 -135 -19 158 -222 -76 44 35 -167 -130 128 -234 -203 36 173 -316 9 -66 260 -95 157 -229 -159
2791a59J86J3J55m17J49Q7J39Lk03J72j93N4j01kJ31p7K07j83l22L74n9j4K87
$$ -159 27 40 195 -222 -73 14 153 156 -47 125 -68 -14 -115 -117 14 -63 144 -39 -361 13 -46 -60 227
2814B27n68N00k80K68l59j5J74N3n6j03Q1M1j46r8K04K25j89M7m5mQ2RJ5k81J3
$$ 227 -341 159 -121 147 -212 -227 -53 0 -56 -159 -78 -37 -183 -281 -77 148 -41 6 -39 -43 39 48 63 -218 -205
2839b05L00l07M71j99M4r2OJ43K9k02%k04K24J49m9l25M88r6j37J21Mj0l30O3
$$ -205 95 -212 259 60 104 12 18 161 190 -12 -12 -216 8 157 108 -217 271 175 38 159 163 153 -177 -114
2863a14L08k53J57%P5j3k06Q1k35L31k56J73kK2n5J80k10jj76K21m9l0o2k27J32
$$ -114 194 -59 98 98 173 160 -46 35 -200 131 -125 48 46 68 13 193 -17 -18 -194 27 -22 -52 -114 -341 -209
2888b09K17k32J88J88n13M29j07J13l14j22M09L1k90J43k7J41K69m00q0L88k12
$$ -209 8 -224 -36 152 -361 68 -39 74 -240 -362 47 78 -212 -69 -96 45 314 -86 -166 222 10
2909A0M9n5J49r7Q1k09j1K16k48J15R7j03J88j83o0K28j50L9J37J93q4k51k61
$$ 10 59 4 153 56 137 -72 -83 133 -115 0 97 -6 182 -1 -61 167 17 56 193 386 302 51 -210
2932b10J93j96N26n48j3M15lM3n58K47j08M2J76K9j41mM7k01J29J39k2m4P6j59
$$ -210 -17 -213 313 -235 -248 167 164 207 -351 -104 -212 -170 6 35 -106 -110 -63 -264 -135 4 -18 -62 14 -145
2956a45J52j06M6K06q7K44o24M59jR0j33l99K55m4J50k25K27j87K53J55q0j09
$$ -145 7 -99 -53 153 66 310 -314 145 144 234 101 -298 -43 -87 63 -162 65 -122 131 286 206 97
2978I7J18l78M73l37L66m12N3Q0J36k40N4R6j45J21k8j17K31j37M1p6j01l7J0
$$ 97 215 -163 310 -27 339 -73 -20 60 196 -44 10 106 -39 82 54 -63 168 31 72 -4 -105 -142 -132
3001a32K12J15k2k5j13k46K14j37L00K08k40k3J39k27k4N0l5J47j12n1nj7k3J44
$$ -132 80 195 173 148 35 -211 3 -134 166 374 134 111 250 23 -1 49 14 161 49 -2 -7 -24 -47 97
3025I7j57m4PK75l4K9j77j91K8K19j31k66M37K1j48K4Q1l2k0k17K45Q7j67K1N26
$$ 97 -60 -104 -97 178 144 173 -4 -195 -167 52 -79 -345 92 113 -35 -11 70 38 18 -199 46 133 -34 -13 513
3050E13n56J48k57K9LL57k39O%l48M81J27l03J35j37R3k01M4J61P0l4N0k16L21
$$ 513 -43 105 -152 -123 -120 237 -2 4 4 -344 137 264 -39 96 -41 52 -149 -105 56 126 92 142 -74 247
3074B47j40j00Q0J28k61l9J95J8k04j15K73k60J16N7p5K19L6l68R9N8l0n7K52
$$ 247 107 7 87 215 -46 -85 110 128 -76 -191 82 -178 -62 -5 -80 139 175 -193 -94 -36 -66 -123 129
3097A29j64J36j40R8j99j63K41R8o1J31Lj48j25r2K91k43J64r7J12j1L0K3oj99
$$ 129 -35 101 -39 59 -140 -303 -62 36 -25 106 109 -39 -164 -256 35 -208 -44 -141 -29 -40 -10 13 7 -192
3121a92K77j26J34j03k44L83j26J42M9k83J77J77o9o11L14j5Q4j38K2M57n69J71
$$ -192 85 -41 93 -10 -254 129 3 145 194 -89 88 265 196 -415 -101 -116 -32 -170 -148 309 -260 -89
3143h9J09K3r3J28j10J27l76J24K30k23J15K48j85j20K27J40j51n7j45J32L2m30
$$ -89 20 43 -50 78 -32 95 -281 -157 73 -150 -35 213 28 -92 135 275 124 67 -78 54 86 -344
3165c44J05J37K62n4j66J18K2j5J35m21K20J66j17j63J28k09mN09p7l42Q4K0J16
$$ -344 -239 -102 160 106 -60 58 80 65 200 -221 -1 165 48 -115 13 -196 -200 309 232 -110 -26 -6 110
3188A10p1N2k5m1M29o05M63r7m3j92j6Q8l4j50j58K37O4N4j81J79j72k2J52r9
$$ 110 39 91 66 25 454 -151 312 215 172 -20 -36 52 18 -132 -290 -53 11 65 -116 63 -109 -131 21 -78
3212g8N0Kj42L18J30q4k50M2M1j31K36j81J40j06K2R5j98m9L43j06q5RO1O7Q6
$$ -78 -28 -26 -168 150 280 196 -54 -12 29 -102 134 -47 93 -13 9 104 -94 -143 200 94 9 18 79 146 232
3237B32j96J37n1j32k3j70K13K9KJ50j72M5l8j37J88o0J96n22J47J10%j48NK22
$$ 232 36 173 122 -10 -33 -203 10 39 41 191 19 64 26 -111 77 17 213 -309 -162 -52 -52 -200 -195 27
3261B7j9k50j8J41j32M45p4j24j0j31k47J34K27P8j37J35m5r8J02j19J54j14J61
$$ 27 8 -242 -260 -119 -251 194 120 -4 -14 -145 -392 -258 -31 47 -90 45 0 -98 4 -115 39 -75 86
3284H6N9j14l15L30l21L34J31j20q2n0L00k74K83k08J62k24J25j97J74j2r4J25
$$ 86 145 31 -284 46 -275 59 190 70 -12 -62 238 -36 247 39 201 -23 102 -95 79 67 -27 98
3306I8o3k49J43N1j37L18l51L29j85J17q6J85n1j17k3O0j45K67j54l59Q2K54m6
$$ 98 35 -214 -71 -20 -157 161 -190 139 -46 71 -15 170 119 2 -21 39 -106 161 7 -352 -270 -16 -62
3329f2L8J47l46NM8J14P2R2m6M5M6J67m03K32L9j92kK1N4j9j02j28K0M13n36j1
$$ -62 -24 123 -223 -218 -170 -56 16 108 62 107 153 320 -83 149 188 -4 -6 15 69 50 -52 -180 -160 253 -283 -294
3355b94L61m12L16k50M70R6j91j59j06R9j04K25j44QK31j42j14L30k22j82j9N01
$$ -294 67 -345 -29 -279 191 287 96 -63 -169 -70 -174 51 -93 -85 146 4 -110 220 -2 -184 -203 298
3377B98j34k31k8J81j07MK75m50K95m7Pr0r0L89j60J74n87N30n52N45m3j17j97
$$ 298 164 -67 -95 86 -21 -17 258 -192 103 56 63 -27 -117 272 112 286 -301 229 -323 222 179 62 -135
3400a35K22m36L77LJ51p4j71j0J76j5j36Q5o3j15M2R9j73L84k93q0j59M04k08
$$ -135 87 -349 28 31 182 108 -63 -73 103 88 -48 37 -26 -141 -99 0 -173 211 -82 -162 -321 83 -125
3423a25O6O4J16K33j96k37j23K83R4k57K8r8Q0J42J1k15K25j16k17K32L55m55
$$ -125 -59 5 121 354 158 -79 -202 81 175 -82 -54 -152 -72 70 81 -134 91 -25 -242 -10 345 -110
3445a10m3K55j33L4m0K65k15M4r1L1r0p0K6M26l18n4J34j68K88l63j35K23P9l
$$ -110 -153 102 -31 3 -37 228 13 57 -34 -3 -93 -163 -137 289 -29 -83 51 -117 171 -192 -327 -104 -25 -28
3469b8L63n67O56o21K69L06n24NK11j04K5L1q9O9K9j05j34K90m1n3k05L33j5q5
$$ -28 335 -232 424 -197 72 378 -146 -141 70 -34 -9 22 -67 2 31 -74 -208 82 41 -12 -217 116 101 16
3493A6K0p1O8m2J54k54M18k13l2j56K98j47j01Q6k19P3j22J57L05k11M1j22Q2
$$ 16 36 -35 33 -9 145 -109 309 96 64 -92 206 59 -42 44 -175 -102 -224 -67 238 27 68 -54 28
3516B8j10J48j67j17L34j70M3J11q0N6q5rO2R6m08L62q1j1J01k34K35r2Rk9m3
$$ 28 -82 66 -101 -218 116 -54 -11 100 20 76 -9 -18 44 140 -268 94 13 2 103 -131 104 12 21 -8 -51
3541e1L6k09J00R0L52r6l38Q0J07P6k08N4k22P3M85l08m5k6Q5J42k48m9o4j9K34
$$ -51 -15 -224 -124 -34 318 222 -116 -36 71 147 -61 -7 -229 -156 329 21 -24 -50 35 177 -71 -120 -184 -203 31
3566C1j99L2K9L0l5K11j21J53Q1q8j03j7l08L06j77K56J52l34J04J43j03r0J32
$$ 31 -168 -136 -107 -77 -112 99 -22 131 212 124 21 4 -304 2 -175 81 233 -101 3 146 43 -47 85
3589H5m4k11L07j63R7p9m1m4N4L61l33J80J3o9j42L5Nj98M87l99J48o6m1K09J14
$$ 85 41 -170 137 -26 71 -8 -49 -93 -39 322 -11 169 182 113 -29 6 11 -187 300 -99 49 -17 -58 151 265
3614B65l53L9O6J01j76k52L83pl32J75N8l3J73k74M7J35q9K15k00j67L07jj4K19
$$ 265 -88 -49 17 118 -58 -310 73 66 -266 -91 -33 -66 107 -167 -120 15 -74 141 -59 -226 81 80 66 285
3638B85k68P5k41K37J6j16k6k4N5l1k58N43l69J54M9q6r7J19J65l15L70j55J18
$$ 285 17 92 -149 88 104 -12 -38 -62 -7 -38 -296 247 -122 32 81 -5 -102 17 182 -133 237 82 200
3661B00j45q1o2R9O1lm52L18M07l20l2J09J27k08k8J08K11j90m4j33qm5o8L44
$$ 200 55 -26 -88 11 72 69 -383 -65 342 22 -10 99 226 18 -10 98 309 119 75 -58 -66 -111 -179 165
3685A65L8m06K2j16M23k29J49K08k82J42j49j12J71P2K19l18j78L0N1O1M13j62
$$ 165 203 -203 -181 -297 126 -103 46 254 -28 114 -35 -147 24 96 315 -3 -181 -151 -100 -39 374 212
3707B12j56j06j75K85p3J43m36M76j91l1q1q3K50m5k01L03j58O3K05j91M6p5K64
$$ 212 56 -50 -225 60 -13 130 -306 170 -21 -52 -133 -216 34 -11 -212 91 -67 -4 201 10 56 -19 245
3730B45k91P5K03r4k4k32L08l19n2J31K39k37J81j83j29J81J68N1N3k52P0j12
$$ 245 -46 29 232 138 114 -118 190 -129 -181 -50 189 -48 133 -50 -179 2 170 221 274 22 92 -20
3752b0K27k62J87j1l18N65m32J35L4j62J35r5J43q2j75L05J91m74J42p8Q4q9K85
$$ -20 207 -55 132 121 -197 368 -64 71 105 -57 78 -17 126 44 -131 174 365 -109 33 -45 39 -50 235
3775B35M8l12j36K58K6J1l39K25K50l29L48l1k00k80L80k79O0L29l25K39j23j48
$$ 235 283 -29 -165 93 119 130 -209 16 266 -63 285 254 54 -226 154 -125 -65 264 -61 178 55 -93
3797i3N0j38J61J73j83M0l9j10J17K4k2j64Q9J46j50p8m8K01j51J87kM0rl7J30
$$ -93 -43 -181 -20 153 -30 10 -29 -139 -22 2 -20 -184 -95 51 -99 -177 -225 -24 -175 12 10 50 41 4 134
3822A34r1l6J85o4k05K42J7l44J20l6O5K05k21J55j53J61J18j52k02j24M06k64
$$ 134 43 7 192 128 -77 165 182 -162 -42 -78 -13 192 -29 126 -27 134 252 100 -102 -226 180 -84
3844h4L85l98J19L11m27k0k3K2P8k97J53J79O5j19J21kN8o7l30L67j10J0J09j06
$$ -84 301 -97 22 333 -94 -114 -137 -115 -37 -334 -181 -2 63 -56 65 63 121 54 -276 91 -19 -9 100 -6
3868fj51K33r5p3J07m24J91J86rj7J96k83OJ28j96N74j59k6j57O0Pm4m1M3K0j53
$$ -6 -157 76 -19 -92 15 -409 -218 -32 -41 -58 138 -145 -139 -11 -207 367 208 182 25 85 92 48 7 50 70 -83
3894h3J19k10M47p4m24L94j31k25J73j99O1K90k99J42j48K49l74k9K12J34k14
$$ -83 36 -174 273 199 -225 169 38 -187 -14 -213 -152 138 -161 -19 -167 82 -292 -321 -109 25 -189
3915a89O4R0L66k30k82J16J32O8q2k96M12j50L6l01l1K12J21j06J83j68j75N8
$$ -189 -125 -35 331 101 -181 -65 67 135 53 -243 169 19 55 -246 -277 -65 56 -50 133 -35 -210 -152
3937a52J24q6m0K68k13J38q4o0j69K25MK34J01m94J58j78K17J10l82K84j8K73
$$ -152 -28 -114 -154 114 -99 39 -45 -105 -274 -49 -45 189 290 -204 -46 -224 -7 103 -279 5 -13 260
3959B60k94K42j61Op3%q9J35k71K60K5k16M32k89l52M33n7j32N3L70J45m3m79
$$ 260 -34 208 47 53 -20 -20 -109 26 -245 15 40 -176 256 -33 -385 48 -9 -141 -88 282 427 384 -95
3982i5n6K03M6l76K20M7J32m9l47OJ33L06j26j31J68pM7k47k13K1N23l20r8J11
$$ -95 -151 52 98 -278 -58 -11 121 72 -275 -269 -136 170 44 -87 81 74 121 -126 -339 -318 205 -115 -213 -102
4006a02j19K35l9l7p2K31o5J45n6o8j19j83L83l44Pj00K2K02K36Ql31K52M6k55
$$ -102 -221 14 -25 -62 -134 97 32 177 121 53 -66 -249 134 -210 -203 -303 -281 -79 157 165 -166 86 132 -123
4030a23Q2k93M60k45J84j82J86m8NkK48m48J95M2NJ76j95J09m03L43n5n2J0M3
$$ -123 -41 -334 126 -119 65 -117 69 21 26 24 272 -176 19 61 66 242 47 156 -247 96 41 -11 -1 42
4054D2r5O5o0J17n4L9l47L13J05j98J59o6J98jm74K46L15l33m8J56l68J70q5N02
$$ 42 -53 12 -48 69 15 54 -293 20 125 -73 86 20 218 217 -257 -11 304 -29 -77 79 -289 -119 -204 298
4078B98l43j69K78j9k20J22M3J94p2p2n6l9K15j04k8M8k98K56j23L3J12o9K12
$$ 298 -45 -214 64 45 -175 -53 -10 184 112 40 -16 -55 160 56 28 76 -222 34 -89 -56 56 -13 199
4101A99l39l5Q3J96j62L1q4M0l2J17j42L52k53K02k10J3R0n8j38L98l97Q7M4j88
$$ 199 -140 -175 -92 104 -58 -27 -111 -71 -103 14 -128 224 -29 173 -37 -24 66 8 -130 268 -129 -42 2 -186
4125a86J43j02O1J35q0L8K01m6J9j5J8j65%J67M4j96q4n1K7j25J41J82j14j76
$$ -186 -43 -145 -84 51 -29 9 210 164 183 168 186 21 21 188 232 36 -48 -99 -72 -197 -56 126 12 -164
4149a64J72Qj29J51l8R7K03l79J68j28J43j27J6M4J60j56k09K91J12l57J29L9
$$ -164 8 16 -113 38 0 97 300 -79 89 -39 104 -23 -7 37 197 41 -168 123 235 -122 7 46
4171D6m2j1K02o2j7Rj66J90Q3nk15n3J22p4o5J60k82K8K94r3P3j48O7Jo0k5J52
$$ 46 4 -7 195 133 116 125 -41 149 232 227 12 -41 81 7 -58 102 -180 -152 142 49 122 -26 41 42 -18 -43 109
4198A09O5j02M0j19K15l10J22O4k85L9K13j27R9J64r9j95k81M84k2j08K9J77j38
$$ 109 174 72 112 -7 208 -102 20 84 -201 -162 51 -76 23 187 88 -107 -388 96 74 -34 -5 172 34
4221C4m7J67k67M0O1L45l72M0K03k73K46k72J50k53R3J58k49K58l29J99j19J22
$$ 34 -13 154 -113 -73 -12 333 -39 1 204 -69 177 -95 55 -198 -105 53 -196 62 -267 -68 -187 -65
4243f5j9j91J73R5n4K4K20q3j1k0j4lj0n20O29j25q0J00Q1j15N7j96L84l31j73
$$ -65 -84 -275 -102 -7 -61 -37 183 100 89 69 55 52 42 -478 151 26 -54 46 127 12 69 -127 257 -74 -247
4268b47M02j65J1l5Pj6J07J1N6n6K65n52L72P1k72k6J29n9M8J9L8k63K15m90N81
$$ -247 155 -10 1 -34 -27 -43 64 75 131 75 340 -212 160 231 -41 -67 62 3 51 70 108 -155 60 -430 151
4293A51j22k84K63J6k28r1L05O7r1L8jl96L31J18M1J61j61k08j8J36O8k1p7o7
$$ 151 29 -255 8 24 -204 -295 10 77 -14 24 23 -373 -42 76 117 278 117 -91 -109 27 95 74 -3 -70
4317g0K99m1k28J33n0j65j07J75J28j90J93l4j63L27k59j85K48k5n8L85j71j94
$$ -70 229 188 -40 93 43 -122 -229 -54 74 -116 77 43 -120 207 -52 -237 11 -14 -72 313 142 -52
4339e2r6K24j67K44j29j03P4J99j08P3l08L89j70J05j49o9J27r0K6P0%J60k16
$$ -52 -148 76 -91 153 24 -79 -5 194 86 159 -149 240 70 175 26 -43 84 -6 20 90 90 250 34
4362C4q1J58k10K4J68j38J13ojj00n8P8J43j29o4K48k42J15j98M7L57j72j99k89
$$ 34 -47 111 -99 -75 93 -45 68 62 61 -39 -97 -19 124 -5 -69 179 -63 52 -146 -99 258 86 -113 -402
4386d02M69l5p7J14j51l8K89q0k47K62r4l6L63m20J38J53o06N18M9l43m8K25j14
$$ -402 67 32 -45 69 -82 -120 169 89 -158 104 10 -26 337 -83 55 208 -398 120 169 -174 -222 3 -111
4409a11P4r6L78j29l48K55j55j25M31k68Q2J62l22j58J97Q8Q0r1l18M07n5J63
$$ -111 -37 -133 245 116 -232 23 -132 -257 174 -94 -12 150 -172 -330 -133 -45 35 -56 -374 33 -22 141
4431A41j90J18O5n6k75r3J03J78pj53K2N0J30L8L5M7p9J25j96M73m70J49l71L17
$$ 141 -49 69 134 78 -197 -290 -187 -9 -16 -169 -147 -97 33 71 106 153 74 199 3 476 6 155 -216 101
4455A01k18J22j25J37j2po2M4k7q8J98j73J77m45L97r6Lj55M98j75Nm3Kr9L5J72
$$ 101 -117 5 -120 17 5 -2 -64 -20 -47 -135 63 -110 67 -378 19 -77 -74 -229 269 94 99 56 58 -41 -6 166
4481A66k80J46j50J56j70n1K01k21J67J27J41j20j69q9J76J62j16R4l5nj97R5
$$ 166 -114 32 -118 38 -132 -183 18 -203 -36 91 232 112 -57 -146 30 192 76 170 135 130 -67 28
4503B8K1k77L94p7o8l8k14K7O5L06j50k7rQ7q4K3JK73j34k10m8L18j29j86R0N1
$$ 28 49 -228 166 89 21 -17 -231 -204 -139 167 17 -10 -19 68 -16 7 8 281 147 -63 -111 207 78 -108 -18 33
4529C3mJ33M1j89O7n3j49N7J57j76L90m10pJ99P0l34K20%k44K00q7K39k62J04
$$ 33 29 162 203 14 81 28 -121 -64 93 -83 307 -103 -110 89 159 -175 45 45 -199 1 -86 153 -109 -5
4553en0K20j91m0L23k94M3L5K7J55l28L2m4p3K56o4K98l07O8k1J1k12J74o0K43
$$ -5 -55 165 -26 -66 257 -37 6 41 68 223 -105 -73 -117 -190 66 2 300 -7 61 40 51 -161 13 -47 196
4578A96M0k26j39K63j27O2N3j10q2k53K98J06k73K33O7j83J28J00j42j53J2K11
$$ 196 236 10 -129 134 7 69 122 12 -70 -323 -25 81 -192 41 108 -75 53 153 11 -142 -130 81
4600H1j49J00m07L43o7J16J69k65L49k61J52r4m1J45j88j03L0L1J26k82M43k97
$$ 81 -68 32 -375 -32 -99 17 186 -79 270 9 161 67 26 171 -17 -120 -90 -59 67 -215 228 -69
4622f9K6n7rK39n1J0Q3k47j73K30J14j99N0q6L19k38K57k15m5J51P0l1j37M05
$$ -69 -43 -100 -109 130 79 89 172 -75 -248 -18 96 -103 -53 -139 180 -58 199 -16 -61 90 160 129 -8 397
4646C97m74J14J13J12m76P4K86%k67QK03l2n3O2r2K2k9J17m6k83P7L52j52kj32
$$ 397 -77 37 150 262 -214 -140 146 146 -121 -113 90 58 5 67 -25 -3 -32 85 39 -244 -167 185 33 31 -101
4671a01Q6J4Q7L6n5j16j4J42qq5M6l46J06O7J20LM60m26J65k10j61J06K40j5j5
$$ -101 -15 -1 86 122 67 -49 -63 79 71 -14 32 -314 -208 -141 -21 -18 442 16 181 -29 -190 -84 156 141 126
4696A26L7j59M2K5l34L20j44K57k66j82M76j56p9l7J55J55r4P8j1k02l5j4J22
$$ 126 163 4 46 71 -263 57 -87 170 -96 -278 198 42 -37 -74 81 236 142 220 209 7 -28 -42 80
4719H0J0j04r8O4o0j03Q2K27j21j9K7P6J05k72L1J28j8j72M17m28J6K92M3n2j11
$$ 80 90 -14 -112 -48 -108 -211 -129 98 -23 -42 -15 61 166 -106 -75 53 35 -137 280 -148 -132 160 203 151 40
4744D0l7m4K44j81K20l57J44j31J46J34m4l23k03M08q4K2R5k28P9P9J21K54o97
$$ 40 3 -41 203 22 242 -115 29 -102 44 178 134 -189 -392 16 -68 -46 49 -179 -100 -21 100 354 -343
4767c43K77j20K65j58J81l07M52n0k56p3l0J01j68L64l15k3K66j59%K28m73L46
$$ -343 -66 -186 79 -79 102 -205 247 197 -59 -132 -162 -61 -229 135 -180 -203 63 -96 -96 132 -341 5
4789Ej34J18L14k34r8R5j26j26K98o1j62j63N85l81N0Q3K85m46L5L8Qm0J9P4J23
$$ 5 -129 -11 303 69 -29 66 -60 -186 112 51 -111 -274 311 -70 -20 63 348 -98 -63 -25 -17 -57 -38 36 159
4814A59l38J77K9J34J66l43k20J38K42j79K6J71N8k55Q3J7J76k70J57J5M8m5j26
$$ 159 -179 -2 27 161 327 -16 -236 -98 144 -35 -9 162 220 -35 48 65 241 -29 128 143 191 146 20
4837B0o2j86K55j18J66j93L26l00J11K34m66J68O0J19l42L38k08N4N3l5j57K24
$$ 20 -42 -228 27 -91 75 -118 208 -92 19 253 -213 -45 15 134 -208 130 -78 -24 29 -6 -163 61
4859F1J42j49k0R4j15j44J79j22j00K95j27j22l4J29L9K89l93O5j67L40j24nj63
$$ 61 203 54 34 128 13 -131 48 -74 -174 121 -6 -128 -162 -33 6 295 -98 -33 -200 140 16 11 -152
4882a52J75K61m01J73o5j25K89j64N4N1j43K66K1j57K92o02K82k01J90q6R6j29
$$ -152 23 284 -117 56 -9 -134 155 -9 45 96 -47 219 240 83 375 -227 55 -146 44 -42 54 -75
4904g5Q9JJ23J97j56l02j2J61n5K11k25J1J80m59L00p0J37L04k57O2j18N4j57
$$ -75 14 15 138 335 179 -123 -135 26 -29 182 -43 -32 148 -311 -11 -81 56 360 103 165 47 101 -56
4927e6J23j53L45j89j8OJ68n8j6o9n8P1l03K45l81J74K62r1o1o4J43p1L2Q2j18
$$ -56 67 -86 259 70 52 58 226 168 152 83 25 96 -207 38 -343 -169 93 2 -59 -123 20 -51 -19 63 -55
4952e5L17l88K56m7j04K05j15l19P3L45j18kO4pj26J38k66R3q3r3J75P3J55KP
$$ -55 262 -126 130 83 -21 184 69 -250 -177 168 50 48 112 105 -21 117 -149 -56 -139 -232 -57 16 171 173 180
4977A80n1j82N0p8J71j43M0K7n2j28K68o9J3l96Q5J84K8K15l50K47j98K01k1J03
$$ 180 129 -53 -3 -81 90 -53 -13 14 -38 -166 102 33 46 -350 -265 -81 -53 162 -188 59 -139 62 41 144
5001A44j40J0J62mK17n99J88Q1j94K52l07J02J98k53Pk69M37m3M0m32K37K94O3
$$ 144 4 14 176 172 389 -210 -22 59 -135 117 -190 -88 110 -143 -136 -405 32 -11 29 -403 -166 128 191
5024A91j43K70j49l84L09Q3l17R8J40m89L90l0J58PR5j80j53k9J70o9L88n40J63
$$ 191 48 318 169 -215 94 177 -140 -42 98 -391 -1 -31 127 134 229 49 -104 -133 37 -32 356 -184 -21
5047b1q2k01N23k67Q2j85LJ05J15j43L72k94P5k43O9L73m38K98j19J35m52L01
$$ -21 -103 -304 219 -48 34 -151 -148 -43 72 -71 301 7 82 -161 -92 281 -157 141 22 157 -295 6
5069FK97o35J73K61r3j45J82K55k87j10J79j18lr4Q8K9P7J21l54L77o3J23m36
$$ 6 303 -332 -159 102 9 -136 46 301 14 -96 83 -35 -38 -132 -44 -15 62 183 -171 206 143 266 -170
5092a70O6R5P8k34J57J7j76M05l14K32l48J30J14J31m4k92K74p6O8o6j46n1K00
$$ -170 -104 -9 69 -165 -8 9 -167 238 -76 156 -192 -62 52 183 139 -153 121 45 113 47 -99 -150 50
5115E0j46J69K05m17K51r6K23j10l05P5J95J3m13K84J57j22k04L04qj99N7J86
$$ 50 -96 73 278 -139 112 16 239 129 -176 -101 94 107 -306 -22 135 13 -191 113 105 -94 -37 149
5137A49k96O5J69N2j1J46q0p3j79j47K2K58j58j66L55j5j16j65J92p1j58J99J91
$$ 149 -147 -82 87 139 128 274 194 121 -58 -205 -183 75 -83 -249 106 91 -25 -190 2 -69 -227 -28 163
5160A63m2k16J03J84j89L9j28j28L54K8m9j10l3L41m42P1P1o2K26k88P2l2J18
$$ 163 121 -95 8 192 3 42 -86 -214 140 168 119 9 -24 317 -125 -54 17 -45 181 -107 -35 -67 51
5183E1j41Lj48L16k69K40Q3j46L0m9K87k32K3J05N9n01L25j71L88m44J47r6J84
$$ 51 -90 -87 -235 81 -188 52 135 -11 19 -30 257 25 48 153 212 -289 36 -135 253 -191 -44 -140 44
5206D4j56J17O5k4j93J86j33J42m8K9j3k22Q8K64j43k3Lj72L65J3j31k83N49m41
$$ 44 -112 5 70 46 -147 39 -94 48 0 29 16 -206 -118 146 3 -20 -17 -189 176 189 58 -225 324 -117
5230a17Q6J19j58J66j52k4K36k12K19j62k19oL51m6oL22k66k9l0j32k09J52N1
$$ -117 -31 88 -70 96 -56 -80 156 -56 163 1 -218 -224 127 81 75 397 131 102 72 -60 -269 -117 -66
5253f6L10l71J26r5j26J75J77P5n58L1K98j30J16j47L48l3j62Q7Q1l41K90j08
$$ -66 244 -127 -1 -96 -222 -47 130 205 -353 -322 -24 -154 -38 -185 163 130 -32 55 136 -205 85 -23
5275b3l9J34P1P1k94Q6N5k60K98k23N5K04j39L2q6j7jk20K05Q7J83j62K94l16
$$ -23 -62 72 143 214 -80 6 61 -199 99 -124 -69 135 -4 28 -58 -75 -76 -296 -91 -4 179 17 311 -5
5299eJ78j66J03O3k44K34m30J51k7K12J8j22K20j62J86j51J07M7k26K41k83J11
$$ -5 173 7 110 173 -71 163 -267 -116 -143 69 87 -35 185 23 209 58 165 212 -14 227 -56 55
5321E5k2p4j45pK90k31J70j38O0J70k18K3K60O9l14K10l17L65j29P7K85o46K92
$$ 55 33 -41 -186 -193 97 -134 36 -102 -42 128 -90 -67 193 262 -52 158 -159 206 77 154 439 -207 85
5344H5r7MJ16Lk63L24k94K94j72J80L0J8m61M34j87jm3j71M22m03K95m9K24m12
$$ 85 -12 -8 108 111 -152 172 -122 172 0 180 210 228 -233 201 14 13 -30 -201 221 -182 113 64 288 -124
5368a24J90j37M06k73l57P1K37l0L5j04J2l0L22J47l78J70k33J63Kl32J79j52
$$ -124 66 -71 335 62 -295 -224 13 -17 18 -86 -74 -104 218 365 -13 157 -76 87 89 -243 -64 -216
5390b16J77P8k60k6M53m17l3l2L51J09m85K70j05P7J34k53O8L82l83J34k8Q3o8
$$ -216 -39 39 -221 -247 206 -211 -244 -276 75 184 -301 -31 -136 -59 75 -178 -110 272 -111 23 -5 78 10
5413A0o02N68L4r8k31M78m84N76j47j57J44j77M5K91qk09k09K87j60K05J89n62
$$ 10 -592 -24 10 -88 -319 159 -325 251 104 -53 91 -86 -41 250 242 33 -176 111 -49 156 345 -217
5435b17L93l16L74l03K18m1l21L03j84J75j28J92j35k8J61p2%o3j41N5J27P6R2
$$ -217 176 -140 234 -69 149 108 -213 90 -94 81 -47 145 10 -18 143 71 71 8 -133 -78 49 125 217
5458B17k39J37j34J05N2j55K62j12j75j95J35m9R8J83k32J73k17K38pk1j63L2
$$ 217 -22 115 -19 86 138 -17 245 133 -42 -237 -102 -151 -53 130 -102 71 -146 92 85 64 -99 -67
5480f7J88j7j45K4K7L6M5j31p1OK27j96J03j40QL25k39M0L0j55J63J44k20j12
$$ -67 121 104 -41 -17 10 46 91 -40 -111 -105 122 -74 29 -111 -103 222 -17 23 53 -102 61 205 -15 -127
5504a27P5l4O8J26j07j23K5R2j12k0o5K32K6J9k64J09R6k04J36j48J67K63j43
$$ -127 -52 -86 -18 108 1 -122 -97 -5 -117 -137 -202 30 56 75 -189 -80 16 -188 -52 -200 -33 230 87
5527H7j56j2K09M5N2m65K13O4k49J33j50L56j55N9P7j67K87l69L98k69R6j14J77
$$ 87 -69 -81 128 173 225 -240 -27 37 -212 -79 -229 127 -28 31 108 -59 228 -141 257 -12 84 -30 147
5550A47R4k15O5k85K87k58N4K64j2m02K94p1j0j86k08N70p1p5n3J42j06J43o4
$$ 147 241 26 91 -194 93 -165 -111 153 141 -261 33 -38 -48 -234 -442 128 57 -18 -71 71 -35 108 44
5573D4q8L76l28K61j80L3m6j64R2k26J99K2qR7J25m38L49L4o2J25k75j21J01K45
$$ 44 -44 332 4 265 85 118 72 -92 0 -226 -27 -5 -13 84 209 -229 120 154 92 217 -58 -179 -78 167
5597A67q3r6J85o8j47K53k53K92l40L65l30lkN70k13k01j46R4LJ21k56kJ18K6
$$ 167 84 -12 173 105 -42 211 -42 250 -90 275 -55 -58 -60 510 297 96 -50 44 47 168 -88 -90 28 54
5621E4j53J74Jj12Q2pk3J72k20r2K30n4j20J02j76R8o0J53K21n53K28j03l1L82
$$ 54 -99 75 76 -36 46 39 16 188 -32 -124 106 52 -68 34 -142 -44 -104 49 270 -283 -55 -158 -189 193
5645A93j07j51K06JN2k14R7n6o8m2K28p8m7P2k02J62q9N3Qo1m9L52k56o3k9J58
$$ 193 86 -65 141 142 194 -20 77 21 -47 -89 139 61 14 86 -116 46 -43 10 18 -43 -92 260 4 -59 -88 70
5671G0n5R9r3M1j05M0Jm0j9o7r2K35k27J87k4k32K28k90J15J03Q5k43K54q3K26
$$ 70 15 114 21 62 -43 -3 -2 -42 -61 -128 -220 15 -212 -25 -49 -281 -53 -343 -228 -125 -40 -283 -29 -112 114
$$ [...]
8191e4
##END NTUPLES=NMR FID
##END=
