##TITLE=31Pdec_44-2026-Bay
 CDCl3,24 sc
 28.4.2026
##JCAMPDX= 6.0         $$ Bruker NMR JCAMP-DX V2.0
##DATA TYPE= NMR SPECTRUM
##DATA CLASS= NTUPLES
##ORIGIN= UXNMR, Bruker Analytische Messtechnik GmbH
##OWNER= root
$$ XWIN-NMR		Version 3.5
$$ Tue Apr 28 14:34:30 2026 Russian Standard Time (UT+4h)  she@DPX200
##.OBSERVE FREQUENCY= 81.013821
##.OBSERVE NUCLEUS= ^31P
##.ACQUISITION MODE= SIMULTANEOUS
##.ACQUISITION SCHEME= undefined
##.AVERAGES= 24
##.DIGITISER RES= 17
##SPECTROMETER/DATA SYSTEM= spect
##.PULSE SEQUENCE= zgpg30
##.SOLVENT NAME= DMSO
##.SHIFT REFERENCE= (INTERNAL, DMSO, 0, 197.392)
##AUDIT TRAIL= $$ (NUMBER, WHEN, WHO, WHERE, WHAT)
$$ ##TITLE= Audit trail, XWIN-NMR		Version 3.5
$$ ##JCAMPDX= 5.01
$$ ##ORIGIN= Bruker BioSpin GmbH
$$ ##OWNER= she
$$ F:/spectra/data/she/nmr/P31/2/pdata/1/auditp.txt
$$ ##AUDIT TRAIL=  $$ (NUMBER, WHEN, WHO, WHERE, WHAT)
(   1,<2026-04-28 14:33:29.32 +0400>,<she>,<DPX200>,
      <created by zg, POWCHK disabled, PULCHK disabled
       configuration hash MD5:
       00 E9 B6 7A A2 85 ED C7 34 08 36 98 17 FE 4E 26
       data hash MD5: 32K
       39 1E A8 10 F3 6F 52 2B 57 A3 0C 23 FE 30 8E 43>)
(   2,<2026-04-28 14:33:31.78 +0400>,<she>,<DPX200>,
      <Start of raw data processing
       efp BC_mod = 2 LB = 1.5 FT_mod = 6 PKNL = 1 PHC0 = 1420.216 PHC1 = 44.10049 SI = 64K 
       data hash MD5: 64K
       E1 8A D0 07 2F CC 1B 63 E2 A3 D6 33 E8 9F 89 4B>)
(   3,<2026-04-28 14:33:50.81 +0400>,<she>,<DPX200>,
      <pk PHC0 = -3.981357 PHC1 = 10.4 
       data hash MD5: 64K
       4D 07 2D F6 10 E0 2E C2 04 8D 60 97 3C 64 2E DE>)
(   4,<2026-04-28 14:33:54.67 +0400>,<she>,<DPX200>,
      <abs ABSG = 5 
       data hash MD5: 64K
       78 3B A2 EA C7 CD 5A 70 16 FF 0F 78 45 D8 EC 3F>)
$$ ##END=
$$ 
$$ hash MD5
$$ 06 C1 95 32 97 DC F4 CC AB E4 4A A9 A7 EB AE 17
##$RELAX= 
##$RELAX= 
##$RELAX= 
##$RELAX= 
##$RELAX= 
##$RELAX= 
##$RELAX= 
##$RELAX= 
$$ Bruker specific parameters
$$ --------------------------
##$DU= <F:/spectra>
##$EXPNO= 2
##$NAME= <P31>
##$PROCNO= 1
##$TYPE= <nmr>
##$USER= <she>
##$AMP= (0..31)
100 100 100 100 100 100 100 100 100 100 100 100 100 100 100 100 100 100 
100 100 100 100 100 100 100 100 100 100 100 100 100 100 
##$AQSEQ= 0
##$AQ_mod= 1
##$AUNM= <au_zg>
##$AUTOPOS= <>
##$BF1= 81.014009
##$BF2= 200.13
##$BF3= 200.13
##$BF4= 200.13
##$BF5= 200.13
##$BF6= 200.13
##$BF7= 200.13
##$BF8= 200.13
##$BYTORDA= 1
##$CFDGTYP= 0
##$CFRGTYP= 5
##$CHEMSTR= <none>
##$CNST= (0..31)
1 1 145 1 1 1 1 1 1 1 1 1 1 1 1 1 1 1 1 1 1 1 1 1 1 1 1 1 1 1 1 1 
##$CPDPRG= <waltz16>
##$CPDPRG1= <>
##$CPDPRG2= <waltz16>
##$CPDPRG3= <>
##$CPDPRG4= <mlev>
##$CPDPRG5= <mlev>
##$CPDPRG6= <mlev>
##$CPDPRG7= <mlev>
##$CPDPRG8= <mlev>
##$CPDPRGB= <>
##$CPDPRGT= <>
##$D= (0..31)
0 1 0 0 0 0 0 0 0 0.06 0 0.03 2e-05 3e-06 0 0 0.0002 0 0 0 0 0 0 0 0 0 
0 0 0 0 0 0 
##$DATE= 1777372408
##$DBL= (0..7)
120 120 120 11 120 120 24 19 
##$DBP= (0..7)
150 150 150 150 150 150 150 150 
##$DBP07= 0
##$DBPNAM0= <>
##$DBPNAM1= <>
$$ [...]
##$SUBNAM3= <"">
##$SUBNAM4= <"">
##$SUBNAM5= <"">
##$SUBNAM6= <"">
##$SUBNAM7= <"">
##$SUBNAM8= <"">
##$SUBNAM9= <"">
##$SW= 400.765351723535
##$SWIBOX= (0..15)
0 1 3 0 0 0 0 0 0 0 0 0 0 0 0 0 
##$SW_h= 32467.5324675325
##$TD= 32768
##$TD0= 1
##$TE= 0
##$TE2= 300
##$TE3= 300
##$TEG= 300
##$TL= (0..7)
0 120 53 12 22 120 120 120 
##$TP= (0..7)
150 150 150 150 150 150 150 150 
##$TP07= 0
##$TPNAME0= <>
##$TPNAME1= <>
##$TPNAME2= <>
##$TPNAME3= <>
##$TPNAME4= <>
##$TPNAME5= <>
##$TPNAME6= <>
##$TPNAME7= <>
##$TPOAL= (0..7)
0.5 0.5 0.5 0.5 0.5 0.5 0.5 0.5 
##$TPOFFS= (0..7)
0 0 0 0 0 0 0 0 
##$TUNHIN= 0
##$TUNHOUT= 0
##$TUNXOUT= 0
##$USERA1= <user>
##$USERA2= <user>
##$USERA3= <user>
##$USERA4= <user>
##$USERA5= <user>
##$V9= 5
##$VALIST= <valist>
##$VCLIST= <CCCCCCCCCCCCCCC>
##$VD= 0
##$VDLIST= <DDDDDDDDDDDDDDD>
##$VPLIST= <PPPPPPPPPPPPPPP>
##$VTLIST= <TTTTTTTTTTTTTTT>
##$WBST= 1024
##$WBSW= 4
##$XGAIN= (0..3)
0 0 0 0 
##$XL= 0
##$YL= 0
##$YMAX_a= 7207
##$YMIN_a= -7321
##$ZGOPTNS= <>
##$ZL1= 120
##$ZL2= 120
##$ZL3= 120
##$ZL4= 120
##$ABSF1= 197.3918
##$ABSF2= -203.3724
##$ABSG= 5
##$ABSL= 3
##$ALPHA= 0
##$AQORDER= 0
##$ASSFAC= 0
##$ASSFACI= 0
##$ASSFACX= 0
##$ASSWID= 0
##$AUNMP= <proc_1d>
##$AZFE= 0.1
##$AZFW= 0.5
##$BCFW= 0
##$BC_mod= 2
##$BYTORDP= 0
##$COROFFS= 0
##$CY= -3
##$DATMOD= 1
##$DC= 0
##$DFILT= <>
##$DTYPP= 0
##$F1P= 0
##$F2P= 0
##$FCOR= 1
##$FTSIZE= 65536
##$FT_mod= 6
##$GAMMA= 0
##$GB= 0
##$INTBC= 1
##$INTSCL= 9.790993e-09
##$ISEN= 30
##$LB= 1.5
##$LEV0= 0
##$LPBIN= 0
##$MAXI= 10000
##$MC2= 0
##$MEAN= 0
##$ME_mod= 0
##$MI= 50
##$NCOEF= 0
##$NC_proc= -5
##$NLEV= 6
##$NOISF1= 182.463
##$NOISF2= 159.3651
##$NSP= 0
##$NTH_PI= 0
##$NZP= 0
##$OFFSET= 197.3918
##$PC= 4
##$PHC0= 1416.235
##$PHC1= 54.50049
##$PH_mod= 1
##$PKNL= yes
##$PPARMOD= 0
##$PSCAL= 0
##$PSIGN= 0
##$REVERSE= no
##$SF= 81.014063255964
##$SI= 65536
##$SIGF1= 159.3651
##$SIGF2= -187.1042
##$SINO= 113.3802
##$SIOLD= 16384
##$SREGLST= <1H.CDCl3>
##$SSB= 0
##$STSI= 65536
##$STSR= 0
##$SW_p= 32467.5324675325
##$SYMM= 0
##$S_DEV= 0
##$TDeff= 32768
##$TDoff= 0
##$TI= <>
##$TILT= no
##$TM1= 0
##$TM2= 0
##$TOPLEV= 0
##$USERP1= <user>
##$USERP2= <user>
##$USERP3= <user>
##$USERP4= <user>
##$USERP5= <user>
##$WDW= 1
##$XDIM= 65536
##$YMAX_p= 378436966
##$YMIN_p= -6885068
$$ End of Bruker specific parameters
$$ ---------------------------------
##NTUPLES= NMR SPECTRUM
##VAR_NAME=  FREQUENCY,     SPECTRUM/REAL,   SPECTRUM/IMAG
##SYMBOL=    X,             R,               I
##VAR_TYPE=  INDEPENDENT,   DEPENDENT,       DEPENDENT
##VAR_FORM=  AFFN,          ASDF,            ASDF
##VAR_DIM=   65536,         65536,           65536
##UNITS=     HZ,            ARBITRARY UNITS, ARBITRARY UNITS
##FACTOR=    0.49542278885378, 1,            1
##FIRST=     15991.5117654749, 0,            0
##LAST=      -16476.0207020576, 0,           0
##MIN=       -16476.0207020576, -6885068,    0
##MAX=       15991.5117654749, 378436966,    0
$$ Real data points
##PAGE= N=1
##DATA TABLE= (X++(R..R)), XYDATA
$$ [...]
##PAGE= N=2
##DATA TABLE= (X++(I..I)), XYDATA
44586 436171 249322 50348 85749 284197 319590 87668 -118705 -4752 325771 515727
44576 515727 424723 292384 404743 719469 937093 909855 820912 878981 982705 884101
44566 884101 619842 515785 710011 930383 890617 681062 550654 485314 295119 26396
44556 26396 -39022 183610 433885 475571 381207 328604 309265 205286 33381 -62789 -21733
44545 -21733 63501 73770 -18379 -155978 -266424 -318680 -333616 -332299 -283580 -144454 49949
44534 49949 197774 252648 282358 373208 509449 580793 504619 332618 224051 274367 364055
44523 364055 253774 -115598 -490760 -563713 -313753 1160 148150 105240 -16612 -102088
44513 -102088 -83575 16396 83827 48751 8403 102837 281125 323526 108319 -256356 -564000
44502 -564000 -658274 -482436 -141966 97186 60211 -83688 -27154 210679 296080 123338
44492 123338 27119 272762 629872 734573 644004 668086 786903 660397 231934 -80019
44482 -80019 55810 433992 640594 619147 652382 885934 1135973 1185051 1061315 931490
44472 931490 838363 666148 338057 -41179 -261921 -200411 62676 284527 241737 -61410
44462 -61410 -352082 -331173 -1000 316236 342485 140333 -50155 -171984 -363329 -636860
44452 -636860 -773414 -620089 -324975 -150062 -160733 -220848 -210556 -125505 -14505 70170
44442 70170 93544 94592 184678 412034 666568 793538 770125 712203 741459 880054 1019604
44431 1019604 980467 707931 430997 458939 746006 862485 550727 105993 -25500 155740
44421 155740 322625 409436 662736 1089662 1290479 1026486 618803 519772 722963 887117
44411 887117 879888 866255 910790 825365 496877 128999 8810 153908 327439 352863 297643
44400 297643 334106 495911 634934 616896 498952 453787 542629 654779 687964 680618 695791
44389 695791 669946 498933 228748 28292 -22130 14470 105749 327411 678203 940540
44379 940540 884268 577281 342501 381900 575068 709471 776633 905149 1076254 1089970
44369 1089970 839771 474340 216868 133075 158507 246880 361989 391513 235059 -12798
44359 -12798 -103541 93701 452489 756611 910524 927135 807895 553283 261899 101514
44349 101514 141647 271179 322708 248503 131434 40065 -57037 -196668 -303454 -266794 -133007
44338 -133007 -102256 -271253 -478726 -511428 -386138 -282352 -240472 -120081 111615 253917
44328 253917 162216 16783 117243 470348 774130 821443 738080 740147 802890 727002 477141
44317 477141 276217 315468 506322 631680 662787 765863 993621 1141640 1006925 673060
44307 673060 405523 331860 372258 446868 573905 743280 866967 920299 976880 1014317 849761
44296 849761 420863 -1475 -89083 115257 257000 140449 -79923 -207493 -266591 -348301
44286 -348301 -396764 -321836 -186051 -93806 463 170162 288574 179590 -20020 65378
44276 65378 528159 979011 1022062 727516 443469 310447 212590 106737 108700 247922
44266 247922 387253 443050 478907 514535 444011 246603 95089 114268 177796 102381 -70613
44255 -70613 -159542 -129086 -111512 -175364 -242646 -239986 -185542 -96898 64320 298994 496116
44244 496116 512270 317697 62209 -6363 251313 698788 1022539 1052129 916770 830574
44234 830574 829296 822485 789583 755795 653958 418177 184854 177066 364340 452299 277555
44223 277555 15758 -99748 -79102 -56471 -28911 96312 280707 372343 325319 248453 230263
44212 230263 247724 275586 362159 519183 612453 478339 166292 -23097 167046 629408
44202 629408 970371 952655 756207 697702 785906 736900 413027 39318 -95211 8591
44192 8591 129174 145296 148064 266639 493452 693291 733715 602221 409135 262085 156782
44181 156782 43434 -36612 -55 89595 36801 -210558 -433253 -400995 -169107 5220
44171 5220 -20677 -166379 -298743 -379668 -428786 -437505 -378509 -280446 -252779 -389116 -615960
44160 -615960 -694346 -465298 -66144 216530 296530 341236 470599 600711 657490 742849
44150 742849 949563 1173286 1272556 1287999 1333464 1377234 1305791 1116924 884469 623994
44140 623994 365751 255821 373836 529972 470097 229645 60807 65035 147231 284115
44130 284115 532242 757024 680991 303443 -5333 37346 303894 516007 590104 567695
44120 567695 430920 203044 69759 175532 390615 459336 310822 95804 10444 190514
44110 190514 637114 1107806 1239650 961325 639860 623453 794472 817192 673434 626455
44100 626455 734415 765172 614038 468149 473534 533959 548654 578982 646919 620119 455327
44089 455327 327049 339981 332449 168326 18979 112362 374234 588971 771127 1060470
44079 1060470 1335881 1289105 897952 508182 373658 388833 369074 334325 375784 461381
44069 461381 540140 673033 899795 1109791 1189607 1176341 1134595 1017935 798124 593476
44059 593476 499151 417246 242584 94266 140087 285474 284408 105760 -59136 -120430 -159069
44048 -159069 -179507 -76854 104044 157625 59271 55277 278355 512070 504294 304077 95990
44037 95990 -108448 -379390 -610516 -614996 -419437 -231604 -137496 -34549 131117 248452
44027 248452 207001 48450 -94443 -136267 -104407 -116491 -263502 -466769 -524110 -376070
44017 -376070 -229209 -290154 -466748 -497819 -317871 -102427 25251 124832 240093 257057
44007 257057 62321 -258661 -471560 -410473 -127084 139821 163651 -41859 -222176 -168979
43997 -168979 48186 213754 245975 227530 242428 338734 580817 947382 1220147 1180338
43987 1180338 905111 674265 600452 567293 515711 526341 588652 568783 478112 486522 563360
43976 563360 420277 -4028 -305090 -130599 299421 507472 423388 383732 555836 726715
43966 726715 683587 492025 314277 191496 103406 57975 27085 -62259 -196938 -265841 -239038
43955 -239038 -228676 -305689 -382563 -356925 -256004 -146586 -2653 223623 460102 555328
43945 555328 447065 224071 35430 -21910 37624 94421 27575 -135713 -213222 -72313
43935 -72313 188815 336804 265470 85591 -47348 -105514 -153338 -221747 -290342 -343895 -359427
43924 -359427 -266436 -27431 235606 310028 137636 -100485 -201854 -152448 -50137 63377
43914 63377 167890 166636 8995 -137341 -41434 262794 505617 565399 602191 729540 780715
43903 780715 561360 167221 -132694 -213098 -121113 97819 395643 613321 600373 437945
43893 437945 355613 416813 464361 404169 357786 449492 579733 522389 187599 -278482 -613103
43882 -613103 -629263 -352677 -55 224726 312513 364031 362976 192242 -87431 -165436 155818
43871 155818 637263 841617 665990 433029 419238 515431 496684 439528 602158 944325
43861 944325 1073280 766913 306278 112961 240958 444120 591050 722635 780306 624176
43851 624176 360714 329347 636261 961014 975593 727175 446430 211159 10509 -69559
43841 -69559 9972 65388 -66238 -222344 -140739 91741 130422 -102973 -294517 -188837
43831 -188837 96014 290980 302129 219572 168490 241111 449595 681746 802053 809892 784491
43820 784491 704331 496873 256401 201926 385684 636604 816216 912495 855082 522400
43810 522400 42800 -192826 -12088 266737 262442 46076 -24679 148920 317674 299904
43800 299904 212314 234502 340959 362970 218915 13813 -55797 115942 435034 708248
43790 708248 870797 1035635 1262549 1382751 1177206 678829 172399 -90747 -76612 109716
43780 109716 357294 570173 656900 589974 469304 466055 650680 878320 913829 714042
43770 714042 506883 500583 602888 587162 468630 481459 682800 853126 868271 886428 1010667
43759 1010667 1049536 863224 702303 856074 1118893 1013709 519499 172706 351179 797941
43749 797941 1019223 879401 593127 346283 187620 178148 376703 679635 872611 876544
43739 876544 806448 763835 709305 594934 490744 466842 434596 263951 50556 85370 458972
43728 458972 835766 810646 443706 218452 416678 748787 756011 425343 181286 308858
43718 308858 603511 656827 348465 -51684 -226929 -171802 -160905 -361693 -562670 -416076
43708 -416076 64749 451040 433724 211618 161341 296506 339229 235296 245919 485705
43698 485705 701536 664065 524393 575128 827380 1038331 1048633 884045 588491 173933
43688 173933 -248885 -458598 -316383 86309 491634 656071 503201 165299 -133636 -271509
43678 -271509 -282449 -218948 -61617 175499 366948 426712 458591 613035 845127 971780
43668 971780 945014 898442 911481 900218 795300 674803 638916 673480 715472 736864 684288
43657 684288 473241 164224 14718 184203 475736 563891 424069 317904 368537 400541
43647 400541 260730 53166 -75131 -165292 -270856 -228829 125690 595649 761755 518545
43637 518545 231947 271533 574562 804637 805230 725941 745265 823491 780172 554988 321613
43626 321613 301316 477919 590449 468194 267369 236991 335681 302088 93009 -16740
43616 -16740 136812 330752 290585 109773 97749 320358 535921 543851 368204 95519
43606 95519 -249088 -596228 -758579 -560703 3053 741480 1335925 1493413 1172536 660940
43596 660940 317536 245063 311912 422233 570774 659509 514929 164322 -121146 -176443
43586 -176443 -148983 -210904 -240799 -1899 464788 851766 966421 907018 840875 780620 649795
43575 649795 451138 278529 211784 256875 360089 445643 463396 424408 374148 325465 247745
43564 247745 133573 43658 60637 213295 461385 733144 950324 1035678 952822 764779
43554 764779 611430 577763 603337 580720 527546 564838 699905 749466 578682 336909 310069
43543 310069 550592 796793 803365 640483 587132 789450 1101897 1248231 1092754 759181
43533 759181 503751 464960 540944 534283 398191 283810 338596 514119 601244 430263 32542
43522 32542 -365048 -513026 -350919 -48573 190299 331901 462276 580491 559058 324530
43512 324530 -22058 -300050 -394145 -294567 -87076 69790 57536 -61382 -94626 46888
43502 46888 249827 366490 374877 318335 214303 123196 190950 475434 796853 911101 800574
43491 800574 655490 591261 538843 425518 309226 278354 339961 470486 665434 858552
43481 858552 898569 725988 505733 451596 554713 630348 624201 690583 898366 1037953 885515
43470 885515 552038 358628 393800 421445 273049 98822 91009 148851 36693 -224737
43460 -224737 -359914 -214961 67996 271216 321463 256563 137588 54306 82821 181618
43450 181618 250651 324696 545995 884491 1076293 971558 780476 791892 961405 994168
43440 994168 792335 597885 644687 834264 857476 565788 138141 -110231 -42817 191808
43430 191808 361939 411844 455989 552598 621972 629338 697432 918040 1157599 1203769 1052739
43419 1052739 899244 861895 867612 818674 730658 655116 581407 495360 468036 601209 894149
43408 894149 1210066 1385331 1367691 1247176 1144449 1077353 972916 807556 661610 596836
43398 596836 553581 439679 266609 119883 44518 50007 177439 432989 667395 668979 432406
43387 432406 230534 334105 706547 1044003 1094004 878088 608781 449783 397670 375309
43377 375309 372554 447254 618698 828431 1006388 1109776 1091882 918863 652126 432256
43367 432256 329415 280957 225151 203648 252190 284997 212091 113427 155720 349453 514809
43356 514809 502825 348703 184716 86223 29400 -66067 -274225 -586833 -882529 -1016010
43346 -1016010 -948549 -761918 -560822 -406210 -323526 -316713 -372531 -479777 -620389 -720378
43336 -720378 -674476 -474783 -245530 -76082 98459 343035 538103 518197 355136 310179
43326 310179 485100 700052 767778 713786 638131 528491 354460 221050 242570 320113
43316 320113 236070 -19702 -193773 -109791 75894 83717 -110623 -269409 -247767 -173373 -198555
43305 -198555 -234448 -96027 171392 308676 182588 -73450 -290648 -449227 -551099 -495052
43295 -495052 -234256 64773 193795 167648 163614 242429 282470 178064 -28222 -216139
43285 -216139 -291214 -219513 -41975 150232 311107 480484 681779 840854 868260 752088
43275 752088 519071 218340 11996 108371 454806 660978 441556 10421 -205762 -142693
43265 -142693 -107691 -277296 -498358 -597149 -582914 -482160 -247480 65636 260597 248978
43255 248978 157306 112781 111376 154567 293500 449946 416368 149403 -133047 -248305 -232645
43244 -232645 -127543 162597 620614 945818 863656 469806 74805 -167288 -295862 -339915
43234 -339915 -282199 -152988 305 169552 302871 285866 130599 37203 112596 180179
43224 180179 55534 -137485 -151606 1839 102713 74402 37512 59274 94258 155390 303565
43213 303565 452549 408230 152636 -92127 -139747 -38185 46320 17386 -108711 -234960
43203 -234960 -236783 -78595 123020 238604 289079 355375 381866 240119 -22556 -173625
43193 -173625 -70152 188000 406506 483177 433848 350146 348877 460528 566240 544385 451172
43182 451172 426895 462124 437318 387223 505220 816443 1048931 962122 663096 448698
43172 448698 422897 421976 284180 57260 -82839 -34880 142590 303091 327017 183656 -57429
43161 -57429 -238707 -196209 68564 308499 255084 -37760 -215012 -62753 225122 349755
43151 349755 315225 328418 415305 414468 318213 322587 476294 549388 390536 205105 286768
43140 286768 596594 804510 703034 416775 203418 183232 306483 486577 672327 809131
43130 809131 823504 707022 572199 534496 542241 429881 170099 -46869 -54766 86113 227173
43119 227173 348283 483686 531692 350540 30665 -121958 77190 494139 847014 970040
43109 970040 886492 717161 555895 395431 185584 -17655 -54771 107898 265144 221893
43099 221893 51604 -59053 -120724 -278329 -502237 -591724 -480933 -307024 -153817 46600
43089 46600 312783 520937 568204 456335 196866 -162995 -408435 -308199 31216 210688
43079 210688 43884 -210042 -236265 -55823 124771 238114 332234 385873 355464 305636
43069 305636 322775 378221 406059 420110 434399 381964 246720 166081 257834 438282 551512
43058 551512 590373 646285 716371 706589 579770 384403 179748 17666 -63213 -96020 -153765
43047 -153765 -198253 -87428 176811 355908 270126 65778 26885 208980 418939 493457
43037 493457 447280 387436 404244 509517 591839 495341 223639 -24606 -110663 -132709 -241413
43026 -241413 -404949 -492084 -467477 -353014 -117190 217547 464025 471293 366313 397278
43016 397278 589701 755098 801168 826109 905836 974078 945438 824180 672802 571529
43006 571529 595755 744550 927109 1091236 1275490 1440108 1386850 1015968 542778 253160
42996 253160 140598 13517 -123517 -74710 181019 405642 430372 350266 342274 471191
42986 471191 702208 924833 949475 673189 271572 40380 40215 101345 166641 352617 622048
42975 622048 705060 496165 273589 319513 507200 485266 157494 -223149 -374428 -229129
42965 -229129 98898 432938 603739 512683 191277 -191848 -393838 -247602 153771 467638
42955 467638 428550 143400 -80068 -161642 -301544 -603081 -890886 -985737 -928008 -803652
42945 -803652 -567254 -209751 84808 158748 124910 188307 334361 406947 405516 463766 573190
42934 573190 576098 454794 399186 510560 626061 554746 356776 254631 341742 508298
42924 508298 624952 677163 704744 719068 742499 850241 1067322 1251386 1204291 931685
42914 931685 670919 584916 540913 321193 -26519 -216684 -84031 240100 512104 590947
42904 590947 464805 236332 130076 346983 814750 1199470 1251268 1041626 799742 644661
42894 644661 570951 568531 618615 649384 622884 613242 691813 787468 769472 629857 481808
42883 481808 406812 398516 436192 519244 624557 694767 682208 585440 462423 414424 505509
42872 505509 685656 860098 1036598 1291273 1561886 1632551 1425593 1173456 1151766 1331416
42862 1331416 1453527 1385826 1232638 1120390 1052007 989970 925247 818168 602293 307228
42852 307228 71080 -31667 -78033 -140923 -143128 17006 246270 304963 100853 -169827
42842 -169827 -236916 -45389 240592 463820 590785 618512 512773 307888 155215 161506
42832 161506 245320 265163 236477 293425 465388 626228 660406 556394 342405 62770
42822 62770 -179996 -298868 -344818 -412036 -430087 -247223 54350 167785 -9595 -184563
42812 -184563 -70912 208596 333869 252839 187054 252867 335480 340217 347543 462402 660687
42801 660687 838404 909475 834375 655693 516301 528940 606194 535177 262134 -6314
42791 -6314 -53851 80117 179872 151391 124192 230312 381861 374050 185667 42715 121350
42780 121350 303293 349075 232155 134625 151000 192164 195951 233620 352405 498286 664059
42769 664059 918376 1192267 1248578 1015115 757995 733741 830259 773599 562996 446512
42759 446512 527949 647356 651623 577748 536500 565480 628702 664019 633837 596000 665343
42748 665343 828471 905469 814769 744631 881756 1079931 1019588 634919 168204 -154327
42738 -154327 -286399 -241429 -42170 202742 368503 468209 579569 663149 640132 583093
42728 583093 597969 582855 384591 150138 191075 491373 706392 710487 762298 986894 1080098
42717 1080098 778209 312163 89278 143595 216271 226472 332664 583110 792402 785138
42707 785138 571579 269657 -4982 -170983 -212815 -176463 -83548 80872 241776 223839
42697 223839 -18614 -274531 -316993 -185687 -103031 -198178 -439420 -732354 -927222 -829878
42687 -829878 -406001 70420 259883 138713 -14150 8635 144575 242382 280017 339628
42677 339628 452408 524462 408428 75385 -275556 -373589 -195422 -8137 -2319 -29884
42667 -29884 132222 391704 448184 230011 -18965 -85917 5093 162821 381107 639609
42657 639609 831897 897508 904052 922637 935818 929207 947687 986227 944844 774973 560577
42646 560577 373744 173776 -42949 -119562 72933 399679 595668 617839 687833 946557
42636 946557 1222602 1244706 994263 729970 688999 861078 1061291 1132911 1035104 806197
42626 806197 527998 304523 193365 154555 137866 213000 499212 930527 1228894 1223710
42616 1223710 1095371 1139421 1341327 1382210 1089377 687023 496650 529204 520965 306721
42606 306721 13190 -114682 19418 281224 427415 309274 8299 -234697 -262773 -145877
42596 -145877 -34783 64078 254819 519834 673558 599844 418789 337446 416807 565015
42586 565015 684423 730243 682809 566317 460710 408398 351719 242240 134401 58434
42576 58434 -92741 -362616 -509948 -261579 236182 542086 553993 654593 1052814 1358174
42566 1358174 1147726 672004 550936 909297 1286786 1380570 1388712 1505601 1532370 1246447
42556 1246447 830907 625552 649380 661936 575097 526371 593928 681541 699245 678932 669907
42545 669907 634558 491741 213781 -129601 -402969 -501349 -427988 -254967 -42003 138532
42535 138532 166456 19776 -80524 116562 512678 719167 557031 263045 102951 35336
42525 35336 -86077 -226826 -302747 -383533 -523147 -570519 -412338 -241333 -289123 -424495
42515 -424495 -342507 -67485 78083 -16995 -110792 -7103 208440 394284 541359 648937
42505 648937 647831 542717 441357 378681 295956 226487 281605 407492 400315 238943 153814
42494 153814 260879 377415 339735 258727 280229 317552 246767 185006 317929 568170 685103
42483 685103 594214 430194 275113 94141 -84077 -148674 -100929 -76923 -120514 -100006 66239
42472 66239 239161 231088 68560 -38499 34588 195253 286225 282649 278134 323460 360013
42461 360013 305064 127131 -157491 -454069 -537993 -198567 454299 968961 1011817 753872
42451 753872 608129 674722 704224 565289 423242 391978 330219 142856 11377 103725
42441 103725 268188 273030 199757 320661 665718 979092 1083869 1051992 1002263 946296 876727
42430 876727 820132 735289 513200 164633 -101859 -77557 226602 605579 854110 902181
42420 902181 808970 670654 536056 412312 329917 324402 329637 203046 -52071 -193909 -16364
42409 -16364 349801 576373 545254 436622 414885 433952 416168 427247 537372 639458 569396
42398 569396 358073 229395 345858 631758 847643 800754 509129 196729 92874 203904
42388 203904 327532 314017 225282 177186 133978 -10630 -216052 -323602 -290089 -225845 -174266
42377 -174266 -28320 254141 513909 599484 583935 611663 634229 507825 299352 250686
42367 250686 415357 565619 534781 427004 369380 280462 71312 -113953 -99303 19827
42357 19827 43819 41020 239621 578577 708118 503014 256622 229242 290415 209944 66583
42346 66583 106116 338977 543612 600735 590214 583975 552076 483496 430401 409759 391410
42335 391410 389882 442254 491038 419141 222111 29899 -67905 -110049 -145576 -135268 -31455
42324 -31455 115243 194066 152974 49503 2788 102944 342120 624841 850734 975534
42314 975534 1003523 978781 991990 1107900 1245739 1230844 1036348 871514 923727 1097825
42304 1097825 1134911 921671 560905 218939 51371 182967 545367 786374 594101 125368
42294 125368 -136567 664 222574 202207 31240 -27477 30973 48797 64544 242848
42284 242848 492224 486461 138941 -214007 -239694 -17065 154453 210378 364614 731414
42274 731414 1104767 1181884 898353 465857 132170 -25025 -82626 -117300 -103489 37038
42264 37038 307279 592621 771511 845872 909515 984817 963549 764600 499622 387379
42254 387379 498989 676416 744705 730266 789373 958044 1078208 1005249 820024 763290
42244 763290 962890 1277006 1435961 1314710 1022361 726235 457959 157217 -128649 -203409
42234 -203409 54599 478848 717828 585249 272158 165650 446951 897903 1136523 1023030
42224 1023030 766306 618634 569094 434452 185302 22181 101248 323199 483527 546908
42214 546908 658698 905567 1163781 1219586 999874 645761 354338 173737 -2829 -238561
42204 -238561 -425941 -417970 -220356 43051 302150 544752 683620 603891 382258 282666
42194 282666 436438 657756 684620 496686 282288 183508 201080 289349 418858 567186
42184 567186 732159 927157 1110123 1178673 1100646 981624 932795 940038 924719 845115 670954
42173 670954 372742 33937 -143271 -66613 116034 236474 331492 492922 622260 549940
42163 549940 323712 157135 126724 124809 87163 62397 67672 79491 164857 410129 701080
42152 701080 784106 592475 328935 187513 179653 270115 467511 693737 758402 586428
42142 586428 339703 222779 287737 488208 770975 1029639 1118491 1022643 901932 879081
42132 879081 897709 866708 814549 799456 778536 674861 496953 314702 193759 200222 362226
42121 362226 572603 648208 548536 421082 382809 397558 421826 494506 587314 546706 323691
42110 323691 110071 90766 183475 177311 19201 -191909 -389649 -547084 -578447 -411591
42100 -411591 -127426 106028 212068 229545 222501 251964 351954 442623 371962 141268 -42361
42089 -42361 -58002 -57324 -191395 -312743 -184298 126919 324797 293615 184248 131738 142989
42078 142989 251681 515017 818130 928136 810747 680708 674821 693326 650620 659809 828656
42067 828656 1047321 1133688 1066653 946246 839686 792999 875440 1060070 1149475 979612
42057 979612 644604 379193 269968 234907 250255 410660 731806 1052858 1211363 1202719
42047 1202719 1089742 867424 541817 267145 233201 405049 522337 413939 189844 41917
42037 41917 -16454 -74175 -91180 50095 285347 380836 264419 160656 295025 604213
42027 604213 848861 894714 768606 546845 322912 207969 234623 308239 337956 336389 313369
42016 313369 202779 21292 -41933 122586 316855 275390 51633 -69261 12074 136487
42006 136487 210428 319578 476009 527454 421024 319470 326311 309852 158444 19505
41996 19505 82696 257765 286231 113325 -42835 20772 282826 575319 749687 754179 641232
41985 641232 527757 507010 595743 772508 1007245 1215980 1268831 1126620 914647 774466
41975 774466 691545 568216 424938 399680 538775 700021 703773 508226 209545 -53124
41965 -53124 -153489 -23712 271150 540070 628540 569649 512843 514146 480445 337988 162211
41954 162211 80526 120029 230709 392066 585340 711444 689862 635527 768780 1100783
41944 1100783 1365909 1348315 1128234 896841 678624 403326 141878 66436 213493 457921
41934 457921 695947 892813 981451 906727 777956 782892 901428 879313 559581 88453
41924 88453 -289569 -492027 -545057 -414025 -66496 349176 565925 480594 276164 204054
41914 204054 292534 338706 192089 -26001 -62114 133635 327361 300687 117182 -2929
41904 -2929 23218 104498 162140 188308 142500 -41944 -320105 -530510 -558511 -416748 -177375
41893 -177375 61819 168076 79670 -76290 -115679 -40987 11764 56724 257714 587748
41883 587748 736331 507985 130582 -14428 153611 404620 548128 607435 683555 810610
41873 810610 949991 1011018 876599 512447 68867 -200143 -144978 176830 582550 900022
41863 900022 1038736 991056 799878 529365 261831 93172 92171 265287 575447 960419
41853 960419 1304655 1461253 1382434 1186643 1020352 908456 827400 836274 981282 1127212
41843 1127212 1069765 808156 539172 384971 295715 215735 156620 92485 -24960 -124824
41833 -124824 -84376 41765 67000 -34046 -111856 -145454 -276569 -471043 -458052 -146307
41823 -146307 195656 353654 471332 712177 898238 790418 521192 413798 498063 528807
41813 528807 418796 355098 492066 762527 1002639 1098512 1032008 915436 922099 1061954
41803 1061954 1124537 966951 716916 544088 411254 248950 178408 295374 402140 261356
41793 261356 -13505 -138642 -115813 -165329 -295240 -310606 -201005 -128220 -42137 275974
41783 275974 742541 964763 818704 642582 695214 794564 707050 552491 542647 589856 493573
41772 493573 332937 353588 556856 687231 608578 470370 480079 661702 867782 942995
41762 942995 863072 749725 732451 798358 845995 876681 1009061 1274123 1520648 1576215 1399550
41751 1399550 1045614 609296 243973 90862 117461 143764 87330 58367 153413 292908
41741 292908 349018 317492 272559 246584 237315 262260 347078 514720 790357 1127708 1348642
41730 1348642 1290622 1009909 694418 399345 63612 -224979 -240867 35711 321549 373612
41720 373612 228404 31475 -131876 -149368 95274 466757 620109 480764 406069 641528
41710 641528 907090 844014 621657 680451 1009559 1140200 862535 530021 535386 815815
41700 815815 1049325 1094421 1028786 906278 696039 430531 253560 270615 406960 469153
41690 469153 363829 219738 233270 412739 572323 576294 453560 250543 -38221 -300808
41680 -300808 -274935 129033 610367 791429 664974 534357 578699 690039 719181 683986
41670 683986 705789 869317 1153306 1408879 1446819 1244942 1005046 901494 872707 791658
41660 791658 709397 732969 778998 696571 560265 570923 701391 723760 590511 498917 535685
41649 535685 549116 459130 407633 462550 434130 179204 -115040 -169500 -302 138220 108686
41638 108686 980 -59831 -49052 -591 48007 72276 96377 185305 348770 509746 626764
41627 626764 769176 987050 1178913 1191808 1003876 714763 411674 158539 68558 228182
41617 228182 524319 683638 562626 319069 211303 281553 347361 293842 234013 304851
41607 304851 423982 409304 292063 302137 499516 640962 554690 457214 660781 1068997
41597 1068997 1244358 983061 566128 359193 370978 337655 107430 -194425 -319182 -131410
41587 -131410 256744 555162 576856 465958 536196 861436 1171009 1209296 1047334 935439
41577 935439 970672 1032710 967932 738574 463134 376166 633455 1067202 1269203 1046806
41567 1046806 666905 488632 490589 390346 137103 -12006 80594 217689 187522 70031
41557 70031 63558 172820 262074 324637 499389 830481 1164860 1315910 1231517 988079 710779
41546 710779 520767 473890 506273 489887 370641 216798 135288 201651 455582 844804
41536 844804 1141827 1070093 635579 222959 191701 432544 516005 267501 -27227 -49841
41526 -49841 139239 265243 247628 234365 300510 323209 178181 -79095 -270273 -261096 -67831
41515 -67831 147496 215052 149515 153246 353822 614339 718345 669584 652397 736717 798709
41504 798709 736138 601467 500053 493191 606797 786715 842647 611695 206933 -68500
41494 -68500 -86955 8261 104003 280222 579457 849331 969019 1033698 1139677 1172786 1018674
41483 1018674 820981 788950 870922 873829 812521 862245 1013857 1063505 944088 791561 656312
41472 656312 430478 130208 -32223 16036 53098 -94572 -278955 -298944 -240594 -294230
41462 -294230 -373026 -212063 194683 536636 598795 501491 464654 533714 638885 761507
41452 761507 905384 1001078 966026 815898 636671 491865 412593 411411 440931 411489 323834
41441 323834 305104 423325 552539 543124 446839 417021 445406 393982 270441 245759 349963
41430 349963 375508 196029 -14526 -36213 87725 185536 268331 472343 753887 883102
41420 883102 752187 501116 324852 327458 557401 964906 1285066 1206627 774771 424835
41410 424835 469727 732480 858587 810390 797792 841836 738902 470263 325500 481098
41400 481098 701917 671591 459335 402255 585493 711975 539045 206460 -6811 -70852
41390 -70852 -146696 -246324 -203442 10304 175493 123278 -33901 -90117 -19723 79460 195347
41379 195347 379738 597388 779448 975644 1260850 1517440 1523456 1276872 1023534 908029
41369 908029 804161 590333 392008 383504 490318 488488 335317 211875 241172 327647 328093
41358 328093 269916 306131 478421 610067 503469 238597 171156 538534 1128728 1481332
41348 1481332 1399234 1099895 853317 682299 510089 392371 416273 501809 509085 469937
41338 469937 517631 634144 673816 627139 642367 738466 708449 430447 120685 106659 410713
41327 410713 711069 710221 421316 72273 -156437 -230278 -185178 -75645 9043 -13401 -117876
41316 -117876 -189706 -187896 -203892 -283103 -284205 -51794 329205 619112 744258 841329 957080
41305 957080 925524 658019 365152 306998 441980 523288 478401 484396 671822 947754 1159730
41294 1159730 1273142 1300675 1181746 862553 453459 193482 234619 506090 799461 951577
41284 951577 939488 848459 791307 830275 914394 897142 685814 380526 175242 101261 3915
41273 3915 -153025 -132407 243829 731716 895570 672356 441014 494800 706304 809587
41263 809587 767849 706959 683659 705385 835644 1091158 1328072 1391189 1305432 1197372 1117715
41252 1117715 1060608 1051284 1074895 1014617 805023 564620 443223 425765 417771 422640 483838
41241 483838 546167 534383 489821 480597 463603 383168 306073 302948 311611 289070 356789 573876
41229 573876 708008 520426 188510 124317 402088 693648 801028 922975 1273186 1696990
41219 1696990 1839117 1544896 972819 412532 71279 -35318 -23901 49099 243320 519408
41209 519408 634334 462814 278548 412600 725358 789071 572945 519363 845769 1193638
41199 1193638 1179243 932773 809368 848628 852656 810603 888729 1067868 1110600 923866 726631
41188 726631 771629 1019354 1168749 988236 584360 305147 348303 539486 598241 529078
41178 529078 552415 704769 780806 698619 631369 678433 691895 593593 603546 920928 1362964
41167 1362964 1564286 1421197 1133346 901804 774244 708068 614631 405977 137358 21758
41157 21758 166498 382691 396672 176149 -73321 -152061 -2413 289524 521810 537152
41147 537152 470798 674287 1231225 1714825 1644788 1070064 479981 232124 293904 470732
41137 470732 629071 697448 672172 666607 802007 1021414 1130036 1032270 837118 735281
41127 735281 837062 1090080 1296711 1280514 1090686 945275 926929 889866 743228 622652
41117 622652 642000 687808 657605 698430 952225 1230959 1240898 1017763 840292 795382 745483
41106 745483 689130 824635 1208218 1607129 1760005 1606501 1248348 858218 616520 564610
41096 564610 543348 429679 353394 489569 744771 894887 938263 1035005 1181456 1251717
41086 1251717 1288755 1414718 1508416 1351051 1069437 1017047 1182492 1155843 786972 448314
41076 448314 474489 732064 951543 1128707 1355563 1556038 1631251 1616101 1503821 1195827
41066 1195827 806681 685572 893497 990848 637418 91073 -220898 -321418 -477256 -635290
41056 -635290 -534490 -226472 -14267 63546 253476 604009 862931 893985 845789 848852
41046 848852 853674 835317 882309 1010289 1120198 1185332 1258352 1282803 1151536 968623 969388
41035 969388 1130335 1154546 937784 752223 813356 930257 802685 481654 304459 460777
41025 460777 799046 1015916 924070 584448 257997 178071 324216 484145 546336 612631
41015 612631 797199 1059776 1293024 1434879 1434211 1255497 994943 839684 818264 742956
41005 742956 504128 257175 178699 203099 192712 234288 522815 1007735 1393557 1497396
40995 1497396 1400661 1220105 942477 589090 380370 560939 1084416 1585534 1704332 1416501
40985 1416501 1032768 877377 979569 1098616 1032131 832478 698524 733975 880578 1037462
40975 1037462 1163037 1277106 1425780 1632304 1842290 1950352 1919416 1817821 1690226 1480737
40965 1480737 1177786 939192 913863 989978 914006 670520 545967 739861 1081105 1253671
40955 1253671 1188379 1091990 1150569 1331978 1458451 1374745 1055866 633220 320674 259085
40945 259085 421792 681994 934792 1129561 1244766 1291634 1307820 1301076 1237356 1119861
40935 1119861 1020029 984068 980434 996751 1096157 1284918 1415183 1351432 1173030 1069970 1082665
40924 1082665 1101621 1098577 1178957 1385548 1614759 1772403 1867756 1901763 1805075 1564769 1299025
40913 1299025 1127028 1048816 1004263 959496 899347 846772 926797 1271148 1791595 2185878
40903 2185878 2258912 2120024 1984849 1923655 1905580 1936395 2004314 2009857 1902158 1784155 1742948
40892 1742948 1694265 1555726 1443955 1490681 1571131 1468323 1252299 1227641 1499505 1843252
40882 1843252 2044886 2130590 2180190 2140518 1963585 1770329 1724103 1828248 1959843 2031629
40872 2031629 2027325 1944100 1801174 1673542 1633633 1660696 1656970 1564900 1452812 1468594 1685516
40861 1685516 1993364 2184581 2164093 2030856 1951947 2030599 2293452 2682391 3030753 3188829
40851 3188829 3213133 3281591 3426414 3602040 3995073 4773156 5315420 4310327 1268383
40842 1268383 -2378113 -4443147 -4225830 -2955089 -2053647 -1754564 -1614417 -1523821 -1614808
40833 -1614808 -1703333 -1490954 -1087189 -825760 -737727 -632295 -522029 -543576 -604077 -526805
40823 -526805 -429908 -538543 -709670 -584338 -186780 55366 -80214 -368722 -554700 -630739
40813 -630739 -611617 -405924 -79282 69105 -92209 -276916 -149273 213635 430137 289753
40803 289753 -55965 -338981 -465397 -528856 -600019 -580364 -332284 70126 369923 468712
40793 468712 560276 781511 923099 735771 381503 256536 419911 538792 420344 256444
40783 256444 248698 310231 300808 289945 377203 447337 330335 89675 -45844 26062 207059
40772 207059 363740 441322 446991 421615 417035 450362 501216 560761 624225 641412 573736 507322
40760 507322 587212 806549 981200 977850 851075 706805 554196 364943 176281 56653
40750 56653 38448 127674 299639 455186 479116 380866 291181 303981 419501 625916 877266
40739 877266 988734 771929 349493 119219 270480 523826 520860 303437 179750 231168
40729 231168 232043 56169 -97944 6169 296666 477975 391288 156792 -35613 -145868
40719 -145868 -221894 -216637 -25901 291311 504990 508395 466755 551577 688277 750329 837913
40708 837913 1079901 1270545 1078386 625528 466430 861216 1412782 1614097 1447438 1200891
40698 1200891 976335 707180 467340 390711 362632 135542 -243718 -410484 -141770 371962
40688 371962 765647 843825 656780 396340 263287 311953 387175 307545 110475 11611
40678 11611 134360 398280 665241 866125 975811 987812 941489 888120 832452 789881 857523
40667 857523 1096090 1367364 1448365 1317529 1173711 1142542 1118754 957645 686986 454827
40657 454827 376455 497576 792843 1112713 1231041 1056401 745464 526067 459297 450460
40647 450460 431935 427714 461186 506438 550822 632848 784448 977397 1157965 1309813 1447139
40636 1447139 1546905 1525786 1325521 1020483 786775 721276 724977 630970 438515 340641 491492
40625 491492 812909 1085366 1188763 1190016 1212665 1291373 1369496 1385713 1330998 1251108 1218155
40614 1218155 1265346 1313613 1200573 850572 409363 137025 147674 318555 479012 605092
40604 605092 763736 940329 1035828 1022770 1003300 1082680 1241193 1356557 1323623 1144051
40594 1144051 917138 739701 619561 529466 531457 727561 1034245 1153333 910995 522453
40584 522453 340375 411494 491354 455682 446098 587229 815466 1061071 1346658 1583016
40574 1583016 1521420 1111477 708237 676429 916174 1031905 883777 697001 648767 638123
40564 638123 548529 501633 679832 1011690 1203281 1075622 770696 590182 668031 840393
40554 840393 844274 608374 303237 129211 139725 283841 515115 788710 1024154 1157624
40544 1157624 1204079 1220541 1247791 1320181 1462910 1622951 1666587 1511696 1217437 901981
40534 901981 639119 477278 463478 572953 702107 813387 993877 1268902 1455246 1346106
40524 1346106 993968 672083 573730 658643 767586 772219 633283 437267 380952 601488
40514 601488 984677 1222897 1109600 745757 441960 432829 671802 885680 852055 626032
40504 626032 445471 421565 425782 313733 142223 87185 235010 525018 808790 906059
40494 906059 724220 417096 304750 519144 840591 1006279 1049942 1171759 1391216 1540371
40484 1540371 1533621 1428118 1244652 938526 559151 256011 94366 9051 -40255 -4011
40474 -4011 148274 372808 610620 792823 813186 640741 446995 451461 612461 626771 290026
40463 290026 -266044 -739939 -941063 -850444 -526263 -56583 437038 827019 1025921 1014307
40453 1014307 847946 622137 399539 194228 35710 -20922 17200 71427 122932 246206
40443 246206 437126 540033 470372 387615 484435 698178 808859 754565 671556 676353 784396
40432 784396 992843 1255950 1412309 1322562 1061988 815767 631984 466563 414863 646603
40422 646603 1092805 1429463 1441635 1238302 1063242 1053306 1225597 1540882 1896866 2149662
40412 2149662 2196692 2015993 1675456 1356574 1248369 1293081 1162856 653632 -22276 -514332
40402 -514332 -741765 -790713 -598650 -94808 467213 726148 731043 850277 1165922 1368923
40392 1368923 1300943 1174384 1140426 1043092 771370 497421 374097 311137 237825 289127
40382 289127 540706 836613 1057615 1284292 1530830 1624058 1533186 1495972 1597059 1555537
40372 1555537 1204840 864097 904086 1214182 1445227 1538568 1639175 1689820 1531261 1291690
40362 1291690 1277853 1518167 1743630 1787493 1703100 1521988 1205194 852493 698401 849562
40352 849562 1192061 1545535 1755207 1693807 1366514 984529 775320 757143 812160 870629
40342 870629 880515 743325 475285 298282 364415 528317 607254 693512 930464 1147201
40332 1147201 1075653 833612 801374 1039208 1219305 1186320 1199709 1470673 1778101 1770568
40322 1770568 1455465 1169635 1161522 1380368 1646510 1881060 2101887 2243063 2108359 1624234
40312 1624234 1075117 864099 997633 1062046 835957 644416 864366 1321849 1518101 1310626
40302 1310626 1015318 900947 928951 988789 1071499 1159150 1192387 1195792 1243022 1300472 1296707
40291 1296707 1301072 1406061 1490682 1378631 1200700 1285385 1659086 1959536 1925456 1706949
40281 1706949 1591863 1653843 1777417 1843031 1793139 1665761 1618998 1782663 2067572 2264756
40271 2264756 2305022 2240932 2033750 1617264 1154334 942436 1029377 1183135 1266081 1352347
40261 1352347 1437032 1359412 1126070 1005644 1150272 1386187 1536449 1696329 1998477 2320961
40251 2320961 2438410 2315264 2082307 1853569 1697117 1646010 1619402 1476188 1245495 1135764
40241 1135764 1212963 1262864 1105827 863239 763811 860784 1090769 1422253 1756036 1852216
40231 1852216 1591404 1204329 1030406 1125508 1296185 1436134 1608843 1829585 1978885 1966627
40221 1966627 1837566 1679638 1536003 1439180 1438897 1536017 1627979 1585184 1413430 1310506 1474643
40210 1474643 1824008 2013252 1822224 1425968 1145788 1047614 991636 981352 1166296 1499705
40200 1499705 1703304 1656291 1548652 1539675 1536240 1471354 1540386 1907292 2338769 2405226 2004763
40189 2004763 1487009 1250440 1340848 1461916 1322513 965477 736496 882258 1245465 1486952
40179 1486952 1539594 1622781 1826522 1959009 1874918 1687050 1530674 1364986 1166641 1094620
40169 1094620 1263450 1523407 1661040 1682912 1726166 1814525 1870756 1857152 1752843 1509308
40159 1509308 1169133 898067 756462 588481 304080 112438 262354 671533 1038768
40150 1038768 1235361 1356139 1445422 1424138 1302074 1251384 1399105 1665260 1852527 1825137
40140 1825137 1592598 1286344 1064385 999534 1054783 1152720 1220782 1198588 1104306 1078995 1231033
40129 1231033 1440266 1479360 1340581 1252822 1345394 1511588 1660499 1857593 2108289 2242985
40119 2242985 2163173 1988771 1821037 1592167 1316540 1235403 1474102 1769910 1809327 1665600
40109 1665600 1625895 1729871 1777387 1696007 1601897 1540811 1439403 1301809 1221694 1198174 1135805
40098 1135805 1023345 942761 918142 912783 946797 1063252 1207924 1287730 1316847 1378467 1491126
40087 1491126 1631388 1814149 2020617 2133774 2086291 1976290 1886382 1709301 1353333 1016405
40077 1016405 1003951 1303745 1577453 1598538 1504299 1557946 1803933 2036884 2051913 1878729
40067 1878729 1758675 1864295 2076779 2145209 2041428 1986587 2115485 2326205 2507067 2666242
40057 2666242 2754725 2644954 2427854 2433704 2747294 2981031 2789079 2355515 2078970 2002321
40047 2002321 1892253 1702502 1593081 1596167 1594956 1564023 1549292 1494793 1356105 1285804 1438266
40036 1438266 1692764 1827925 1847620 1872992 1867137 1764055 1708225 1831364 1942997 1805898
40026 1805898 1584670 1638287 1980695 2327984 2551643 2670918 2537099 2020734 1434480 1249186
40016 1249186 1408606 1437553 1217195 1088081 1141548 1033737 678053 526477 870765 1361359
40006 1361359 1553072 1514220 1553324 1701366 1823967 1954693 2158656 2287062 2195789 2036372
39996 2036372 2045767 2197194 2305567 2327043 2317792 2240702 2051070 1859755 1793134 1782811 1684376
39985 1684376 1523266 1454238 1544914 1736923 1954747 2140966 2249588 2287343 2292092 2230585
39975 2230585 2030665 1754859 1598259 1645458 1755770 1752212 1611134 1426626 1308785 1341503
39965 1341503 1513117 1677801 1711846 1684419 1725661 1785439 1725315 1591636 1552393 1608787 1647569
39954 1647569 1744439 2089182 2597147 2932359 2967030 2889395 2799012 2553810 2126493 1762195
39944 1762195 1627890 1608956 1596819 1675839 1871148 2009404 2005623 2022101 2179137 2360371
39934 2360371 2446088 2476014 2451630 2268749 1993449 1904803 2098106 2337624 2459229 2599340
39924 2599340 2847378 3015821 2983092 2934963 3008406 3011633 2785712 2550959 2573369 2730518
39914 2730518 2728915 2549675 2378702 2278994 2214698 2223106 2288999 2217429 1899723 1554631 1460215
39903 1460215 1592735 1742276 1809712 1780650 1610113 1364180 1271755 1399991 1489537 1351964
39893 1351964 1198119 1300381 1560912 1718518 1767889 1846847 1904808 1835964 1780996 1932396
39883 1932396 2153722 2140889 1882722 1643997 1563067 1571387 1653778 1888821 2245955 2582100
39873 2582100 2820051 2949887 2927872 2755359 2559854 2418839 2227588 1929133 1725752 1839293
39863 1839293 2186551 2502281 2658685 2671456 2544884 2326727 2176875 2182436 2245764 2312283
39853 2312283 2500818 2826791 3048438 3020144 2945919 3029071 3141944 3133326 3172333 3425585
39843 3425585 3652794 3535315 3208932 3056885 3128920 3161075 3031880 2816095 2527123 2194276
39833 2194276 2056394 2271255 2545044 2454827 2048167 1737972 1701533 1776845 1861073 2004996
39823 2004996 2174315 2294496 2459608 2734844 2866984 2600716 2180600 2095436 2386117 2645643
39813 2645643 2656156 2575604 2518387 2415332 2318153 2411848 2665966 2840269 2859379 2834014 2740128
39802 2740128 2471036 2187462 2192868 2444456 2593146 2525024 2457815 2488508 2472260 2386719 2392005
39791 2392005 2477653 2466329 2415005 2574958 2885638 2966784 2732145 2565983 2725106 2973748
39781 2973748 3005889 2869625 2769593 2759633 2823525 2985525 3161996 3143668 2886378 2621057
39771 2621057 2557040 2653766 2756043 2775191 2695532 2571763 2519872 2554531 2514844 2345317 2304533
39760 2304533 2615381 3053659 3216162 3062571 2835353 2601516 2299503 2098685 2224257
39751 2224257 2510978 2619985 2619108 2832819 3194647 3324141 3216702 3248293 3467415 3499945
39741 3499945 3238978 3025746 3034713 3073243 3113512 3403707 3876639 4060434 3801475 3503315
39731 3503315 3421063 3295114 2942904 2645184 2640715 2753401 2816951 2977825 3298125 3547428
39721 3547428 3649303 3825280 4050829 3943939 3490418 3265750 3555587 3860171 3723427
39712 3723427 3467444 3567644 3830863 3806888 3582048 3521897 3562758 3404376 3169201 3254362
39702 3254362 3672100 4072006 4298519 4439340 4434003 4124272 3652859 3380290 3388792 3398739
39692 3398739 3191941 2870734 2706991 2907318 3462178 4086963 4419715 4393512 4275553 4266978
39682 4266978 4278381 4179232 3997162 3760142 3435283 3150158 3159516 3445070 3664564 3641797
39672 3641797 3574650 3621485 3656521 3599104 3592394 3665203 3613689 3422357 3395220 3646756 3872052
39661 3872052 3856901 3804412 3911716 4036641 4032831 3998799 3956009 3728558 3397275 3395617 3858019
39650 3858019 4340675 4493432 4527796 4695655 4809055 4659885 4447637 4393876 4363034 4233607
39640 4233607 4202128 4353257 4383034 4118987 3859192 3842828 3873856 3823941 3968007 4418923
39630 4418923 4775647 4761043 4665974 4742264 4749733 4557688 4549091 4897601 5095218 4792469 4465768
39619 4465768 4606987 4892344 4860384 4777759 5043876 5331004 5176199 4907186 5085413 5475989
39609 5475989 5474793 5174677 5108489 5264995 5244793 5105966 5197498 5411799 5418836 5373969 5594702
39598 5594702 5827853 5652615 5313412 5323651 5549870 5543923 5459841 5714362 6022536 5759867
39588 5759867 5096080 4800740 5048488 5338026 5475193 5713600 6001996 5994363 5779988 5793842
39578 5793842 6059644 6255847 6365829 6502686 6342897 5593320 4773911 4622994 4957028
39569 4957028 5060300 4941994 5164063 5643568 5759636 5539539 5606848 5994071 6119574 5932384
39559 5932384 5963718 6217173 6133059 5730882 5670763 6055740 6264083 6124513 6182258 6605852
39549 6605852 6873479 6770332 6711465 6857508 6858138 6669377 6698660 6963727 7013298 6817219
39539 6817219 6829588 7081188 7141522 7027333 7163261 7415606 7223603 6738534 6725158 7248004
39529 7248004 7584073 7535916 7659766 8060153 8167986 7908985 7899167 8264332 8436799 8313731
39519 8313731 8415793 8718617 8587116 8075661 7997419 8471611 8727127 8587869 8766596 9401943
39509 9401943 9737536 9589021 9670639 10103502 10117989 9652648 9666841 10364734 10729699 10409131
39499 10409131 10398344 11153389 11712919 11528801 11476329 12026665 12023885 10487231 8273613 6771504
39489 6771504 6138671 5898756 6089342 6731222 7241379 7376398 7758061 8653206 9343600
39480 9343600 9443780 9597108 10114889 10287028 9860982 9773869 10505183 11131117 10962553 10685409
39470 10685409 10916377 11113511 10922399 11073598 11879738 12385147 12106423 12045379 12843658
39461 12843658 13553775 13429951 13280644 13799109 14242951 14066010 14124598 14905519 15333313
39452 15333313 14759955 14329734 14904578 15514464 15389978 15541716 16663734 17520541 17215976
39443 17215976 16992759 17880418 18687933 18361562 18143325 19191770 20277207 20192651 20205858
39434 20205858 21582038 22921329 22683557 22157656 23061510 24365571 24480458 24415959 25638849
39425 25638849 26973225 26899281 26756143 28275987 30148608 30539752 30720324 32528826 34648539
39416 34648539 35275230 35923509 38463705 41098536 41696939 42203110 44967444 47904176 48579810
39407 48579810 49622376 54089884 59168049 61246734 63314329 69446268 75933975 76988200
39399 76988200 75487172 77940204 82795126 85526368 90954915 105983397 124308067 136661816
39391 136661816 152236794 183203766 204256773 160637586 37100122 -104727725 -184726958
39384 -184726958 -186652883 -157593846 -138482288 -127827695 -111795469 -94916139 -87531474
39377 -87531474 -85990802 -81764339 -76749262 -76264827 -76825411 -72483706 -65808262 -62509349
39369 -62509349 -61197409 -57335841 -52227313 -49906772 -49303397 -46892673 -43621456 -42496144
39361 -42496144 -42362773 -40258137 -37243948 -36195387 -36219502 -34618114 -32187346 -31473275 -31722952
39352 -31722952 -30428344 -28181048 -27380023 -27599699 -26615352 -24740696 -24009394 -24178505 -23458021
39343 -23458021 -22197934 -22125917 -22819726 -22474498 -21361971 -21155688 -21574697 -20957893 -19521142
39334 -19521142 -18931103 -19211561 -19008220 -18357066 -18354852 -18639786 -17974217 -16817506 -16627823
39325 -16627823 -17098014 -16719457 -15620059 -15229509 -15545477 -15319563 -14602868 -14545269 -14941748
39316 -14941748 -14505813 -13402429 -13046843 -13485739 -13374682 -12533588 -12190947 -12616748 -12738836
39307 -12738836 -12248512 -11991956 -12126328 -11884986 -11305887 -11266311 -11690040 -11597534 -11007237 -10899672
39297 -10899672 -11230778 -10921228 -9954257 -9530335 -9900473 -9964789 -9347856 -8994982 -9279396
39288 -9279396 -9316506 -8676795 -8092852 -7904742 -7420408 -6482894 -6204025 -7387833 -9397853
39279 -9397853 -11174569 -12305670 -12673365 -12179722 -11277771 -10752405 -10618085 -10199734 -9482320
39270 -9482320 -9259880 -9731003 -10120139 -9985445 -9771368 -9760883 -9595604 -9169940 -8937240 -8992814
39260 -8992814 -8855400 -8446124 -8295243 -8526024 -8625044 -8442974 -8416068 -8595441 -8501861 -8151235
39250 -8151235 -8148347 -8530790 -8614576 -8247244 -8098970 -8403478 -8532780 -8188138 -7905765 -7953125
39240 -7953125 -7797802 -7170310 -6664580 -6755799 -7096651 -7254800 -7315323 -7344458 -7098373 -6659577
39230 -6659577 -6538784 -6789757 -6856582 -6608494 -6618877 -7070059 -7323505 -6992346 -6526359 -6298462
39220 -6298462 -6024188 -5560883 -5380709 -5716141 -6066324 -6076700 -6107881 -6413644 -6554624 -6186800
39210 -6186800 -5688924 -5454813 -5269565 -4930240 -4797928 -5169527 -5709149 -6011885 -6159471
39201 -6159471 -6289467 -6229461 -5977904 -5921686 -6168736 -6288631 -6080151 -5925374 -6025163 -6010036
39191 -6010036 -5699020 -5491233 -5581200 -5552126 -5198552 -4971441 -5125441 -5221671 -4996044 -4903770
39181 -4903770 -5222133 -5430878 -5133570 -4802769 -4903477 -5037904 -4729339 -4342970 -4400400 -4615556
39171 -4615556 -4472061 -4207525 -4355819 -4773946 -4964489 -4964115 -5105268 -5253139 -5060000 -4674181
39161 -4674181 -4477118 -4402791 -4174402 -3903742 -3827986 -3801528 -3676450 -3790065 -4388960 -4958948
39151 -4958948 -4871465 -4360699 -4105120 -4148239 -4028161 -3731577 -3692019 -3962165 -4145514 -4094600
39141 -4094600 -4019521 -3973735 -3845660 -3776121 -3988657 -4285425 -4281238 -4055751 -4023591 -4245368
39131 -4245368 -4413078 -4444085 -4554638 -4784360 -4925546 -4881255 -4687748 -4296363 -3740134 -3354428
39121 -3354428 -3397698 -3624214 -3662260 -3595773 -3694537 -3813851 -3631613 -3305274 -3302320 -3674367
39111 -3674367 -4037835 -4184440 -4195873 -4055097 -3679205 -3281557 -3207090 -3454341 -3785607 -4177212
39101 -4177212 -4687631 -5042191 -4908623 -4495583 -4324901 -4460590 -4491688 -4230206 -3891349 -3612843
39091 -3612843 -3336087 -3164287 -3305281 -3621347 -3731613 -3599330 -3539121 -3615703 -3543533 -3259289
39081 -3259289 -3095966 -3245306 -3471841 -3517067 -3435604 -3396243 -3449036 -3586657 -3770683 -3843760
39071 -3843760 -3668052 -3365699 -3175997 -3102545 -2966184 -2757865 -2651685 -2706760 -2823892 -2940424
39061 -2940424 -3020992 -2962904 -2775676 -2713892 -2944906 -3250601 -3363790 -3391698 -3548766 -3699022
39051 -3699022 -3591337 -3346556 -3255210 -3283157 -3254727 -3313989 -3651163 -3955045 -3765996 -3271868
39041 -3271868 -3108508 -3405192 -3668440 -3616548 -3469561 -3343007 -3022975 -2512863 -2197738 -2240299
39031 -2240299 -2332317 -2259899 -2229950 -2412819 -2610887 -2620198 -2537759 -2504427 -2492215 -2509612 -2671057
39020 -2671057 -2924700 -3055382 -3062391 -3167434 -3361299 -3354449 -3094683 -2912388 -3000822 -3151689
39010 -3151689 -3161365 -3109535 -3078398 -2981333 -2832443 -2810715 -2899665 -2838559 -2585095 -2443148 -2568585
38999 -2568585 -2730346 -2727624 -2661516 -2631735 -2566687 -2529268 -2764281 -3224718 -3471175 -3294687
38989 -3294687 -3042596 -3061424 -3214607 -3257169 -3304109 -3555245 -3853440 -3890779 -3649360 -3341638
38979 -3341638 -3112097 -3042841 -3220182 -3536007 -3646973 -3389834 -3034322 -2893090 -2898380 -2797575
38969 -2797575 -2546285 -2264944 -2014984 -1856342 -1921325 -2189825 -2383334 -2316049 -2167504 -2187404
38959 -2187404 -2326203 -2390190 -2371506 -2375548 -2383935 -2332853 -2291591 -2345795 -2429751 -2463799 -2519043
38948 -2519043 -2662285 -2781961 -2754100 -2648821 -2599615 -2592566 -2534870 -2402514 -2193829 -1888298
38938 -1888298 -1573584 -1449677 -1586982 -1840224 -2082042 -2310683 -2448914 -2317072 -1951003
38929 -1951003 -1673306 -1676033 -1796590 -1876143 -2027002 -2306358 -2440814 -2207687 -1854116 -1780328
38919 -1780328 -1967993 -2069843 -1958127 -1849796 -1935808 -2176458 -2451041 -2671692 -2751120 -2655562
38909 -2655562 -2499260 -2443550 -2509318 -2591626 -2621461 -2619601 -2630893 -2669766 -2686058 -2575629 -2319508
38898 -2319508 -2095318 -2094767 -2241180 -2285845 -2180321 -2111205 -2152516 -2168114 -2106552 -2085467 -2106506
38887 -2106506 -2010734 -1816095 -1749367 -1814567 -1714758 -1391128 -1240389 -1526754 -1941102 -2064932
38877 -2064932 -1957518 -1938076 -2060908 -2173662 -2269969 -2411091 -2470083 -2309370 -2087716 -2084181
38867 -2084181 -2329202 -2656761 -2960284 -3146384 -3035412 -2609588 -2191796 -2080842 -2166858 -2188647
38857 -2188647 -2180914 -2338196 -2602526 -2743115 -2733662 -2721459 -2718238 -2627706 -2484808 -2380234 -2253194
38846 -2253194 -2036789 -1882084 -1947378 -2099177 -2124267 -2094763 -2197275 -2347265 -2339238 -2258341
38836 -2258341 -2345310 -2525095 -2471508 -2121708 -1754416 -1548310 -1402057 -1212978 -1025917 -884766
38826 -884766 -811918 -928966 -1318318 -1775396 -1979121 -1904092 -1801623 -1804165 -1835060 -1879970 -2027781
38815 -2027781 -2223162 -2277689 -2175158 -2111847 -2193582 -2314201 -2346516 -2240737 -1949528 -1483699
38805 -1483699 -1025677 -762850 -636446 -481035 -360948 -505600 -934518 -1403324 -1717894
38796 -1717894 -1880518 -1953545 -1994782 -2081246 -2189975 -2139648 -1866100 -1620017 -1622741 -1681710 -1482427
38785 -1482427 -1122386 -966426 -1074767 -1194954 -1253855 -1407434 -1620473 -1658655 -1532564 -1502834
38775 -1502834 -1585338 -1501777 -1218067 -1080823 -1266493 -1509881 -1562256 -1542497 -1637332 -1796029
38765 -1796029 -1924115 -2068552 -2217679 -2215279 -2063724 -2019279 -2182997 -2276147 -2045742 -1648442
38755 -1648442 -1399757 -1339087 -1261334 -1034119 -717130 -491953 -571873 -1024634 -1613684 -1993737
38745 -1993737 -2103790 -2151728 -2204597 -2102268 -1835446 -1659104 -1694957 -1744390 -1655090 -1561239
38735 -1561239 -1580985 -1580914 -1445796 -1300667 -1258551 -1224413 -1160012 -1250738 -1557994 -1783930 -1675666
38724 -1675666 -1433777 -1416850 -1626588 -1777408 -1718131 -1509553 -1233285 -998438 -1004845 -1320859
38714 -1320859 -1692390 -1813699 -1690819 -1520772 -1348463 -1110963 -917137 -985587 -1326238 -1718218
38704 -1718218 -1989494 -2125749 -2140485 -2043412 -1929918 -1920720 -1995479 -2010061 -1875372 -1632311
38694 -1632311 -1391771 -1277215 -1346741 -1481929 -1455474 -1221915 -1037474 -1160091 -1522013 -1832518
38684 -1832518 -1916143 -1809807 -1612441 -1404935 -1276714 -1277069 -1334066 -1316877 -1185715 -1037107
38674 -1037107 -1016043 -1187090 -1440559 -1543388 -1371927 -1071318 -876803 -832050 -841508 -922478
38664 -922478 -1158554 -1443487 -1572825 -1598764 -1760909 -2017427 -2025222 -1708932 -1457083 -1548800
38654 -1548800 -1752015 -1747627 -1612870 -1581365 -1628207 -1627254 -1650579 -1760933 -1761225 -1535329 -1404124
38643 -1404124 -1702826 -2179376 -2288780 -1988844 -1760136 -1851531 -1977588 -1841452 -1545125 -1335411
38633 -1335411 -1257116 -1212838 -1145317 -1049854 -973550 -1039326 -1288094 -1498602 -1390495 -1024323
38623 -1024323 -767937 -832272 -1062106 -1212327 -1189305 -975109 -580381 -184235 -95146 -421124
38613 -421124 -921194 -1291296 -1465461 -1546413 -1585972 -1566097 -1515080 -1528507 -1691409 -2004003
38603 -2004003 -2338750 -2483891 -2322594 -1976477 -1683428 -1533730 -1423485 -1262826 -1106091
38594 -1106091 -1041992 -1056669 -1061744 -1005315 -918451 -873628 -902944 -953299 -951861 -911016 -898911 -911821
38582 -911821 -895750 -907486 -1077477 -1341082 -1406522 -1134579 -777369 -659943 -771452 -868726
38572 -868726 -847576 -781961 -704403 -602582 -574416 -743462 -1045682 -1303397 -1464613 -1564102
38562 -1564102 -1518978 -1222266 -811868 -578805 -592599 -661570 -679631 -742839 -857975 -809059
38552 -809059 -468615 -59124 65402 -189163 -601350 -914656 -1083991 -1248545 -1495586 -1692537
38542 -1692537 -1633158 -1353552 -1148810 -1193102 -1319138 -1325334 -1315047 -1492213 -1765795 -1856561
38532 -1856561 -1720995 -1558717 -1431667 -1208020 -916607 -824170 -1042115 -1326864 -1425292 -1411704
38522 -1411704 -1515078 -1753849 -1904004 -1769646 -1392490 -1027887 -936030 -1142801 -1414265 -1518413
38512 -1518413 -1447449 -1303607 -1097417 -835000 -689612 -836304 -1162674 -1392756 -1477209 -1605151
38502 -1605151 -1829798 -1960654 -1886347 -1757280 -1754385 -1864055 -1955359 -1927049 -1749506 -1516173
38492 -1516173 -1438711 -1603524 -1773160 -1667419 -1398039 -1321560 -1471233 -1500628 -1264209 -1073874
38482 -1073874 -1207433 -1493174 -1613728 -1562871 -1549954 -1641913 -1742392 -1795208 -1801731 -1731485 -1576684
38471 -1576684 -1413031 -1296644 -1206588 -1172716 -1309758 -1609575 -1837732 -1763138 -1397705 -941648
38461 -941648 -609727 -545047 -732598 -945037 -955503 -845704 -889371 -1100554 -1187131 -1035751
38451 -1035751 -906180 -975720 -1032275 -882129 -761949 -999086 -1462236 -1706718 -1552355 -1198030
38441 -1198030 -848664 -547335 -343726 -325073 -436883 -487695 -376908 -184455 -51390 -94291
38431 -94291 -371738 -779579 -1044379 -991105 -765995 -637365 -652277 -679451 -717960 -917456
38421 -917456 -1286385 -1601967 -1672607 -1535915 -1341549 -1163502 -990376 -816869 -686042 -666113
38411 -666113 -790624 -1008753 -1228870 -1416298 -1569140 -1591634 -1340291 -866131 -451496 -283647
38401 -283647 -239851 -150642 -122270 -368879 -817668 -1144157 -1191811 -1119080 -1092555 -1058739 -923857
38390 -923857 -785555 -821808 -1017815 -1154000 -1082139 -912915 -863733 -969760 -1048619 -964611
38380 -964611 -807279 -728562 -724438 -728390 -820725 -1117709 -1482628 -1603209 -1403231 -1146521 -1062043
38369 -1062043 -1094259 -1118073 -1163026 -1283723 -1417493 -1524690 -1680506 -1879363 -1949227 -1822777
38359 -1822777 -1678381 -1620301 -1453100 -1034579 -645856 -678289 -1068660 -1376811 -1375590 -1252927
38349 -1252927 -1223670 -1226971 -1089343 -802468 -559023 -592801 -970045 -1466146 -1727217 -1652844
38339 -1652844 -1509523 -1551472 -1687943 -1696739 -1590022 -1519210 -1455045 -1256006 -975283 -800126
38329 -800126 -717605 -528573 -200361 53707 68039 -129366 -467774 -891488 -1249606 -1371675
38319 -1371675 -1307557 -1289217 -1410707 -1535127 -1548203 -1504920 -1482486 -1479015 -1511092 -1638959 -1836819
38308 -1836819 -1976051 -1966555 -1795967 -1460802 -1027689 -722593 -738079 -953547 -1069040 -1021168
38298 -1021168 -1021139 -1155453 -1228867 -1098153 -905871 -839926 -864731 -840755 -742401 -610709 -439741
38287 -439741 -265542 -242465 -456909 -735463 -800685 -607156 -411537 -492353 -854053 -1223399
38277 -1223399 -1327518 -1166933 -984517 -964011 -1044209 -1077037 -1047857 -1017749 -950515 -772317
38267 -772317 -553916 -457407 -514972 -610953 -668947 -714616 -770749 -826746 -891305 -954336 -946091
38256 -946091 -861451 -843244 -983967 -1140411 -1138342 -1061551 -1104007 -1223166 -1213336 -1066358 -965724
38245 -965724 -947980 -873270 -735538 -697565 -789733 -869499 -913079 -1042663 -1218763 -1228345 -1057865
38234 -1057865 -958556 -1031923 -1052924 -831144 -470773 -157966 34285 36485 -206350 -500885
38224 -500885 -523975 -317837 -302216 -611360 -820744 -604771 -271928 -268608 -476500 -462791
38214 -462791 -224968 -207999 -644961 -1284054 -1770861 -1979066 -1950795 -1787720 -1637821 -1582358
38204 -1582358 -1514250 -1275635 -885910 -503315 -237426 -136494 -243758 -494731 -676604 -672170
38194 -672170 -618014 -636608 -585538 -327644 -84555 -189073 -575224 -852182 -844129 -726475
38184 -726475 -647441 -573030 -544667 -719224 -1025172 -1107411 -811846 -473051 -495366 -832264
38174 -832264 -1119487 -1199561 -1249381 -1410449 -1539985 -1428979 -1128462 -913853 -943650 -1072849
38164 -1072849 -1065795 -920165 -863728 -1034858 -1292390 -1397200 -1281404 -1057070 -839000 -664622
38154 -664622 -551778 -533816 -620412 -761342 -861186 -849090 -763891 -724787 -747601 -665114 -372723
38143 -372723 -83122 -109127 -403797 -589828 -504152 -416604 -570340 -797209 -812549 -654804
38133 -654804 -564951 -600772 -640541 -640137 -622495 -514042 -253394 8829 62212 -67841 -194903
38122 -194903 -271780 -390726 -552338 -671303 -761273 -884814 -973945 -938021 -892940 -1016186
38112 -1016186 -1203169 -1151987 -813019 -496507 -481595 -731097 -1030439 -1205718 -1171286 -961237
38102 -961237 -759906 -739489 -854739 -946805 -997944 -1073291 -1073891 -838091 -484956 -341944 -474527
38091 -474527 -599091 -562009 -583836 -850707 -1154083 -1200537 -1086723 -1170482 -1543046 -1891656
38081 -1891656 -1913285 -1684112 -1534696 -1636548 -1810586 -1783254 -1577840 -1511095 -1740554 -1976993
38071 -1976993 -1825373 -1307621 -815229 -589322 -506903 -395521 -288921 -278180 -330904 -384816
38061 -384816 -463895 -594281 -730435 -841834 -953412 -1051056 -1082562 -1089862 -1182351 -1336042 -1393596
38050 -1393596 -1318869 -1264464 -1312192 -1338542 -1235205 -1076053 -948045 -793467 -555554 -322477
38040 -322477 -184209 -87931 23650 68224 -33831 -205076 -357973 -570426 -931164 -1309799
38030 -1309799 -1484288 -1444868 -1378281 -1371542 -1320213 -1154520 -990119 -975133 -1083120 -1144192 -1051796
38019 -1051796 -874919 -750102 -699603 -617793 -452118 -311860 -313922 -389136 -378974 -301680 -361496
38008 -361496 -656791 -1012500 -1163237 -1012477 -679769 -390587 -340950 -550854 -809274 -873420
37998 -873420 -762167 -742053 -983445 -1348237 -1572074 -1550754 -1387816 -1247635 -1214126 -1231056
37988 -1231056 -1164742 -986738 -860285 -939374 -1128874 -1193920 -1070032 -888401 -731025 -581971
37978 -581971 -509348 -634437 -875477 -975304 -855975 -705558 -643161 -568382 -447284 -454219 -655377
37967 -655377 -812446 -715462 -501194 -429618 -533241 -697833 -902610 -1142067 -1267710 -1162600
37957 -1162600 -966885 -903285 -968883 -1001003 -949542 -880586 -804034 -704369 -662808 -748464 -856443
37946 -856443 -844323 -769206 -808822 -993949 -1172588 -1192094 -1002010 -661994 -356154 -279641
37936 -279641 -398870 -477050 -450365 -555546 -904042 -1185231 -1074328 -725324 -529160 -550679
37926 -550679 -571367 -561490 -692406 -918477 -955707 -718786 -433466 -262270 -140722 -46860
37916 -46860 -113057 -364803 -620259 -757415 -850153 -959512 -1023849 -1032720 -1072951 -1118005 -1004293
37905 -1004293 -708657 -427089 -288285 -211393 -136381 -156747 -306134 -439245 -457429 -443722
37895 -443722 -443253 -329054 -51999 171565 114026 -160813 -408403 -485343 -386030 -157388 56916
37884 56916 34497 -267863 -575472 -597578 -390739 -254700 -336977 -511608 -606646 -588096 -522736
37873 -522736 -480120 -479691 -470225 -388201 -280136 -296738 -503185 -775761 -958355 -1031892 -1047381
37862 -1047381 -996366 -865030 -733022 -688205 -699669 -694194 -703332 -804278 -950280 -995072 -887091
37851 -887091 -733425 -658878 -678453 -714516 -677658 -530148 -320279 -153132 -97231 -137307 -236235
37840 -236235 -396076 -623887 -886696 -1136017 -1321972 -1354482 -1141441 -741011 -404226 -363742
37830 -363742 -598847 -868271 -941865 -756131 -411675 -102904 57 -99611 -211490 -171181
37820 -171181 -44960 -39993 -229397 -460614 -547738 -480101 -419529 -541311 -882868 -1292952
37810 -1292952 -1521495 -1424007 -1113856 -878001 -911481 -1152153 -1385070 -1467182 -1412468 -1289177
37800 -1289177 -1108831 -851524 -565063 -383547 -426014 -677985 -966579 -1060994 -853642 -489998
37790 -489998 -276447 -378952 -631146 -734411 -639894 -604849 -833834 -1195366 -1377802 -1227783
37780 -1227783 -849500 -464142 -267843 -335795 -546988 -665783 -595392 -476463 -449216 -443767
37770 -443767 -349864 -267749 -378434 -630074 -774636 -706662 -579055 -581489 -759448 -1029753
37760 -1029753 -1217451 -1125517 -758122 -429525 -437281 -668130 -769707 -675468 -662043 -872194
37750 -872194 -1103928 -1154625 -1070345 -938238 -727851 -492218 -443606 -629981 -777302 -668687
37740 -668687 -471644 -465236 -625232 -715059 -644024 -512087 -417876 -419316 -563212 -768255 -811703
37729 -811703 -618134 -410553 -373684 -345162 -101761 210012 255850 35261 -120707 -57782
37719 -57782 15836 -105934 -354993 -560039 -665931 -696532 -675415 -658828 -707040 -771883 -733703
37708 -733703 -569360 -361308 -151318 60551 179104 58713 -285127 -670329 -982688 -1254519
37698 -1254519 -1480293 -1538041 -1372144 -1102705 -857889 -612582 -288845 66211 295669 296513
37688 296513 127679 -30580 -42076 28072 -16576 -210991 -314634 -137025 123634 98118
37678 98118 -229415 -477833 -394165 -161483 -65726 -89643 -30751 134177 227421 152706 7826
37667 7826 -84048 -114023 -133228 -157531 -168729 -163403 -165302 -192872 -221940 -198876 -116075 -56572
37655 -56572 -117423 -296138 -501147 -661431 -763604 -793491 -727090 -597179 -494654 -471460
37645 -471460 -491347 -496427 -477821 -464795 -478356 -502007 -481340 -378077 -243284 -172371 -145550
37634 -145550 -18604 226642 341839 108413 -294734 -457737 -279395 -91614 -172041 -381009
37624 -381009 -440155 -359394 -344388 -401519 -324684 -83798 33375 -210704 -654584 -918916
37614 -918916 -869595 -742553 -804294 -1032296 -1201005 -1175654 -1001722 -763972 -510884 -323257
37604 -323257 -302911 -430060 -549958 -570279 -556535 -553685 -452387 -168569 157036 311769
37594 311769 295081 273235 292821 226231 -1404 -305575 -582203 -799178 -926350 -932062 -891500
37583 -891500 -945662 -1083639 -1098147 -848603 -470613 -226025 -205796 -278497 -316336 -383180 -637798
37572 -637798 -1058680 -1359579 -1293441 -1002023 -871446 -996166 -1027195 -709773 -331742 -352147
37562 -352147 -738667 -1021784 -952212 -749105 -672373 -694621 -697317 -693921 -717084 -721636 -730642 -860412
37550 -860412 -1074836 -1131983 -918005 -636583 -521684 -549200 -577277 -580390 -579557 -519649 -396336
37539 -396336 -351532 -470560 -630537 -710958 -786535 -923656 -962726 -749648 -458017 -413561
37529 -413561 -654599 -900204 -925299 -766072 -578511 -482844 -539760 -715146 -866474 -891089
37519 -891089 -867433 -935635 -1084054 -1178534 -1155087 -1058555 -940032 -835640 -787632 -768870 -664465
37508 -664465 -460463 -359971 -547832 -910196 -1155992 -1158023 -1009161 -806722 -570656 -336866
37498 -336866 -147222 35855 252009 423067 467582 465994 514532 477330 132738 -434291
37488 -434291 -832755 -818045 -553654 -366561 -411947 -631751 -875461 -982524 -875604 -653823
37478 -653823 -518538 -574959 -767280 -979548 -1103547 -1061493 -902805 -833903 -993203 -1237854
37468 -1237854 -1323823 -1241269 -1159825 -1092397 -887119 -566935 -393706 -515250 -789968 -1044750
37458 -1044750 -1265765 -1430337 -1396487 -1115812 -764114 -518733 -386322 -373276 -596963 -1028958
37448 -1028958 -1325113 -1173994 -719884 -411540 -480002 -752216 -939993 -936419 -833034 -777522
37438 -777522 -820664 -837843 -651094 -289029 -27973 -79654 -342124 -578146 -729452 -896558
37428 -896558 -1094229 -1215378 -1209150 -1134052 -1044265 -959495 -936638 -1037342 -1212838 -1321314 -1266200
37417 -1266200 -1053862 -755443 -492140 -393176 -454236 -497001 -401803 -321927 -499837 -899937
37407 -899937 -1210817 -1227182 -1052470 -882606 -766721 -666373 -599262 -601412 -642671 -692213 -794754
37396 -794754 -971625 -1106432 -1058678 -874377 -759367 -816829 -911748 -852439 -633227 -413948
37386 -413948 -297596 -235055 -161428 -109828 -110486 -66447 131949 392810 474903 290973 23066
37375 23066 -140598 -262894 -529770 -938154 -1251837 -1259458 -976548 -594830 -317759 -248580
37365 -248580 -357513 -526885 -658369 -735616 -772647 -761867 -730192 -779845 -970677 -1196942
37355 -1196942 -1293592 -1250568 -1200312 -1185611 -1074740 -761929 -342561 -9703 145368 145578 10628
37344 10628 -248795 -521646 -597180 -353014 80973 406977 433916 253594 123470 187128
37334 187128 349333 430783 385636 312902 285194 242997 80565 -202045 -460997 -524575 -359229
37323 -359229 -127574 -47727 -165192 -301915 -281591 -165450 -176285 -395109 -638504 -681649
37313 -681649 -519542 -332831 -251159 -248813 -257852 -271000 -288519 -254509 -140464 -51216 -130756
37302 -130756 -345701 -474861 -381177 -202280 -164185 -271081 -329855 -269665 -260146 -441245 -680455
37291 -680455 -727889 -536174 -296932 -194789 -245589 -372372 -528540 -709524 -906441 -1079823
37281 -1079823 -1155316 -1060440 -814955 -571048 -500977 -637118 -860706 -1030837 -1071548 -960963
37271 -960963 -729972 -488809 -371794 -408109 -488114 -484984 -374255 -221528 -105191 -78873
37261 -78873 -159404 -305605 -436669 -514785 -596877 -767331 -1019068 -1228514 -1261167 -1095496
37251 -1095496 -835601 -605021 -445070 -332128 -269953 -306136 -439380 -569906 -596245 -529495
37241 -529495 -454229 -400849 -332457 -260541 -288931 -487849 -763364 -920205 -872288 -756055 -793075
37230 -793075 -1037583 -1308319 -1411162 -1386581 -1448596 -1678051 -1879463 -1794677 -1386838 -857853
37220 -857853 -453467 -315191 -450201 -743425 -1019585 -1162079 -1158550 -1021681 -765168 -508436
37210 -508436 -454686 -627218 -757951 -628142 -408652 -412112 -583538 -561590 -260025 -28520
37200 -28520 -105772 -252797 -164400 35619 23554 -195853 -349007 -382251 -518932 -828426
37190 -828426 -1086486 -1145668 -1147309 -1240679 -1346908 -1358136 -1350800 -1411888 -1430466 -1276478 -1061024
37179 -1061024 -995442 -1068624 -1083981 -979635 -897290 -928765 -993190 -1010187 -1029688 -1124555 -1277017
37168 -1277017 -1422254 -1493981 -1393236 -1043296 -532977 -87106 161549 254106 226364 30521
37158 30521 -264476 -391503 -195412 107820 191108 32155 -160368 -338107 -617057 -899787
37148 -899787 -851430 -389473 90932 187828 -20554 -182071 -190911 -233185 -410765 -602434
37138 -602434 -691701 -697325 -654876 -570401 -518012 -582700 -661746 -531416 -197640 15595 -140064
37127 -140064 -509208 -743420 -712969 -550640 -398767 -311056 -345553 -536726 -756382 -780516
37117 -780516 -548723 -228657 14517 174736 279829 269428 117160 -43702 -73772 -45368
37107 -45368 -143799 -368005 -496815 -392137 -191755 -122002 -225402 -366961 -430469 -407241
37097 -407241 -349603 -344503 -491912 -793379 -1079551 -1157656 -1022015 -814551 -601950 -337482
37087 -337482 -46711 125907 119042 46275 378 -79996 -234931 -337029 -296168 -283499 -526469
37076 -526469 -941737 -1206185 -1187443 -1075434 -1046305 -1020534 -861511 -635147 -517162 -537769
37066 -537769 -559904 -480605 -363998 -377870 -619795 -976947 -1183893 -1110169 -963493 -1054880
37056 -1054880 -1354593 -1482485 -1212031 -766611 -471406 -327445 -166515 -54557 -202257
37047 -202257 -519829 -621563 -371091 -128993 -280776 -728605 -1060600 -1078017 -918584 -736061
37037 -736061 -518190 -246584 -14116 114363 205182 306044 311863 126999 -105341 -110059
37027 -110059 162479 422176 351788 -45130 -476789 -686642 -666946 -577391 -534452 -508663
37017 -508663 -405080 -225159 -120882 -238305 -510090 -692304 -655441 -549252 -589119 -760569
37007 -760569 -875655 -876352 -895626 -984305 -960775 -653441 -183711 135901 149861 -8980 -124390
36996 -124390 -121872 -55758 39241 189552 377143 476540 374118 133136 -47464 -58787 25705
36985 25705 120243 257210 443061 521011 369908 158629 165362 362496 434630 242212 1499
36974 1499 -87385 -125052 -268813 -441797 -497283 -491500 -565668 -693780 -765129 -792084 -819731
36963 -819731 -765634 -596803 -527707 -734962 -972159 -824010 -321649 53085 12227 -236844
36953 -236844 -407127 -490706 -552395 -491038 -227323 106706 368283 587193 768130 741688
36943 741688 441614 126267 62189 146176 101895 -94023 -260953 -359686 -478651 -563513
36933 -563513 -488591 -355653 -390562 -552650 -592777 -525100 -655654 -1029059 -1237696 -1009235
36923 -1009235 -652186 -601848 -766898 -704768 -319535 11717 9226 -170985 -267639 -287047
36913 -287047 -364635 -453113 -369519 -73612 276766 516884 587712 491873 288401 130984
36903 130984 144937 206698 3329 -560699 -1131255 -1259930 -944277 -613622 -571149 -680691
36893 -680691 -695936 -655255 -729827 -843983 -747552 -431369 -183695 -187115 -313740 -405108 -499123
36882 -499123 -627176 -627043 -401507 -197962 -330545 -682369 -785231 -435867 24525 153936
36872 153936 -62942 -277357 -239591 -36181 89546 17444 -168029 -306691 -335336 -325003
36862 -325003 -346268 -349557 -253355 -123037 -147665 -416080 -810332 -1141422 -1287286 -1184096
36852 -1184096 -839627 -433574 -249553 -367441 -528469 -453406 -209013 -95965 -241214 -489332
36842 -489332 -664536 -737960 -727320 -637494 -558096 -632836 -835495 -925556 -734418 -378632 -92795
36831 -92795 30964 34389 -46651 -172790 -254029 -267541 -344425 -575967 -800841 -777915 -543472
36820 -543472 -391982 -480198 -642966 -659091 -518900 -330347 -116233 151525 407816 527285
36810 527285 467708 283606 31095 -254336 -513993 -682261 -736601 -683693 -535377 -356159
36800 -356159 -278547 -375271 -537857 -571696 -407935 -151176 64854 184256 203758 142115
36790 142115 52359 -23199 -134592 -374965 -714026 -965191 -976125 -790364 -569556 -423698
36780 -423698 -384106 -472464 -683766 -912129 -987226 -809832 -417902 56266 435226 543745
36770 543745 326271 -56693 -345949 -448489 -517283 -724321 -1033928 -1269195 -1329441 -1245261
36760 -1245261 -1070106 -835901 -597781 -400202 -191170 103925 392702 441142 174626 -161887
36750 -161887 -267270 -131328 12675 19903 -47510 -111935 -194770 -287370 -288205 -186495 -173510
36739 -173510 -412736 -773522 -958216 -869515 -699135 -650903 -729302 -835132 -914508 -930322
36729 -930322 -818934 -601010 -447162 -487291 -595589 -514425 -196111 114362 173477 244
36719 244 -211277 -336645 -398096 -475762 -636039 -898206 -1181007 -1320448 -1234685 -1041973 -917019
36708 -917019 -864845 -771287 -665144 -744064 -1065078 -1378661 -1419133 -1247590 -1123737 -1102072
36698 -1102072 -980829 -674793 -410942 -426339 -631810 -753648 -719256 -694782 -752610 -723970
36688 -723970 -479053 -185952 -116540 -265145 -349643 -207467 -20154 -59699 -340159 -649195
36678 -649195 -840251 -927789 -921015 -757943 -468350 -243690 -225711 -324992 -369500 -346656 -350992
36667 -350992 -359339 -256766 -92854 -109251 -421855 -820724 -1001349 -896236 -664392 -438536
36657 -438536 -225168 -19247 121167 133892 7330 -221906 -462321 -590693 -573058 -535152
36647 -535152 -602203 -690807 -605040 -349198 -168692 -204897 -282236 -185869 -15649 -46688 -288416
36636 -288416 -431168 -295897 -124396 -260448 -658773 -905026 -709774 -219311 203486 366476
36626 366476 324462 177663 -41445 -281727 -425051 -409590 -325229 -298670 -333554 -359664 -397321
36615 -397321 -532461 -715591 -738988 -498671 -164593 23153 41613 36583 55700 -1074 -183332
36604 -183332 -418577 -659943 -928653 -1149733 -1124696 -786684 -343841 -29657 173949 404066
36594 404066 606113 565795 232889 -176381 -430902 -496980 -476165 -470336 -549335 -728030 -919089
36583 -919089 -1000665 -968315 -931720 -941276 -924079 -817982 -657608 -497601 -365292 -312772 -378692
36572 -378692 -465795 -417468 -270258 -247958 -416145 -539382 -419300 -184853 -64132 -42467
36562 -42467 19842 69964 -53833 -285611 -361587 -189278 50911 183376 190913 77053 -183240
36551 -183240 -498321 -683649 -707287 -723161 -795741 -791235 -623921 -411055 -278947 -199961 -131309
36540 -131309 -128222 -190579 -181520 -52431 22573 -86629 -217024 -128120 150270 380439 425018
36529 425018 299112 18489 -373509 -686424 -725614 -549191 -390917 -341779 -300391 -225934
36519 -225934 -222212 -336992 -477034 -583730 -722599 -929050 -1117514 -1218909 -1268696 -1274174
36509 -1274174 -1126771 -763721 -334957 -94362 -149071 -374998 -552902 -556247 -440664 -368330
36499 -368330 -417325 -487840 -454410 -361737 -347141 -387514 -288390 23451 337070 375367 84274
36488 84274 -364969 -767784 -1000420 -1032643 -936371 -844259 -822056 -810822 -743349 -661329 -649689
36477 -649689 -701686 -724991 -658206 -523530 -386000 -307641 -314959 -363293 -353438 -225338 -22644
36466 -22644 157670 255168 271411 246788 233501 248590 232100 100338 -136173 -363534 -501332
36455 -501332 -585270 -671737 -725408 -666833 -492323 -286351 -136915 -78798 -92948 -127932 -153002
36444 -153002 -216077 -405323 -722079 -1041924 -1240661 -1308523 -1297404 -1215269 -1042105 -814938
36434 -814938 -624773 -533698 -537417 -603581 -720620 -913451 -1207300 -1546475 -1769298 -1738066
36424 -1738066 -1500511 -1242867 -1070539 -926502 -740592 -538228 -358927 -199336 -105785 -183145
36414 -183145 -410862 -587992 -591634 -558576 -652720 -785575 -775724 -672123 -650065 -643518 -399552
36403 -399552 60374 348741 220827 -83688 -204910 -165447 -258403 -552781 -790256 -768735
36393 -768735 -588683 -446398 -359341 -217978 -17651 89483 -29993 -330660 -616805 -706206
36383 -706206 -569618 -338367 -188756 -204940 -331271 -444802 -470338 -417949 -309784 -114636
36373 -114636 180066 442477 454949 173893 -149053 -229431 -107380 -106324 -408746 -801338
36363 -801338 -923076 -686157 -352606 -223302 -337711 -490300 -482596 -314500 -130218 -17919
36353 -17919 74378 209675 333179 357120 320535 339736 408581 386009 214586 13533 -115302
36342 -115302 -239613 -434483 -570915 -438873 -66563 236749 211397 -64464 -279352 -244653
36332 -244653 -88767 -83237 -311183 -576492 -674235 -663421 -743555 -901897 -888408 -611356 -359617
36321 -359617 -462482 -853242 -1165176 -1185065 -1004984 -769267 -515064 -299300 -255237 -413187
36311 -413187 -620353 -744088 -826923 -940923 -1018683 -960238 -812946 -708331 -681023 -670697
36301 -670697 -650019 -632345 -597504 -526771 -471549 -468786 -428195 -237487 47184 259362 353328
36290 353328 414038 435701 290310 -18292 -266764 -313299 -333736 -581388 -1006701 -1304737
36280 -1304737 -1296140 -1075144 -791194 -483327 -183432 -7842 -36278 -204268 -404569 -597237
36270 -597237 -729008 -660892 -330507 75429 281387 251442 209575 320310 502053 601615
36260 601615 599048 548381 445104 275997 107697 -4437 -121367 -295239 -407819 -311550
36250 -311550 -106460 -79256 -328748 -622245 -688796 -507067 -232861 949 104851 345
36240 345 -277676 -532083 -595946 -513255 -422867 -356737 -282370 -236157 -237197 -159689 91924 337633
36228 337633 298190 6939 -211921 -209378 -187979 -326949 -499863 -523920 -464388 -488701 -586816
36217 -586816 -647614 -681005 -747820 -774584 -669531 -557507 -662212 -964958 -1187124 -1132152
36207 -1132152 -882801 -647543 -559686 -636882 -795515 -883131 -807499 -635957 -481890 -349477
36197 -349477 -209350 -136340 -188318 -225657 -81410 137976 183774 72122 55654 165265
36187 165265 126238 -156773 -368372 -227172 123812 388751 513192 552345 406212 21329
36177 21329 -332512 -361474 -216290 -290492 -606478 -785670 -641003 -417260 -355595 -374908
36167 -374908 -341888 -346562 -489028 -625192 -571942 -419638 -417123 -642955 -980683 -1326952 -1619985
36156 -1619985 -1725058 -1519211 -1107077 -773411 -669937 -675191 -610676 -483876 -449881 -605518
36146 -605518 -886365 -1126803 -1179617 -1018694 -770780 -613852 -596310 -585892 -457846 -304380
36136 -304380 -346342 -603315 -778153 -600118 -216503 -56526 -282648 -570314 -542293 -258221
36126 -258221 -90235 -212690 -438808 -541053 -503076 -396958 -210665 79753 391253 608716
36116 608716 702423 680016 505086 174885 -176890 -372617 -374873 -302235 -283567 -366488 -537319
36105 -537319 -734900 -840563 -742372 -456166 -153974 -40051 -182212 -438847 -550015 -357088
36095 -357088 23060 281376 228994 -378 -117922 -22161 108683 71627 -101570 -195812
36085 -195812 -81500 135020 239991 154303 14576 8992 156589 281596 207648 -62829
36075 -62829 -387033 -653904 -848655 -953838 -884549 -597615 -223573 10829 18370 -55376
36065 -55376 -13421 167134 333476 331728 127545 -197522 -489579 -598062 -505307 -366584
36055 -366584 -330095 -344107 -260018 -92345 1283 3206 71377 213030 167977 -203568 -618938
36044 -618938 -705525 -503082 -362938 -424691 -488322 -395979 -241845 -138153 -40904 69921
36034 69921 54522 -183387 -501628 -673739 -642620 -510995 -369890 -242464 -131498 -34336
36024 -34336 49660 91622 76650 79224 183642 313579 287266 95245 -25906 115116 418410
36013 418410 619892 555190 232482 -221214 -592220 -687129 -526459 -345348 -317168 -375600
36003 -375600 -381334 -328491 -275627 -197146 -40899 146136 258658 232262 41733 -284382 -578887
35992 -578887 -613862 -368299 -84754 34198 30524 -2337 -115056 -355142 -616095 -804141
35982 -804141 -964324 -1066020 -904737 -471358 -180951 -391859 -871787 -1115864 -1056797 -1033715
35972 -1033715 -1134073 -1051547 -651005 -223559 -28861 45769 185186 315665 283520 129480
35962 129480 -9404 -90630 -103894 10454 233022 396142 361051 150499 -140946 -406932
35952 -406932 -481589 -267588 28998 52778 -214086 -385240 -212331 91576 238603 280998
35942 280998 396984 514814 449465 248991 123488 144068 248520 420582 625815 693674
35932 693674 515177 256760 139899 119436 30493 -71259 -18997 107630 73935 -88566
35922 -88566 -89402 167028 449261 573038 601137 585712 424699 131424 -25242 129832 371593
35911 371593 337403 -19471 -431822 -683459 -773090 -754815 -616209 -363398 -102240 41615
35901 41615 40878 -35436 -113006 -156963 -131837 16254 270576 466500 415851 142694 -113129
35890 -113129 -192367 -200828 -297213 -424574 -428782 -362073 -439574 -683603 -821595 -619808 -177412
35879 -177412 200253 330335 281984 235597 263948 237179 -32174 -507998 -871319 -859753
35869 -859753 -605649 -471949 -579154 -688187 -570193 -293616 -78560 -37416 -139702 -281979
35859 -281979 -312414 -136174 116063 174542 -20855 -217747 -209512 -119235 -159708 -272232 -235533
35848 -235533 -40888 93288 65804 22669 100499 224996 244275 134975 -10482 -126323
35838 -126323 -231370 -375482 -559472 -694698 -659622 -434179 -150031 37066 78559 -15490
35828 -15490 -263296 -617701 -848935 -718044 -303097 9872 -60659 -403307 -706116 -814642
35818 -814642 -791016 -713713 -572758 -355292 -120974 40424 75839 -15991 -194180 -386729
35808 -386729 -510969 -496546 -316404 -40566 158296 145677 1861 -38471 115253 269218
35798 269218 198932 -50949 -261277 -363855 -487194 -689934 -846098 -840459 -698039 -451027
35788 -451027 -67711 366151 580158 423392 108526 -59027 -101706 -273974 -594205 -765834
35778 -765834 -629216 -433829 -515306 -875991 -1237637 -1381921 -1288612 -1039308 -751836 -561742
35768 -561742 -522090 -531489 -460744 -330021 -275023 -365433 -537367 -674557 -681346 -518447 -256584
35757 -256584 -64376 -57407 -181608 -308739 -389269 -419183 -323790 -23654 387434 661944
35747 661944 636202 383144 126478 63578 243288 523356 658371 526895 280261 190400
35737 190400 348998 581795 645238 442258 75344 -236033 -326916 -257695 -267053 -474936
35727 -474936 -718602 -799374 -772130 -795115 -797554 -578123 -207390 -16980 -126394 -282123
35717 -282123 -287706 -300177 -503588 -738493 -717006 -446030 -184152 -88629 -135590 -285922 -481112
35706 -481112 -549913 -382808 -163545 -165505 -329504 -322482 -45780 213694 239358 193631 275709
35695 275709 326523 80914 -316538 -400898 -25628 386537 380045 50842 -116180 107552
35685 107552 453416 575714 489332 457256 579818 684103 594022 342465 74075 -142859
35675 -142859 -339633 -551946 -757748 -872232 -790247 -496474 -145890 50726 53917 26216
35665 26216 105034 243681 323982 310667 215177 21610 -237384 -428500 -481569 -536302 -772268
35654 -772268 -1132769 -1376395 -1389931 -1289507 -1197523 -1086996 -912630 -754473 -716227 -750754
35644 -750754 -694628 -463814 -148128 94853 202587 244725 302710 345938 283644 137143
35634 137143 57671 106572 120563 -67264 -329702 -349283 -40169 300116 336458 69807
35624 69807 -224245 -325825 -225813 -26473 167640 264115 208474 42989 -113883 -177878
35614 -177878 -162979 -134068 -137498 -188656 -284415 -399134 -489962 -525816 -495214 -383672 -190310
35603 -190310 6274 61654 -75678 -252937 -266826 -124896 -21485 -20041 71533 390987
35593 390987 741277 815129 599692 320587 43167 -369416 -871589 -1139704 -1010980 -736880
35583 -736880 -583639 -422679 -3829 540632 805318 652952 325110 32817 -241441 -491993
35573 -491993 -560160 -394014 -203155 -196243 -328097 -439040 -491486 -525179 -508855 -399135 -266530
35562 -266530 -213638 -209720 -130798 48535 195549 166665 -15361 -136716 18333 395303
35552 395303 641376 477760 70212 -146208 -15994 176096 144569 -45027 -200079 -335137
35542 -335137 -549601 -741094 -723763 -558151 -490508 -572656 -589090 -398524 -131534 22194
35532 22194 44244 16687 -33342 -113602 -188797 -214201 -184030 -91325 85277 299788 421531
35521 421531 365826 182139 -40183 -278661 -518456 -663710 -624992 -473699 -399511 -494460
35511 -494460 -660293 -761332 -794938 -846810 -922534 -916935 -768240 -569234 -469476 -506078 -595929
35500 -595929 -670324 -727673 -744184 -639433 -402776 -185180 -164121 -328847 -479380 -448950
35490 -448950 -270921 -111760 -83996 -149224 -189523 -165624 -196772 -443720 -887060 -1272855
35480 -1272855 -1343309 -1099372 -775279 -580988 -549376 -613923 -714525 -790443 -779329 -704979
35470 -704979 -696287 -828119 -985656 -981804 -790129 -566223 -443361 -414829 -436874 -515579 -609747
35459 -609747 -566304 -301856 11046 116254 27555 14617 183415 287904 106674 -189430
35449 -189430 -294794 -272053 -468942 -926917 -1221122 -1045115 -675221 -598935 -855128 -1037894
35439 -1037894 -888864 -593186 -455935 -534577 -692847 -831325 -924019 -939636 -868291 -779055
35429 -779055 -747281 -751085 -711845 -601342 -436729 -214524 43366 189302 29529 -422879
35419 -422879 -856488 -935302 -655467 -334884 -231953 -281707 -279653 -221444 -298335 -568632 -811266
35408 -811266 -789981 -542660 -293445 -157612 -71800 13846 21809 -135045 -413051 -664836
35398 -664836 -762431 -673986 -468769 -273696 -188031 -209891 -253990 -242372 -167664 -86943 -78576
35387 -78576 -181824 -347721 -479040 -554959 -669026 -877903 -1055471 -998928 -681740 -312665
35377 -312665 -120667 -143703 -242856 -262504 -162262 -46743 -71179 -261029 -434885 -386564
35367 -386564 -138496 88356 164122 176115 216174 192294 -16133 -305961 -418281 -251878
35357 -251878 19982 172621 175442 173550 288393 484478 606801 523278 248904 -52932
35347 -52932 -202062 -143783 33905 198973 271551 252074 200769 186366 221111 251286 240482
35336 240482 236936 295647 341366 201553 -172971 -583451 -758410 -637356 -416597 -318291
35326 -318291 -377326 -466682 -469129 -386053 -313149 -341855 -460774 -535508 -420885 -117337 219873
35315 219873 445854 546557 568710 515489 385040 233796 94561 -99978 -370508 -524185
35305 -524185 -333891 107056 421226 403437 235530 143437 67008 -135338 -344175 -320882
35295 -320882 -101472 39537 2590 -36485 24832 40760 -101392 -258993 -252326 -130864 -49035
35284 -49035 -11648 67303 145405 97045 -54245 -137105 -78636 9422 25649 14811 37084
35273 37084 16973 -165152 -478428 -742024 -823644 -766127 -694439 -652698 -582702 -438471 -256502
35262 -256502 -95908 36579 159127 249095 262501 203535 115465 4470 -165818 -386875
35252 -386875 -562773 -586212 -438984 -210818 -33953 21794 26193 130540 366740 531833
35242 531833 379388 -58060 -449347 -527068 -379148 -290607 -362560 -419850 -302926 -123603
35232 -123603 -132085 -370148 -577874 -500828 -207270 13055 30277 -5813 39249 60297 -74957
35221 -74957 -237199 -181273 75437 248346 167383 -45205 -215535 -327111 -408480 -406595 -301925
35210 -301925 -206754 -212985 -245131 -182628 -35509 110003 225603 303763 273064 79117 -204849
35199 -204849 -451779 -610000 -675929 -621746 -458783 -299604 -239106 -229341 -179525 -120594 -152939
35188 -152939 -272332 -358308 -316810 -165663 -18297 -28195 -268623 -608013 -796649 -730233
35178 -730233 -513824 -238153 103017 395718 388874 98396 -38918 278464 714564 715538
35168 715538 279545 -114022 -260775 -436612 -813018 -1150343 -1236130 -1214394 -1248052 -1199726
35158 -1199726 -922624 -593775 -461583 -466141 -401573 -296214 -329856 -467173 -463958 -220458
35148 -220458 97635 294591 327520 253057 137040 28877 -74656 -235136 -470426 -677713
35138 -677713 -726321 -596528 -385375 -222902 -196267 -271902 -289064 -151548 -20537 -141322
35128 -141322 -465985 -674214 -619527 -494203 -461522 -425714 -322401 -314075 -457232 -483106 -219912
35117 -219912 43819 -14476 -204676 -130032 152598 259016 140255 102057 208813 205267
35107 205267 68356 93216 303297 301581 -72503 -410479 -335326 -24191 172422 257963
35097 257963 386713 456571 299656 48290 -66056 -98139 -225385 -377509 -396631 -413607
35087 -413607 -664180 -1020136 -1103121 -835934 -511793 -323209 -190204 -84579 -147086 -375748
35077 -375748 -527832 -489259 -478989 -710273 -1045580 -1162479 -934154 -512291 -132596 60734
35067 60734 79916 61217 118969 220758 268479 246301 160933 -85465 -549139 -1007826 -1128575
35056 -1128575 -901063 -654556 -594174 -584637 -474722 -344304 -275701 -153210 90701 249865
35046 249865 119725 -154885 -259114 -133622 6496 -3199 -146317 -350143 -528018 -550039
35036 -550039 -381021 -217585 -292662 -561876 -761741 -750560 -603214 -396111 -122518 151498
35026 151498 257425 129160 -104575 -287253 -373685 -378110 -323073 -276445 -305705 -357031 -306466
35015 -306466 -157812 -47483 -23869 8977 67176 -14535 -347699 -793384 -1122212 -1256236
35005 -1256236 -1235084 -1065704 -766349 -477318 -350182 -351555 -325493 -238994 -218110 -325271
34995 -325271 -448108 -476248 -478978 -602651 -833805 -965315 -820952 -462616 -139539 -51495
34985 -51495 -192400 -407608 -544021 -528556 -372986 -172156 -64843 -123559 -288794 -452521
34975 -452521 -564051 -591853 -454867 -125648 231372 389048 341854 299191 352261 327855
34965 327855 77022 -250389 -376975 -246839 -50900 29569 -43552 -234615 -471340 -622690
34955 -622690 -593606 -468490 -440719 -568798 -707898 -720061 -650748 -633275 -691501 -722278 -655224
34944 -655224 -559258 -555833 -645670 -680327 -557974 -411980 -495218 -848607 -1201468 -1282734 -1131264
34933 -1131264 -981172 -923388 -844342 -672372 -511680 -494643 -630000 -845358 -1076822 -1266852
34923 -1266852 -1359540 -1348672 -1270763 -1135838 -951038 -821974 -896354 -1138370 -1280890 -1116155
34913 -1116155 -755195 -476048 -371425 -292911 -129691 21683 24258 -93809 -210107 -303906
34903 -303906 -439621 -574500 -543810 -303761 -62321 -44386 -198682 -283313 -209924 -133174
34893 -133174 -176980 -247765 -203572 -65557 48172 80347 8098 -220053 -563127 -795151
34883 -795151 -715988 -411298 -143995 -36213 -25049 -69200 -179162 -265974 -202076 -54295
34873 -54295 -18453 -84954 -34936 152106 187283 -60019 -262010 -65148 372240 573708
34863 573708 358281 -37084 -373491 -623098 -760683 -671735 -393078 -206756 -324854 -615584
34853 -615584 -780478 -709495 -543303 -454717 -481465 -545703 -556754 -495411 -423375 -394419 -371719
34842 -371719 -294209 -204182 -199139 -248102 -196927 -16985 94556 -19554 -222698 -255437 -100035
34831 -100035 2922 -101645 -295302 -389972 -368101 -324752 -283553 -197674 -75759 19143 76197
34820 76197 129842 150336 54915 -150770 -347855 -456319 -508080 -520694 -419599 -183492 33747
34809 33747 60675 -70102 -188880 -226207 -230808 -188558 -22907 193841 226420 -27884 -370928
34798 -370928 -536354 -477824 -325209 -168932 -17457 114990 214134 306201 380839 340685
34788 340685 159546 29998 185899 583611 909779 931966 723854 516734 440044 456475
34778 456475 467178 416036 319854 228958 164905 128110 169538 359685 623284 717849 508551
34767 508551 181243 18819 28344 -11403 -165204 -245752 -139330 10065 39521 -14202 -61704
34756 -61704 -146418 -327747 -524441 -638509 -710962 -785464 -743549 -487782 -195758 -140883 -287488
34745 -287488 -315649 -77723 208880 302471 248738 217265 208912 117446 -18380 -25169 161036
34734 161036 415684 599434 686367 701079 646897 545114 454614 392337 301269 156805 41235
34723 41235 33017 67752 9744 -149290 -268198 -256979 -201244 -229507 -338178 -434741 -497234
34712 -497234 -576933 -660178 -655992 -558713 -509005 -603430 -712349 -607338 -268180 42619 61703
34701 61703 -183351 -434538 -524306 -542461 -657796 -864370 -1001174 -991367 -937453 -937732 -911667
34690 -911667 -701920 -302876 103631 321772 278553 19218 -332432 -609507 -700777 -649638
34680 -649638 -593225 -595088 -609978 -605093 -598709 -553180 -367069 -53881 185923 182512 6166
34669 6166 -153708 -247478 -367197 -534783 -645905 -636952 -579209 -575115 -660012 -826348 -1035689
34658 -1035689 -1170801 -1089059 -792734 -462627 -251209 -110516 104566 426003 742391 921961
34648 921961 884139 611554 211878 -58250 25114 398360 724581 719263 416634 87863
34638 87863 -40783 51775 233288 350539 330164 216436 126373 144188 253730 371957
34628 371957 423293 377708 261540 153993 126736 157409 157553 123238 176078 370178 535767
34617 535767 457308 180163 -25302 -31650 -15558 -166592 -394317 -482856 -435461 -461758 -634689
34606 -634689 -757907 -645104 -386289 -223789 -249804 -351579 -414949 -444656 -468134 -457315
34596 -457315 -433258 -548503 -909191 -1326317 -1416280 -1040155 -527640 -334877 -548899 -873311
34586 -873311 -1047133 -1078046 -1054547 -964703 -821076 -775665 -916625 -1050114 -882547 -390618
34576 -390618 148342 473693 537392 401718 125086 -202071 -456153 -593980 -669123 -676036
34566 -676036 -485719 -30999 516454 867111 902016 765121 662622 633441 557193 358230
34556 358230 128198 3966 -19793 -53265 -96622 -7171 250806 458257 375670 43605
34546 43605 -285190 -447201 -461500 -394642 -312234 -320293 -450820 -519282 -319502 12504 64672
34535 64672 -337998 -893917 -1198234 -1151067 -874928 -464954 -43714 119823 -146611 -604815
34525 -604815 -809428 -648802 -448250 -469603 -538288 -334872 84764 290975 9530 -531224
34515 -531224 -876590 -853472 -655793 -480588 -294991 -35676 163944 137832 -26354 -80018
34505 -80018 42253 174627 208860 219890 270760 296506 249868 185241 125439 9907 -156864
34494 -156864 -272465 -313354 -360175 -386024 -245858 19506 110269 -144974 -547412 -843407
34484 -843407 -1050952 -1258739 -1335889 -1137165 -830080 -698140 -720293 -653930 -466685 -371900
34474 -371900 -450403 -526619 -449750 -266264 -89921 4391 -40102 -204538 -340742 -351200 -357880
34463 -357880 -493662 -631563 -587200 -487647 -597273 -828143 -814182 -498341 -247696 -288898
34453 -288898 -414777 -410135 -408081 -597770 -872786 -1020650 -1035728 -1010484 -911199 -687738 -441741
34442 -441741 -281986 -166970 -70559 -122766 -379175 -625734 -649419 -561956 -616998 -825778
34432 -825778 -991672 -1021462 -960144 -804515 -533906 -270342 -165586 -161683 -89157 28583
34422 28583 5820 -177347 -317804 -296873 -230217 -247113 -305472 -312066 -279269 -265428 -262281 -233504
34410 -233504 -205289 -245036 -366832 -488684 -489108 -331124 -133518 -50005 -52226 56045 332769
34399 332769 531315 382986 -37687 -392785 -480167 -394919 -322346 -334130 -390421 -396644 -246146
34388 -246146 62632 342875 381580 193813 -13837 -136669 -272152 -492645 -689693 -749138
34378 -749138 -758577 -897149 -1161472 -1333946 -1256454 -1053871 -999904 -1161133 -1274315 -1072613
34368 -1072613 -671116 -454462 -564105 -706470 -578938 -279196 -92577 -45191 45195 164919
34358 164919 92985 -177676 -333395 -185683 34959 10805 -238271 -473705 -633386 -852111
34348 -852111 -1139957 -1293944 -1185402 -955433 -823078 -804002 -731510 -515581 -277034 -205452
34338 -205452 -346277 -567630 -706270 -702122 -603775 -495583 -430500 -393597 -319509 -181739 -60293
34327 -60293 -57386 -141947 -170351 -97569 -62862 -186347 -371767 -428453 -336309 -259807 -306126
34316 -306126 -383683 -331346 -119382 110963 184768 68658 -85025 -99059 23857 121223
34306 121223 98995 32589 4455 -26678 -113833 -210203 -284246 -425290 -690500 -945728 -1014412
34295 -1014412 -903560 -730804 -521458 -258490 -48733 -26055 -132205 -190466 -155726 -102597
34285 -102597 -35961 55269 27600 -242531 -545046 -529845 -243136 -117867 -335164 -557698
34275 -557698 -474467 -263966 -246193 -357972 -316003 -120402 -33331 -131237 -209543 -131532 10468
34264 10468 119431 232947 363035 399583 282782 129660 73097 64338 -55157 -329155
34254 -329155 -625729 -790977 -788824 -665632 -440314 -115978 193982 263367 -13539 -427608
34244 -427608 -626788 -498971 -268653 -183917 -237292 -269306 -227941 -195467 -209849 -190669 -63889
34233 -63889 111523 185718 83870 -88415 -141473 -19927 128647 148044 63445 -8367 -56540
34222 -56540 -139659 -206502 -138895 31316 140173 157688 245644 482779 705246 713436 502642
34211 502642 215387 2411 -6319 239342 573915 683703 433283 29181 -221668 -212666
34201 -212666 -49531 90129 44378 -222322 -511944 -553774 -345171 -155227 -128531 -120936
34191 -120936 -29112 -3259 -154327 -319242 -347480 -366592 -488441 -501735 -211188 111683
34181 111683 33917 -374279 -592142 -356037 56993 280363 241221 26740 -296719 -597533
34171 -597533 -674909 -496492 -270875 -188084 -241710 -360325 -530469 -714323 -809541 -771251
34161 -771251 -655545 -516476 -394410 -396400 -601994 -877058 -982260 -898035 -836868 -890814
$$ [...]
##END NTUPLES=NMR SPECTRUM
##END=
