##TITLE=abcd
##JCAMPDX= 6.0         $$ Bruker NMR JCAMP-DX V2.0
##DATA TYPE= NMR FID
##DATA CLASS= NTUPLES
##ORIGIN= UXNMR, Bruker Analytische Messtechnik GmbH
##OWNER= root
$$ XWIN-NMR		Version 3.5
$$ Sat Oct 20 08:53:03 2018 Russian Standard Time (UT+4h)  servis@DPX200
##.OBSERVE FREQUENCY= 200.131235884673
##.OBSERVE NUCLEUS= ^1H
##.DELAY= (6, 6)
##.ACQUISITION MODE= SIMULTANEOUS
##.ACQUISITION SCHEME= undefined
##.AVERAGES= 8
##.DIGITISER RES= 18
##SPECTROMETER/DATA SYSTEM= spect
##.PULSE SEQUENCE= zg
##.SOLVENT NAME= CDCl3
##.SHIFT REFERENCE= (INTERNAL, CDCl3, 0, 16.5164)
##AUDIT TRAIL= $$ (NUMBER, WHEN, WHO, WHERE, WHAT)
$$ ##TITLE= Audit trail, XWIN-NMR		Version 3.5
$$ ##JCAMPDX= 5.01
$$ ##ORIGIN= Bruker BioSpin GmbH
$$ ##OWNER= servis
$$ F:\spectra/data/av/nmr/H1/1/audita.txt
$$ ##AUDIT TRAIL=  $$ (NUMBER, WHEN, WHO, WHERE, WHAT)
(   1,<2018-10-20 08:52:42.64 +0400>,<servis>,<DPX200>,
      <created by zg, POWCHK disabled, PULCHK disabled
       configuration hash MD5:
       00 E9 B6 7A A2 85 ED C7 34 08 36 98 17 FE 4E 26
       data hash MD5: 32K
       B8 2F 12 3C C3 FA E7 99 75 58 CF 24 28 B2 11 D5>)
$$ ##END=
$$ 
$$ hash MD5
$$ 72 45 26 24 52 2B 3E CE 4E 3C 49 9C 1E 70 83 47
##$RELAX= 
##$RELAX= 
##$RELAX= 
##$RELAX= 
##$RELAX= 
##$RELAX= 
##$RELAX= 
##$RELAX= 
$$ Bruker specific parameters
$$ --------------------------
##$DU= <F:\spectra>
##$EXPNO= 1
##$NAME= <H1>
##$PROCNO= 1
##$TYPE= <nmr>
##$USER= <av>
##$AMP= (0..31)
100 100 100 100 100 100 100 100 100 100 100 100 100 100 100 100 100 100 
100 100 100 100 100 100 100 100 100 100 100 100 100 100 
##$AQSEQ= 0
##$AQ_mod= 1
##$AUNM= <au_zg>
##$AUTOPOS= <>
##$BF1= 200.13
##$BF2= 200.13
##$BF3= 200.13
##$BF4= 200.13
##$BF5= 500.13
##$BF6= 500.13
##$BF7= 500.13
##$BF8= 500.13
##$BYTORDA= 1
##$CFDGTYP= 0
##$CFRGTYP= 5
##$CHEMSTR= <none>
##$CNST= (0..31)
1 1 145 1 1 1 1 1 1 1 1 1 1 1 1 1 1 1 1 1 1 1 1 1 1 1 1 1 1 1 1 1 
##$CPDPRG= <>
##$CPDPRG1= <>
##$CPDPRG2= <>
##$CPDPRG3= <>
##$CPDPRG4= <mlev>
##$CPDPRG5= <mlev>
##$CPDPRG6= <mlev>
##$CPDPRG7= <mlev>
##$CPDPRG8= <mlev>
##$CPDPRGB= <>
##$CPDPRGT= <>
##$D= (0..31)
0 2 0 0 0 0 0 0 0 0.06 0 0 0 0 0 0 0.0002 0 0 0 0 0 0 0 0 0 0 0 0 0 0 
0 
##$DATE= 1540011161
##$DBL= (0..7)
120 120 120 120 120 120 120 120 
##$DBP= (0..7)
150 150 150 150 150 150 150 150 
##$DBP07= 0
##$DBPNAM0= <>
##$DBPNAM1= <>
##$DBPNAM2= <>
##$DBPNAM3= <>
##$DBPNAM4= <>
##$DBPNAM5= <>
##$DBPNAM6= <>
##$DBPNAM7= <>
##$DBPOAL= (0..7)
0.5 0.5 0.5 0.5 0.5 0.5 0.5 0.5 
##$DBPOFFS= (0..7)
0 0 0 0 0 0 0 0 
##$DE= 6
##$DECBNUC= <off>
##$DECIM= 32
##$DECNUC= <off>
##$DECSTAT= 4
##$DIGMOD= 1
##$DIGTYP= 9
##$DL= (0..7)
0 120 120 120 120 120 120 120 
##$DP= (0..7)
150 150 150 150 150 150 150 150 
##$DP07= 0
##$DPNAME0= <>
##$DPNAME1= <>
##$DPNAME2= <>
##$DPNAME3= <>
##$DPNAME4= <>
##$DPNAME5= <>
##$DPNAME6= <>
##$DPNAME7= <>
##$DPOAL= (0..7)
0.5 0.5 0.5 0.5 0.5 0.5 0.5 0.5 
##$DPOFFS= (0..7)
0 0 0 0 0 0 0 0 
##$DQDMODE= 0
##$DR= 18
##$DS= 0
##$DSLIST= <SSSSSSSSSSSSSSS>
##$DSPFIRM= 0
$$ [...]
##$SUBNAM0= <"">
##$SUBNAM1= <"">
##$SUBNAM2= <"">
##$SUBNAM3= <"">
##$SUBNAM4= <"">
##$SUBNAM5= <"">
##$SUBNAM6= <"">
##$SUBNAM7= <"">
##$SUBNAM8= <"">
##$SUBNAM9= <"">
##$SW= 20.6817932712277
##$SWIBOX= (0..15)
0 0 3 0 0 0 0 0 0 0 0 0 0 0 0 0 
##$SW_h= 4139.07284768212
##$TD= 32768
##$TD0= 1
##$TE= 0
##$TE2= 300
##$TE3= 300
##$TEG= 300
##$TL= (0..7)
0 120 120 120 120 120 120 120 
##$TP= (0..7)
150 150 150 150 150 150 150 150 
##$TP07= 0
##$TPNAME0= <>
##$TPNAME1= <>
##$TPNAME2= <>
##$TPNAME3= <>
##$TPNAME4= <>
##$TPNAME5= <>
##$TPNAME6= <>
##$TPNAME7= <>
##$TPOAL= (0..7)
0.5 0.5 0.5 0.5 0.5 0.5 0.5 0.5 
##$TPOFFS= (0..7)
0 0 0 0 0 0 0 0 
##$TUNHIN= 0
##$TUNHOUT= 0
##$TUNXOUT= 0
##$USERA1= <user>
##$USERA2= <user>
##$USERA3= <user>
##$USERA4= <user>
##$USERA5= <user>
##$V9= 5
##$VALIST= <valist>
##$VCLIST= <CCCCCCCCCCCCCCC>
##$VD= 0
##$VDLIST= <DDDDDDDDDDDDDDD>
##$VPLIST= <PPPPPPPPPPPPPPP>
##$VTLIST= <TTTTTTTTTTTTTTT>
##$WBST= 1024
##$WBSW= 4
##$XGAIN= (0..3)
0 0 0 0 
##$XL= 0
##$YL= 0
##$YMAX_a= 40860
##$YMIN_a= -36978
##$ZGOPTNS= <>
##$ZL1= 120
##$ZL2= 120
##$ZL3= 120
##$ZL4= 120
##$ABSF1= 10
##$ABSF2= 0
##$ABSG= 5
##$ABSL= 3
##$ALPHA= 0
##$AQORDER= 0
##$ASSFAC= 0
##$ASSFACI= 0
##$ASSFACX= 0
##$ASSWID= 0
##$AUNMP= <proc_1d>
##$AZFE= 0.1
##$AZFW= 0.1
##$BCFW= 1
##$BC_mod= 2
##$BYTORDP= 0
##$COROFFS= 0
##$CY= 19
##$DATMOD= 1
##$DC= 2
##$DFILT= <>
##$DTYPP= 0
##$F1P= 11.0000007629395
##$F2P= -0.999999237060547
##$FCOR= 0.5
##$FTSIZE= 0
##$FT_mod= 4
##$GAMMA= 1
##$GB= 0
##$INTBC= 1
##$INTSCL= 1
##$ISEN= 128
##$LB= 0.2
##$LEV0= 0
##$LPBIN= 0
##$MAXI= 10000
##$MC2= 0
##$MEAN= 0
##$ME_mod= 0
##$MI= 0
##$NCOEF= 0
##$NC_proc= 0
##$NLEV= 6
##$NOISF1= 0
##$NOISF2= 0
##$NSP= 1
##$NTH_PI= 0
##$NZP= 0
##$OFFSET= 16.51637
##$PC= 1
##$PHC0= 205.2504
##$PHC1= 1.056204
##$PH_mod= 0
##$PKNL= yes
##$PPARMOD= 0
##$PSCAL= 4
##$PSIGN= 0
##$REVERSE= no
##$SF= 200.13
##$SI= 16384
##$SIGF1= 0
##$SIGF2= 0
##$SINO= 400
##$SIOLD= 16384
##$SREGLST= <1H.CDCl3>
##$SSB= 0
##$STSI= 0
##$STSR= 0
##$SW_p= 4139.07284768211
##$SYMM= 0
##$S_DEV= 0
##$TDeff= 0
##$TDoff= 0
##$TI= <>
##$TILT= no
##$TM1= 0
##$TM2= 0
##$TOPLEV= 0
##$USERP1= <user>
##$USERP2= <user>
##$USERP3= <user>
##$USERP4= <user>
##$USERP5= <user>
##$WDW= 1
##$XDIM= 8192
##$YMAX_p= 0
##$YMIN_p= 0
$$ End of Bruker specific parameters
$$ ---------------------------------
##NTUPLES= NMR FID
##VAR_NAME=  TIME,          FID/REAL,        FID/IMAG
##SYMBOL=    X,             R,               I
##VAR_TYPE=  INDEPENDENT,   DEPENDENT,       DEPENDENT
##VAR_FORM=  AFFN,          ASDF,            ASDF
##VAR_DIM=   16384,         16384,           16384
##UNITS=     SECONDS,       ARBITRARY UNITS, ARBITRARY UNITS
##FACTOR=    0.0002416,     1,               1
##FIRST=     0,             0,               0
##LAST=      3.9581328,     0,               0
##MIN=       0,             -36978,          0
##MAX=       3.9581328,     40860,           0
$$ Real data points
##PAGE= N=1
##DATA TABLE= (X++(R..R)), XYDATA
0@%%%%%%%%%%%%%%%%JkLj0J6j6J7j8J8k6L4l4L7m6N2o0O9p8Q8r7J12j27J40j54
$$ 0 0 0 0 0 0 0 0 0 0 0 0 0 0 0 0 0 1 -1 2 -8 8 -8 9 -9 9 -17 17 -17 20 -26 26 -34 35 -43 45 -52 60 -67 73 -81
40h1J72j93K15k36K62k90L18l51L88m28M71n20N74o33O97p72Q57r53J066j197
$$ -81 91 -102 113 -123 139 -151 167 -184 204 -224 247 -273 301 -332 365 -407 450 -503 563 -634
60f34J354j543J779k086K497l084L995n603R280l2389p408N0865l0025J736N0694
$$ -634 720 -823 956 -1130 1367 -1717 2278 -3325 5955 -26434 -33842 17023 -13002 -11266 39428
75C9428J432m9398Q20O657k1059O321K5952j1909M210K7280k5626m1086L0912
$$ 39428 40860 -8538 -7718 -1061 -22120 -15799 10153 -1756 2454 29734 4108 -36978 -6066
88f066K4458l4334L176M8667j0441l7577P741K402k3677J1493J9432j1242J3284
$$ -6066 18392 -15942 -12766 35901 25460 -12117 -4376 -1974 -25651 -14158 5274 -5968 7316
101G316K9293k8135l0242K9885N869m2934P764M0528j4558k1065K2955L919j7794
$$ 7316 36609 8474 -21768 8117 13986 -28948 -21184 19344 4786 -16279 6676 10595 -7199
114g199J3472O029k2591J0273J9171l2035j5311L9564K383l5190J8049L0668k5631
$$ -7199 6273 12302 -10289 -16 19155 -12880 -28191 11373 13756 -21434 -3385 27283 1652
127A652j6536K2233l469j3778J7923j52k2341J5064J2618l3810k316M3205l906
$$ 1652 -14884 7349 3880 -9898 8025 7873 -14468 596 13214 -20596 -22912 20293 16387
140A6387k8668K3285J6923l5580j3623J8007q496l689K6704O58j4160K0392J643
$$ 16387 -12281 11004 27927 -7653 -21276 -3269 -11765 -15454 11250 11908 -2252 18140 19783
153A9783m0900J00L4082j4099j9709L1882J3049l0862l128J3747j4812l15K3847
$$ 19783 -21117 -21017 13065 -1034 -20743 11139 24188 -6674 -9802 3945 -10867 -11182 12665
166A2665o193r464K3181o103l9438P652K7823j9556r797L6338P229k6373L721
$$ 12665 6472 -2992 20189 14086 -25352 -17700 10123 -9433 -19230 17108 24337 -2036 1685
179A685O287k1726Q67J8284j1918k146K8667p538l1259J6326J9489k7305o025
$$ 1685 7972 -13754 -12887 5397 -6521 -8667 20000 12462 -18797 -2471 17018 -10287 -16312
192a6312L1915l251k2181J1511L848j9709Q248J5016j6405K378K6845j4366k5827
$$ -16312 15603 12352 -9829 1682 5530 -14179 -5931 9085 -7320 -4942 21903 7537 -18290
205a8290K1322J0895k9750J793K8803r981j5299J7071k23j7356J2590Q328k0187
$$ -18290 3032 13927 -15823 -14030 14773 4792 -10507 6564 6341 -11015 1575 9903 -10284
218a0284O453K2241k0089j7778K6037M544k6908J0153K3617j6045j0313J6687
$$ -10284 -3831 18410 -1679 -19457 6580 11124 -15784 -5631 17986 1941 -8372 8315
230H315o626j4543J5516L090j8468J3138J8236k3208j0026K6281l976k4831J4960
$$ 8315 1689 -12854 2662 5752 -12716 422 18658 -4550 -14576 11705 7729 -17102 -2142
243b142J7128j8616l289J6606j0354r790J6979k932j6734J7345J2311k5447k545
$$ -2142 14986 -3630 -6919 9687 -667 -10457 6522 3590 -13144 4201 16512 -8935 -11480
256a1480K5331j0729k0662J9250J1104j9049L232J4383j4305n297J6551r153j3973
$$ -11480 13851 3122 -17540 1710 12814 -6235 -3003 11380 -2925 -8222 8329 -824 -14797
269a4797K1174P012k4862N602K2942j6767j5999K0651L431j8514R034J1020j5779
$$ -14797 6377 13389 -11473 -5871 17071 304 -15695 4956 8387 -10127 -1093 9927 -5852
282e852J114J5785j3978r867K2736K16k3544J1392J7865k0756r430K1100k562
$$ -5852 -4738 11047 -2931 -12798 9938 10154 -13390 -1998 15867 -4889 -14319 6781 4219
295D219j4840J3962O881j5896N865J1632j8670n760K1929n593j8996J7421J3319
$$ 4219 -10621 3341 10222 -5674 191 11823 -6847 -12607 9322 3729 -15267 2154 15473
308A5473k1263k349J8873r203j2089J5252J150j4836J0497Q317j9357P66K0815
$$ 15473 -5790 -8139 10734 1531 -10558 4694 5844 -8992 1505 9822 -9535 -8769 12046
321A2046j0667j4478K0368O483k2008L154J5262j4127p548J6811l081j1554J5117
$$ 12046 1379 -13099 7269 13752 -8256 -5102 10160 -3967 -11515 5296 2215 -9339 5778
334E778M816j9097O142J6784j7162j1053K0861m92k0171J0504J3830j4734r64
$$ 5778 10594 -8503 -2361 14423 -2739 -13792 7069 6577 -13594 -3090 10740 -3994 -4958
347d958J6290r204j0556J4822j926j8292J2045J4390j8278l651K1334o892j8281
$$ -4958 11332 2128 -8428 6394 4468 -13824 -1779 12611 -5667 -9318 12016 5124 -13157
360a3157J3526Q688j5339M343J4049j2910p086J4055p660j5289J7292J1743j6755
$$ -13157 369 9057 -6282 -1939 12110 -800 -7886 6169 -1491 -16780 512 12255 -4500
373d500L594J8957j3876j7455J2223J467j4321J1027J4233j1050K82J3275j4203
$$ -4500 -906 18051 4175 -13280 -1057 410 -13911 -2884 11349 299 581 13856 -347
386c47j5043J6289M306j6606J0416J8335j5012j1020J3013n158j4208J3620J0208
$$ -347 -15390 899 5205 -11401 -985 17350 2338 -8682 4331 -827 -15035 -1415 8793
399H793j1009O620J2453j8141j2234J5204l249j5896J6227J7185j3755k630J3565
$$ 8793 -2216 4404 16857 -1284 -13518 1686 -1563 -17459 -1232 15953 2198 -432 13133
412A3133j1917j5016J1954K294j1962J2753J3452j5862l895J5812j0156j6573
$$ 13133 1216 -13800 -1846 448 -11514 1239 14691 -1171 -5066 10746 590 -15983
424a5983J5639R461j4907M488J4695j2717r519J2525m329j2785J4202R488j4571
$$ -15983 -344 9117 -5790 -1302 13393 676 -8843 3682 -647 -13432 770 10258 -4313
437d313L811J5826j3888j3789J4362P28j6170R398J4359j0654j171J3965r300
$$ -4313 -502 15324 1436 -12353 2009 2737 -13433 -4035 10324 -330 -1501 12464 3164
450C164j3218J1579Q51j5802R532J6222j2375n208J6437n685j7768R151P909j2490
$$ 3164 -10054 1525 2376 -13426 -3894 12328 -47 -5255 11182 5497 -12271 -3120 4789 -7701
464g701M820J5468r677p882J2408o021j7228J1568J2183j2904K459J8608q991
$$ -7701 -2881 12587 2910 -4972 7436 1415 -15813 -4245 7938 -4966 -2507 16101 7110
477G110j5656R368K70j5267Q219J4431q868K28J5123j0155j6796J1009M058j6088
$$ 7110 -8546 822 1092 -14175 -5956 8475 -393 -165 14958 4803 -11993 -984 3074 -13014
491a3014P121J8885q849q016J2615m675j6320Q238P958j1417N557J6284j0641
$$ -13014 -5893 12992 4143 -3873 8742 4067 -12253 -4015 3943 -7474 -1917 14367 3726
504C726j0852J2924k339j7945Q485J4231j0289j049J5243o723j3248R156R75j4391
$$ 3726 -7126 5798 3459 -14486 -6001 8230 -2059 -3108 12135 5412 -7836 1320 2295 -12096
518a2096P871J4142j0829l364J5812n812j6731R145P050j3733K988J5438p469
$$ -12096 -4225 9917 -912 -4276 11536 5724 -11007 -1862 5188 -8545 -5557 9881 2412
531B412p092J2343l303j5235Q550Q656j3265J679J6986p593j1870J2069J497j6119
$$ 2412 -4680 7663 4360 -10875 -2325 6331 -6934 -5255 11731 4138 -7732 4337 5834 -10285
545a0285N223J2187r976j920J4720n680j2503J0664L123j5600M908J4820j0048
$$ -10285 -5062 7125 -2851 -4771 9949 4269 -8234 2430 5553 -10047 -5139 9681 -367
558c67o251J4997k343j5285P731P591j2803J599J4107p876p763J3291j015j5464
$$ -367 -6618 8379 6036 -9249 -1518 6073 -6730 -5131 8976 1100 -6663 6628 5613 -9851
572i851P687J0500j3068k075J5569n206j1709J0896L712j3734M198J0914j0673
$$ -9851 -2164 8336 -4732 -6807 8762 3556 -8153 2743 6455 -7279 -3081 7833 -2840
585b840l791J4266m235j2642J1020O663j4737J158J3629q558q067J2907L95j2466
$$ -2840 -6631 7635 3400 -9242 1778 8441 -6296 -5138 8491 -67 -8134 4773 5168 -7298
599g298P479P555j2953l68J3450p588r391J3720L024j4752M796J0916j1539m653
$$ -7298 181 7736 -5217 -5585 7865 277 -9114 4606 7630 -7122 -2326 8590 -2949 -7602
613g602J3396l333j0160J0912M380j3927L179J1463j1094o154J4967q79j3154
$$ -7602 5794 2461 -7699 3213 7593 -6334 -3155 8308 -2786 -8940 6027 5148 -8006
626h006Q846P983j3397q38J2371p385p656J2848P54j3156P193R199j3046k497
$$ -8006 840 8823 -4574 -5412 6959 -426 -8082 4766 5520 -7636 -443 8756 -4290 -6787
640f787J4278n252j0860J1387M345j3536L316J0801r940m505J3178l004j1430
$$ -6787 7491 2239 -8621 2766 7111 -6425 -3109 7692 -2248 -6753 6425 3421 -8009
653h009R915N835j3784J335J2638q564p690J2874N98j2407P063Q436j1673j380
$$ -8009 1906 7741 -6043 -4708 7930 -634 -8324 4550 5148 -7259 -196 8240 -3433 -4813
667d813J2081o769r091J1774K216j3106N739J0883j0915m221J3164l654j1384
$$ -4813 7268 499 -8592 3182 5398 -7708 -1969 8914 -2001 -6222 6942 3288 -8096
680h096R399M940j2558K645J1216r066n384J3171j813j2306Q853P505j3316q19
$$ -8096 1303 6243 -6315 -3670 7546 -1520 -6904 6267 4454 -7852 1001 8506 -4810 -5629
694e629J2571p028q528J1871J840j1787O600R009j1533k347J2433o228j0877J1147
$$ -5629 6942 -86 -8614 3257 5097 -6690 -90 8919 -2614 -4961 7472 1244 -9633 1514
708A514M363j2966L905J1850r097n410J1916k586j1099Q741N636j2508J471J1704
$$ 1514 5877 -7089 -3184 8666 -431 -5841 6075 3489 -7610 1131 6767 -5741 -4270 7434
722G434q656p458J2814J193j1718P266Q832j1608l093J0209o762q895J1631L925
$$ 7434 -1222 -8680 4134 5327 -6391 875 9707 -1901 -4994 5215 -1547 -10442 1189 5114
736E114j0488O399J0283j1601n907J0956m201j0724J0415O904j0997J952R893
$$ 5114 -5374 1025 11308 -293 -6200 4756 555 -10169 246 7150 -3847 -1895 7998
749G998r798o811J2114m3r727R666P576j3553l036R669q152q099J3788N305r146
$$ 7998 -1800 -8611 3503 3460 -6267 3399 10975 -2578 -5614 4055 -4097 -12196 1592 6897 -2249
764b249O718P928j3816o452R516n245q132J3600P097j1011K964Q844j2010p341
$$ -2249 4469 12397 -1419 -7871 1645 -3600 -11732 1868 8965 -2046 918 9762 -2248 -9589
778i589J2130k30q899R916O455j3256j804R058q271n732J4530L503r882O579O212
$$ -9589 2541 2311 -6588 3328 9783 -3473 -5277 3781 -4490 -10222 4308 7811 -2071 4508 10720
793A0720j4707n338J0433m390o712J3174N524j0588L590P663j1793n289J1537
$$ 10720 -3987 -9325 1108 -3282 -9994 3180 8704 -1884 1706 9369 -2424 -7713 3824
806C824k927r791R916N814j2033J501J1312p318n967J1365q25j1560O473O284
$$ 3824 897 -8894 1022 6836 -5197 -3696 7616 298 -5669 5696 4871 -6689 -216 6068
820F068j1643r4J2317o218q364J1095K179j1567N943J0176r688l998R672o569
$$ 6068 -5575 -5669 6648 430 -7934 3161 5340 -6227 -284 9892 204 -3794 5878 -691
834f91j1327R343N459q843P004J3106r140q121P851n483j3086Q645R720p136L589
$$ -691 -12018 -2675 2784 -6059 945 14051 4911 -3210 4641 -842 -13928 -5283 4437 -2699 890
849H90J1701r145j0618P836q72j0203R725J1783r141l250Q236r095j1884J0033
$$ 890 12591 3446 -7172 664 -208 -10411 -686 11097 1956 -1294 6942 -2153 -14037 -4004
863d004O533o331Q445J1270j1297r038N898o702j0605J1892J0600o656L824R814
$$ -4004 2529 -3802 4643 15913 4616 -4422 1476 -5226 -15831 -3939 6661 5 3829 13643
877A3643j1349j0989P964n59q663J0233J0094j0031k496Q335q572r009J1904N014
$$ 13643 2294 -8695 -731 -1290 -9953 280 10374 343 -2153 6182 -2390 -11399 505 5519
891E519q536O412Q244j2853o937R232l842p808J2194P226j0032K163Q138j0834
$$ 5519 -3017 3395 11639 -1214 -8151 1081 -2761 -10569 1625 8851 -1181 982 9120 -1714
905a714o794J1352p08r689Q485O467j2087o16J1301n591o044J1614J006j2292
$$ -1714 -8508 2844 2136 -7553 932 7399 -4688 -5304 5997 406 -5638 5976 6982 -5310
919e310L775O104j1178j120J3687k576p773R579J937j3679J738R548p436k477
$$ -5310 -1535 4569 -6609 -7729 5958 3382 -4391 5188 7125 -6554 -4816 4732 -2704 -5181
933e181J2638k188j1264N933L364j1653K884J3546m756n547R842k556j4287L774
$$ -5181 7457 5269 -5995 -62 3302 -8351 -5467 8079 3323 -2224 7618 5062 -9225 -5451
947e451P252p988K352J4040m177r189P081j059j3304M768J1262o611j469J1727
$$ -5451 1801 -6187 -3835 10205 6028 -3161 3920 2861 -10443 -5675 5587 -1024 -2493 9234
961I234m654j2213O291L728r914M774J2396p063o219Q991l694j2226P540Q411
$$ 9234 4580 -7633 -1342 2386 -7528 -2754 9642 2579 -3640 5351 1657 -10569 -3029 5382
975E382q396J850J1432p634r787Q309L45j0336P383J0198q978k703R772o233j0169
$$ 5382 -3014 -1164 10268 2634 -7153 1156 1501 -8835 -1452 8746 -232 -2935 6837 604 -9565
990i565R532M869r500M483R589r952o442R826k080q850R659P107j0400j59Q322
$$ -9565 -33 4836 -4664 -181 9408 -544 -6986 2840 760 -8090 1569 8676 -1724 -1883 6439
1005F439q989p382J1287K289q491P563P432j1698l821R018n528p320J1347M521
$$ 6439 -2550 -9932 1355 3644 -4847 2716 10148 -1550 -5371 3647 -1881 -9201 2146 6667
1019F667r767L674P160j0936m609J1236j756p867R741M867j2129j29Q325q057
$$ 6667 -3100 574 7734 -3202 -7811 3425 1669 -6198 3543 8410 -3719 -3848 4477 -3580
1033c580m760J2544J274q942O833M844j2799k058J0160n567o067J2045K995j0680
$$ -3580 -8340 4204 5478 -3464 3369 8213 -4586 -6644 3516 -2051 -8118 3927 6922 -3758
1047c758M155O929j0592k948J1161l452q236R346L215j1818K433R567p795l888
$$ -3758 397 7326 -3266 -6214 4947 1495 -6741 2605 5820 -5998 -3565 6002 -1793 -5681
1061e681J1928j110j0233O371M290j1548K73J0533n901n295J1442R99j0696N090
$$ -5681 6247 5137 -5096 1275 5565 -5983 -5710 4823 -1078 -6373 5069 6068 -4628 462
1075D62O635j0542k163J0420m625p863R503K988j0226M198R036q521l640J0490
$$ 462 7097 -3445 -5608 4812 187 -7676 1827 4815 -5411 -1213 7823 -698 -4338 6152
1089F152l294j0136P245M278j0601K078J0544o371m801J0991n65j0779N568N568
$$ 6152 2858 -7278 -33 4245 -6356 -4278 6266 -105 -4906 6085 5520 -5259 309 5877
1103E877j0932q82J0620n184o596J0658K265j0372M735P802r904l351J0259m172
$$ 5877 -5055 -5937 4683 -501 -7097 3561 5826 -4546 189 7991 -1913 -5264 4995 823
1117H23r147Q674M131j0064L516R974p597m538J0384k357j0787O496N247j0557
$$ 823 -8324 350 4481 -5583 -2067 7907 310 -4228 6156 3799 -6988 -492 4755 -5802
1131e802O85J0679n582n740J0546J009j0208N173O444j0566k637R834m829p658
$$ -5802 -5117 5562 -20 -5760 4786 5795 -4413 760 7204 -3362 -5999 3835 -994 -8652
1145h652J0237M384r223L953Q247r386n165R057l194q877Q785N753r694J602R270
$$ -8652 1585 5969 -3254 699 8946 -440 -5605 3452 258 -8619 166 5919 -3775 -2173 7097
1160G097p659o054J0433N80r127O389N762j1256k418Q879n523n727J2210M377
$$ 7097 -562 -6616 3817 4397 -4730 1659 7421 -3835 -6253 2626 -2897 -8624 3586 7963
1174G963r032M058N977j2033n667R213k711o167J1391N929r956J275O747j0046
$$ 7963 -1069 2989 8966 -3067 -8734 479 -2232 -8399 2992 8921 -1035 240 6987 -3059
1188c059n696J1129M04p784P973N130j1903j911Q507n910m354J2786L031r527
$$ -3059 -8755 2374 2778 -5006 2967 8097 -3806 -5717 2790 -3120 -7474 5312 8343 -1184
1202a184L867M265j2695l978J0239k331m678J1884M378j0756J207N764j0295m401
$$ -1184 2683 6948 -5747 -9725 514 -1817 -6495 5389 9767 -989 218 5982 -4313 -8714
1216h714J1177n85p488Q316M518j1061N5Q821o430m557J0997K97j0107M932N216
$$ -8714 2463 1878 -5610 2706 7224 -3837 -3782 5039 -1391 -5948 5049 5346 -4761 171 5387
1231E387j0510j111J0575l859n999R909K022j0517L503P032r320l207J0038l399
$$ 5387 -5123 -6234 4341 482 -5517 4392 6414 -4103 -600 6432 -2888 -6095 3943 544
1245E44q359Q711M841r177K922R124q007n985Q438k450r577P767P159q314J081
$$ 544 -7815 896 5737 -3440 -518 8606 599 -5386 3052 602 -8975 -1208 5951 -2363 -1282
1260a282R563p225q097Q426Q45q957O562Q375q741k770Q242o005q470R539M921
$$ -1282 8281 1056 -7041 1385 2230 -6727 -165 8210 -531 -3301 4941 -1064 -9534 5 4926
1275D926p913M607Q406r629o634P507l049p939R610P524p833J324P724r011p944
$$ 4926 -2987 1620 10026 397 -6237 1270 -1779 -9718 -108 7416 -417 907 8631 -380 -8324
1290h324Q578O66p761P691P870r152k441P717o233p330R869L818q310M518P128
$$ -8324 254 920 -6841 850 8720 -432 -2873 4844 -1389 -8719 1150 4968 -3342 1176 8304
1305H304r975m897Q842k652p000R488N329r488J200P277q503n483J0035m6q160
$$ 8304 -1671 -6568 2274 -378 -7378 2110 7439 -2049 -849 6428 -2075 -7558 2477 2431 -5729
1320e729P193N696j0117r18Q964n605n791R940J317r903M230O418r329j961J0519
$$ -5729 1464 7160 -2957 -3875 5089 -516 -6307 3633 4950 -4953 -723 5695 -3634 -5595 4924
1335D924k966p120Q312K403j0701K107Q063p192k998J0593j654r079O233L990
$$ 4924 1958 -5162 3150 5553 -5148 -3041 5022 -2170 -5168 5425 3771 -5308 925 4915
1349D915j0060Q81R767n119m858R200n56j0236M575O065q527j66J0456l898p212
$$ 4915 -5145 -4264 5503 384 -4474 4726 4170 -6066 -1491 4574 -3953 -4119 6337 2439 -4773
1364d773P655J145j0293L319Q051o913k128R920k962q692O674L338r728K020R309
$$ -4773 2882 4027 -6266 -2947 5104 -1809 -3937 5983 3021 -5671 1003 4341 -5387 -3367 5942
1379E942o062m562R226j104r340N724N412r062J09R456n225o319Q867J127r576
$$ 5942 -120 -4682 4544 3440 -5900 -176 5236 -3826 -3717 5739 514 -5805 3062 4189 -5387
1394e387M405P023q410k241R429l466p328Q165L042r717K429P797p584l985R761
$$ -5387 -982 6041 -2369 -4610 4819 1353 -5975 2190 5232 -4485 -2056 5741 -1843 -5828 3933
1409C933j069q028O747M512r790m6Q384n860m982R757J036q760M783N570r431
$$ 3933 2864 -5164 1583 6095 -3695 -3741 4643 -1217 -6199 3558 4594 -4166 617 6187 -3244
1424c244k102R029l591n886Q889K600r358K634O533q297l259R678j447p106P355
$$ -3244 -5346 3683 92 -5794 3095 5695 -3663 -1029 5504 -2793 -6052 3626 2179 -4927 2428
1439B428L701r782N34P649o449m186R800K51q260N577M842r690j204Q803m397
$$ 2428 6129 -3653 -3119 4530 -1919 -6105 3695 3946 -4314 1263 6105 -3585 -4789 4014 -383
1454c83n337R164J691r096L634N964q776k459R497k620o701Q027L114r542J697
$$ -383 -5720 3444 5135 -3961 -327 5637 -3139 -5598 3899 1279 -5422 2605 5719 -3823 -2126
1469b126P255p151l682R430r21p766O497M317r481K6Q368n399n120Q986P89q553
$$ -2126 5129 -2022 -5704 3726 2805 -4961 1536 5853 -3628 -3602 4766 -633 -5753 3233 4022 -4531
1485d531M556N541q623j476Q974l652o221Q164K294r208K597O828p449l090R090
$$ -4531 25 5566 -3057 -4533 4441 789 -5432 2732 5026 -4182 -1585 5243 -2206 -5296 3794
1500C794j681p152O846L716r178Q98P763o095m576Q960J05q151N179N117q649
$$ 3794 2113 -5039 1807 5523 -3655 -2757 5006 -1089 -5665 3295 3400 -4751 428 5545 -3104
1515c104p57Q521m338n665Q296J447q985L372O321p824k239R231k231o617P171
$$ -3104 -3861 4660 322 -5343 2953 4400 -4585 -1213 5108 -2716 -4955 4276 2045 -4572 2599
1530B599K697r406J449P114o670l446R482m93p561N763M059r206k15Q073m895
$$ 2599 5296 -4110 -2661 4453 -2217 -5663 3819 3326 -4235 1528 5587 -3619 -3834 4239 -656
1545f56m594Q807P46q609L981N199q397j335R197k729n762P513J657r465J803
$$ -656 -5250 3557 4303 -4306 -325 4874 -3523 -4858 4339 1610 -4152 3361 5018 -4447 -2644
1560b644O297o858k149R860q24o885N886K733r731RP503n020l343R302L80q051
$$ -2644 3653 -3205 -5354 4506 3682 -3203 2683 5416 -4315 -4306 3197 -1823 -5166 4136 4516 -3535
1576c535M226M106q780p54Q851l266n066P817J066r148K490N704p049j310R504
$$ -3535 691 4797 -3983 -4737 4114 848 -4218 3599 4665 -4483 -1993 3711 -3338 -4648 4856
1591D856j803o545O298J964r578J108P183n631k758R228m53p435N151L531q894
$$ 4856 3053 -3492 2806 4770 -4808 -3700 3483 -2148 -4906 4322 3869 -3566 1585 5116 -3778
1606c778q0P901m787m696Q308R08p980M159N478p728j519Q108l530o075P323K312
$$ -3778 -3858 4043 -744 -5440 2868 3776 -4204 -45 5433 -2295 -3814 4294 764 -5311 2012 4324
1622D324q286K584O446p013l237Q360j229o402O544L860q468J10O366o277m495
$$ 4324 -3962 -1378 5068 -1945 -5182 3178 1949 -4453 2091 5951 -2517 -2407 3959 -2318 -6813
1637f813Q682J296o346N432M835q634k351O483m474n012Q613L032o918L265N077
$$ -6813 1869 3165 -3181 2251 7086 -1548 -3899 2584 -1890 -6902 1711 4743 -2175 1090 6167
1652F167q403l566P768j677n125P705L575q386L33N215p041l547R261Q86n770
$$ 6167 -2236 -5802 1966 289 -4836 2869 6444 -1942 -1609 3606 -3435 -6982 2279 3165 -2605
1667b605N862L504r472j732O441m546l542R304K027p260L306L919q788k064Q337
$$ -2605 3257 6761 -2711 -4443 1998 -2548 -6090 3214 5241 -2019 1287 5206 -3582 -5646 2691
1682B691k172m811P606K050q753J302N574o336j966R086q61o740N124K417q772
$$ 2691 519 -4292 3314 5364 -3389 -2087 3487 -2849 -4815 4271 3410 -3330 1794 4211 -4561
1697d561N08P683m035l235Q034l78q259L361M197p093K84Q624l143n591O116M36
$$ -4561 -4053 3630 -405 -3640 4394 4016 -4243 -882 3315 -3778 -3494 5130 1987 -3604 2512 2948
1713B948q442K983O679n220j215P822l124p602M805K429p089K990Q253m757l889
$$ 2948 -5494 -2511 4168 -1052 -2267 5555 2431 -5171 -366 2063 -5026 -2036 6217 1460 -2429
1728b429O357k421q217M757N055n718J674P824m989o187N696k57p442M806O758
$$ -2429 3928 1507 -6710 -1953 3102 -2616 -942 6882 1893 -4294 1402 1145 -6297 -1491 5267
1743E267n715j225O806m342o830O115K651o487L547O665o473l939O437k231o512
$$ 5267 -448 -1673 5133 791 -6039 76 2727 -3760 -213 6452 -21 -3960 2477 246 -6266
1758f266O334M720o432J015O244n935m962O897K57o534M882M944p208j281O924
$$ -6266 68 4788 -1644 -629 5615 -320 -5282 1615 1872 -4662 220 5164 -2044 -3325 3599
1773C599l467m644P290J899p493K027M482p166k220Q241o99m834O405K510q534
$$ 3599 132 -4512 2778 4677 -2816 -789 3693 -3473 -5693 2548 1849 -2985 3420 5930 -2604
1788b604j86N349n336k488Q607M13o559M071K770q230l80P822k556l162P416J14
$$ -2604 -2790 2559 -2777 -5265 3342 3755 -2804 1267 4037 -4193 -4573 3249 693 -2469 4947 5061
1804E061q897J372L682o549J68R709p02m653N594J33r787K71N577m528o81R187
$$ 5061 -3836 -2464 1218 -5331 -5163 4546 3844 -809 4785 4918 -4869 -4598 979 -3549 -4230 4957
1820D957m51o693L874J773q222P74P771l242l130O922j041q433K643M262n674
$$ 4957 4506 -2187 1687 3460 -4762 -3988 3783 541 -2589 4333 3292 -5141 -2498 1764 -3910
1835c910J135Q822k392n286N065m96q882J852N967m591n54Q400j537o239M606
$$ -3910 -2775 6047 3655 -1631 3434 2938 -5944 -4092 1875 -2716 -3270 5130 3593 -2646 1960
1850A960J838p701J176O467m746l294O955o60o711M612M543o139L05O681m297
$$ 1960 3798 -3903 -2727 3740 -1006 -4300 2655 1995 -4716 -104 4439 -1700 -1395 5286 989
1865I89n238N789K11p129L494N679n557r05P417k427n546N558J648p628J363N311
$$ 989 -4249 1540 1751 -5378 -1884 3795 -1762 -2667 4750 2323 -3223 2335 3983 -3645 -2282 3029
1881C029n677k522P677m14n360N578L542p298l72N432n197m147O933O14o015M507
$$ 3029 -2648 -5170 2507 2093 -3267 2311 5853 -1445 -1817 3615 -1582 -5729 1204 1818 -4197 310
1897C10M796o415r35O714l352n205N888J169p314K138N201n497j426P810j094
$$ 310 5106 -1309 -2244 4470 1118 -4087 1801 2970 -4344 -2206 2995 -2502 -3928 3882 2788
1912B788n324N308K219p906K2N323m926k961P503M58n530M663L830o929q02O097
$$ 2788 -2536 2772 4991 -2915 -2893 2430 -2496 -5457 2046 2504 -3026 1637 5467 -1462 -2264 3833
1928C833m038m709O261R57o709L090N237n518j007P205k179n405N184J267p846
$$ 3833 -205 -4914 1347 2304 -4405 -1315 3922 -1596 -2603 4602 2423 -2982 2202 3469 -4377
1943d377J045N561m664j823P953j30n613M403K433p787m19N913m036l286P307
$$ -4377 -3332 2229 -2435 -4258 3695 3565 -2048 2355 4788 -2999 -3418 2495 -1541 -4827 2480
1958B480P04o534L372M163o358o89P027k585m752N538M89p855J719N515m536o52
$$ 2480 3184 -3350 22 4185 -2173 -2862 4165 1580 -3172 2366 2855 -5000 -3281 2234 -2302 -2954
1974b954Q251r19n952L669R36q176M00O442l162j654P753j91p007K779K943o752
$$ -2954 5297 4378 -1574 2095 3031 -5145 -4745 1697 -1465 -3119 4634 4443 -2564 215 3158 -3594
1990c594L3P319k510m119N572k24p624K490N409m443p2P669k239o433L652N99
$$ -3594 -3561 3758 1248 -2871 2701 2477 -5147 -2657 2752 -1691 -1763 5906 3667 -2766 886 1485
2006A485p395K001O937l268j453O939j712p186L406K779o435J033O999l527l990
$$ 1485 -5910 -3909 3028 -240 -1693 5246 3534 -3652 -246 2533 -3902 -2869 4130 603 -3387
2021c387N757l32o616L872N072n376n73O234l810n839N159J614n935L185O050
$$ -3387 2370 2038 -4578 -706 4366 -1010 -1583 4651 841 -4998 161 1775 -4160 -975 5075
2036E075n065k505N857k332n825N300L279o204R84N526n089l877O425L99n142
$$ 5075 10 -2495 3362 1030 -4795 505 3784 -2420 -1436 4090 -999 -4876 1549 1948 -3194
2051c194M748M026o780j514N051l998m107P080K469n484K936M001o888k894N907
$$ -3194 1554 5580 -1200 -2714 2337 -1661 -5768 1312 3781 -1703 1233 5234 -1654 -4548 1359
2066A359j648l935O518K861o804N07M298n693k803P416N43m753M600K491p689
$$ 1359 -289 -4224 2294 5155 -1649 -1142 3156 -2537 -5340 2076 2619 -2134 2466 4957 -2732
2081b732j096N520l452k494P642J183o454K362K969p018j263P177j395l603O037
$$ -2732 -3828 1692 -1760 -4254 3388 4571 -1883 479 3448 -3570 -4833 2344 949 -2654 3383
2096C383J032p650J086M687n027j217P578q96n796L899J771p105J036O764l130
$$ 3383 4415 -3235 -2149 2538 -2489 -3706 3872 2976 -2820 1079 2850 -4255 -3219 3545 415
2111D15k507O240j251p397K809L703n380R62P609k570m856M405m96p237K800N904
$$ 415 -2092 4148 2897 -4500 -1691 2012 -3368 -2406 5203 2633 -2223 2182 1686 -5551 -2751 3153
2127C153l963n09O602k973o691L793J962n727K927P061l918l413M727k649o950
$$ 3153 -810 -1319 5283 2310 -4381 -588 1374 -4353 -1426 5635 1717 -1696 3031 382 -6568
2142f568M314M751m313J938O715m463n765M012p48o149M411O189m253n63N741
$$ -6568 -2254 2497 -1816 122 6837 2374 -3391 621 -127 -6276 -1865 4324 71 -492 5249
2157E249m075o267M732J953n459L303O056n067l201N196k373n603N349L961n262
$$ 5249 1174 -5093 -361 1592 -3867 -564 5492 425 -2776 2420 47 -5556 -207 3754 -1508
2172a508J420N608n184m666N328m08n620M515M730n398k79N984l573m741N435
$$ -1508 -88 5520 336 -4330 998 590 -5030 -515 4215 -1183 -1462 4522 949 -3792 1643
2187A643Q79o503K509M837n306j460O879j441m914M831J776p023Q67N409m357
$$ 1643 2522 -3981 -1472 3365 -1941 -3401 3478 2037 -2877 1954 3730 -3293 -2426 2983 -1374
2202a374k339O890l85o094L542K917o341L89O747k768l548N609m76p437K166M314
$$ -1374 -3713 3177 2792 -3302 240 3157 -3184 -2795 3952 1184 -2364 3245 2769 -4668 -2502 1812
2218A812m941L23P908j531n008M036j9p823J381N691l635o64P470j255o368L201
$$ 1812 -3129 -2806 5102 3571 -1437 2599 2580 -5243 -3862 1829 -1806 -2470 5000 3745 -2623 578
2234E78J740o720J185O915k941k882N769j192p165K898L976n072R32P437k654
$$ 578 2318 -4402 -3217 3698 757 -2125 3644 2452 -4713 -1815 2161 -2911 -1979 5458 2804
2249B804n032M303l47p281K371N608l947l74P079k051n984L803J426o741J542
$$ 2804 -2228 2075 1728 -5553 -3182 2426 -1521 -1895 5184 3133 -2851 952 2378 -4363 -2821
2264b821O230l719k579O198r57o226L631L454n763N00O412l490m354N336J56o416
$$ -2821 3409 -310 -2889 3309 2352 -3874 -243 3211 -2552 -2052 4360 870 -3484 1852 2008 -4408
2280d408K997M845m921o88O498k430n193M669J281o648J768N463m465k013O649
$$ -4408 -1411 3434 -1487 -2175 4323 1893 -3300 1369 2650 -3998 -2230 3233 -1232 -3245 3404
2295C404j002n561M179K594o465N24N724m015l290O230J28o023L486L981n837
$$ 3404 2402 -3159 1020 3614 -2851 -2327 3397 -618 -3908 2322 2450 -3573 -87 3894 -1943
2310a943n46O240k951m492N393R59o481K434M963n046j493O662j642n402M497
$$ -1943 -2489 3751 800 -3692 1701 2660 -3821 -1387 3576 -1470 -2963 3699 2057 -3345 1152
2325A152K013o515J056N585m176k604O463m84n892L752L356o107q8O093l314m026
$$ 1152 3165 -3350 -2294 3291 -885 -3489 2974 2490 -3402 350 3706 -2401 -2489 3604 290 -3736
2341c736N629N55o196K900M545n257r91O439k394n173M738J615o362J849N492
$$ -3736 1893 2448 -3748 -848 3697 -1560 -2551 3888 1494 -3679 1059 2674 -3688 -1839 3653
2356C653m413k090O302j321n835M077K751o199P68O113l727l426N833j29o167
$$ 3653 -760 -2850 3452 2131 -3704 373 3124 -3075 -2307 3806 79 -3347 2486 2357 -3810
2371c810L319M005n528l40O353l021m684N175R82o361K448N180m764j514O319
$$ -3810 -491 3514 -2014 -2354 3999 978 -3706 1469 2451 -3910 -1462 3718 -1046 -2560 3759
2386C759j955n568M405K128o243J452N890m023k860O024p48o098L561L438n709
$$ 3759 1804 -3764 641 2769 -3474 -2022 3868 -155 -3015 3009 2261 -3837 -276 3162 -2547
2401b547K22O189l256m053N540M60o335K746M610n145j066O293k272n008M769
$$ -2547 -2325 3864 608 -3445 2095 2555 -3780 -1034 3576 -1569 -2635 3658 1386 -3622 1147
2416A147J635o269J766N378m469k228O290j105n760L989K841o083N58N899l664
$$ 1147 2782 -3487 -1721 3657 -812 -3040 3250 2145 -3615 374 3215 -2868 -2310 3589 -75
2431g5l315O003Oo177L137L888n695n89O284k564m384N335J136o353K099M751
$$ -75 -3390 2613 2619 -3558 -421 3467 -2228 -2817 3467 903 -3481 1854 2990 -3363 -1264 3487
2447C487m983j635O465j585n294M516K287o310R63N532m028k754O197n05n831
$$ 3487 -1496 -3131 3334 1749 -3545 971 3258 -3052 -2089 3443 -585 -3339 2858 2353 -3478
2462c478L612L379n928q0O034l193l997N519P65o067K700M487n169j242O056k390
$$ -3478 134 3513 -2415 -2495 3539 346 -3651 1868 2633 -3434 -734 3753 -1416 -2658 3398 1008
2478A008n015M918K027n961J737N356m550k654N790j243n548M357L351n645N46
$$ 1008 -4007 911 2938 -3023 -1286 4070 -480 -3134 2656 1413 -4135 222 3573 -2072 -1526
2493a526N538m125m036N543L63n487L839M503n350j164N269l538m881N430K013
$$ -1526 4012 -113 -4149 1394 1757 -3730 109 4612 -738 -1902 3367 -171 -5052 378 2391
2508B391n224K854N096n276k772N187k133n049N185L365n339J250N006n073l800
$$ 2391 -2833 21 5117 -159 -2931 2256 123 -4926 259 3624 -1715 -465 4541 -532 -4332
2523d332N557j73m962M588M199n642q58M805m128m314N867J658m945L464M551
$$ -4332 1225 1052 -3910 678 4877 -765 -1623 3182 -946 -5260 607 2265 -2680 784 5335
2538E335n692k386N079k661m748N387K827n298J781M983m987l064N623j000n278
$$ 5335 -357 -2743 2336 -325 -5073 314 3141 -2157 -376 4607 -380 -3444 2179 1179 -4099
2553d099M410L439n724J70N408l779l690N666L65n603L357M206n400r83N675k954
$$ -4099 311 3750 -1974 -1804 3604 -175 -3865 1801 2166 -3437 -80 4126 -1274 -2257 3418 464
2569D64m820M895J519n585K652N410m312j928N462k512o051L873K585n242K035
$$ 464 -4356 539 2058 -3527 -875 4535 223 -1705 3757 1245 -4806 -933 1652 -3590 -1555
2584a555O400l425l206M874j557o439L401M005m620Q30O192l474m924M346J54
$$ -1555 4845 1420 -1786 3088 1531 -4908 -1507 2498 -2122 -1292 4900 1426 -3498 848 1002
2599A002n709L511N678l952j210N084l589o236L907K234m651L292O578l753l210
$$ 1002 -4707 -1196 4482 530 -680 4404 815 -5421 -1514 720 -3931 -639 5939 2186 -1024
2614a024M241k597o512L697L990m205J652O171l768m533M341l57n773L701M998
$$ -1024 3217 620 -5892 -2195 1795 -2410 -758 5413 1645 -2888 1453 1096 -4677 -976 4022
2629D022m452q77N131l495n238M625J910m821L109N520m581k755M658k480n653
$$ 4022 -430 -1307 3824 329 -4909 -284 1626 -3195 -86 5434 853 -1902 2756 276 -5377
2644e377M326L244m742J698N737l930l445N033q24n865L417L676n325j72N797
$$ -5377 -1051 2193 -2549 -851 4886 956 -2489 2544 1720 -4145 -728 2948 -2377 -2549 3248
2659C248k767l770N339R27n773K367M167n157j624N722j940m692M642K111n629
$$ 3248 481 -3289 2050 2977 -2796 -429 3738 -1419 -3043 2679 739 -3953 689 2800 -2829
2674b829J533N230l940k351N549j213n858L263K729n488O58O297k500l052N249
$$ -2829 -1296 3934 -6 -2357 3192 1979 -3879 -616 2113 -3375 -2717 3580 1080 -1972 3277
2689C277j86o391K085L474n040m50O308j794m102M720J171o070J634M786m164
$$ 3277 3091 -3300 -1215 2259 -2781 -3231 3077 1283 -2819 1901 3072 -2998 -1364 3422 -742
2704g42j791N603j630n355L728K378n357J380N938l194k938N056r65o139K796
$$ -742 -2533 3070 1440 -3915 -187 2191 -3166 -1786 4152 958 -1980 3076 2111 -4028 -1232
2719a232L365m927L54O170k445l811M799M59o033K133M316m618j339N653j881
$$ -1232 2133 -2794 -2440 3730 1285 -2526 2273 2732 -3301 -1168 3148 -1470 -2809 2844 963
2734I63m668M418K011n387J651N175m019k747N078j230n532L544L272m870P24
$$ 963 -3705 713 2724 -2663 -1012 4163 144 -2603 2475 1245 -4287 -743 2529 -2341 -1617
2749a617N716l053l609M721j37n815K665M070m619o98N692k223m377M429J393
$$ -1617 4099 1046 -2563 2158 2021 -3794 -1129 2941 -1678 -2376 3316 1093 -3284 1145 2538
2764B538n426J958M784m317k257N146j550n082M063K984m874J122N257l737l521
$$ 2538 -2888 -930 3854 -463 -2720 2426 876 -4206 -143 2841 -2033 -911 4346 609 -2912
2779b912M619o35n319L463M023m597k06N364l022m313M524R72n147K625M474m634
$$ -2912 1707 1072 -4247 -784 3239 -1358 -1564 3800 778 -3535 989 1961 -3186 -561 3913 -721
2795g21j787N064k056m581M593K553m990J314M579m378l076M917n71m543M170
$$ -721 -2508 2556 500 -4081 512 3065 -1925 -611 3968 -410 -3486 1431 860 -3683 487
2810D87L434n146k08M638l570l640N176R69m776K840L639n208j513N063j999l670
$$ 487 3921 -1225 -1433 3205 -365 -4005 1171 2140 -2636 204 3843 -1365 -2878 2185 186 -3484
2826c484N079J872n445J065L893m655k127N787k83m013M001K117o059k91M498
$$ -3484 1595 3467 -1978 -913 2980 -1675 -3802 1985 1702 -2311 1690 3807 -2252 -2543 1955
2841A955l267k305O044P72n001K473K494n744q64N484j735k931N152Q36n977J251
$$ 1955 -1312 -3617 2427 3199 -1802 671 3165 -2579 -3443 2041 306 -2625 2527 3363 -2614 -1363
2857a363L620m381r49O166p68m260L502J007o128O24M970k895j423N905m79n451
$$ -1363 2257 -2124 -3073 3093 2325 -1935 1567 2574 -3554 -2930 2040 -855 -2278 3627 3148 -2303
2873b303K430K130n424K56N610k227k934M699R4n516K352L894m224o88N325k317
$$ -2303 127 2257 -3167 -2911 2699 472 -2462 2237 2331 -3185 -833 3061 -1163 -1851 3474 1157
2889A157m724L703J343m840K219N087l523k132M606j764n165L602K927m521R11
$$ 1157 -3567 136 1479 -3361 -1142 3945 422 -1710 2896 1132 -4033 -431 2496 -2025 -1114
2904a114M813l695l552M491K36m189L845L900m808j446L724l631m171N058K576
$$ -1114 3699 4 -3548 943 1179 -3010 835 4735 -73 -1519 2205 -1426 -5597 -539 2037
2919B037l391L118M015n275l262L510k168l756N319L571m146R09L495n044l591
$$ 2037 -1354 1764 5779 504 -2758 752 -1416 -5172 147 3718 -428 481 3976 -1068 -4659
2934d659M902N41l162M542L119n724j703L154l799k849O320K663l321K777K605
$$ -4659 243 784 -2378 2164 5283 -441 -2144 1010 -2789 -5638 682 3345 24 2801 5406
2949E406o382l084L789j837k631N966L062m466R45L041n174k812N155l2l538M001
$$ 5406 -976 -4060 -271 -2108 -4739 1227 4289 -177 768 3809 -1365 -4177 978 946 -2592 1409
2965A409K343n611m94M065l069k159N829J038m557K281K359n572j390M790j824
$$ 1409 3752 -1859 -2353 1712 -1357 -3516 2313 3351 -1206 1075 3434 -2138 -3528 1262 -562
2980e62k941N004J555m764J785L729m363j865M694j701m605L526K221m345J684
$$ -562 -3503 1501 3056 -1708 77 3806 -557 -2422 2272 571 -4034 -508 1713 -2632 -948
2995i48N149l062k618M104j314n432K858L199l959O54N188k816l878L776L26m511
$$ -948 4201 1139 -1479 2625 1311 -4121 -1263 1936 -2023 -1369 3819 1003 -2875 901 1227 -3284
3011c284L031M443l884j403L923l196m938L865K546l243K961N018l912l330K955
$$ -3284 -253 4190 306 -1097 2826 -370 -5308 -1443 1103 -2140 821 5839 1927 -1403 1552
3026A552k398m949L949L947l097J433M618l833m223L448j09m183L608M202m038
$$ 1552 -846 -5795 -1846 2101 -996 437 5055 1222 -3001 447 338 -3845 -237 3965 -73
3041g3j074L758l278m159M517K269l473K675L999m647k976L390k035l965M552
$$ -73 -1147 2611 -667 -4826 -309 1960 -1513 1162 5161 514 -2462 928 -1107 -5072 -520
3056e20L321l636J300M088m139l458M033l89m196L382L274m359l13M367k735l168
$$ -520 2801 -835 465 4553 414 -3044 989 600 -3596 -214 3060 -1299 -1612 2755 20 -3148
3072c148M644J033m576K072L217m611j584M604j529l431M260J967m560J185L870
$$ -3148 1496 2529 -2047 25 3242 -1369 -2953 1651 122 -3309 951 2918 -1642 -457 3413
3087C413l829k250M575q24m400L104K488m407N15M750k529k693M335j24n090K026
$$ 3413 -416 -2666 1909 1085 -3315 -211 2277 -2130 -1615 3135 606 -2087 2248 2124 -2966 -940
3103i40L021m152k99N128j645l462L889R24m979J456L776l658j457M759j257m290
$$ -940 2081 -2071 -2370 2758 1113 -2349 1540 2464 -2515 -1059 2717 -941 -2398 2361 1104 -3186
3119c186L343K094m409R81M586l002k545M205p48m779K670K978m040K13M873k304
$$ -3186 157 2251 -2158 -1177 3409 407 -2138 2067 1319 -3460 -790 2188 -1852 -1639 3234 930
3135I30l362L938M33m802J936L598l832r51M652j643l893L715J673m543J230M066
$$ 930 -2432 1506 1939 -2863 -927 2671 -1161 -2112 2540 897 -2996 719 2392 -2151 -921 3145
3151C145l452k171M314q31m276L190K678m250M43M423k863l036M121J31m536K381
$$ 3145 -307 -2478 1836 1005 -3271 -81 2597 -1653 -1210 3213 350 -2686 1435 1566 -2970 -589
3167e89L338l985o04M555k053l552L883J206m576J524L875l684j721M477j121
$$ -589 2749 -1236 -1840 2715 662 -2890 993 2199 -2377 -853 3022 -662 -2383 2094 973
3182I73m016L386K223m354O68M151l164k651M326j53m342K778L045m110l49M325
$$ 973 -3043 343 2566 -1788 -1120 3031 -133 -2784 1542 1389 -2953 -175 2870 -1240 -1589 2736
3198B736k403l289M034Q23m486K009L577l860j321M451j474l788L660J770m445
$$ 2736 333 -2956 1078 1901 -2585 -576 3001 -859 -2180 2271 797 -2991 669 2439 -2006
3213b006R80L856l391k073M510m95m102L092K468m463p5M138k612k723M407N02
$$ -2006 -1026 2830 -561 -2634 1876 1381 -2721 371 2839 -1624 -1699 2439 -173 -2896 1511 2013
3229B013m353K206L001m256r39M577j687l295L992J268m672J075L516l578j483
$$ 2013 -2340 -134 2867 -1389 -2328 2249 562 -2733 1259 2527 -2145 -1070 2446 -1132 -2615
3244b615M813o40l850L185J789m863J20M160k597k064M793K14m460K159K292m561
$$ -2615 2198 1558 -2292 893 2682 -2181 -2061 2099 -498 -2562 2231 2445 -2015 144 2436 -2125
3260b125n40M675j671k687M289Q13m858J180L095l788j026M971q83l505L402J250
$$ -2125 -2665 2010 339 -2348 1941 2754 -2104 -924 2171 -1617 -2643 2328 1445 -2060 1342 2592
3276B592n065N36L915k893j541M902j42m237K432J919m801j49M497k075k237M592
$$ 2592 -2473 -1937 1978 -915 -2456 2446 2304 -1933 499 2418 -2383 -2532 1965 -110 -2347 2245
3292B245N00m715J607K694m240q91M737j251k992L983J190m829Q11L408l574j596
$$ 2245 2745 -1970 -363 2331 -1909 -2800 1937 686 -2306 1677 2867 -1962 -1151 2257 -1317 -2913
3308b913M881l93l632L143J897m885j27L879k691k132M869N29m107K260K386m744
$$ -2913 1968 1575 -2057 1086 2983 -1902 -2029 1850 -841 -2973 1896 2425 -1682 578 2964 -1780
3324a780j048M259j668k519M543J366m481J161K775m334j660M617n50l040L988
$$ -1780 -2828 1431 -237 -2756 1787 3153 -1328 -167 2608 -1726 -3386 1231 681 -2359 1629
3339A629J928m828L4L239l479k036M889L75l521L047K246m956r00L814k407k444
$$ 1629 3557 -1271 -1237 2002 -1477 -3513 1376 1751 -1770 1277 3523 -1433 -2333 1481 -926 -3370
3355c370M858J251m062J895K595m696j577M274j280k811M472J916m483O43K967
$$ -3370 1488 2739 -1323 572 3167 -1529 -3106 1168 -112 -2923 1549 3465 -1018 -375 2592
3370B592m038k176M503j09l128L758K396m692m10L389l237k686M666R54l547K705
$$ 2592 -1446 -3622 881 772 -2356 1402 3798 -894 -1304 2085 -1152 -3838 828 1782 -1765 940
3386I40K817m613j402L715k152k907M548J800l977J538L059m338k194M067q50
$$ 940 3757 -856 -2258 1457 -695 -3602 946 2746 -1231 307 3366 -972 -3166 901 51
3401E1l068M150K460m317K11L201l837k725M430L97l286L426K888m472r70L415
$$ 51 -3017 1133 3593 -724 -513 2688 -1149 -3874 556 953 -2333 1093 3981 -491 -1461 1954
3417A954k861k949M472J362l709K289L124m377j834L922j540l159M160K061m153
$$ 1954 -907 -3856 616 1978 -1731 558 3682 -695 -2529 1393 -147 -3306 854 2915 -1238
3432a238R09L308l900k298M330l07l447L504K580m401k46L626l066k780M291O34
$$ -1238 -329 2979 -921 -3219 1111 804 -2643 861 3441 -960 -1206 2420 -646 -3426 865 1499
3448A499l830K675L068m191j008M030k084l375L844J365m164J640L621l613j714
$$ 1499 -2331 344 3412 -779 -1787 2243 159 -3216 628 1993 -2171 -531 3090 -523 -2237
3463b237M270j183l845L337K127m238O70M036l053k545M062k02m064K828K956
$$ -2237 2033 850 -2995 342 2469 -1769 -1099 2937 -116 -2661 1401 1199 -2865 -37 2919
3478B919l981k65M170k556l369L753P41m092K204L683l565j232M079j854l865
$$ 2919 -1062 -1327 2843 287 -3082 671 1412 -2680 -476 3207 -358 -1590 2489 635 -3230
3493c230L436J702m111J350M037l227k215M034p79m025L042K602m024K12M111
$$ -3230 206 1908 -2203 -853 3184 -43 -2258 1776 997 -3028 14 2616 -1408 -1196 2915
3508B915k841k969L942L86m081K468L244l838r02M060k049l466L726J344m124
$$ 2915 74 -2895 1047 1433 -2648 -180 3064 -774 -1676 2384 335 -3131 595 1939 -2185
3523b185J595L730l567j839M208j017l825L250K126m182N01L950k973k487M218
$$ -2185 -590 3140 -427 -2266 1942 925 -2900 350 2476 -1706 -1205 2745 -228 -2715 1503
3538A503K7m106K604K817m144n34M183k124l050L991R28m266J751L264l836j371
$$ 1503 1530 -2576 28 2845 -1299 -1833 2350 226 -2824 1167 2095 -2171 -420 2844 -992 -2363
3554b363M337j231l531L536J739m328Q43L718l237k044M280l91l966K897K397
$$ -2363 1974 743 -2788 748 2487 -1841 -998 2720 -517 -2561 1719 1328 -2638 259 2656
3569B656m284NM130k444k736M131M63m270K026K951m012q69M451j536l208L794
$$ 2656 -1628 -1623 2507 63 -2673 1458 1921 -2349 -323 2628 -1384 -2253 2198 662 -2546 1248
3585A248J269m442J040L415l519j698M476o30l690L197K029m440K92M009k740
$$ 1248 2517 -1925 -885 2530 -989 -2687 1789 1159 -2531 666 2695 -1745 -1453 2556 -184
3600a84k393M257P8m255K206K617m085k96M590j707k971L830O44m776J199L225
$$ -184 -2577 1680 1758 -2497 -291 2326 -1759 -2055 2535 828 -2143 1687 2331 -2445 -1246 1979
3616A979l453r54M823q51l554L117J285m677O39L950k787j804M426m32m376K353
$$ 1979 -1474 -2428 2395 1544 -2010 1107 2392 -2285 -1646 2304 -483 -2287 2139 1707 -2669 -316
3632c16K273l993M35M668k010k793L576k21m966J684L301l164j56M962j326l748
$$ -316 1957 -2036 -1601 3067 1057 -1736 1840 1619 -3347 -1663 1638 -1526 -1682 3280 1954 -1794
3648a794K898O10m769J202M057k796j327M462r22m325K652K117l973O71M393k568
$$ -1794 1104 1714 -3055 -1853 2204 -592 -1919 2543 1621 -2704 -52 2065 -1908 -1237 3156 588
3664E88k814L627m16m464K411L361l341m7M536k071l656L133O10m464J626L662
$$ 588 -2226 1401 985 -3479 -1068 2293 -1048 -1095 3441 1370 -2286 847 1457 -3007 -1381 2281
3680B281l233j157M488j015l666L290J783m398L63L514l243k253M419J60l522
$$ 2281 -952 -2109 2379 1364 -2302 988 2771 -1627 -1264 2250 -993 -3246 1173 1333 -2189
3695b189K978K524m358o10L813k438k728M276R03m200J618K681m103r58M763p58
$$ -2189 789 3313 -1045 -1655 2158 -280 -3008 1268 2171 -2029 -411 2270 -1833 -2791 1972 1214
3711A214k702L846J056n251j19K731l371j093N551P34l033K796J161n544r38L587
$$ 1214 -1488 2358 3414 -1837 -1956 775 -2596 -3689 1862 2596 -437 2359 3520 -2024 -2962 625
3727F25k149j466N266R03m280J362J772m601n30M975p22k269L859L01n647J74
$$ 625 -1524 -2990 2276 3179 -1101 261 2033 -2568 -3098 1877 1155 -1114 2745 3046 -2601 -2427
3743b427K819l053j75N869J79l377K380L60n673k35L884k018r15N221K37m380
$$ -2427 392 -2661 -2836 3033 3212 -165 2215 2575 -3098 -3333 551 -1467 -2382 2839 3076 -1304
3759a304J701J756m458j01M621j625k552L720J07m768J498L322l154l40M786j314
$$ -1304 397 2153 -2305 -2406 2215 590 -1962 1758 1865 -2903 -1405 1917 -1237 -1577 3209 1895
3775A895l786K726Q53m611J002L918k727j457M428n06l861K833K231m215j07L583
$$ 1895 -1891 835 1688 -2923 -1921 1997 -730 -2187 2241 1735 -2126 707 2938 -1277 -1384 2199
3791B199k912k867M058O97l359K820L263l937j304L376k465l379L902J861l511
$$ 2199 -713 -3580 478 1175 -2184 636 3899 -38 -1342 2034 -431 -3810 92 1953 -1558
3806a558J623L233l896k138L889p84k992L860K374m300l16K786l578k433M690
$$ -1558 65 3298 -598 -2736 1153 369 -2623 1237 3611 -689 -1005 1781 -1797 -4230 460
3821D60J161k743L167K371m891j667K926k518k419M893J961l450J644K468m542
$$ 460 1621 -1122 2045 4416 -475 -2142 784 -1734 -4153 740 2701 -749 895 3363 -1179
3836a179j831L995q60k582M063J694m614Q6K818l363j553M941M62l164K687J567
$$ -1179 -3010 985 125 -2457 1606 3300 -1314 -1228 1590 -1773 -3326 1615 2077 -1087 1600 3167
3852C167m965p56L581k156j770M759Q49m011J619K261m177q96M272j276k830L631
$$ 3167 -1798 -2554 1027 -1129 -2899 1860 2709 -1302 317 2578 -1599 -2495 1777 501 -2329 1302
3868A302Q70m498J068L424k992j089M499q23l934K537J426m271N93M161k217j923
$$ 1302 2172 -2326 -1258 2166 -826 -1915 2584 1761 -2173 364 1790 -2481 -1888 2273 56 -1867
3884a867L998l40m311K053K601l627q3M238j995l126L333N03m042J890L553l074
$$ -1867 2131 1791 -2520 -467 2134 -1493 -1576 2662 667 -2459 874 1377 -2665 -775 2778 -296
3900b96j053L872j715l869K962J643l702J288L954k804k109L606q68l945K757
$$ -296 -1349 2523 808 -3061 -99 1544 -2158 -870 3084 280 -1829 1777 909 -3036 -279
3915b79K565l568K28L842k560k837L545L34l769K282L071l536r12L740j876l228
$$ -279 2286 -1282 -1054 2788 228 -2609 936 1270 -2499 -217 2854 -682 -1594 2146 270 -2958
3931b958L510J444l768J332L323l343j803L793q65l409L142K094l832L18L585
$$ -2958 552 1996 -1772 -440 2883 -460 -2263 1530 665 -2744 398 2492 -1340 -1022 2563
3946B563k782k342L848Q8l721K347K562l766n01L829j870k727L679Q36m029J371
$$ 2563 -219 -2561 1287 1375 -2346 1 2563 -1203 -1704 2125 255 -2472 1207 2043 -1986 -615
3962f15K981l418j222M039r49l095L222J517m070N59L364k921j908L993k56l607
$$ -615 2366 -1052 -2274 1765 816 -2279 943 2460 -1610 -1051 2313 -608 -2516 1477 1221 -2386
3978b386K588K260l822m2L779k155k513L618L09m011J776K810l439o91M102j287
$$ -2386 202 2462 -1360 -1402 2377 222 -2291 1327 1636 -2375 -599 2211 -1228 -1919 2183 896
3994H96k979L215J032m157Q99L184l014j439M104n53l378K792J869l939J83L566
$$ 896 -2083 1132 2164 -1993 -1094 2090 -924 -2363 1741 1188 -2190 602 2471 -1468 -1285 2281
4010B281k414k225L674ml809K111K588l457k45M086j675k856L134M87m187J224
$$ 2281 -133 -2358 1316 1312 -2497 -386 2202 -1255 -1500 2586 911 -1945 1189 1676 -2511 -1287
4026a287L117k864p86M212q99l384K679J213m127N86L618k384j685L800m52l781
$$ -1287 1830 -1034 -1820 2392 1493 -1891 788 2001 -2126 -1540 2078 -306 -1991 1809 1357 -2424
4042b424K194K222l476K73M077j982k765L003q4m185J738L182k606j77M170j475
$$ -2424 -230 1992 -1484 -1211 2866 884 -1881 1122 1038 -3147 -1409 1773 -833 -1010 3160 1685
4058A685l543K395O15m098J252L790k268j237L810r74l842K226J831l455O94L919
$$ 1685 -1858 537 1152 -2946 -1694 2096 -172 -1409 2401 1427 -2415 -189 1642 -1813 -1119 2800
4074B800k238k465L087l49l869K119L011k792l7L849j952l347K611M03l852J637
$$ 2800 562 -1903 1184 835 -3034 -915 2096 -696 -733 3116 1164 -2183 428 831 -3021 -1384
4090a384L584k511r16L836j159l578K439J337l741O76L565k372j825L677k72l547
$$ -1384 2200 -311 -1227 2609 1450 -2128 311 1648 -2093 -1417 2148 -224 -2049 1628 1356 -2191
4106b191K228K268l533k02L661j897k502L253L98l797J531K787l051o29M028r92
$$ -2191 37 2305 -1228 -1430 2231 334 -2168 1085 1483 -2314 -783 2004 -1047 -1676 2352 1360
4122A360k984K666P86m186N02L183k334r29M278j29l433J987J206m193j50L685
$$ 1360 -1624 1042 1828 -2358 -1856 1327 -1007 -1936 2342 2213 -1220 767 1973 -2220 -2370 1315
4138A315j587j545L854K55l926J245J968l487k75M226q70k453K922L25m436O20
$$ 1315 -272 -1817 2037 2292 -1634 -389 1579 -1908 -2183 2043 1173 -1280 1642 1967 -2469 -1849
4154a849K933k396m33M424m04l301J952O68m367K55L723j597j118L998o3l912
$$ -1849 1084 -1312 -1745 2679 2275 -1026 926 1594 -2773 -2518 1205 -392 -1510 2488 2425 -1487
4170a487J400J572l641m1M075j232k175L178K41m082J054K684k746m95M068r01
$$ -1487 -87 1485 -2156 -2197 1878 646 -1529 1649 1890 -2192 -1138 1546 -1200 -1695 2373 1472
4186A472l040K393P80l945O76L327k171j216L844l02l485J928J585l654K2L489
$$ 1472 -1568 825 1605 -2340 -1664 1663 -508 -1724 2120 1818 -1667 261 1846 -1808 -1786 1703
4202A703j823j920L478L67l504J604K291l315p34L512j258k571L074J010l544
$$ 1703 -120 -2040 1438 1805 -1699 -95 2196 -1119 -1853 1659 401 -2170 904 1914 -1630
4217a630R47K751k889j308L692m88k921K567J553l700N6L028k262j753L663L46
$$ -1630 -683 2068 -821 -2129 1563 1075 -1846 721 2274 -1426 -1370 1658 -604 -2357 1306 1652
4233A652l139J903J978l626o74L297j520k167L394R58l395J154K392l191j162
$$ 1652 -1487 416 2394 -1232 -1906 1391 -129 -2296 1098 2056 -1339 -185 2207 -984 -2146
4248b146L540p67k653K831J362l589M08K857k472j550L599r8l025K123J760l555
$$ -2146 1394 627 -2026 805 2167 -1422 -1014 1843 -629 -2179 1420 1322 -1703 420 2180 -1375
4264a375j91L270j822k056L344N39l348J489K279l167p07L427j202k627K918J043
$$ -1375 -1566 1704 -118 -2174 1170 1709 -1639 -150 2129 -1038 -1745 1682 480 -2147 771 1814
4280A814l471R21K840k595j374L437n93l053K300J628l312L01L218k059j971L218
$$ 1814 -1657 -736 2104 -491 -1865 1572 979 -2074 226 1854 -1458 -1157 2061 2 -1969 1249
4296A249R0l311J787K224l050l77L320j555k507K883P44l348J291K746k680j068
$$ 1249 1339 -1972 -185 2039 -1011 -1388 1932 377 -2130 753 1497 -1851 -560 2186 -494 -1562
4312a562L288r47k942K450J359l261O85L073k240j680L257l14l247J955J987l120
$$ -1562 1726 779 -2163 287 1646 -1615 -930 2143 -97 -1777 1480 1166 -2081 -126 1861 -1259
4328a259l5L281j744k200K986L95l324J488K470k858p13L325j188k727K572J066
$$ -1259 -1294 1987 243 -1957 1029 1424 -1900 -412 2058 -800 -1513 1812 624 -2103 469 1535
4344A535l295R11K931k359j313L257n84l148K086J634l155K45L248j825j908L056
$$ 1535 -1760 -849 2082 -277 -1590 1667 1083 -2065 21 1655 -1500 -1255 1993 168 -1740 1316
4360A316Q1l296J563K202k977l76L349j381k475K757Q13l294J082K680k525j054
$$ 1316 1397 -1899 -336 1866 -1111 -1487 1862 481 -1994 763 1576 -1718 -636 2044 -481 -1535
4376a535L251q84k967K296J398l193N85L155k006j664L090k80l262J783J918l028
$$ -1535 1716 832 -2135 161 1559 -1634 -1049 2106 100 -1564 1526 1246 -2016 -233 1685 -1343
4392a343k7L299j573k188K863M39l271J298K488k685p70L202j188k727K487J155
$$ -1343 -1370 1929 356 -1832 1031 1470 -1801 -503 1985 -700 -1470 1732 544 -2183 304 1459
4408A459l099R59L008k272j490K991p13l183J994J824k866L78L273j835k096K840
$$ 1459 -1640 -681 2327 55 -1435 1556 843 -2340 -346 1478 -1388 -1010 2263 428 -1668 1172
4424A172K2l276J628K326k705m42L136j468k589K648Q88k986J291K829k548j343
$$ 1172 1194 -2082 -454 1872 -833 -1275 1861 393 -2196 452 1340 -1646 -355 2474 -74 -1417
4440a417K866j080l001K347J770k719P50L076k165k018K702l99l148J921K253
$$ -1417 1449 369 -2632 -285 1485 -1234 -484 2592 427 -1591 1111 712 -2436 -515 1738
4455A738k665j18L118j680k364K716N92l054J433K503k727j022K972j194k655
$$ 1738 -927 -1045 2073 393 -1971 745 1337 -1717 -284 2219 -508 -1530 1442 248 -2407
4470b407K602J451k882Q18K820k370j632K835n95l035K083J874k860L04L187j689
$$ -2407 195 1646 -1236 -418 2402 32 -1600 1235 640 -2395 -312 1562 -1298 -994 2193 504
4486E04j940K757L2l361J286K128k698k69L411j009k382K531O69l414P85K666
$$ 504 -1436 1321 1353 -2008 -722 1406 -1292 -1561 1850 841 -1541 990 1659 -1755 -970 1696
4502A696k201r52L270p64l061J913J249l042P13L445j533j580K757o40l732J201
$$ 1696 -505 -1457 1813 1049 -2012 -99 1150 -1892 -1179 2266 733 -847 1910 1270 -2462 -1261
4518a261J947k410M92L830j078k344K199k14l773J020K761j941k35L464j084l097
$$ -1261 686 -1724 -1232 2598 1520 -824 1375 1161 -2612 -1592 1169 -772 -1007 2457 1373 -1724
4534a724J800P95l073J116L413j703j387K648j064l587J636J933k296Q53L563
$$ -1724 76 871 -2202 -1086 2327 624 -763 1885 821 -2766 -1130 803 -1493 -640 2923
4549B923j570k386K168m90l472J527K712k142r5L249j386k845K192P24l023J169
$$ 2923 1353 -1033 1135 645 -2827 -1300 1412 -730 -825 2424 1038 -1807 385 1109 -1914 -745
4565g45K873k278j295K843q96k842K293J827k758M34K823k146j969K695n2k896
$$ -745 2128 -150 -1445 1398 502 -2340 -47 1780 -978 -544 2279 133 -1836 859 807 -2089
4581b089J897K107k812l89K984j401k121K879P47l133Q58K093k814r76L304m29
$$ -2089 -192 1915 -897 -1286 1698 297 -1824 1055 1802 -1331 -473 1620 -1194 -2170 1134 705
4597G05k141K655J133l475M1K301k235j235L496K14k593J795J316l487l46L031
$$ 705 -1436 1219 2352 -1123 -1082 1219 -1016 -2251 1245 1459 -1134 661 1977 -1510 -1856 1175
4613A175j263j444L249L57l405P85J655k861l74L676m52j999K483M21l794K80
$$ 1175 -88 -1532 1717 2074 -1331 -546 1109 -1752 -2126 1550 1098 -901 1582 2003 -1791 -1511
4629a511K460j994o38L626k42k887J667R46l393K65L245j399j387K983j93l451
$$ -1511 949 -1045 -1683 1943 1701 -1186 481 1427 -1966 -1701 1544 145 -1242 1741 1548 -1903
4645a903J228J917k576O3L441j208k365K269J98l346J198K822k035o87L087j122
$$ -1903 -675 1242 -1334 -1271 2170 962 -1403 866 1064 -2282 -1084 1738 -297 -984 2103 981
4661I81l038J936J164k790R60L119j965j693K632o61l099K023K187k488J18K875
$$ 981 -2057 -121 1043 -1747 -787 2332 367 -1326 1306 645 -2454 -431 1756 -732 -614 2261
4677B261j966k457K470L81k686J904K682k558r74K539j601k728K556J452k519
$$ 2261 295 -2162 308 689 -1997 -93 2589 31 -943 1596 -5 -2733 -177 1275 -1244
4692a244J236K690k580j765K594p29k617K468J978k773J17K588k152k055K858
$$ -1244 -8 2682 102 -1663 931 202 -2415 53 2031 -742 -625 1963 -189 -2244 614
4707F14M05k569J914K038l003q57K690j533k110K960J155k783J135K276k772j293
$$ 614 1019 -1550 364 2402 -601 -1458 1232 -301 -2411 549 1704 -1079 56 2332 -440 -1733
4723a733K829p96k419K468J384l029M73K705k025j501L067j28k929J673J544l010
$$ -1733 1096 300 -2119 349 1733 -1296 -823 1882 -143 -1644 1423 1295 -1634 39 1583 -1427
4739a427j70L116j345j816K953M10l163J138K073k702p23L110r79k393K401R23
$$ -1427 -1597 1519 174 -1642 1311 1721 -1442 -304 1769 -933 -1656 1454 475 -1918 483 1406
4755A406l013R27K799k046j303K909p48l078J753J444k754N38L267j495j709K669
$$ 1406 -1607 -680 2119 73 -1230 1679 931 -2147 -394 1050 -1704 -1166 2101 606 -1103 1566
4771A566j85l295J348K018k689k23L158j186k262K544O49l004J184K536k436j123
$$ 1566 1381 -1914 -566 1452 -1237 -1460 1698 512 -1750 794 1443 -1561 -377 2159 -277 -1400
4787a400K842j018k814K197J483k687Q00L070j949j739K631n71l119J691J896
$$ -1400 1442 424 -2390 -193 1290 -1397 -597 2473 524 -1215 1416 845 -2274 -583 1313
4802A313k656J01L206j427k044K608L72l084J264K211k624q44K912j076k436K501
$$ 1313 -1343 -1242 1964 537 -1507 1101 1473 -1611 -347 1864 -760 -1604 1308 232 -2204 297
4818B97J302k747R45K700k341j630K558p76k854K112J900k547M43L090j836k102
$$ 297 1599 -1148 -203 2497 156 -1474 1084 308 -2546 -434 1466 -1081 -638 2452 616 -1486
4834a486K526n3l064J606K171k582m35K943j368k295K634J005k787J179K439k674
$$ -1486 1040 987 -2077 -471 1700 -882 -1317 1626 258 -2037 597 1602 -1185 -6 2433 -241
4850b41j518K591r47k561K583J877k425O87K679k402k195K483k77k772K062K260
$$ -241 -1759 832 -115 -2676 -93 1784 -641 46 2725 323 -1872 611 334 -2438 -376 1884
4866A884k524j58K814j741k229K650O61k813J370K227k813j143K751r65k187K757
$$ 1884 -640 -798 2016 275 -1954 696 1357 -1456 -86 2141 -672 -1815 936 -29 -2216 541
4882E41J502k672O81K309k670j805K709l60k503K285J941k685Q0K759j895j988
$$ 541 2043 -629 52 2361 -309 -2114 595 235 -2268 17 1958 -727 -647 2112 217 -1771
4898a771K716J72k964J406K050k692m34L154j014k176K566P31l178P41K325k361
$$ -1771 945 1117 -1847 -441 1609 -1083 -1517 1637 623 -1553 1013 1744 -1434 -693 1632 -729
4914g29j025L093n68k663K090J379k884N14K991j790j718K611m66l234J524K024
$$ -729 -1754 1339 771 -1892 198 1577 -1307 -793 2198 408 -1310 1301 835 -2399 -875 1149
4930A149k337L22L376j282k386K079j0l307J173K656j969l75L113j111k951J909
$$ 1149 -1188 -866 2510 1228 -1158 921 911 -2396 -1223 1433 -536 -911 2202 1091 -1860 49
4946D9R20k803J046L079j856j559K486q77l093J828K026k194O41L122j873k463
$$ 49 969 -1834 -788 2291 435 -1124 1362 485 -2608 -780 1246 -948 -307 2815 942 -1521
4962a521K090k10l004J750K671k065k88K854j545k791K174Q59k722J263K743k282
$$ -1521 569 359 -2645 -895 1776 -289 -577 2277 732 -2059 115 974 -1748 -485 2258 -24
4978b4j362K608q33k688K272J773k557M45K577k239k000K628M4k603J932K147
$$ -24 -1386 1222 389 -2299 -27 1746 -811 -366 2211 -28 -2028 600 644 -1959 -27 2120
4994B120k671m40K681j585k149K690P58k802J137K139k641j052L002o33k227K475
$$ 2120 -551 -991 1690 105 -2044 646 1404 -1398 -261 1878 -763 -1815 1187 554 -1673 802
5010H02J190l049K27K289k232j285L182O8k558J860J434l125l06K766j403j578
$$ 802 1992 -1057 -830 1459 -773 -2058 1124 1192 -1366 494 1928 -1197 -1503 1263 -140 -1718
5026a718K975M44l008J040J804k759n20L203p82k109K451P18l241M87K344k076
$$ -1718 1257 1701 -1307 -267 1537 -1222 -1742 1461 679 -1430 1021 1739 -1502 -1015 1329 -747
5042g47q56L171l58k640J800J159l024K00K860j583j472K811Mk992J374J851k617
$$ -747 -1603 1568 1210 -1430 370 1529 -1495 -1295 1565 -18 -1490 1321 1325 -1667 -293 1558 -1059
5059a059k00K990j284k185K427N52k913J132K435k226r07K785r79k624K156J276
$$ -1059 -1259 1731 447 -1738 689 1241 -1672 -540 1895 -331 -1238 1547 568 -2056 100 1376
5075A376k686P32K684k059j631K576l48k693J970J912k507l7K605j850k137K571
$$ 1376 -1310 -578 2106 47 -1584 992 644 -2049 -79 1833 -674 -711 1894 44 -2093 478
5091D78M66k564J596K307k559r42K499j322k359K570J308k488R64K392k481j608
$$ 478 944 -1620 -24 2283 -276 -1218 1281 -41 -2400 170 1478 -1010 -46 2346 -135 -1743
5107a743K588n93k400K279J776k552J02K421k068j899K675K77k462J768J992k693
$$ -1743 845 252 -2148 131 1907 -645 -543 1878 -190 -2089 586 863 -1599 169 2161 -532
5123e32o33K502j432k073K631R82k581J096K147k526j177K619p65k348K357J453
$$ -532 -1165 1337 -95 -2168 463 1445 -1136 -40 2107 -419 -1596 1023 258 -2090 267 1720
5139A720k666M40K434k097j588K694k06k559J816J787k649j56K699j544j950K581
$$ 1720 -946 -506 1928 -169 -1757 937 731 -1828 -12 1775 -874 -1030 1669 125 -1825 756
5155G56M45k742J282K127k454p20K744j070k314K322J020k692P75K451k104j295
$$ 756 1201 -1541 -259 1868 -586 -1306 1438 368 -1946 376 1396 -1296 -521 1930 -174 -1469
5171a469K631n51k592J941J569k561K73K698j756j803K502L7k733J506J993k403
$$ -1469 1162 611 -1981 -40 1529 -1032 -759 1939 183 -1620 882 919 -1814 -308 1685 -718
5187g18l40K685j279k168K351O92k701J036K333k199j039K636q14k401K082J331
$$ -718 -1058 1627 348 -1820 531 1223 -1478 -442 1891 -308 -1347 1289 475 -1926 156 1487
5203A487k605N12K500j945j569K555j82k603J745J853k540j54K626j536j933K490
$$ 1487 -1118 -606 1894 -51 -1620 935 753 -1850 -105 1748 -792 -946 1680 144 -1789 701
5219G01M51k666J248K106k377q27K673r45k200K266J076k632O56K259k093j341
$$ 701 1152 -1514 -266 1840 -537 -1364 1309 364 -1836 430 1506 -1126 -470 1789 -304 -1645
5235a645K676l68k426K004J513k608jK436j707j678K563K79k552J516J869k544
$$ -1645 1031 663 -1763 241 1754 -854 -855 1581 -126 -1804 759 1038 -1514 2 1871 -673
5251f73n40K552j172j999K394Q40k636Q87K105k241j050K615n91k242K133J281
$$ -673 -1213 1339 167 -1832 562 1402 -1234 -347 1758 -483 -1533 1082 491 -1751 382 1663
5267A663k630K62K354j869j511K592Jk434J674J688k520k88K516j457j892K439
$$ 1663 -967 -705 1649 -220 -1731 861 862 -1572 102 1790 -730 -1018 1498 41 -1851 588
5283E88N52k515J180K077k298q19K544r61k220K217J028k530O58K342j986j351
$$ 588 1140 -1375 -195 1882 -416 -1235 1309 348 -1872 345 1373 -1157 -499 1843 -143 -1494
5299a494K447l87k383J866J590k410J01K418j723j803K361K05k407J498K053k296
$$ -1494 953 566 -1817 49 1639 -771 -670 1748 25 -1778 583 788 -1619 -121 1932 -364
5315c64n68K385j317k153K234Q64k368J079K297k160j234K327p15k318K052J499
$$ -364 -932 1453 136 -2017 217 1081 -1287 -208 2089 -71 -1305 1022 307 -2011 41 1540
5331A540k352L85K284j899j689K343jk324J772J854k394l64K320j450j957K306
$$ 1540 -812 -427 1857 -42 -1731 612 611 -1713 59 1913 -481 -845 1475 25 -1932 374
5347C74O91k340J185K027k289r69K403q14k103K138J207k483M77K206j969j344
$$ 374 1065 -1275 -90 1937 -352 -1321 1082 268 -1835 303 1510 -973 -496 1710 -259 -1603
5363a603K523j87k265J708J490k554j24K404j398j576K429L70k549J103J737k342
$$ -1603 920 733 -1532 176 1666 -888 -1012 1392 -6 -1582 847 1217 -1332 -229 1508 -834
5379h34n37K709q20j891K100O56k715N42K110j846q35K684l66k305J640J011k621
$$ -834 -1371 1338 518 -1373 727 1383 -1332 -790 1320 -526 -1361 1323 957 -1348 292 1303 -1318
5396a318K32K521j365j279K425j02k640J158J536k242n2K758r92j845K035K71
$$ -1318 -1086 1435 70 -1209 1216 1114 -1526 -368 1168 -1074 -1126 1632 640 -1205 830 1101
5412A101k770Q57K105j836n42K644o98k275J698Q88k531N41K402j654j247K380
$$ 1101 -1669 -812 1293 -543 -1085 1559 861 -1414 284 1172 -1359 -818 1584 -70 -1317 1063
5428A063l02k425J542J555k192K2K419j447j809K112K68k380J270J991k109o54
$$ 1063 761 -1664 -122 1433 -759 -737 1682 235 -1574 538 806 -1574 -304 1687 -422 -1076
5444a076K376r84j998K092R21k321O51J952k086j257K406k22j920K008J467k449
$$ -1076 1300 316 -1682 410 1331 -990 -339 1613 -473 -1730 676 454 -1466 542 2009 -440
5460d40j74J890j836j560K458N08j929J555J623k528p61K082j100j639K444R20
$$ -440 -614 1276 -560 -2120 338 846 -1083 472 2095 -433 -1194 888 -212 -1851 593 1513
5476A513k271O71J589k360j005K520k12j619K180J109k726j59J690j922j151K759
$$ 1513 -758 -87 1502 -858 -1863 657 445 -1174 1006 2115 -611 -770 920 -1002 -2153 606
5492F06M54j837J611J259k755n86K067j259j405K520O66k287R07J525k259o60
$$ 606 1060 -777 834 2093 -662 -1248 819 -440 -1845 675 1341 -946 -39 1486 -773 -1433
5508a433K503n30j770K003P19k659K88J917j735q89K645k9k024J572J078k538
$$ -1433 1070 540 -1230 773 1492 -1167 -879 1038 -697 -1586 1059 1030 -994 578 1656 -882
5524h82j09K139j481j426K362K83k173J291J763k136m23K234j178j994J910N94
$$ -882 -991 1148 -333 -1759 603 886 -1287 4 1767 -369 -792 1442 264 -1730 180 774
5540G74k254R77K189j784q70K291o58k215J686J094k242L83K108j720j422K243
$$ 774 -1480 -503 1686 -98 -968 1323 665 -1550 136 1230 -1012 -629 1479 -241 -1663 580
5556E80L9k026J637J705k146l52J959j602j881K044O23j912J378K053j957q86
$$ 580 619 -1407 230 1935 -211 -563 1396 -206 -2087 -43 580 -1332 46 2099 142 -744
5572g44J993j038k123J856J040k077O78K036j780j162K201k29j981J672J368k334
$$ -744 1249 211 -1912 -56 984 -1093 -415 1621 -159 -1321 880 651 -1330 342 1710 -624
5588f24j84J937j557j550K319M95j912J427J694k207p28J980j170j868K042Q76
$$ -624 -808 1129 -428 -1978 341 836 -1076 351 2045 -162 -890 1090 -80 -1948 94 970
5604I70k097Q65J972j874r47K248n24k042J668J063k373J65K071j512j173K408
$$ 970 -1127 -262 1710 -164 -1111 1137 613 -1429 239 1302 -1071 -906 1165 -347 -1520 888
5620H88J81k045J349J329k344m70K054j217j569K248P07k057R62J767k039q17
$$ 888 1069 -976 373 1702 -642 -1112 942 -275 -1844 404 1111 -946 16 1783 -256 -1073
5636a073K137p48j919J843R13k271M23K036j612j006K372r3k079J412J083k401
$$ -1073 1064 316 -1603 240 1153 -1118 -695 1341 -271 -1277 1095 1002 -1077 335 1418 -983
5652i83j92K064j221j264K415M70k100J028J411k264o75K141q06j606K020P89
$$ -983 -1175 889 -332 -1596 819 1289 -811 217 1628 -636 -1311 830 24 -1582 438 1227
5668A227k207N94J820j807q44K356l33k058J513R36k365Q6K165j252j048K373
$$ 1227 -980 -386 1434 -373 -1217 1139 806 -1252 261 1197 -1168 -1082 1083 -169 -1217 1156
5684A156J02k259J043J248k252l11K274q87j493K045M87k264Q10J733j834o42
$$ 1156 1258 -1001 42 1290 -962 -1273 1001 114 -1379 666 1153 -1111 -301 1432 -402 -1044
5700a044K253o98k065J617Q62k110N44K219j450j089K086l90k276J325J329j998
$$ -1044 1209 511 -1554 63 925 -1185 -641 1578 128 -961 1125 735 -1541 -216 1113 -885
5716h85J06K288j265j628J914K53k164J193J779j829n65K050j105j963J843R00
$$ -885 -779 1509 244 -1384 530 783 -1381 -188 1591 -238 -803 1247 142 -1821 22 922
5732I22j901Q67K026j801j222J877o16j991J718J466j878K50J965j683j602J992
$$ 922 -979 -112 1914 113 -1109 768 152 -1839 -121 1345 -533 -283 1682 -1 -1603 389
5748C89J51j899J453J663k042n29J901j265j621K127Q45j976Q70J627k105j021
$$ 389 540 -1359 94 1757 -285 -814 1087 -178 -1799 328 1173 -803 67 1694 -411 -1432
5764a432K068n02j613J990J117k211J44J654j749j139K343J58j854J402J191k381
$$ -1432 636 134 -1479 511 1628 -583 -439 1215 -534 -1673 670 828 -1026 376 1567 -814
5780h14l33K033j037j178K289M38k313O74J305k084m58K532l83j508J799M81k653
$$ -814 -1147 886 -151 -1329 960 1398 -915 -241 1064 -1020 -1478 1054 671 -837 962 1443 -1210
5797a210J70J725j462m81K632j05k069J182O95k482O2K289q97r29K187r5k497
$$ -1210 -1040 685 -777 -1258 1374 1269 -800 382 1077 -1405 -1343 946 49 -880 1307 1212 -1285
5814a285P28J328j922J08K634o70j633J553N1k627N88J968j364k32K489n72k157
$$ -1285 -557 771 -1151 -1043 1591 921 -712 841 892 -1735 -1147 821 -543 -775 1714 1142 -1015
5831a015J244N81k335M59K286j164r89K114l12k283J218J339j921Q4K238j235
$$ -1015 229 810 -1525 -1066 1220 56 -933 1181 869 -1414 -196 1143 -778 -694 1544 309
5847C09j647J814K02k188J068J884j723m87K145q94j884J722P25k145N30J848
$$ 309 -1338 476 678 -1510 -442 1442 -281 -768 1377 483 -1401 321 1046 -1099 -569 1279
5863A279j704j011K230j24j786J681J178k313k22J700j542j256K371N27j774J239
$$ 1279 -425 -1436 794 670 -1116 565 1743 -570 -792 908 -634 -1890 481 1008 -766 473
5879D73J367k321p51J925r20j373K252Q22k197N07J413k067q02K423o0j471J823
$$ 473 1840 -481 -1232 693 -227 -1600 652 1474 -723 -216 1197 -870 -1672 751 691 -780 1043
5896A043P89k647k77J572j535p78K736M93j761J183R20k669n92J958q96j034K438
$$ 1043 1832 -815 -1092 480 -1055 -1833 903 1396 -365 818 1738 -931 -1523 435 -461 -1495 943
5913I43N92k232O42J291k134o01K447l84j533J788N62k526J61J760j492o11K553
$$ 943 1535 -697 -55 1236 -898 -1499 948 564 -969 819 1381 -1145 -984 776 -716 -1327 1226
5930A226Mj941J301P87k512j69K064j112j075K340K51k085J020J364k093m41K174
$$ 1226 1230 -711 590 1377 -1135 -1304 760 -352 -1427 913 1164 -921 99 1463 -630 -1071 1103
5947A103r44j646J882O03k177P57J861j664p74K145n52j942J566R21k189L08J972
$$ 1103 159 -1487 395 998 -1179 -422 1439 -225 -999 1146 594 -1348 218 1139 -1050 -742 1230
5964A230j439j173K173N5k005J439J308k110l71J908j245j548K104N99j928J106
$$ 1230 -209 -1382 791 846 -1159 280 1588 -522 -893 1015 -230 -1778 326 925 -1003 103
5980A03J689j976q14J941q50j794J887R25k040N71J850j711j076K122j80j905
$$ 103 1792 -184 -998 943 93 -1701 186 1111 -929 -358 1492 -219 -1295 827 647 -1258
5996a258J548J164k209j10J921j375j250K216L57j924J171J416k166o23K005r23
$$ -1258 290 1454 -755 -865 1056 -319 -1569 647 1004 -920 251 1667 -499 -1122 883 -40
6012d0j597K026P40k068P14J755j853q74K162m44j875J610J001k244K00J965j382
$$ -40 -1637 389 1129 -939 -225 1530 -323 -1197 965 521 -1354 256 1257 -987 -787 1178 -204
6029b04j103K209P9k084J245J245k223k75K140j022j422K095M52k127Q42J595
$$ -204 -1307 902 981 -1103 142 1387 -836 -1111 1029 7 -1415 680 1132 -995 -153 1442
6045A442j909p00K179o27j812J765Q13k209M50J931j493r95K187k40k008J353
$$ 1442 -467 -1167 1012 385 -1427 338 1151 -1058 -608 1323 -170 -1165 1022 782 -1226 127
6061A27J100k186l4K148j173j284K146K26k156R79J451k044m49K186q24j591J896
$$ 127 1227 -959 -993 1155 -18 -1302 844 1070 -1086 -107 1344 -700 -1149 1037 213 -1378 518
6078E18O60k226O37J806j736q51K187l92j942J565R61k191K39K053j349j157K134
$$ 518 1178 -1048 -411 1395 -341 -1192 995 603 -1339 226 1187 -1004 -765 1288 -61 -1218 916
6095I16L4k138J182J301k115k33K193r87j509J999M54k183Q03J667j872o59K203
$$ 916 950 -1188 -6 1295 -820 -1053 1140 153 -1356 643 1097 -1086 -283 1384 -488 -1147 1056
6112A056o33j821J705Q69k151M37J937j575j039K141k31k025J388J226k116KK134
$$ 1056 423 -1398 307 1176 -975 -538 1399 -176 -1215 926 695 -1330 58 1284 -832 -830 1304
6129A304j225j377J995K27k112J034J566j987m78K205q22j775J835O98k146O42
$$ 1304 79 -1298 697 924 -1188 -154 1412 -575 -1053 1152 330 -1445 390 1088 -1058 -416
6145d16J845j668r13K163m44k005J559J057k110K67K062j365j257K019j6k138
$$ -416 1429 -239 -1152 1011 567 -1438 121 1178 -932 -665 1397 32 -1225 794 778 -1360
6161a360J212J387j955j74K195r98j649J902M08k197Q43J763j754o06K153o76
$$ -1360 -148 1239 -716 -890 1305 307 -1342 560 968 -1229 -386 1377 -377 -983 1170 494
6177D94j899J579Q14k104N07K059j427j033K045l17k185J286J239j981J31K252
$$ 494 -1405 174 988 -1116 -609 1450 23 -1010 1035 718 -1467 -181 1058 -923 -792 1460
6193A460j145j473J917J05k278R76J669j805k97K226q37j834J679N59k196O77
$$ 1460 315 -1158 759 864 -1414 -438 1231 -574 -871 1355 518 -1316 363 922 -1274 -597
6209e97J981j527q11K143n07k116J402R77k055L36K207j232j230K021j33k231
$$ -597 1384 -143 -954 1189 682 -1434 -32 945 -1110 -774 1433 201 -1029 992 859 -1372
6225a372J045J368j938o9K310q93j555J841L01k292O99J702j713n24K335n28j906
$$ -1372 -327 1041 -897 -966 1344 451 -1104 737 1038 -1254 -555 1147 -566 -1090 1245 717 -1189
6242a189J530P18k271L52K068j321r10K273k68k213J103J074k167R5K362q93j206
$$ -1189 341 1059 -1212 -860 1208 -113 -1023 1250 982 -1231 -128 946 -1221 -1126 1236 343 -863
6259h63K011J06k443O50J378j895k15K508m85j625J660L85k470M22J796j433n60
$$ -863 1148 1254 -1189 -539 839 -1056 -1271 1237 752 -873 787 1172 -1298 -876 920 -513 -1073
6276a073K404l04k058J206P38k274K26K308r97r98K148j22k431P75J176j961M
$$ -1073 1331 1027 -1031 175 913 -1361 -1135 1173 176 -822 1326 1204 -1227 -452 724 -1237 -1233
6293a233K527o46j417J791K00k481N02J659j649m52K434m25j870J460P06k289
$$ -1233 1294 648 -769 1022 1222 -1259 -757 902 -747 -1199 1235 810 -1060 400 1106 -1183
6309a183L56K037j373r00K174k04k164J136J122k033N8K233r99j315K008J86k302
$$ -1183 -827 1210 -163 -1063 1111 907 -1257 -121 1001 -1032 -974 1259 260 -1055 953 1139 -1163
6326a163P68J452j897m43K298n74j519J819O34k231L67J668j750q88K240j65j779
$$ -1163 -395 1057 -840 -1283 1015 441 -1078 741 1375 -856 -489 1179 -571 -1459 781 616 -1163
6343a163J510J079k183MJ880j314j154K145J81k024J028J269k132l66K169p32
$$ -1163 347 1426 -757 -753 1127 -187 -1341 804 985 -1039 -11 1258 -874 -1240 929 197
6359A97j356K048N55k263M70J373j897o80K340k73j546J739Q61k296K3J736j483
$$ 197 -1159 889 1444 -819 -349 1024 -873 -1553 787 514 -1032 707 1568 -728 -705 1031 -452
6376d52j017K245O9j907J247J104k123j75K076r58j282K025L35k216P00J377j875
$$ -452 -1469 776 845 -1062 185 1289 -834 -1009 1067 109 -1173 852 1187 -1029 -329 1048 -827
6393h27m35K288n21j558J764O43k328L54J712j628q05K225j80j840J408J021k104
$$ -827 -1262 1026 505 -1053 711 1354 -974 -620 1092 -536 -1341 884 704 -1136 272 1293 -811
6410h11M9J996j255j229J988J11k107J017J405j855k18K130q21j558J773M30k172
$$ -811 -762 1234 -21 -1250 738 849 -1258 -241 1164 -691 -909 1221 400 -1158 615 1045 -1127
6427a127N89J694j641o62K178m51j772J533Q55k100K50J872j380j056K022r8j983
$$ -1127 -538 1156 -485 -1147 1031 580 -1192 341 1196 -904 -654 1218 -162 -1218 804 706 -1277
6444a277J234J293j930o5J996j071j416J830K63k132Q81J608j714m35K106o78
$$ -1277 -43 1250 -680 -745 1251 180 -1236 594 857 -1275 -394 1214 -500 -935 1171 493
6460D93j714J576O68k080N01J804j491q60K059l28j932J371J097j972J14J981
$$ 493 -1221 355 1023 -1057 -556 1248 -243 -1103 956 628 -1304 67 1164 -808 -694 1287
6476A287j234j267J873J05k028J085J480j796l16K000r39j620J705N72j965P06
$$ 1287 53 -1214 659 764 -1264 -179 1301 -495 -811 1189 250 -1370 335 907 -1058 -352
6492c52J722j606p64J944n55j773J543R90j943K81J831j420j166J901k0j804J243
$$ -352 1370 -236 -1000 944 389 -1384 159 1149 -794 -513 1318 -102 -1268 633 613 -1191 52
6509E2J318j907k50J845j098j422J930N24j881Q74J492j856p25J886o55j553J770
$$ 52 1370 -537 -787 1058 -40 -1462 468 992 -889 -15 1477 -379 -1104 782 127 -1426 344
6526C44Q68j928L71J640j596r74K005j60j707J370J045k022q4J818j143j087K030
$$ 344 1212 -716 -345 1295 -301 -1275 730 570 -1137 233 1278 -744 -828 990 -153 -1240 790
6543G90K71j955Q83J232j971m40K005o52j338J810N27k036N15J544j562p09K037
$$ 790 1061 -894 -11 1221 -750 -1190 815 163 -1175 635 1162 -874 -359 1185 -377 -1086 951
6560I51l83j825J341Q29j956L10J988j092r32J825k30k137R11J205j753Q3K175
$$ 951 568 -1257 84 913 -1043 -733 1255 163 -769 1056 826 -1311 -400 805 -948 -865 1310
6577A310p86j442J597J04k119Q16J692j453l83J923q27j901J328P35j712Q00K075
$$ 1310 524 -918 679 783 -1336 -520 1172 -281 -664 1259 432 -1469 -141 594 -1118 -318 1757
6594A757j258j034J487p15k134J192J356j399M65K140j177j567J347j40j960J137
$$ 1757 499 -535 952 237 -1897 -705 651 -748 -283 1857 680 -887 460 320 -1640 -503
6610e03J754j449k63J775j070j807J524O79j627R97J820j575j072J465p40j841
$$ -503 1251 -198 -461 1314 244 -1563 -39 640 -987 10 1830 255 -817 648 -92 -1933
6626a933J574J343j483M93J846j448j452J501k01j801J256J451j624j37J839j022
$$ -1933 -359 984 -499 -6 1840 392 -1060 441 240 -1561 -305 1146 -478 -615 1224 202
6642B02j391J734M41j879P44J371j715o97J866m53j468J630Q43j887K96J605j389
$$ 202 -1189 545 986 -893 -149 1222 -493 -1190 676 223 -1245 385 1228 -659 -363 1242 -147
6659a47r35J858j61j854J100R94j827R7K090p27j056J677l9k274N04J141j558
$$ -147 -1082 776 615 -1239 -139 855 -972 -875 1215 488 -568 1109 1070 -1204 -700 441 -1117
6676a117l8K342k88j372J363J79k288K85J643j160l80K086l50j922R46O53j852
$$ -1117 -1155 1187 899 -473 890 1069 -1219 -934 709 -451 -831 1255 905 -1017 -71 582 -1270
6693a270M33K181p39r20J556m82k333O39J216j324L18K399n19j515J169j41k289
$$ -1270 -837 1344 605 -315 1241 759 -1574 -935 281 -1043 -725 1674 1155 -360 809 668 -1621
6710a621N78J696j146j70K059n50j855J099O04j811N24J964j100j002J580m54
$$ -1621 -1043 653 -493 -663 1396 846 -1009 90 694 -1117 -593 1371 271 -731 849 395
6726C95j986J081J261j443L21J983r99j442J381o4j908Q32J528j410k72J894o60
$$ 395 -1591 -510 751 -692 -371 1612 613 -829 552 488 -1420 -588 940 -470 -742 1152 492
6743D92j498J450N85j889M54J512j479q53J818k22j497J409J020j794M6J561j236
$$ 492 -1006 444 1029 -860 -406 1106 -373 -1226 592 370 -1127 282 1302 -492 -446 1115 -121
6760a21j134J717J78j677R73J185j718l16J845o45j217J643M03j938M05J237j584
$$ -121 -1255 462 640 -1037 -64 1121 -597 -913 932 287 -930 713 1116 -822 -417 820 -764
6777g64n26K029j32j341J416O69k058NJ465j222p93J965R2j654J008R37j816j63
$$ -764 -1290 739 607 -734 682 1351 -707 -702 763 -459 -1252 713 805 -849 159 1096 -720 -883
6795h83J810p77j073J653J92j932N72J240j514k93K031l96j404J351M36k003K97
$$ -883 927 150 -923 730 922 -1010 -438 802 -712 -1005 1026 630 -774 577 1013 -990 -693
6812f93J506j214o27J925j65j649J102Q35j808O9J744r80j058J635Q6j810Q48
$$ -693 813 -401 -1028 897 732 -917 185 1020 -788 -719 1025 45 -1013 622 708 -1102 -254
6829b54J256j533j66J848p49j402J370M04j842N78J532j333n68J826m41j597J260
$$ -254 1002 -531 -697 1151 402 -1000 370 774 -1068 -490 1042 -291 -859 967 526 -1071 189
6846A89P67j755K56J663j175r83J684o6j674J033J140j630q9J719r07j292J521
$$ 189 956 -799 -543 1120 -55 -1038 646 580 -1094 -61 1079 -551 -640 1079 172 -1120 401
6863D01L10j730P34J412j455m82J765o05j480J374O26j728M34J533j260q26J711
$$ 401 711 -1019 -285 1127 -328 -810 955 350 -1130 244 870 -858 -424 1109 -151 -977 734
6880G34j98j604J098R95j654N1J633j004j107J589J65j696Q89J224j527l72J723
$$ 734 536 -1068 30 1025 -629 -578 1055 51 -1056 533 698 -998 -109 1115 -412 -784 939
6897I39p41j341J447N35j647N47J450j411p20J676l77j530J295Q61j632J97J550
$$ 939 198 -1143 304 839 -808 -261 1189 -222 -942 734 357 -1173 122 983 -649 -452 1098
6914A098j182j001J653Lj568J023J121j637k20J614q77j210J584M83j639O89J265
$$ 1098 -84 -1085 568 571 -997 26 1147 -490 -710 904 27 -1183 401 884 -755 -66 1199
6931A199j581o21J688n38j351J461Q14j631K91J409j347q96J668j40j479J216
$$ 1199 -382 -1003 685 147 -1204 257 1071 -560 -269 1140 -207 -1103 565 425 -1054 162
6947A62R81j689o3J577j052j064J659K66j615Q24J127j604l90J620o42j254J562
$$ 162 1143 -546 -609 968 -84 -1148 511 777 -838 -14 1113 -491 -881 739 97 -1157 405
6964D05N67j645M71J328j407p65J645k94j458J287Q85j592J89J551j169j046J590
$$ 405 972 -673 -202 1126 -281 -1046 599 305 -1153 134 1019 -573 -384 1167 -2 -1048 542
6981E42k5j644J001J174j513j50J663q70j297J463L30j620P40J413j408n59J592
$$ 542 517 -1127 -126 1048 -465 -615 1048 178 -1119 344 674 -946 -206 1207 -201 -760 832
6998H32o50j495J341Q10j504M91J568j321r86J437l27j594J197J210j363J13J577
$$ 832 182 -1313 28 838 -666 -175 1393 72 -914 523 196 -1398 -201 1009 -354 -241 1336
7015A336j147j297J337J19j537R78J415j331l70J499q50j494J369O35j441P08
$$ 1336 189 -1108 229 348 -1189 -211 1204 -127 -497 1002 152 -1342 27 662 -779 -71
7031g1J493j355q78J413n20j529J323J102j416L12J535j246j207J383j06j573
$$ -71 1422 67 -811 602 82 -1447 -124 978 -438 -126 1409 163 -1044 339 233 -1340
7047a340J138J354j389j27J562r82j419J345L78j551P89J506j335n79J532o21
$$ -1340 -202 1152 -237 -364 1198 216 -1203 142 520 -1031 -242 1264 -71 -650 882 261
7063B61j544J276P86j505M73J562j215r41J468l02j642J101J133j410J39J658
$$ 261 -1283 -7 779 -726 -253 1309 94 -847 621 319 -1323 -222 911 -499 -360 1298
7079A298j009j269J376P9j715Q75J390j260k52J645p48j496J229M52j642O20J596
$$ 1298 289 -980 396 475 -1240 -365 1025 -235 -487 1158 410 -1086 143 595 -1047 -427 1169
7096A169j164o74J586m77j633J034Q82j497L40J694j020j048J455j74j746R07
$$ 1169 5 -669 917 440 -1193 -159 723 -774 -434 1260 240 -808 647 473 -1273 -366
7112c66J246j352m1J729p99j348J260K28j693O60J468j167m18J649n60j565J114
$$ -366 880 -472 -513 1216 417 -931 329 557 -1136 -476 992 -175 -593 1056 496 -1069 45
7129D5O73j646L66J651j030q10J554k57j680R68R89j492O3J749q56j125J391R4
$$ 45 718 -928 -562 1089 59 -751 803 546 -1134 -166 823 -669 -606 1143 287 -838 553 647
7147F47j750P18J326j380k73J776o11j424J250M41j701M27J535j164n98J684l44
$$ 647 -1103 -385 941 -439 -712 1064 453 -971 279 720 -981 -554 981 -183 -781 903 559
7164E59j586J069P85j651J92J665r26r85J563J6j757Q05J153j461j45J725p09
$$ 559 -1027 42 827 -824 -632 1033 107 -878 685 701 -1056 -251 902 -559 -704 1021 312
7181C12j280J417L16j767N92J380j275m80J679m36j457J199O56j669K57J575j100
$$ 312 -968 449 765 -1002 -410 970 -305 -785 894 458 -999 200 856 -813 -556 1019 -81
7198h1q32J616j12j625R99R84j515o0J632q79j113J481K06j689P38J268j410m04
$$ -81 -913 703 591 -1034 -35 949 -566 -626 1006 127 -986 495 701 -988 -250 1018 -392 -796
7216g96J693n61j383J358N55j694M20J435j253p34J664k20j480J120Q89j614O3
$$ -796 897 336 -1047 311 866 -828 -408 1027 -226 -960 704 484 -996 124 1013 -601 -538
7233e38J549j018j069J578J10j600Q90J171j523k76J673p62j247J448M16j671
$$ -538 1011 -7 -1076 502 612 -988 -98 1073 -450 -726 947 185 -1062 386 802 -869
7249h69N81J335j349n80J662l77j424J278P45j676J84J468j155r05J659o1j517
$$ -869 -288 1047 -302 -882 780 403 -1021 257 1002 -674 -490 978 -177 -1082 577 516 -1001
7266a001J056J059j608j08J580q92j189J494L26j647P13J291j413m82J668n30
$$ -1001 55 1114 -494 -602 978 86 -1103 391 717 -930 -217 1074 -339 -821 847 317
7282C17j340J370O13j740L22J418j242p42J711j40j448J145Q40j664o3J523j019
$$ 317 -1023 347 960 -780 -458 960 -282 -1024 687 547 -901 244 1084 -580 -643 880 -139
7299a39j023J645J84j569Q60J153j538l35J638o72j243J441M38j750M80J348j318
$$ -139 -1162 483 667 -902 -42 1111 -427 -762 876 204 -1039 402 840 -910 -430 918 -400
7316d00n46J776k64j391J152O60j768J06J483j053q31J764O2j564R44R67j644
$$ -400 -946 830 566 -825 327 987 -781 -675 808 -245 -1076 688 750 -814 130 1097 -547
7333e47j95J639q27j138J539K53j666O89J307j379m19J710n15j441J247N26j722
$$ -547 -742 897 70 -1068 471 724 -942 -253 1054 -325 -744 966 451 -990 257 783 -939
7350i39L61J516j160p17J697j51j520J091R03j660MJ472j007j103J535K45j491
$$ -939 -578 938 -222 -939 758 607 -913 178 1081 -579 -575 897 -110 -1213 322 567 -924
7367i24R82J278j510m10J441q33j356J387O16j486O61J444j399p58J548m47j367
$$ -924 58 1336 -174 -584 857 24 -1332 55 671 -815 -154 1290 -109 -867 681 234 -1133
7384a133J361Q99j606R0J353j299j020J637K23j282J236J084j706m86J295j084
$$ -1133 228 1127 -479 -389 964 -335 -1355 282 505 -777 459 1543 -163 -649 646 -438
7400d38j173J732O69j353Q66J178j671p87J485n58j237J599P94j621K51J272j425
$$ -438 -1611 121 790 -563 303 1481 -190 -977 508 -50 -1287 312 1106 -515 -264 1008 -417
7417d17q67J755P4j264J212Q47j835k97J353j033r38J832M92j425Q41J025j731
$$ -417 -1284 471 545 -719 493 1340 -495 -792 561 -472 -1410 422 914 -511 330 1355 -376
7434c76n28J499o38j178J536N50j631N23J364j329o28J679l23j506J119O77j668
$$ -376 -904 595 -43 -1221 315 865 -766 -243 1121 -208 -836 843 520 -986 133 810 -858
7451h58K07J594r95q40J640o1j620R28J048j541j35J630q99j286J389K84j522
$$ -858 -651 943 -52 -892 748 687 -933 -5 1043 -498 -633 997 98 -1188 201 485 -1037
7468a037Q93J485j270n07J459q17j647J184P01j378O90J728j163r47J319m50j666
$$ -1037 -144 1341 71 -436 1023 206 -1441 -257 444 -934 -244 1484 321 -626 693 243 -1423
7485a423J185J139j330J64J559j155j340J347J73j409J110J444j375m89J305j032
$$ -1423 -238 901 -429 -265 1294 139 -1201 146 319 -1090 20 1464 89 -400 905 -127
7501a27j502J427P55j259Q21J512j445r54J321n66j453J348J078j384K03J456
$$ -127 -1629 -202 553 -706 115 1627 182 -772 549 -17 -1470 -122 956 -428 -225 1231
7517A231j269j142J524J01j375J066J134j577l54J406r22j151J603N94j488O54
$$ 1231 -38 -1180 344 445 -930 136 1270 -307 -661 745 -177 -1328 275 869 -619 35
7533C5J232j555o75J567m61j254J379P01j632K69J361j179p47J697n3j522R23
$$ 35 1267 -288 -963 604 143 -1111 268 969 -663 -394 967 -212 -959 738 685 -837 86
7550H6Q11j678n7J654p73q89J633J42j742N82J064j489k31J788n11j227J287L51
$$ 86 897 -781 -838 816 43 -846 787 929 -813 -231 833 -656 -887 901 390 -837 450 801
7568H01j764M21J441j120n19J732l60j603R64O85j603K51J711q45q65J485j51
$$ 801 -963 -542 899 -221 -740 992 632 -971 -7 678 -925 -674 1037 192 -673 812 661
7585F61j761P81J082j375pJ731p29j256J282K11j668O38J426j227m25J591n43
$$ 661 -1100 -319 763 -612 -619 1112 383 -873 409 620 -1048 -410 1016 -211 -636 955 412
7602D12j518J161O84j501L69J533j136q66J458k10j532J070J038j426jJ531r75
$$ 412 -1106 55 739 -762 -393 1140 4 -862 596 386 -1146 -76 962 -464 -465 1066 91
7619I1j184J434K10j487P98J249j396m03J517o61j306J401N89j545M32J312j319
$$ 91 -1093 341 551 -936 -138 1111 -285 -688 829 168 -1138 263 852 -693 -261 1051 -268
7636b68p32J589k20j322J209Q52j581OJ371j107r80J583K07j450Q93J097j528
$$ -268 -1000 589 369 -953 256 1108 -473 -467 904 -203 -1183 400 607 -843 50 1147 -381
7653c81k99J500p31j140J439M17j582N31J220j350n44J665l24j314J256O16j635
$$ -381 -680 820 89 -1051 388 805 -777 -246 974 -376 -920 745 421 -893 363 979 -656
7670f56J51J326j122p76J679L0j436R80Q91j575j30J449q40j055J502K49j508
$$ -656 -505 821 -301 -1077 602 632 -804 176 1067 -508 -638 811 -29 -1084 418 667 -841
7687h41O65J190j373l75J612n23j278J254M84j662L28J326j096o19J674j26j427
$$ -841 -176 1014 -359 -734 878 355 -923 331 815 -847 -519 807 -289 -908 766 640 -787
7704g87J049P29j630o5J449r11q98J601J61j465P72J021j468k68J535o61j132
$$ -787 262 991 -639 -704 745 -166 -1064 537 698 -767 5 1026 -442 -710 825 164 -968
7721i68J303L89j601M72J275j184m49J649k98j350J051N29j691J19J443r35o47
$$ -968 335 724 -877 -405 870 -314 -763 886 588 -762 289 818 -873 -754 689 -246 -893
7738h93J643K8j470Q44P77j554j41J535p48r88J465K47j572O19J151j256l42J560
$$ -893 750 778 -692 152 929 -625 -766 769 21 -967 498 745 -827 -208 943 -313 -655 905
7756I05n27j308J159M22j581L37J428j022n51J600j83j469R41P05j559jJ430q74
$$ 905 378 -930 229 651 -930 -593 835 -187 -738 862 679 -790 151 856 -703 -704 726 -148
7774a48q66J555J77j448Q02J030j410l94J431p11j132J357N13j481N59J230j270
$$ -148 -1014 541 718 -730 72 1102 -308 -702 729 18 -1114 243 756 -725 -166 1064 -206
7791b06n91J474l60j269J185P22j537P2J264j043p76J598J62j290R22Q78j624
$$ -206 -797 677 317 -952 233 955 -582 -510 754 -289 -1065 533 695 -595 327 1205 -419
7808d19l73J250p78r21J596N60j337N98R98j510o56J418l93j065J390O94j518
$$ -419 -792 458 -320 -1241 355 915 -422 176 1174 -336 -992 426 33 -1032 358 1052 -466
7825d66J23J151j196o78J608O2j231J053O66j643k65J273p98p38J666L86j376
$$ -466 -343 808 -388 -1066 542 604 -627 426 1092 -551 -816 457 -341 -1079 587 973 -403
7842d03O06Q48j572m91J449m75r63J434N26j507L57J108j265n69J537k13j245
$$ -403 203 1051 -521 -1012 437 -38 -1001 433 959 -548 -191 917 -348 -917 620 407 -838
7859h38J083N95j526R7J342q85p45J500M4j407P65Q74j455j62J435p05r98J352
$$ -838 245 840 -686 -589 753 -132 -877 623 667 -740 25 899 -556 -718 717 12 -986 366
7877C66L43j425O09J171j269m76J352n32j231J141O46j329M17J311j049q09J293
$$ 366 709 -716 -107 1064 -205 -681 671 139 -1092 49 695 -634 -217 1094 45 -764 529
7894E29k11j351R54R48j265KJ326r24r89J282J84j275Q27J079j290m33J272o90
$$ 529 318 -1033 -79 869 -396 -394 932 8 -981 301 485 -790 37 1116 -174 -607 665 -25
7912b5j138J266N83j256N29J197j218p18J251l38j227J172Q15j312J21J259j019
$$ -25 -1163 103 686 -570 -41 1156 -62 -780 471 133 -1094 78 893 -419 -298 961 -58
7929e8q82J328O5j245Q44R30j348k61J297o75j004J346L85j310N06J048j236n19
$$ -58 -940 388 453 -792 52 982 -366 -627 670 -5 -1009 337 722 -588 -82 966 -270 -789
7947g89J368l87j112J184N73j418K28J226r95p00J403r7j301Q65P62j380n3J398
$$ -789 579 192 -920 264 837 -581 -353 873 -122 -822 581 484 -817 48 810 -570 -623 775
7965G75o78q83J306J79j436N57R68j244k58J422m16j080J130L79j449L39J187
$$ 775 97 -786 520 699 -737 -180 788 -456 -714 708 292 -788 342 721 -728 -389 798
7982G98j002n14J416k01j283Q52O44j376J15J357p61p32J282kj408O71Q90j237
$$ 798 -204 -718 698 497 -786 66 710 -666 -551 806 45 -687 595 593 -815 -144 746 -491
8000d91j26J387n30j003J177K67j407M13J113j083m36J430l65j184J008N80j390
$$ -491 -617 770 240 -763 414 681 -726 -313 800 -283 -719 711 346 -838 170 750 -640
8017f40K25J249r11o90J336q8j271P91Q01j325p4J357o78r07J254K20j357N66
$$ -640 -415 834 -77 -767 569 481 -790 1 802 -523 -597 760 82 -825 429 649 -708 -142
8035a42R89j242l28J365m42j025J108M93j360K81J125j067n72J370j59j171R20
$$ -142 847 -395 -723 642 200 -825 283 776 -584 -303 822 -245 -817 553 394 -777 143
8052A43O87j360J6J261q01p84J339J17j301O48Q51j256k64J350n25r29J219L60
$$ 143 830 -530 -514 747 -54 -838 501 618 -683 -35 816 -440 -704 646 121 -808 411 771
8070G71j373L58J025j098m87J377k55j084J001N55j355J12J240q83o82J303j8
$$ 771 -602 -244 781 -317 -804 573 318 -766 235 790 -565 -453 787 -96 -778 525 507
8087E07j250P39P78j283r8J354o30q66J214K06j378M84R55j119l14J360l52j056
$$ 507 -743 -4 774 -509 -607 747 117 -749 465 671 -707 -223 732 -387 -701 659 307 -749
8105g49J010M78j373K77J161r56n67J313j71j219Q38O80j253N2J295p32p96J211
$$ -749 261 739 -634 -357 804 -152 -719 594 423 -796 42 722 -531 -479 816 84 -712 499
8123D99L7j307N95Q80j132j84J372n07r61J058L02j328L76J071j027m52J333k66
$$ 499 536 -771 -176 704 -428 -612 760 253 -708 350 652 -676 -300 771 -256 -708 625 359
8141C59j139R28N97j307J71J184q33p12J248j5j261P30Q03j215j14J326o05q50
$$ 359 -780 148 745 -562 -391 793 -40 -752 496 481 -780 -50 753 -462 -576 750 145 -705
8159g05J155K29j351M30R47j134l13J339k71r74J002M62j374J50J059r37n52J373
$$ -705 450 679 -672 -242 705 -429 -742 597 326 -648 354 816 -558 -408 651 -286 -838 535
8177E35o4j120Q11O00j301n9J248o45p22J273J38j309M80P74j200k23J424l50
$$ 535 471 -649 162 762 -539 -598 650 5 -717 556 694 -615 -135 639 -561 -784 640 290
8195B90q60J110K93j455J80R78r96l81J456q1j051Q30M55j367RJ157p20n87J350
$$ 290 -570 540 833 -622 -442 536 -460 -841 615 534 -517 313 768 -599 -590 567 -153 -740 610
8214F10N9j301N67P11j236q4J361m68q08J128J46j409L71R26j022k51J404k67
$$ 610 669 -632 -65 646 -590 -674 687 219 -589 539 685 -724 -353 573 -449 -700 704 437
8232D37j033Q96M19j346J62J140q67n50J276m8j204P70P32j233l1J208o91q49
$$ 437 -596 300 719 -627 -465 675 -192 -742 534 486 -718 52 784 -449 -480 728 37 -812
8250h12J157J56j227O37R29j116k90J220m81r97J064M49j200L29R98j040n77J193
$$ -812 345 501 -726 -89 840 -276 -566 654 173 -824 240 689 -511 -182 816 -224 -801 392
8268C92j72r95R90O78j222NJ052r24p77J258J72j064P68Q46j262l22J081o01q68
$$ 392 220 -775 215 893 -329 -324 728 -196 -973 285 457 -607 161 1007 -255 -577 504 -97 -965
8287i65J245M31j126L75Q69j151n18J239k13r13J084N51j304O7R28q93o26J350
$$ -965 280 711 -415 -40 829 -322 -840 399 186 -727 357 908 -396 -329 599 -294 -920 430
8305D30Q2j073Q03O11j323j67J184o35p22J276K92j303M83P72j161k96J334l34
$$ 430 512 -561 242 853 -470 -637 547 -88 -810 466 758 -545 -62 710 -451 -747 587 253
8323B53r19J026L51j352K34J050q68m27J319j33j200P38N13j255J26J288o47o44
$$ 253 -666 360 711 -641 -407 643 -225 -652 667 534 -666 72 585 -670 -544 744 97 -547
8341e47J159m1j374N52Q07j024m9J352m91r80R50J78j277M60J099q77l45J226
$$ -547 612 571 -803 -251 556 -468 -517 835 344 -636 314 492 -785 -325 774 -103 -448 778
8359G78m39j214Q08N34j129L35J259p72o70J071k37j273P19Q32j017L9J277o87
$$ 778 339 -875 -67 467 -662 -327 932 160 -510 561 324 -949 -230 602 -415 -376 901 214
8377B14r15R95J42j216O02R96j033l31J210m91j056J033N09j193L78J090r95o20
$$ 214 -701 294 436 -780 -178 818 -215 -546 664 173 -883 150 659 -534 -156 934 -61 -681
8395f81J143k24j113R05P20j186P9J145p58p34J146J20j216N86P71j181k04J206
$$ -681 462 238 -875 30 750 -436 -357 788 30 -704 442 562 -654 -68 703 -478 -682 524
8413E24m23q04J178L40j289K87Q64j105m18J319j72r67R65N08j293Q7J038p56
$$ 524 101 -703 475 815 -474 -187 677 -428 -846 473 301 -666 299 807 -486 -399 639 -117
8431a17o20J319l1j222O19O52j213m2J319m75o73J119J71j448L19Q20j068k32
$$ -117 -737 582 551 -671 -52 600 -613 -655 664 189 -484 635 806 -642 -323 497 -571 -803
8449h03J395k21r35J016L39j349J71J039q87m73J281j71j142P41O33j148M0J267
$$ -803 592 371 -564 452 791 -558 -387 652 -235 -708 573 402 -740 1 634 -514 -474 793
8467G93o24p12J096k5j346N24Q16j061q3J352l79q82J013K22j330K79R70r55m11
$$ 793 169 -543 553 528 -818 -294 522 -539 -622 730 351 -531 482 704 -626 -347 623 -332 -743
8486g43J295k49j025Q88O06j217J55J115q28o85J108j03j164O89Q29j073MJ263
$$ -743 552 303 -722 166 772 -445 -290 825 -3 -688 420 317 -847 -158 671 -402 -398 865
8504H65o00q93J043J68j359M26R60r93k67J294l25r48R51M18j248J98J065r16
$$ 865 265 -628 415 583 -776 -350 610 -383 -650 644 319 -629 322 740 -508 -310 755 -161
8522a61n98J167j29j108Q36P37j113M1J197p43q17J051mj249O04R50j003j27J281
$$ -161 -759 408 279 -829 7 744 -369 -328 869 126 -691 360 356 -893 -289 661 -342 -469 812
8541H12m53r93R53K67j293L55J024r40m29J244k32j037Q93O01j172R9J088q33
$$ 812 359 -634 319 586 -707 -352 672 -268 -697 547 315 -722 171 772 -400 -301 787 -46
8559d6p55J122k4j164P72Q67j073p8J208o15r27J051J59j256M67R51r83l03J270
$$ -46 -801 321 297 -867 -95 772 -301 -379 829 214 -713 338 497 -759 -292 659 -324 -627 643
8578F43k77r57R40M31j313J21J019r18n18J310o5j012P74O37j246o8J138o08p58
$$ 643 366 -591 349 780 -533 -412 607 -311 -829 481 416 -596 178 815 -431 -499 639 31 -727
8597g27J164J29j259N04Q05j077j74J377l46q80R39K40j388J44R92q57k97J433
$$ -727 437 566 -693 -189 616 -461 -635 742 396 -484 455 695 -693 -549 443 -414 -711 722
8615G22j18j076P36M20j367L7J204o30n53J251k4j262N48O99j111k7J375m93q57
$$ 722 604 -472 264 684 -683 -646 558 -72 -625 626 602 -660 -112 587 -524 -551 824 331 -526
8634e26R55Q6j378M07J013q45k21J337l03j122P86L38j281K53J192p50n54J209
$$ -526 429 515 -863 -456 557 -288 -509 828 525 -597 189 527 -754 -501 691 -59 -613 596
8652E96j52j188P03P09j097M5J232p31q47J046P1j203O39R94r69k87J192n62j026
$$ 596 444 -744 -41 668 -429 -384 848 117 -730 316 387 -816 -177 817 -152 -439 753 191 -835
8671h35R42M13j163M22J070r52n78J168k19j055Q76P19j149L2J038q55p81J160
$$ -835 107 520 -643 -221 849 -103 -681 487 268 -787 89 808 -341 -309 729 -126 -907 253
8689B53J37j038P63Q20j184k82J095o11q67J149M15j129M25Q97j098n16J230k81
$$ 253 390 -648 115 935 -249 -531 564 -47 -914 235 650 -479 -54 843 -255 -771 459 178
8707A78r36J037N37j243P7J015q98n91J264L3j035P17O30j246j41J187n90p48
$$ 178 -758 279 816 -427 -350 665 -233 -824 440 473 -562 155 785 -461 -602 585 -5 -753
8725g53J201K20j239M47Q08j082k93J301l24r35R88L21j280K32J052q11m50J235
$$ -753 448 668 -571 -124 684 -398 -691 610 286 -649 339 660 -620 -388 664 -147 -597 638
8743F38j59j184P00N51j177J48J277o19p25J092o6j299N52Q48r77n7J298n00r83
$$ 638 479 -705 -5 546 -631 -483 794 175 -550 542 476 -823 -271 577 -400 -457 841 341 -642
8762f42Q96J91j238M57J102q57l40J164m01j195Q04N07j068L22J205p15p25J033
$$ -642 254 445 -793 -336 766 -91 -431 733 332 -863 -59 448 -620 -298 907 192 -533 500
8780E00k04j259P20Q12r49O6J243o64r34R47J06j206N80J007r20k91J140m53j060
$$ 500 296 -963 -243 569 -380 -314 929 265 -669 278 384 -822 -242 765 -155 -446 694 241 -819
8799h19R01M47j112L57J093q95o04J135k16j126Q01P12j096Q4J132o90p84J058
$$ -819 82 529 -583 -226 867 -28 -632 503 287 -839 -38 674 -422 -338 794 104 -680 378
8817C78L6j162N86Q19j051j58J246m34r15R76L09j258L42R29r49l84J260k24r97
$$ 378 414 -748 -162 657 -394 -552 694 260 -655 321 630 -628 -286 643 -306 -690 570 346 -651
8836f51Q31N10j226J19J112p59n82J191m8j196O25O94j142J0J240m96p70J008
$$ -651 180 690 -536 -417 695 -64 -646 545 497 -699 -74 620 -522 -512 728 232 -538 470
8854D70J07j265L78Q46r26k20J316k97r93Q86L05j262K54J018p82m49J193j34
$$ 470 577 -688 -310 536 -390 -610 706 409 -584 302 607 -655 -401 617 -165 -614 579 445
8872D45j143O99O22j150P0J197o07p42J062M3j239N15Q22r58j25J232m05r46Q96
$$ 445 -698 1 623 -527 -457 740 133 -609 453 496 -743 -228 594 -364 -489 743 338 -608 288
8891B88K49j200L19J004q90l76J223k49j061Q12N51j161J39J061p03o82J107l8
$$ 288 537 -663 -344 660 -230 -606 617 368 -693 119 670 -491 -352 709 6 -676 431 393
8909C93j137O66P53j028p7J162n73q34R59K04j163M43R34r80k73J172l12j017
$$ 393 -744 -78 675 -353 -430 732 159 -675 284 488 -675 -232 702 -278 -551 621 309 -708
8927g08R03M25j159K35R98q18n30J129j20j066P26O78j079qJ102o41p67J029J33
$$ -708 195 620 -539 -304 694 -124 -654 475 355 -711 15 693 -386 -394 708 67 -700 329 462
8946D62j156N55Q24r52k27J160m30r07Q99L26j161K91R90q40m38J162k24r89P37
$$ 462 -694 -139 685 -267 -494 666 236 -671 228 554 -607 -316 674 -166 -604 558 334 -655 82
8965H2N41j099J00J066p06o47J078Mj098N74P62j002j01J156n57q19R55J98j157
$$ 82 623 -476 -376 690 -16 -663 415 419 -679 -105 657 -345 -446 710 153 -666 289 487 -670
8984f70M27R13q98k73J143l19r89Q04M05j092J94J049p18n60J096r8j107O38O77
$$ -670 -243 670 -228 -501 642 323 -666 138 543 -549 -355 694 -24 -584 512 414 -693 -55 622
9003F22j050K0J126o01p54R90P0j112M78Q70r17j99J139m15r36Q66L17j107K95
$$ 622 -428 -408 718 117 -637 353 423 -689 -211 659 -258 -457 682 267 -669 197 514 -593 -298
9022b98R83p87m68J123j88j059P37N87j082Q6J015o49o54J036L6j081N86P69j000
$$ -298 685 -102 -570 553 365 -694 43 630 -452 -366 649 0 -654 382 418 -663 -77 692 -308
9041c08j59J100m97q13R25K83j108M00Q50q72l77J143k62r60Q36M64j146J50R59
$$ -308 -467 633 136 -677 248 531 -577 -177 673 -199 -576 567 305 -655 181 645 -501 -351 608
9060F08p40n25J089j4r98O41O59j098r0J041n50p23J021K04j093M54P64r40k56
$$ 608 -132 -657 432 418 -580 61 720 -378 -468 573 23 -700 321 525 -568 -114 650 -290 -546
9079e46J089l46q27Q92L24j128K36Q91p55m38J117j26r71O92N41j063j2J025o24
$$ -546 543 197 -630 262 586 -542 -306 585 -170 -608 509 383 -588 104 645 -418 -430 595 -29
9098b9o29J031J10j078N63P11r65j62J060m58q24Q66K35j037L61R38q20l52J055
$$ -29 -658 373 483 -595 -32 679 -286 -448 612 154 -670 196 431 -606 -245 693 -127 -479 576
9117E76k76j012P92M54j006J85J005p14n91R65p9j015O86P29r52l6R56o13q55
$$ 576 300 -712 80 534 -472 -287 718 4 -587 378 299 -716 -30 699 -253 -289 667 54 -801
9136h01R21J99r40N43R03q51l34R11m40r37Q10M43r06L20R57p84n49R27k05r34
$$ -801 120 319 -621 -78 825 -26 -360 551 111 -826 -16 427 -479 -159 798 14 -535 392 187 -747
9156g47P64O50r21K3R03o97p34R45J17r19O55P84r41k33Q99n47q51R00L73r30
$$ -747 17 667 -254 -231 672 -25 -759 186 303 -616 39 823 -118 -351 548 1 -850 50 423 -507
9176e07M16Q81q26m40R52k77r20P70M98r88J16R66o83n38R51Mr59N86O54r69j10
$$ -507 -91 790 -36 -476 476 199 -721 49 547 -441 -325 641 -42 -580 371 375 -584 2 656 -313 -423
9197d23R80m97p14Q94J92j020M40Q32q10k56R95l54r21P03L60j008K51J040o40
$$ -423 557 60 -654 240 432 -588 -148 684 -126 -382 613 259 -662 41 401 -607 -356 684 44
9216D4m21R94k30j057N57N10r20Q4J073m83o45Q73L0j056M76P70q19j19J010m53
$$ 44 -377 617 387 -670 -113 397 -523 -439 634 151 -494 379 409 -647 -171 599 -220 -339 671 218
9236B18q90P43K37r68M11R78o62l82R36l15j042O07M73r23K42J055n48n74Q66
$$ 218 -672 71 308 -660 -249 729 67 -315 621 306 -736 -129 344 -579 -337 718 170 -404 462
9255D62q2j051N30O83q77n3J002m73p86Q20K15r57M32Q58p97l22R13l47r31P42
$$ 462 380 -671 -141 542 -335 -388 614 141 -645 175 390 -567 -135 723 -74 -396 517 170 -761 -19
9275a9M26r02K58R52o75m86R21j61r59N81N52r00l1J014m77o43Q93J46r88M28
$$ -19 407 -495 -237 715 40 -446 475 314 -645 -64 488 -412 -443 571 94 -549 344 490 -498 -70
9295g0O97q88k30R48l81p51Q32L34r27K72Q64p55m29R33j96r13O59M96r56J03
$$ -70 627 -261 -491 457 76 -675 157 491 -436 -164 700 -55 -484 449 253 -660 -1 495 -461 -358
9315c58R46n25n58R01K7r85M89N84q66j61R99l83o99Q59K48r50K84P74q20l39
$$ -358 588 63 -495 406 433 -552 -63 521 -345 -506 493 110 -589 270 518 -432 -148 626 -194 -533
9335e33R31k37q20P61L87q93J74Q71o32n15R16p6r41N79N38r18j0R46m65n88Q88
$$ -533 398 161 -659 102 489 -404 -230 641 9 -506 410 334 -607 -28 510 -408 -418 528 63 -525 363
9356C63J23r69L75O96q61k63R76k81p50P90L16r40K11Q27p32m04R40j52q53O07
$$ 363 486 -483 -108 588 -273 -536 440 159 -591 199 515 -425 -214 613 -119 -523 417 265 -588 19
9376A9M89r22Q8R05m91n55Q56M1r81M14O22q52q1J001l37p05P66J84r68K72P77
$$ 19 508 -414 -326 579 88 -467 389 430 -551 -137 485 -367 -448 553 216 -489 277 461 -507 -235 542
9397E42p13k73R41k04q45O21L77r30K14R02n75m79Q47j22r63N32N79p73j2R97
$$ 542 -171 -444 497 293 -552 69 446 -484 -270 632 57 -422 425 303 -660 -128 451 -322 -334 663
9417F63m56p27P62O0r44M56P63p12k28R12l62q13O69L45q56K96Q52o79n00Q35
$$ 663 207 -520 242 302 -642 -186 577 -135 -363 549 187 -626 43 388 -468 -172 680 1 -499 336
9437C36j29q74O54N76q54O7Q58o52o21Q43J08q44N31O86q10k67Q48m24o90P93
$$ 336 207 -667 -13 563 -291 -224 634 -18 -639 204 312 -532 -1 685 -125 -392 456 32 -658 135
9457A35L46q19K74P14q13m17Q95j31p22P51M32r36K4P34o86m65R65J38p72N27
$$ 135 481 -338 -64 650 -163 -580 315 184 -538 213 645 -291 -267 467 -219 -684 281 419 -353 174
9477A74N10r76k07Q24m19n47R30K56q76L07N87q44l22R81j75o70P31L22r93P2
$$ 174 684 -292 -499 325 -94 -641 289 545 -331 -24 563 -281 -603 378 203 -467 264 586 -407 -335
$$ [...]
16383A09
##END NTUPLES=NMR FID
##END=
