##TITLE=abcd
##JCAMPDX= 6.0         $$ Bruker NMR JCAMP-DX V2.0
##DATA TYPE= NMR FID
##DATA CLASS= NTUPLES
##ORIGIN= UXNMR, Bruker Analytische Messtechnik GmbH
##OWNER= root
$$ XWIN-NMR		Version 3.5
$$ Sat Oct 20 08:50:56 2018 Russian Standard Time (UT+4h)  servis@DPX200
##.OBSERVE FREQUENCY= 200.131235884673
##.OBSERVE NUCLEUS= ^1H
##.DELAY= (6, 6)
##.ACQUISITION MODE= SIMULTANEOUS
##.ACQUISITION SCHEME= undefined
##.AVERAGES= 8
##.DIGITISER RES= 18
##SPECTROMETER/DATA SYSTEM= spect
##.PULSE SEQUENCE= zg
##.SOLVENT NAME= CDCl3
##.SHIFT REFERENCE= (INTERNAL, CDCl3, 0, 16.5164)
##AUDIT TRAIL= $$ (NUMBER, WHEN, WHO, WHERE, WHAT)
$$ ##TITLE= Audit trail, XWIN-NMR		Version 3.5
$$ ##JCAMPDX= 5.01
$$ ##ORIGIN= Bruker BioSpin GmbH
$$ ##OWNER= servis
$$ F:\spectra/data/av/nmr/H1/1/audita.txt
$$ ##AUDIT TRAIL=  $$ (NUMBER, WHEN, WHO, WHERE, WHAT)
(   1,<2018-10-20 08:50:31.25 +0400>,<servis>,<DPX200>,
      <created by zg, POWCHK disabled, PULCHK disabled
       configuration hash MD5:
       00 E9 B6 7A A2 85 ED C7 34 08 36 98 17 FE 4E 26
       data hash MD5: 16K
       8E 29 6F DA 62 A3 1B 06 5A 25 83 2D A5 34 A8 37>)
$$ ##END=
$$ 
$$ hash MD5
$$ 51 8D 6B A3 01 EF 3E F4 37 07 0E 10 3F FF 63 BE
##$RELAX= 
##$RELAX= 
##$RELAX= 
##$RELAX= 
##$RELAX= 
##$RELAX= 
##$RELAX= 
##$RELAX= 
$$ Bruker specific parameters
$$ --------------------------
##$DU= <F:\spectra>
##$EXPNO= 1
##$NAME= <H1>
##$PROCNO= 1
##$TYPE= <nmr>
##$USER= <av>
##$AMP= (0..31)
100 100 100 100 100 100 100 100 100 100 100 100 100 100 100 100 100 100 
100 100 100 100 100 100 100 100 100 100 100 100 100 100 
##$AQSEQ= 0
##$AQ_mod= 1
##$AUNM= <au_zg>
##$AUTOPOS= <>
##$BF1= 200.13
##$BF2= 200.13
##$BF3= 200.13
##$BF4= 200.13
##$BF5= 500.13
##$BF6= 500.13
##$BF7= 500.13
##$BF8= 500.13
##$BYTORDA= 1
##$CFDGTYP= 0
##$CFRGTYP= 5
##$CHEMSTR= <none>
##$CNST= (0..31)
1 1 145 1 1 1 1 1 1 1 1 1 1 1 1 1 1 1 1 1 1 1 1 1 1 1 1 1 1 1 1 1 
##$CPDPRG= <>
##$CPDPRG1= <>
##$CPDPRG2= <>
##$CPDPRG3= <>
##$CPDPRG4= <mlev>
##$CPDPRG5= <mlev>
##$CPDPRG6= <mlev>
##$CPDPRG7= <mlev>
##$CPDPRG8= <mlev>
##$CPDPRGB= <>
##$CPDPRGT= <>
##$D= (0..31)
0 2 0 0 0 0 0 0 0 0.06 0 0 0 0 0 0 0.0002 0 0 0 0 0 0 0 0 0 0 0 0 0 0 
0 
##$DATE= 1540011030
##$DBL= (0..7)
120 120 120 120 120 120 120 120 
##$DBP= (0..7)
150 150 150 150 150 150 150 150 
##$DBP07= 0
##$DBPNAM0= <>
##$DBPNAM1= <>
##$DBPNAM2= <>
##$DBPNAM3= <>
##$DBPNAM4= <>
##$DBPNAM5= <>
##$DBPNAM6= <>
##$DBPNAM7= <>
##$DBPOAL= (0..7)
0.5 0.5 0.5 0.5 0.5 0.5 0.5 0.5 
##$DBPOFFS= (0..7)
0 0 0 0 0 0 0 0 
##$DE= 6
##$DECBNUC= <off>
##$DECIM= 32
##$DECNUC= <off>
##$DECSTAT= 4
##$DIGMOD= 1
##$DIGTYP= 9
##$DL= (0..7)
0 120 120 120 120 120 120 120 
##$DP= (0..7)
150 150 150 150 150 150 150 150 
##$DP07= 0
##$DPNAME0= <>
##$DPNAME1= <>
##$DPNAME2= <>
##$DPNAME3= <>
##$DPNAME4= <>
##$DPNAME5= <>
##$DPNAME6= <>
##$DPNAME7= <>
##$DPOAL= (0..7)
0.5 0.5 0.5 0.5 0.5 0.5 0.5 0.5 
##$DPOFFS= (0..7)
0 0 0 0 0 0 0 0 
##$DQDMODE= 0
##$DR= 18
##$DS= 0
##$DSLIST= <SSSSSSSSSSSSSSS>
##$DSPFIRM= 0
$$ [...]
##$SUBNAM0= <"">
##$SUBNAM1= <"">
##$SUBNAM2= <"">
##$SUBNAM3= <"">
##$SUBNAM4= <"">
##$SUBNAM5= <"">
##$SUBNAM6= <"">
##$SUBNAM7= <"">
##$SUBNAM8= <"">
##$SUBNAM9= <"">
##$SW= 20.6817932712277
##$SWIBOX= (0..15)
0 0 3 0 0 0 0 0 0 0 0 0 0 0 0 0 
##$SW_h= 4139.07284768212
##$TD= 16384
##$TD0= 1
##$TE= 0
##$TE2= 300
##$TE3= 300
##$TEG= 300
##$TL= (0..7)
0 120 120 120 120 120 120 120 
##$TP= (0..7)
150 150 150 150 150 150 150 150 
##$TP07= 0
##$TPNAME0= <>
##$TPNAME1= <>
##$TPNAME2= <>
##$TPNAME3= <>
##$TPNAME4= <>
##$TPNAME5= <>
##$TPNAME6= <>
##$TPNAME7= <>
##$TPOAL= (0..7)
0.5 0.5 0.5 0.5 0.5 0.5 0.5 0.5 
##$TPOFFS= (0..7)
0 0 0 0 0 0 0 0 
##$TUNHIN= 0
##$TUNHOUT= 0
##$TUNXOUT= 0
##$USERA1= <user>
##$USERA2= <user>
##$USERA3= <user>
##$USERA4= <user>
##$USERA5= <user>
##$V9= 5
##$VALIST= <valist>
##$VCLIST= <CCCCCCCCCCCCCCC>
##$VD= 0
##$VDLIST= <DDDDDDDDDDDDDDD>
##$VPLIST= <PPPPPPPPPPPPPPP>
##$VTLIST= <TTTTTTTTTTTTTTT>
##$WBST= 1024
##$WBSW= 4
##$XGAIN= (0..3)
0 0 0 0 
##$XL= 0
##$YL= 0
##$YMAX_a= 37143
##$YMIN_a= -32431
##$ZGOPTNS= <>
##$ZL1= 120
##$ZL2= 120
##$ZL3= 120
##$ZL4= 120
##$ABSF1= 10
##$ABSF2= 0
##$ABSG= 5
##$ABSL= 3
##$ALPHA= 0
##$AQORDER= 0
##$ASSFAC= 0
##$ASSFACI= 0
##$ASSFACX= 0
##$ASSWID= 0
##$AUNMP= <proc_1d>
##$AZFE= 0.1
##$AZFW= 0.1
##$BCFW= 1
##$BC_mod= 2
##$BYTORDP= 0
##$COROFFS= 0
##$CY= 19
##$DATMOD= 1
##$DC= 2
##$DFILT= <>
##$DTYPP= 0
##$F1P= 11.0000007629395
##$F2P= -0.999999237060547
##$FCOR= 0.5
##$FTSIZE= 0
##$FT_mod= 4
##$GAMMA= 1
##$GB= 0
##$INTBC= 1
##$INTSCL= 1
##$ISEN= 128
##$LB= 0.2
##$LEV0= 0
##$LPBIN= 0
##$MAXI= 10000
##$MC2= 0
##$MEAN= 0
##$ME_mod= 0
##$MI= 0
##$NCOEF= 0
##$NC_proc= 0
##$NLEV= 6
##$NOISF1= 0
##$NOISF2= 0
##$NSP= 1
##$NTH_PI= 0
##$NZP= 0
##$OFFSET= 16.51637
##$PC= 1
##$PHC0= 205.2504
##$PHC1= 1.056204
##$PH_mod= 0
##$PKNL= yes
##$PPARMOD= 0
##$PSCAL= 4
##$PSIGN= 0
##$REVERSE= no
##$SF= 200.13
##$SI= 16384
##$SIGF1= 0
##$SIGF2= 0
##$SINO= 400
##$SIOLD= 16384
##$SREGLST= <1H.CDCl3>
##$SSB= 0
##$STSI= 0
##$STSR= 0
##$SW_p= 4139.07284768211
##$SYMM= 0
##$S_DEV= 0
##$TDeff= 0
##$TDoff= 0
##$TI= <>
##$TILT= no
##$TM1= 0
##$TM2= 0
##$TOPLEV= 0
##$USERP1= <user>
##$USERP2= <user>
##$USERP3= <user>
##$USERP4= <user>
##$USERP5= <user>
##$WDW= 1
##$XDIM= 8192
##$YMAX_p= 0
##$YMIN_p= 0
$$ End of Bruker specific parameters
$$ ---------------------------------
##NTUPLES= NMR FID
##VAR_NAME=  TIME,          FID/REAL,        FID/IMAG
##SYMBOL=    X,             R,               I
##VAR_TYPE=  INDEPENDENT,   DEPENDENT,       DEPENDENT
##VAR_FORM=  AFFN,          ASDF,            ASDF
##VAR_DIM=   8192,          8192,            8192
##UNITS=     SECONDS,       ARBITRARY UNITS, ARBITRARY UNITS
##FACTOR=    0.0002416,     1,               1
##FIRST=     0,             0,               0
##LAST=      1.9789456,     0,               0
##MIN=       0,             -32431,          0
##MAX=       1.9789456,     37143,           0
$$ Real data points
##PAGE= N=1
##DATA TABLE= (X++(R..R)), XYDATA
0@%%%%%%%%%%%%%%%%JkKpJ4j6J7j8J8j9K7l5L6l8M6n3O1p0P9q9R9j12J23j36J53
$$ 0 0 0 0 0 0 0 0 0 0 0 0 0 0 0 0 0 1 -1 1 -6 8 -8 9 -9 9 -10 17 -18 18 -20 26 -27 34 -36 43 -46 53 -59 64 -72 81
41H1j71J89k08K32k58K84l14L45l79M19m62N08n61O20o85P61q46R43j060J199
$$ 81 -90 99 -109 123 -135 149 -165 180 -199 220 -242 266 -295 325 -360 401 -445 498 -562 637
61F37j369J581j850K215k736L540m966Q226k8842p164M4233k4255K599M3243K051
$$ 637 -732 849 -1001 1214 -1522 2018 -2948 5278 -23564 -30728 13505 -10750 -8151 35092 37143
76C7143m3173k688M817j5493N626K1404p851N697K1313k3948l5278K5801K0575
$$ 37143 -6030 -8718 -3901 -19394 -13768 7636 -215 5482 26795 2847 -32431 -6630 13945
89A3945k8080L291M2087p167l2579L684J911j8519Q622J5415p147J2886K3315
$$ 13945 -14135 -10844 31243 24076 -8503 -4819 -2908 -21427 -12805 2610 -4537 8349 31664
102C1664k4759k5303K4738M724l5876O361L4794j0656j8554J7277M214j3574R697
$$ 31664 6905 -18398 6340 11064 -24812 -18451 16343 5687 -12867 4410 8624 -4950 4747
115D747M137j7007R290J4569k7143j2196L3176K119k9290J4445K5967k0541j5178
$$ 4747 8884 -8123 1167 15736 -11407 -23603 9573 11692 -17598 -3153 22814 2273 -12905
128a2905J7140j239r919J3769n58j7075J2394Q588k8699j289L6345k590k3342
$$ -12905 4235 2996 -6923 6846 6288 -10787 1607 10195 -18504 -19793 16552 13962 -9380
141i380J9033J4312k9306j3170J3469n438j552K1349P47r991J6529q40l4686L96
$$ -9380 9653 23965 -5341 -18511 -5042 -10480 -12032 9317 10064 73 16602 15762 -18924 -18528
155a8528K8324j0914j5453K6619J1389k5444m627R802j1085P61J8925m496n763
$$ -18528 9796 -1118 -16571 10048 21437 -4007 -8634 1168 -9917 -9156 9769 5273 -490
168d90J8882o910l3224O289K2725j5666p397L0331O921k1500J186L961j6918R68
$$ -490 18392 11482 -21742 -15453 7272 -8394 -15791 14540 21461 -39 1147 5108 -11810 -10842
182a0842J4047q920J76K3384p476k5916J3223J5639k2264m823K6493j518j8050
$$ -10842 3205 -5715 -5539 17845 10369 -15547 -2324 13315 -8949 -13772 12721 11203 -6847
195f847P890K722j5156O457J1258j2541L334K1554j2589k1113J7357Q757k4277
$$ -6847 1043 3765 -11391 -4934 6324 -6217 -2883 18671 6082 -15031 2326 11083 -13194
208a3194J291K3830p048j2678J2584j24j3176R645N958j5501O181J7575j6928
$$ -13194 -11903 11927 4879 -7799 4785 4661 -8515 1130 7088 -8413 -2232 15343 -1585
221a585j4396K1221L700k1878Q048J9602j2179q844J2381n061j1010J1892J903
$$ -1585 -15981 5240 8940 -12938 -4890 14712 2533 -6311 6070 1009 -10001 1891 3794
234C794j3999J1415J4230j9257q014K1309l282k0254J1902J4361j4327l130J2532
$$ 3794 -10205 1210 15440 -3817 -11831 9478 6196 -14058 -2156 12205 -2122 -5252 7280
247G280p952p266J2935k879j2626J4628R349k0886j798K0430q855j6791J5376
$$ 7280 -672 -7938 4997 2118 -10508 4120 13469 -7417 -9215 11215 2360 -14431 945
260I45R406j4722K247J0865j1034l763J2441p921j0362J7520N067k0102M912J8420
$$ 945 10351 -4371 -2124 8741 -2293 -6056 6385 -1536 -11898 5622 10689 -9413 -4501 13919
274A3919j3679j3060J6413L080j4294O841Q331j2004J297J1706j1630p067J8497
$$ 13919 240 -12820 3593 6673 -7621 -780 7551 -4453 -3156 8550 -3080 -10147 8350
287H350l49j8849R565J4293j6868p859J6695j690j1409J0769N252j1947M885Q343
$$ 8350 8001 -10848 -1283 13010 -3858 -11717 4978 3288 -8121 2648 7900 -4047 838 9181
301I181j5226l971J7560m852j5043J4338J0724j7142k245J4856o963r469J1735
$$ 9181 -6045 -10016 7544 2692 -12351 1987 12711 -4431 -6676 8180 1217 -8252 3483
314C483R26j1063Q448N796j5578J107J6493q903j1300J6596N267j7635K195J1964
$$ 3483 4409 -6654 1794 7590 -7988 -6881 9612 709 -10591 6005 11272 -6363 -4168 7796
328G796j0939n892J2874k417q437J2098L116j5134N430J3139j4118q594J6788
$$ 7796 -3143 -9035 3839 1422 -7015 5083 8199 -6935 -1505 11634 -2484 -11078 5710
341E710m88j6071Q247J0953j1262n95J2397p413p811J1537k343j4247J0345J1307
$$ 5710 5222 -10849 -2602 8351 -2911 -3506 8891 1478 -6333 5204 2861 -11386 -1041 10266
355A0266j4756k588J6946n876j4732J0509O906j1536L867J0765j0198n212J0510
$$ 10266 -4490 -7078 9868 3992 -10740 -231 6675 -4861 -994 9771 -427 -5639 4871
368D871p073j1841J4435R368j3093L447J5031j1566j4392R091R75j0670R289J1370
$$ 4871 -2202 -14043 392 9760 -3333 114 15145 3579 -10813 -1722 -747 -11417 -2128 9242
382I242q180P07R611j2400j1999J3091L326j2636R202J4920j2073r310R416m575
$$ 9242 1062 1769 11380 -1020 -13019 72 3398 -9238 -36 14884 2811 -6499 2917 -1658
396a658j0990J0968Q322p687N988R265j5220r992J1690l061j2292J3744J4270
$$ -1658 -12648 -1680 6642 -1045 4943 14208 -1012 -11004 686 -2375 -14667 -923 13347
409A3347j0498k194R969r971j2107R008J702q453J1002J0527j2764l017J2033
$$ 13347 2849 655 10624 653 -11454 -2446 -744 -9197 1805 12332 -432 -3449 8584
422H584q889j3245J2732P841j1289L885J1491j0169p639R190m004r588J1755P342
$$ 8584 -305 -13550 -818 7023 -4266 -381 11110 941 -6698 2492 -1512 -11100 655 7997
436G997j1238L669J2367j1607j1197J1227L39j2630P743J1530p897m90J0463p874
$$ 7997 -3241 428 12795 1188 -10009 1218 1557 -11073 -3330 8200 303 -187 10276 2402
450B402j0382Q868K6j2264Q416J3101r729l877J2798n111j4351O890O120r240
$$ 2402 -7980 888 914 -11350 -2934 10167 438 -3439 9359 4248 -10103 -3213 2907 -6333
464f333M577J2202p643n885R246n835j3780R503R811r828K710J4947p401j2767
$$ -6333 -1756 10446 2803 -3082 6164 329 -13451 -3948 5863 -3965 -1255 13692 6291 -6476
478f476O663l97j1821P009J1612o394R85J1625r024j3601Q467K745j2485O481
$$ -6476 187 -210 -12031 -5022 6590 196 1181 12806 3782 -9819 -1352 1393 -11092 -4611
492d611J5406o704o161R346m457j3013O418N973q378N440J2922q818q521R900
$$ -4611 10795 4091 -2070 7276 2819 -10194 -3776 2197 -6181 -741 12181 3363 -5158 4742
506D742k725j4331P077J1487p652k74J1854n654j0484O746N9j1036O902J1200
$$ 4742 2017 -12314 -5237 6250 -1402 -1676 10178 4524 -5960 786 845 -10191 -3289 7911
520G911q440k111J2417n248j3504P094N340j0611K833J2279n677n220R320l304
$$ 7911 -529 -2640 9777 4529 -8975 -1881 3459 -7152 -4319 7960 2283 -2937 6383 3079
534C079j1994O920O530j0375K065J3541o169r384R293P43j2754M205R594p555
$$ 3079 -8915 -1995 4535 -5840 -3775 9766 3597 -5787 3506 4249 -8505 -4300 5294 -2261
548b261r17J1435m815r740Q309J902j2347M359J1808p903m633J1758k159j2144
$$ -2261 -3178 8257 3442 -6298 2011 3913 -8434 -4075 7733 -170 -4803 6955 4796 -7348
562g348N981N675r902J753J0987o269n777J0434j402j2146O328Q111j0371j258
$$ -7348 -1367 4308 -5594 -3841 7146 877 -4900 5534 4132 -8014 -1686 6425 -3946 -5204
576e204J2291m247r086Q483K527j0631L596Q283q483k447J1187l799r780Q951
$$ -5204 7087 2840 -6246 2237 4764 -5867 -2271 6012 -2471 -4918 6269 2470 -7310 1641
590A641M922j1690J243J0591o862o084J0080K9r516O085N478j0245J71J0374o345
$$ 1641 6563 -5127 -3884 6707 -155 -6239 3841 3870 -5646 439 5917 -4328 -4157 6217 -128
605a28p000J1072K029j1573M003Q282r184l398J0413k830p606Q758K970j0898
$$ -128 -7128 3944 5973 -5600 -1597 6685 -2499 -5897 4516 1686 -5920 2838 5808 -5090
619e090K856Q661r054m402J1909r77j0150P162O005j0583m67R511n959n638J0148
$$ -5090 -2234 6427 -2627 -7029 4880 3903 -6247 915 6920 -3663 -4130 5381 -578 -6216 3932
634C932J96j0151N986O852j0447j611J1214m339q371R109L158j0564K771Q257
$$ 3932 4128 -6023 -37 6815 -3632 -5243 5971 1632 -6739 2370 5528 -5036 -2265 5992
648E992p922l142J0216k679q747Q050M195j0910J416R816o943n851J0132K58r623
$$ 5992 -1930 -5072 5144 2465 -6282 1768 5963 -4947 -3531 6285 -658 -6509 3623 3881 -5742
663e742N762O364r172p09R239n657o810R362J394j0255M835Q386q725l023J0265
$$ -5742 20 6384 -2788 -3497 5742 85 -6725 2637 4031 -6224 -1389 6997 -1728 -4751 5514
678E514l163q679P484L574r760K432Q540p379l821J0362j843r513P274N612j0576
$$ 5514 2351 -6328 1156 4730 -5030 -2598 5942 -1437 -5258 5104 3261 -6252 1022 6634 -3942
693c942k92R726n751o404R316J144r055N487O734r151j455R663n336q291Q927
$$ -3942 -4234 5492 -259 -6663 2653 3797 -5258 229 6963 -2188 -3643 6020 684 -7607 1320
708A320L141j0134L418R083p256l998R232k392q455P154M094r807J602Q949p177
$$ 1320 4461 -5673 -2255 6828 -428 -4426 4806 2414 -6041 1113 5207 -4600 -2998 5951 -1226
723a226n638J0122O56q968O058O727r170k254P668n711o650R318K865p877N594
$$ -1226 -6864 3258 3914 -5054 1004 7731 -1439 -3693 3975 -1736 -8386 932 3797 -4080 1514
738A514P687r499m591Q401l688q058Q635N352q421J812P233q261n168R513k40
$$ 1514 9201 -298 -4889 3512 -176 -8234 401 5753 -2668 -856 6377 -1884 -7052 2461 2221
753B221p099Q297N680j0960k320P075p017n925J1219M242o599N708N532j1437
$$ 2221 -4878 3419 9099 -1861 -4181 2894 -4123 -10048 1171 5413 -1186 4522 10054 -1383
767a383n033P018m501n560J1462N485q487K559O160j0209n567R543k28o161Q381
$$ -1383 -6416 602 -3899 -9459 2003 7488 -999 1560 7720 -2489 -8056 1487 1259 -4902 3479
782C479M660j0701j376O397o993l852J1930K696p255N532M120j2088m157P901
$$ 3479 8139 -2562 -3938 2459 -4534 -8386 3544 6240 -1015 4517 8637 -3451 -7608 293
796B93l629m492J0861M113q153L004N263r764l762R080k559p133Q170M161r494
$$ 293 -3336 -7828 3033 7146 -1007 1997 7260 -2504 -6266 2814 255 -6878 1292 5453 -4041
811d041J450Q537o023m267Q910j065q844N423M499r168N07R509n304o305Q709
$$ -4041 -2591 5946 -77 -4344 4566 3501 -5343 80 4579 -4589 -4082 5427 123 -6182 2527
826B527J238q892N156P880p531k718P197n918q824P454M018o439O422J0277p572
$$ 2527 3765 -5127 29 7909 378 -2340 4857 -1061 -9885 -2431 1587 -4852 1570 11847 4275
841D275o380N573n233j0105P365P851m906L631Q751q073q601N660j316p365Q746
$$ 4275 -2105 3468 -1765 -11870 -4505 3346 -1560 2071 10822 2749 -5852 -192 -1508 -8873 -127
856a27R523p059k276N621q249r438Q078N192l997P713Q615r473p351L730o169
$$ -127 9396 2337 61 5682 -2567 -12005 -3927 1265 -2732 4981 13596 4123 -3228 502 -5667
871e667p854J0293Q676m606L649O965r944q930N901p31n940R075P949p888j788
$$ -5667 -13521 -3228 5448 842 4491 11456 1512 -7418 -1517 -2248 -8188 887 8836 948 -840
886h40N656p684o778R736L995o091N743N917j0715n433O762l391n364J0247N466
$$ -840 4816 -2868 -9646 90 4085 -2006 3737 9654 -1061 -6494 268 -3123 -8487 1760 7226
901G226p679J999N641r162m946R014q33p060P176M501r726j86Q541m657m089R378
$$ 7226 -453 1546 7187 -1975 -6921 2093 1260 -5800 1376 5877 -3849 -4035 4506 -151 -4240 5138
917E138K73r551L157M133q985j41J0876k188n640P608O76j0965J608P193n758
$$ 5138 5411 -4140 -983 3150 -5835 -5976 4900 2712 -2928 4680 5356 -5609 -4001 3192 -2566
932b566j022J0077k195q753M518J817r191L091J0770l724l752P627k984j1455
$$ -2566 -3588 6489 4294 -4459 59 1876 -7315 -4224 6546 2822 -930 6697 3713 -7742
946g742L019N324n890K915J1148l639p045N182j838j0499M365Q911m846l83R055
$$ -7742 -4723 601 -5289 -2374 8774 5135 -1910 3272 1434 -9065 -4700 4211 -635 -1018 8037
961H037m477r713M781K404p444M657R763n679m579O645l827r522O370O530o221
$$ 8037 3560 -6153 -1372 1032 -6412 -1755 8008 2329 -2250 4395 568 -8954 -2584 3946 -2275
976b275K212Q682o590p652O256k51p710O517P907o999j787P201n611p777P729
$$ -2275 -63 8619 2029 -5623 633 382 -7328 -811 7096 97 -1690 5511 -100 -7877 -148
991a48L667p033M100P127q249m941P424k055o378Q140N428q086J09N937p670n498
$$ -148 3519 -3514 586 7713 -536 -5477 1947 -108 -6486 1654 7082 -1004 -895 5042 -2628 -8126
1007h126Q976J653o056O501N346r502k949O645m770n115R365L382p387L157M933
$$ -8126 850 2503 -3553 2948 8294 -1208 -4157 2488 -2282 -7397 1968 5350 -2037 1120 6053
1022F053r123l306Q769j564n530Q099L426r613rN991o722l160J0072Q69o564N630
$$ 6053 -3070 -6376 2393 829 -4701 3398 6824 -2789 -2798 3193 -3529 -6689 3383 4252 -2312 3318
1038C318L185j0371j396P663m580m119R793K036q220L399M881q558j943Q744k872
$$ 3318 6503 -3868 -5264 2399 -2181 -6300 3493 5529 -2691 708 5589 -2969 -4912 3832 960
1053I60n990P528K032r318K107P218o340k550R419j103p751N079K912r159N27
$$ 960 -5030 2498 4530 -4788 -2681 4537 -1803 -4353 5066 3963 -3788 1291 4203 -4956 -4429
1068d429Q042m717l742R088M20q239M172M818q348j362Q079l852n870P577K005
$$ -4429 3613 -1104 -4846 4242 4662 -3577 595 5413 -2935 -4297 3782 -70 -5940 1637 3642
1083C642p943L564O811o790k473Q164k932p720N818K974q250J964Q107n205l331
$$ 3642 -4301 -737 6074 -716 -3189 4975 2043 -5677 141 3115 -5135 -3171 4936 -269 -3600
1098c600Q587q47q249M580L982q632l12Q169m288m817Q465J408q027M000N751
$$ -3600 4987 4140 -4109 471 4453 -4179 -4491 3678 -610 -5427 3038 4446 -3581 419 6170
1113F170p892k258P930l559o896O950K892p801L063P593o125l186Q071k200q274
$$ 6170 -1722 -3980 3950 391 -6505 445 3337 -4464 -1401 6192 67 -3119 4952 2752 -5522
1128e522N259L791q204Q66Q198m586m207Q296M23p760M350M725q391j783P485
$$ -5522 -263 3528 -4676 -3810 4388 -198 -4405 3891 4314 -3446 904 5629 -2762 -4545 2940
1143B940m040n702Q164L231o985L394O105p583l910O897k823o509P188M395p492
$$ 2940 -1100 -6802 1362 4593 -2392 1002 7107 -476 -4386 2511 -312 -6821 367 4762 -2730
1158b730J470O842o402m568Q236L12o694N381M169q985j874O519m652m003R914
$$ -2730 -1260 5582 -820 -5388 2848 3160 -3534 1847 6016 -2969 -4843 1676 -2976 -6979 2935
1173B935L411o675L411M086r920m386O923k242m118R457M576p720J005M569q452
$$ 2935 6346 -329 3082 7168 -2752 -7138 -215 -2457 -6575 2882 7458 -262 743 5312 -3140
1188c140m215Q833M11n420O676L630r646j592O092m836k844J0404K458p099L130
$$ -3140 -7355 1478 1889 -3531 3145 6775 -2871 -4463 1629 -3207 -6051 4353 6811 -288 2842
1203B842K632j0436l103P823j745k931R762L308q416P81L896q439l186Q844k85
$$ 2842 5474 -4962 -8065 -242 -1987 -4918 4844 8152 -264 517 4413 -4026 -7212 1632 1347
1218A347n351O720L180q843n9O587n121l181Q773K24p751L905L740q387p37Q187
$$ 1347 -4004 2716 5896 -2947 -3006 3581 -1540 -4721 4052 4276 -3475 430 4170 -4217 -4954 3233
1234C233l028m409P837J393q120K775N283p320k325P738k834o412O890L681o998
$$ 3233 205 -4204 3633 5026 -3094 -319 4964 -2356 -4681 3057 223 -6189 701 4382 -2616
1249b616K569O991o383m658O376k275p280O315N664o297J165P212o047o410O383
$$ -2616 -47 6944 561 -4097 2279 4 -7276 -961 4703 -1594 -429 6783 736 -5674 709
1264G09M83o686N655O574o736k099N972n182o604P577L925n707M060O403p875
$$ 709 1192 -5494 161 6735 -1 -2100 3872 -1310 -7914 -337 3588 -2119 1941 8344 469
1279D69n348N429k764n843Q033O031n809J296N581p622o306O559M04n534O593
$$ 469 -4879 550 -2214 -8057 -24 6007 198 1494 7075 -547 -6853 -294 110 -5424 1169
1294A169O126p205j965N508n319n545P941L082o093L861N237q125l880O634k275
$$ 1169 7295 90 -1875 3633 -1686 -7231 710 3792 -2301 1560 6797 -1328 -5208 1426 -849
1309h49n042P791M153p298R64N271p018m125P874p8o028N890M229q008o98O741
$$ -849 -5891 1900 6053 -1245 -281 4990 -2028 -6153 1721 1643 -4385 1505 5734 -2274 -2972 3769
1325C769m492m227P898R49p639L367M704p420j363Q232k317n266O532J609q434
$$ 3769 -723 -4950 2948 3897 -3742 -375 4329 -3091 -4454 3778 1461 -3805 2727 4336 -4098
1340d098J699O105n621k028Q357j344o986M787K789p918Q61P601l896l544P188
$$ -4098 -2399 3706 -1915 -3943 4414 3070 -3916 871 3660 -4258 -3397 4204 308 -3236 3952
1355C952p03p990L509M522o586J56Q238l055n505N904N56q082K685O206n344j334
$$ 3952 3249 -4741 -1232 3290 -3296 -3140 5098 2043 -3462 2442 2998 -5084 -2399 3807 -1537 -2871
1371b871P722k471o764N184K364p594J856P195m724l335P149j129p186M516M038
$$ -2871 4851 2380 -4384 800 3164 -4430 -2574 4621 -103 -3438 3711 2582 -4604 -88 3950
1386C950p055L53P265m216m745O949O56p377L617N308o635j568P266k857n523
$$ 3950 -3105 -2752 4513 297 -4448 2501 3157 -4220 -603 4705 -1930 -3498 3768 911 -4612
1401d612O494K226p546K018N860o055k975P602r16o014N437L279p670L3O250m684
$$ -4612 1882 4108 -3438 -1420 4440 -1615 -4590 3012 2096 -3918 1519 4798 -2872 -2839 3411 -1273
1417a273l609P704P46o630L873M047p568j531O866k870m254P153J906p242K104
$$ -1273 -4882 2822 3568 -3062 811 4858 -2710 -4241 2625 -245 -4499 2654 4560 -2682 -578
1432e78M767o664k369P578j204n212N932K643p697M53N676n184l001P815J14o176
$$ -578 4189 -2475 -4844 2734 1530 -3682 2250 4893 -2804 -2351 3325 -1859 -4860 2955 3069 -3107
1448c107M448L477p733q30O673l514l829P315J198o998K878M356p043j745P363
$$ -3107 1341 4818 -2915 -3745 2928 -586 -4415 2900 4098 -2900 -22 4334 -2709 -4454 2909
1463B909k117m895O388K251p440J397N390n754k636P430q45n813N192L107p478
$$ 2909 792 -4103 2285 4536 -2904 -1507 3883 -1871 -4507 2923 2078 -3735 1457 4564 -2914
1478b914J40O336m336l746P138M72o501L655M082o868r58O882k950m585O470J617
$$ -2914 -2774 3562 -774 -4520 2618 3090 -3411 244 4326 -2542 -3500 3382 432 -4153 2317 3934
1494C934p125K134N055n928k200P077j479n285N493K625p184Q34N890m923l275
$$ 3934 -3191 -1057 3998 -1930 -4130 2947 1468 -3817 1676 4301 -2883 -2049 3841 -1082 -4357
1509d357P033j19o175M221L652o835l68O501l544m103O611Q13o908K846M581o234
$$ -4357 2676 2557 -3618 603 4255 -2580 -2948 3553 9 -4094 2517 3330 -3578 -732 3849 -2385
1525b385j449P183j946m835N771J757p353J305N250n359k326P463n45n665M674
$$ -2385 -3834 3349 1403 -3432 2339 4096 -3257 -1952 3298 -2061 -4387 3076 2531 -3134 1540
1540A540K758p277oO105l916l177P042L50o632L188L669o699p56P122k175m114
$$ 1540 4298 -2979 -2985 3120 -796 -3973 3069 3419 -3213 -25 3644 -3055 -3811 3311 1136 -2978
1556b978O001R83p457J443M550n461j289P851o90n120M647J705p777J03N666l915
$$ -2978 3023 4006 -3451 -2008 2542 -2919 -4208 3643 2953 -2167 2480 4185 -3592 -3489 2177 -1738
1572a738k214P467J47o182L299K764p032l48O922k545l538O192N20p190J961M138
$$ -1738 -3952 3515 3662 -2520 779 3543 -3489 -3837 3085 540 -2998 3194 3714 -3476 -1515 2623
1588B623n596o70P517j462m822M948J113p575R98N367m397j732P294n07n637M069
$$ 2623 -2973 -3643 3874 2412 -2410 2538 3651 -3924 -2926 2441 -1956 -3688 3606 3099 -2538 1531
1604A531K389p077J76O013l854l339O617M54o116L417L985o177r29O197k932m432
$$ 1531 3920 -3157 -2981 3032 -822 -4161 2456 2910 -3206 211 4196 -1981 -2910 3287 355 -4077
1620d077N833J577o362K191M749n672k351O484j147m662N395K748o566K21M589
$$ -4077 1756 3333 -3029 -838 3911 -1761 -4112 2372 1225 -3437 1958 4706 -1860 -1639 2950
1635B950n156l257O844R42m579M552L458o926j812M691l737l532P032K346n143
$$ 2950 -2206 -5463 1381 2323 -2256 2296 5754 -1172 -2984 1707 -2030 -5562 1470 3816 -1327
1650a327K741L481o905k722N914j386l506O397K663o550K36L530n829k453P352
$$ -1327 1414 4895 -2010 -4732 1182 -204 -3710 2687 5350 -1200 -964 2566 -3263 -5716 1636
1665A636P48m037M823K296p646j406M677l640k264P560J567n479K604K510p172
$$ 1636 2384 -1653 3170 5466 -2180 -3586 1091 -2549 -4813 2747 4314 -1165 1439 3949 -3223
1680c223j415O429j670l214O129J297o916J023L963n052j095P225p45n001M009
$$ -3223 -4638 1791 121 -3093 3036 4333 -2583 -1560 2403 -2649 -3744 3481 2736 -2265 1744
1695A744J393o997O05N891l129k021O305o17o448K634K865n494O56O790k509m154
$$ 1744 3137 -3860 -3255 2636 -493 -2514 3791 3174 -3274 -640 2225 -3269 -2613 4177 1668 -2486
1711b486M671j85o567K524N127l929m90O008k790n926L617J532n376K825O442
$$ -2486 2185 2000 -4567 -2043 3084 -845 -1335 4673 1883 -4043 -426 1106 -4270 -1445 4997
1726D997l647k792M683k403o357L757L849m182J787O028m149m797M194n99n593
$$ 4997 1350 -1442 3241 838 -5519 -1762 2087 -2095 -308 5720 1571 -3226 968 369 -5224
1741e224M121N295m336o81N037l801n297M779J911m760L172N055n198k975M746
$$ -5224 -1103 4192 -144 -825 4212 411 -4886 -107 1804 -2956 216 5271 73 -2902 1844
1756A844k078m838N162L615m839J049M560m928l727N386Jm781M074L587n746q33
$$ 1844 -234 -5072 90 3705 -1134 -85 4475 -453 -4180 1206 1207 -3574 500 4087 -1659 -2492
1772b492N124k901l265N922J315n739J684L066n819j499O489n87l291N153J585
$$ -2492 2632 -269 -3534 2388 3703 -2036 -352 2714 -3105 -4604 1885 1298 -1993 3160 4745
1787D745o804j21L785m246j487O989K43m841L105J610o690r3O030j870j883N986
$$ 4745 -2059 -2180 1605 -2641 -4128 2861 3104 -1737 1368 2978 -3712 -3805 2225 355 -1528 4458
1803D458k35p055Q92K352n176O20P786m17l225M291m68p901J50M123l400J04P410
$$ 4458 4223 -2832 -1940 412 -4764 -4144 3642 3225 0 4291 3823 -4078 -3928 195 -3205 -3101 4309
1820D309m61n117K842P80o580Q93O059k388j936N453j174o733J959K960m327J350
$$ 4309 3848 -1269 1573 2353 -4227 -3334 2725 337 -1599 3854 2680 -4053 -2094 866 -3461 -2111
1836b111P002j846l858L792q70p029J568M476l422M2O566j405m758L509J040o002
$$ -2111 4891 3045 -813 2979 2109 -4920 -3352 1124 -2298 -2256 4310 2905 -1853 1656 2696 -3306
1852c306J186M954l694k237N410q44n101L649L282m714N13N099l540l860M463
$$ -3306 -2120 2834 -860 -3097 2313 1469 -3632 17 3299 -1415 -902 4197 657 -3203 1260
1867A260j30n431K955M196m336m14N654k107m080M389J025n858J241L875m600
$$ 1260 1130 -4301 -1346 2850 -1486 -1900 3754 1647 -2433 1956 2981 -2877 -1636 2239 -2361
1882b361j642N976n20l877M498K501n758j16L983m217k956N469L33m444L686L459
$$ -2361 -4003 1973 1453 -2424 2074 4575 -1183 -1299 2684 -1533 -4489 980 1313 -3131 555 4014
1898D014n121n22N055k804l726M681O64n595J801L800m382q58O054r71l895M250
$$ 4014 -1107 -1629 3426 622 -3104 1577 2241 -3354 -1553 2247 -2135 -2993 3061 2090 -1805 2445
1914B445J445o204J32L901l951j991N884K36m109L762K698n511m21M562l299l355
$$ 2445 3890 -2314 -2182 1719 -2232 -4223 1661 1897 -2212 1550 4248 -1263 -1684 2878 -421 -3776
1930c776M929N34n079K554L775m355n10N552j839l944M083P12o154R30M112l679
$$ -3776 1153 1687 -3392 -838 2937 -1418 -1928 3624 1785 -2159 1924 2636 -3518 -2588 1524 -2155
1946b155j058O294k40m162L472J499o180j71M442l206k162N815L31m984K666K859
$$ -2155 -3213 3081 2841 -1321 2151 3650 -2530 -2701 1741 -1465 -3627 2188 2519 -2465 201 3060
1962C060n037k48N461k095l330M350Po168J415L981l540pO547q41m492K811K24
$$ 3060 -1977 -2225 3236 1141 -2189 2161 2168 -4000 -2585 1396 -2144 -2151 4396 3555 -937 1874 2098
1979B098o525M96M940k327p60O156m40n467K066J810n271L93N738j871k843M246
$$ 2098 -4427 -3931 1009 -1318 -2078 4078 3638 -1829 237 2047 -3224 -2831 2907 1036 -1807 2439
1995B439o04o034J985M033l353M59O020j912m887K651j5n768J824N384k372p16
$$ 2439 1835 -4199 -2214 1819 -1534 -1075 4945 3033 -1854 797 782 -4986 -3162 2222 -150 -866
2011h66N368j724n624K553J830m881J190N474k767k898M356o65n056L162L827
$$ -866 4502 2778 -2846 -293 1537 -3344 -2154 3320 553 -2345 2011 1346 -3710 -548 3279
2026C279m107j41M739l218m482L964J035m420K801M622l980j811M348k107m352
$$ 3279 -828 -969 3770 552 -3930 34 1069 -3351 -550 4072 92 -1719 2629 522 -3830
2041c830M230K481m649R72M047m190k913M937J85l658L967K958n350j191L626
$$ -3830 400 2881 -1768 -796 3251 -939 -3852 1085 1270 -2388 1579 4537 -813 -2004 1622
2056A622l356k908N666J948l984K427K839n686k265M425j350k664N409K107n257
$$ 1622 -1734 -4642 1024 2972 -1012 1415 4254 -1432 -3697 728 -622 -3286 2123 4230 -1027
2071a027L65K918m681j939N849M91l320L739J637o244q99M019k676j516O213Q69
$$ -1027 -662 2256 -2425 -4364 1485 1976 -1344 2395 4032 -2212 -3111 908 -1768 -3284 2929 3798
2087C798m930J739J899n684p81N607r98k392M814M74o053Q04L380l936n53O065
$$ 3798 -1132 607 2506 -3178 -3959 1648 650 -1742 3072 3546 -2507 -1703 1677 -2259 -2812 3253
2103C253q20m330K926R15n593J026N260k298j552M839j381n826K149K596m066
$$ 3253 2433 -1897 1029 1944 -3649 -2623 2637 339 -1213 3626 2245 -3581 -1432 1164 -2902
2118b902J219O005k053l651L213r05n647K389M583k837M1N077k708n279K802J176
$$ -2902 -1683 4322 2269 -1382 1831 926 -4721 -2332 2251 -586 -545 4532 1824 -3455 -653 523
2134E23m240K782N600k998k491L370k607n459L482L622k978J995N184l727m523
$$ 523 -3717 -935 4665 1667 -824 2546 -61 -5520 -2038 1584 -1394 601 5785 2058 -2465
2149b465K804r93m606L793M882l080j36M185l641m893L611J323l948L039M681
$$ -2465 339 -654 -5260 -1467 3415 335 199 4384 743 -4150 -539 784 -3164 -125 4556
2164D556m042k354L732k217m274M327L058l870J407M180m297l523L980n67m176
$$ 4556 514 -1840 1892 -325 -4599 -272 2786 -1084 323 4503 206 -3317 663 96 -4080
2179d080L760L553m134J1M455k986l505M261M41m922K143L533m192q38N288j257
$$ -4080 -320 3233 -901 -890 3565 579 -2926 1335 1776 -3146 -1003 2530 -1662 -2500 2788 1531
2195A531l609L796J050n473Q42M012l379j468N450n42m602K706J891m975N38N282
$$ 1531 -2078 1718 2768 -2705 -1863 2149 -1230 -2698 2752 2210 -2392 314 2205 -2770 -2232 3050
2211C050k114k409M356p70n851J668L082l763P30O271j260l724L022n37o179J180
$$ 3050 936 -1473 2883 2113 -3738 -2070 1012 -2751 -2021 4250 2990 -734 2288 1751 -4428 -3248
2227c248M321k624J1N873j215m995K347Q89n240J253N458k166j899M431j306n655
$$ -3248 1073 -1551 -1540 4333 3118 -1877 470 1359 -3881 -2628 2830 664 -1235 3196 1890 -3765
2243c765K205K841l797J141N876k074l812L162o98n680J952M284k850R5N506j798
$$ -3765 -1560 1281 -2516 -1375 4501 2427 -1385 1777 1079 -4601 -2649 1635 -1215 -1120 4386 2588
2259B588m658K890P19n186J443M826k859j680M741j050m807K850K421m390O98
$$ 2588 -2070 820 1539 -3647 -2204 2622 -237 -1917 2824 1774 -3033 -183 2238 -2152 -1454
2274a454M890k785l186M061j44m928K481L582l774k39M992k106l852L625O59n070
$$ -1454 3436 651 -2535 1526 1382 -3546 -1065 2517 -1257 -1496 3496 1390 -2462 1163 1822 -3248
2290c248J575M099l533j207N102r82m132L299J735n008O04M277l177k322M876
$$ -3248 -1673 2426 -1107 -2314 2788 1806 -2326 973 2708 -2300 -1696 2581 -596 -2918 1958
2305A958j51m552K861K782m527j81M705k409l213M203M59m933K025L631l953q64
$$ 1958 1807 -2745 116 2898 -1629 -1810 2895 486 -2727 1476 1935 -2998 -973 2658 -1295 -2159
2321b159N105j434m027L521J294n017R79M190l283j738M987n58m445K977K336
$$ -2159 2946 1512 -2515 1006 2300 -2717 -1738 2452 -831 -2569 2418 1860 -2585 392 2728
2336B728m731J64M620k660k895M356J82m702K370L327m031n29M894j983l849L673
$$ 2728 -2003 -1839 2781 121 -2774 1582 1764 -2938 -568 2759 -1272 -1801 3093 1110 -2739 934
2352I34R88m845J595M114l404j381M804j238m412L187J877m718Q06M652k944k453
$$ 934 1922 -2923 -1328 2786 -618 -1999 2805 1567 -2845 342 2219 -2499 -1693 2959 15 -2438
2368b438M505l89m653K658K880m244N0M808k450l507L979M89m844K077L868l680
$$ -2438 2067 1678 -2975 -317 2563 -1681 -1631 3177 727 -2780 1199 1688 -3156 -1079 2789 -891
2384h91r05M841j713m207L427J386m777J379M461l164j972M622q37m629K849K425
$$ -891 -1796 3045 1332 -2875 552 1938 -2839 -1460 3001 -163 -2135 2487 1650 -2979 -130 2295
2400B295m398M51M721k637k934M237J08m824K260L400l972n86M804j902l745L686
$$ 2295 -2103 -1652 3069 432 -2502 1735 1843 -2981 -721 2679 -1293 -1879 2925 1023 -2722 964
2416I64J025m779J527M037l494j499M837j098m295L160J958m674O12M447k884
$$ 964 1989 -2790 -1263 2774 -720 -2219 2618 1520 -2775 385 2343 -2331 -1719 2728 -156
2431a56k336M622k08m689K538K794m428k67M827k097l198M188O25m862J756L488
$$ -156 -2492 2130 1922 -2767 -229 2565 -1863 -2130 2697 600 -2598 1590 2215 -2647 -891 2597
2447B597l879r95M954j353l960L510J536m873R32M141l212j852M793n80m417K874
$$ 2597 -1282 -2277 2677 1324 -2636 874 2410 -2463 -1531 2610 -602 -2454 2339 1759 -2658 216
2463B16K384m565J62M564k575k914M296L31m628K269L281m037p22M607k021l745
$$ 216 2600 -1965 -1803 2761 186 -2728 1568 1899 -2729 -460 2821 -1216 -1938 2669 648 -3097
2479c097L853J346m511J560M028l578j884M361j199m132L471K444m255O24M173
$$ -3097 756 2102 -2409 -849 3179 -399 -2283 2078 879 -3253 218 2662 -1593 -969 3204
2494C204l403l001M226Q5m014L150L428m140p38L825k997l650M225J463l825K485
$$ 3204 -199 -3200 1026 1111 -2903 247 3675 -465 -1203 2622 -375 -4025 200 1663 -2162 323
2510C23L830m229k086L796j887l711M177K569l922J143L635m160k944M216k73
$$ 323 4153 -76 -2162 1634 -253 -3964 213 2782 -1140 3 3638 -522 -3466 750 477
2525D77l571L849L178m369n54L455l511l214M598J202l538K943L396m566j779
$$ 477 -3094 755 3933 -436 -990 2465 -1046 -4260 338 1540 -1998 945 4341 -225 -2004
2540b004L704k294l491M347K090l918J593L634m019k270M231r40l855L571K505
$$ -2004 1700 -594 -4085 262 2352 -1566 27 3661 -358 -2628 1603 663 -3192 379 2884
2555B884m336K80L980l069k686M326J07m167K756L106m179n36M258k435l685L798
$$ 2884 -1452 -1172 2808 -261 -2947 1379 1486 -2681 75 3181 -998 -1534 2724 289 -3396 402
2571D02R46m214K287M137l305j260M049k216m649K951J800l853J866N003k653
$$ 402 1348 -2866 -579 3558 253 -1007 3042 826 -3823 -872 928 -2925 -1059 3944 1291
2586A291k376L554j538n024K715L071l311R69M788k837l876L112j78m307K979
$$ 1291 -1085 2469 931 -4093 -1378 1693 -1618 -649 4139 1302 -2574 538 360 -3947 -968
2601i68M485k881o26L701l149m941K925J554l311K951N198k912k426L008k478
$$ -968 3517 636 10 3711 562 -4379 -1454 100 -3211 -260 4938 2026 -400 2608 130
2616A30n086L011L052k967J683M707l109l550L155o30m302L122L931l303m51L731
$$ 130 -4956 -1945 1107 -1860 -177 4530 1421 -2129 1026 396 -3906 -784 3147 -156 -607 3124
2632C124l000m054L516J316l515K773M262l651j970L373k240m284L447K414l476
$$ 3124 124 -3930 -414 902 -2613 160 4422 771 -1199 2174 -66 -4350 -903 1511 -1965
2647a965J598M302l173k533L801r32m401K771K717m033O7M381k282k758M116N08
$$ -1965 -367 3935 762 -1771 2030 1098 -3303 -532 2185 -1848 -1781 2600 318 -2440 1676 2184
2663B184m386J995L057m035j058M388j667l490L631J423m324J305L950l022j614
$$ 2184 -2202 -207 2850 -1185 -2243 2145 478 -3012 619 2042 -2282 -977 2973 -49 -1663
2678a663M273j128m450K537J885m253P21M837j897k126M010l98m966J614K516
$$ -1663 2610 1482 -2968 -431 1454 -2799 -2078 2759 862 -1264 2746 2348 -2618 -1004 1512
2693A512l870m4M888j443l025L619O04m669J403L581l190j131M294j421m085K870
$$ 1512 -2358 -2402 2486 1043 -1982 1637 2241 -2428 -1025 2556 -634 -1765 2529 1108 -2977 -107
2709a07J586m080J274M581k489k080L853r98m723K178K449l748N36M736j971k778
$$ -107 1479 -2601 -1327 3254 765 -1315 2538 1540 -3183 -1005 1444 -2304 -1768 2968 997 -1781
2725a781L654Q9m670J787L224l530p91M284j576l507L380J396m100J462L914l134
$$ -1781 1873 1962 -2708 -921 2303 -1227 -2018 2266 690 -2817 563 1959 -2141 -679 3235 101
2741A01j942L836j165m190K780K358l642Q19M307k424k679L583l27m438K163L045
$$ 101 -1841 1995 830 -3360 -580 1778 -1864 -1045 3262 838 -1841 1742 1415 -3023 -860 2185
2757B185l509l08M288j831l312L370R21m092J660L600l343j556L852j421l823
$$ 2185 -1324 -1632 2656 825 -2487 883 1804 -2288 -628 2972 -371 -1927 1925 504 -3319
2772c319L171K177l592J034L989k991k613L436o94m041K885L002l461O1L993k489
$$ -3319 -148 2029 -1563 -529 3460 469 -2144 1292 598 -3443 -558 2444 -1017 -956 3037 548
2788E48l281L431N93l817K238L358l578j235L754j831l398L632J878l742J242
$$ 548 -2733 698 1291 -2526 -288 3070 -508 -1743 2011 180 -3218 414 2292 -1450 -208
2803b08L366l518k333L710o08l272L418K520l906o5L390k978k670M050O31l476
$$ -208 3158 -360 -2693 1017 409 -2863 555 3075 -831 -896 2494 -484 -3154 896 1527 -1949
2819a949K354K608m141j083L781j648k601M080J337m172R26K696l711j493M459
$$ -1949 405 3013 -1128 -2211 1570 -78 -2679 1401 2738 -1434 -508 2188 -1523 -3016 1443
2834A443k38k811L198J400m745k41L279k593j492M802N59l731J902J651m567n74
$$ 1443 1205 -1606 1592 2992 -1753 -1994 1285 -1308 -2800 2002 2561 -1170 732 2383 -2184 -2758
2850b758M164j292j949M079M61m639R04K503l407m55M878o01l083K659M48m858
$$ -2758 1406 114 -1835 2244 2705 -1934 -1030 1473 -1934 -2389 2489 1888 -1195 1464 1912 -2946
2866b946N84L726k182p66M633m84m211J799J329m158M18M326j710k070L626k26
$$ -2946 -2362 1364 -818 -1584 3049 2565 -1646 153 1482 -2676 -2258 2068 358 -1712 1914 1688
2882A688m262J885K899l168k56M010j925l561K778Q03l615J925L905k705j490
$$ 1688 -2574 -689 2210 -958 -1214 2796 871 -2690 88 891 -2724 -799 3106 401 -1089
2897a089L381j604l919K845K197l305R32L584l020k750L330J7l002L238L044l669
$$ -1089 2292 688 -3231 -386 1811 -1494 -562 3022 2 -2748 582 599 -2403 835 3879 210
2913B10j079K530l113l209M032K007k237K684K984m282k659K402j868k675M409
$$ 210 -869 1661 -1452 -4661 -629 1378 -859 1825 4809 527 -2132 270 -1598 -4273 136
2928A36K894k968P79K318m253k808L679M62k000L852K380m507j447J993l204k010
$$ 136 3030 62 841 3159 -1094 -3902 -223 239 -1761 2091 4471 -36 -1483 510 -2694 -4704
2944d704N052K275k218K359J738n257k568K679j484j661M953K423l295P25J938
$$ -4704 348 2623 405 2764 4502 -755 -3323 -644 -2128 -3789 1164 3587 292 1017 2955
2959B955m294k100L968kk368L328J630m428m58K871k520j419M656P85l292J813
$$ 2955 -1339 -3439 529 527 -1841 1487 3117 -1311 -1769 1102 -1418 -2837 1819 2604 -688 1125
2975A125J540m452r54L558j479j992L944J048l604J453K676l382j253L557j483
$$ 1125 2665 -1787 -2741 817 -662 -2654 1290 2338 -1266 187 2863 -519 -1772 1785 302
2990C02l452K784J494l233J547L911k385j895L025j344m121K296K353k844Q23
$$ 302 -3150 -366 1128 -2105 -558 3353 968 -927 2098 754 -3367 -1071 1282 -1562 -739
3005g39L920k381k931K724j7l319K628L462k897q64K761k817l876K953J896k194
$$ -739 3181 800 -2131 593 576 -2743 -115 3347 450 -414 2347 -470 -4346 -1393 503 -1691
3021a691K681L901l121k619J957k249l723L251L130k102J437L436l285l363K461
$$ -1691 990 4891 1770 -849 1108 -1141 -4864 -1613 1517 -585 852 4288 1003 -2360 101
3036A01l38k931L092L278k983p12K581k854l198L515J736k401K391L024l728k313
$$ 101 -237 -3168 -76 3202 219 -493 2088 -766 -3964 -449 1287 -1114 1277 4301 573 -1740
3052a740K335j829k936L733K614k615J196K936l421k656L001m53l047K854K459
$$ -1740 595 -1234 -4170 -437 2177 -438 758 3694 273 -2383 618 165 -2882 -28 2431
3067B431l329j13L162k333k298L625O68l358J743K300l636j070L425j281k507
$$ 2431 -898 -1011 2151 -182 -2480 1145 1813 -1545 198 2498 -1138 -2208 1217 -64 -2571
3082b571L374J413l431R77K857l042j577L501p75l291K477J754l366N29L627k013
$$ -2571 803 2216 -1215 -238 2619 -423 -2000 1501 726 -2565 -88 1666 -1700 -1171 2456 443
3098D43j906L329l08l856J593K184l155o8L950j343k516K968M85l755J152K811
$$ 443 -1463 1866 1558 -2298 -705 1479 -1676 -1744 2206 863 -1653 1315 1800 -1955 -803 2008
3114B008k781r25L604j083l237K558J487l373R28L448k290j855L163p04l669K090
$$ 2008 -773 -1698 1906 823 -2414 144 1631 -1742 -814 2634 344 -1511 1652 948 -2721 -631
3130f31K184l041L47L698j838k505K960J56l619J592K668k890n86L520j382k906
$$ -631 1553 -1488 -1141 2557 719 -1786 1174 1330 -2289 -697 1971 -919 -1505 2015 633 -2273
3146b273K860J147l419J073L051k684j589L273p43l230K526J988l206M51L311
$$ -2273 587 1734 -1685 -612 2439 -245 -1834 1439 696 -2534 -8 1980 -1226 -775 2536
3161B536k270k258L117j3l428J919K448k982l89L421j660k665K984Q20l447J307
$$ 2536 266 -1992 1125 1112 -2316 -397 2051 -931 -1320 2101 441 -2224 760 1580 -1867 -560
3177e60K847k799j240L373r80l002K674J592l285O08L100k474j959L317k61l233
$$ -560 2287 -512 -1752 1621 641 -2361 313 1905 -1380 -772 2328 -146 -2105 1212 951 -2282
3193b282K196K278l141j46L246j942k420L082N10l339J628K653k996r06L359j292
$$ -2282 -86 2192 -949 -1095 2151 209 -2211 871 1381 -1958 -330 2323 -673 -1579 1780 488
3209D88k732K828J266l360Q45K835k664j486L436m79l035K446J768l437N5L088
$$ 488 -2244 584 1850 -1510 -665 2170 -494 -1980 1456 977 -2058 388 2156 -1281 -1226 1862
3225A862k141j927L408K87l242J738K174l302n83L426j381k358L120Q51l582R21
$$ 1862 -279 -2206 1202 1489 -1753 -15 2159 -1143 -1726 1700 319 -2039 1081 1932 -1650 -729
3241g29K513k807r71L697n48k800K508J176l781J72L064k047j330L725O8l288
$$ -729 1784 -1023 -1994 1703 1155 -1645 863 2039 -1742 -1570 1494 -553 -1883 1842 1910 -1378
3257a378J610J581l589k91L554j314j850L344M84l739Q92K229k972o00L827o89
$$ -1378 232 1813 -1776 -2067 1487 173 -1677 1667 2151 -1588 -696 1533 -1439 -2039 1788 1099
3273A099k511K641P43l920M11K899k267r50L854j98l152J911J196l737jL359j623
$$ 1099 -1412 1229 1972 -1948 -1537 1362 -905 -1855 1999 1801 -1351 560 1756 -1981 -1982 1377 -246
3290b46j506L681K27l575J271J839l343n51L610r48k087L140P44l755P07K428
$$ -246 -1752 1929 2156 -1419 -148 1691 -1652 -2203 1407 459 -1628 1512 2256 -1499 -792 1636
3306A636k858j012L791l62k633K526J230l799m7K817k229j355L864L25l044J834
$$ 1636 -1222 -2234 1557 1195 -1438 1088 2318 -1481 -1528 1289 -940 -2295 1569 1894 -1150 684
3322F84J585l808o87L184j377j694L676R36l399R61J849l509j136L574n23k025
$$ 684 2269 -1539 -2226 958 -419 -2113 1563 2499 -900 61 1910 -1599 -2735 839 316 -1709
3338a709L228J323l738Q6K235k847j369L814K55k475K520J504l976o21K696j957
$$ -1709 1519 2842 -896 -810 1425 -1422 -2791 1023 1278 -1197 1323 2827 -1149 -1770 926 -1031
3354a031j571L865Q81k946J553J716l775j119L174j104j854L625J369l404N86
$$ -1031 -2602 1263 2144 -802 751 2467 -1308 -2427 747 -357 -2211 1414 2783 -621 -35
3369c5K017l343j568L511j99k103L104J684l663k47K315k691j853L681O50k466
$$ -35 1982 -1361 -2929 582 383 -1720 1384 3068 -595 -842 1473 -1218 -3071 610 1260 -1206
3385a206K270J949l698r76K620j888j943L691J320k905J350K089l572j601L029
$$ -1206 1064 3013 -685 -1661 959 -929 -2872 819 2139 -766 584 2673 -899 -2500 529
3400E29p97k036L409J776l267K92K154l235j937L422K45k255K883K070l545o69
$$ 529 -268 -2304 1105 2881 -386 -94 2060 -1175 -3112 310 555 -1700 1183 3253 -292 -961
3416i61K377k426k092L599R24k603J967K175l567j302K850j366k193L386J490
$$ -961 1416 -1010 -3102 497 1421 -1182 785 2960 -607 -1909 941 -425 -2618 768 2258
3431B258l098Q82K269l181j649L281l43k441K915J807l415l3K570k543j954L340
$$ 2258 -840 42 2311 -870 -2519 762 419 -2022 893 2700 -715 -748 1822 -721 -2675 665
3447F65L10k738K242K210l305o15K979j800k416L025Q90l087J455K597k863j150
$$ 665 975 -1763 479 2689 -616 -1231 1748 -52 -2468 557 1447 -1640 -185 2412 -451 -1601
3463a601L178j114k791K678J483l215P30K943k456j796L055l40l016K364K089
$$ -1601 1577 463 -2328 350 1833 -1382 -652 2291 -165 -1961 1094 754 -2262 102 2191
3478B191l028JL078k184k462K890L88l025J941K721k791p39K980j621k857K689
$$ 2191 -837 -836 2242 58 -2404 486 874 -2151 -210 2511 -280 -1019 1961 340 -2517 172
3494A72J131l030J272K968k573j569L009q27k941K477J821l010M33K987k341k146
$$ 172 1303 -1727 -455 2513 -60 -1629 1380 553 -2388 89 1910 -1100 -667 2320 -21 -2167
3510b167L015P8k997K101K378l020n14K992j764k532K932Q52l047J444K670k849
$$ -2167 848 926 -2071 30 2408 -612 -1126 1866 102 -2430 502 1354 -1693 -249 2421 -428
3526d28j209L157j036k746K630J468l206O22K873k463j706L242j77k985K143J944
$$ -428 -1637 1520 484 -2262 368 1836 -1370 -748 2125 -338 -2044 1198 1021 -1964 179 2123
3542B123l219j65L097j853k090L093N05l163J548K305l081q09L267j162k513K870
$$ 2123 -1096 -1261 1836 -17 -2107 986 1491 -1672 -124 2181 -900 -1709 1558 396 -2117 753
3558G53J082l278Q71K655k627j370L326n64k855K386J613l290J77L049k068j851
$$ 753 1835 -1443 -572 2083 -544 -1914 1412 848 -2007 379 1992 -1298 -1121 1928 -140 -1991
3574a991L211J24l164J776K005l192m24L347j380k227L012P50l377J004K399k826
$$ -1991 1220 1344 -1820 -44 1961 -1231 -1655 1692 312 -1915 1097 1847 -1530 -526 1873 -953
3590i53j052L435o93k631K593J292l409M26K914k218j564L310j79l147J836J746
$$ -953 -2005 1430 737 -1894 699 1991 -1418 -992 1922 -296 -1860 1450 1271 -1876 -40 1706
3606A706l213K2L480j504j987K973K25l655J081K254k712m19L715q31k547K487
$$ 1706 -1507 -1485 1995 491 -1496 1477 1702 -1953 -872 1382 -1330 -1749 1966 1135 -1412 1075
3622A075O25l627O90K930k195j098L454o29l295J895J465l070O20L591j661j926
$$ 1075 1700 -1927 -1237 1693 -502 -1600 1854 1225 -2070 -175 1290 -1780 -1160 2431 770 -1156
3638a156K767n06l813J458K324k414K54L863j297k735K212P6l603J154L056k160
$$ -1156 1611 1105 -2708 -1250 1074 -1340 -1086 2777 1480 -1255 957 1033 -2570 -1416 1640 -520
3654e20o75L396j018l247K090J342l012Q77L306k121j916K704o53l341K043K399
$$ -520 -1195 2201 1183 -2064 26 1368 -1644 -767 2539 418 -1498 1206 553 -2788 -745 1654
3670A654k537K97L390j818k677K455J32l342J475K696k566n99L362j031k641K667
$$ 1654 -883 -586 2804 986 -1691 764 896 -2446 -971 1725 -841 -1440 1922 891 -1750 917
3686I17J098l371N36K469k632j478L433p8k496K476J685l473k84K758k043j781
$$ 917 2015 -1356 -820 1649 -983 -2461 972 894 -1602 874 2559 -914 -1198 1560 -483 -2264
3702b264L409N27l088J336J742l305n33L654o42j757L125N21m136j00J819k726
$$ -2264 1145 1672 -1416 -80 1662 -1643 -2176 1478 836 -921 2204 2725 -1411 -1511 308 -2418
3718b418m64M436N34k081K199M89m495o46K600j704o14M257N69l266R88R45l752
$$ -2418 -2882 1554 2088 7 2206 2695 -1800 -2446 154 -1550 -2164 2093 2662 -604 384 1329 -2423
3735b423j45L888m98j362L095j76m431J28J832k363L39M708P6k438J829k20m536
$$ -2423 -2568 1320 822 -540 2555 2379 -2052 -1924 -92 -2455 -2116 2592 2668 230 2059 1839 -2697
3752b697p0K894j501k25M180m9l334J268R29l491J76L572j233j680K899k69l692
$$ -2697 -2767 127 -1374 -1599 2581 2532 -802 466 1395 -2096 -1920 1652 419 -1261 1638 1369 -2323
3769b323J279K323k415P6L698j209k778K120L16l505R84K888k150q19L340o23
$$ -2323 -1044 1279 -1136 -1060 2638 1429 -1349 771 1087 -2418 -1434 1454 -696 -1515 1825 1202
3785A202k826K282J514l193J24K577k434k006L094M05k384K429K305l138q54K387
$$ 1202 -1624 658 2172 -1021 -897 1680 -754 -2760 334 739 -1645 784 3089 -49 -903 1484
3801A484k138k367L172J296k499J495K215l264j537K883p53k016L261J694l322
$$ 1484 -654 -3021 151 1447 -1052 443 2658 -606 -2143 740 -13 -2029 1232 2926 -396
3816c96j30J821l055j655L719Q27j803K704J539l960j288J999k136j527M035J452
$$ -396 -526 1295 -1760 -3415 304 1131 -672 2032 3571 -389 -1677 322 -1814 -3341 694 2146
3832B146k423J356J512l710j335K971p15j603L360J107l572J14J856k784r32L913
$$ 2146 -277 1079 2591 -1119 -2454 517 -198 -1801 1559 2666 -906 -792 1064 -1720 -2652 1261
3848A261L21k181K175Q88l983m93K575j691j009L800N20l031J311J421l320n03
$$ 1261 1582 -599 1576 2464 -1519 -2012 563 -1128 -2137 1663 2183 -848 463 1884 -1436 -1939
3864a939L259j050j903K845M20l442R21K440k344n14L432q24k879J967Q24l289
$$ -1939 1320 270 -1633 1212 1632 -1810 -889 1551 -793 -1307 2125 1301 -1578 389 1213 -2076
3880b076O74L136j764j200L027n14l298J736J739k742K43L149j650k238K510J34
$$ -2076 -1402 1734 -30 -1230 1797 1283 -2015 -279 1460 -1282 -1039 2110 460 -1778 732 866
3896H66l037J695K638k417n64K850j564k863K327J073k729J283K929k274j452
$$ 866 -2171 -476 2162 -255 -819 2031 467 -2396 -69 1004 -1725 -442 2487 213 -1239
3911a239K665r43k873K260J824k701M36K806k132k084K708N7k734J938K188k723
$$ -1239 1426 483 -2390 -130 1694 -1007 -571 2235 103 -1981 727 784 -1950 -12 2176 -547
3927e47n46K738j642k307K778R58k799J217K397k689j225K801q40k436K544J465
$$ -547 -1093 1645 3 -2304 474 1432 -1367 -150 2247 -442 -1667 1134 294 -2142 402 1867
3943A867k914M22K598k277j641K974q0k700J896J786k924j96K806j564j901K886
$$ 1867 -1047 -625 1973 -304 -1945 1029 949 -1751 145 1931 -993 -1189 1617 53 -1848 1038
3959A038N08l044J179K088k704p42L065q81k197K554R65l097N91K414k343j261
$$ 1038 1546 -1498 -319 1769 -935 -1677 1388 507 -1690 864 1829 -1268 -677 1737 -606 -1867
3975a867L055l67k615K070J524k920J19K809j796j707K839L6l001J466J980k684
$$ -1867 1188 821 -1794 276 1800 -1120 -1001 1808 12 -1695 1144 1180 -1821 -355 1625 -1059
3991a059l38L084j110k078K477N85l138Q37K273k381q71L109n56k455K228J249
$$ -1059 -1397 1687 577 -1501 976 1561 -1577 -740 1533 -848 -1719 1390 834 -1621 607 1856
4007A856l038L09K614j923j503K831k31k829J730J801k669JL054j359k013K434
$$ 1856 -1182 -873 1741 -182 -1685 1146 915 -1914 -184 1617 -1052 -1051 2003 644 -1369 1065
4023A065J09l163J052K246k210m05L227q56k433K055O80l171O60K701j844j071
$$ 1065 1174 -1989 -937 1309 -901 -1306 1921 1065 -1368 687 1367 -1804 -1144 1557 -287 -1358
4039a358K874n36k852J720J511k605M67L046j598j959K262l45l158J469K329j942
$$ -1358 1516 980 -1872 -152 1359 -1246 -779 2267 669 -1290 972 627 -2531 -1062 1267 -675
4055f75J32L166j317k629J798J77l067J149K868j709o96K815r88k896J731J170
$$ -675 -543 2623 1306 -1323 475 652 -2415 -1266 1602 -107 -803 2012 1024 -1872 -141 1029
4071A029k547Q04K951j765j760K303n58k951J769K248k104K41K890j683k476J920
$$ 1029 -1518 -714 2237 472 -1288 1015 457 -2494 -725 1523 -581 -340 2550 867 -1609 311
4087C11Q6k903J498K659j926m26K842j127k651J903P91k785P85K614j882j194
$$ 311 397 -2506 -1008 1651 -275 -701 2141 1014 -1637 266 1057 -1728 -943 1671 -211 -1405
4103a405K763m09k640J788J523k678J01K702j554j738K509Q8k855J292J949k346
$$ -1405 1358 949 -1691 97 1620 -1058 -957 1745 191 -1547 962 1050 -1805 -513 1436 -910
4119i10k56L062q98k108K063L47l260N42K278j815l97L318k56k492J533O10l297
$$ -910 -1166 1896 998 -1110 953 1300 -1960 -1418 860 -955 -1352 1966 1710 -782 751 1361 -1936
4136a936O5K755j206q86L039p2k987R78J183k679J09L278p47j622K259j08l441
$$ -1936 -1871 884 -322 -1208 1831 1759 -1228 -250 933 -1746 -1637 1641 894 -728 1531 1423 -2018
4153b018N67K046j799M6L438m13k453J447J60l393L85K774j144n36L109k77k990
$$ -2018 -1451 595 -1204 -1158 2280 1867 -586 861 1021 -2372 -1987 787 -357 -893 2216 1939 -1051
4170a051J052Q90k799K74L086r64j417K447j44l164R19J854k064j04L114p85k216
$$ -1051 1 891 -1908 -1634 1452 488 -929 1518 1374 -1790 -871 983 -1081 -1185 1929 1144 -1072
4187a072J873K81l029O75K441j702o27K918m34k542J550R29k789K17K586j467
$$ -1072 801 1082 -1947 -1272 1169 -533 -1160 1758 1324 -1218 332 1261 -1528 -1311 1275 -192
4203a92j247K711Q4k618J324J509k576l49K633j091j735K399N84k684Q60J918
$$ -192 -1439 1272 1356 -1262 62 1571 -1005 -1354 1279 188 -1547 852 1436 -1248 -388 1530
4219A530k307p83K806n38k037K066R38k836J97K157j888j061K864P8k268J607
$$ 1530 -777 -1560 1246 708 -1329 737 1675 -1161 -964 1193 -695 -1756 1108 1186 -1082 525
4235E25J232k835l56K398j259j415K693N42k514J028J556k541o56K649p10j811
$$ 525 1757 -1078 -1434 964 -295 -1710 983 1525 -989 39 1595 -946 -1602 1047 337 -1474
4251a474K271Q35k761M78J997k011r42K785k17k192J781J062k763L7K386j506
$$ -1474 797 1632 -1129 -651 1346 -665 -1607 1178 961 -1231 550 1612 -1151 -1114 1272 -234
4267b34j336K607J98k472J256J544k470l53K575j090j804K292N67k553Q51J984
$$ -234 -1570 1037 1235 -1237 19 1563 -907 -1260 1315 225 -1579 713 1280 -1273 -422 1562
4283A562k038q48K572o47k168J858J034k529M34K343j700j282K461j53k402J491
$$ 1562 -476 -1324 1248 601 -1567 291 1325 -1204 -770 1573 -127 -1409 1052 899 -1503 -12
4299a2J501k339p3K432j352j731K238L75k496J157J933k112o01K489r33k104J965
$$ -12 1489 -850 -923 1509 157 -1574 664 1039 -1457 -300 1633 -479 -1080 1409 476 -1628 337
4316C37P85k389P32K217j849j056K435m69k349J604J289k353K27K388j470j494
$$ 337 1122 -1267 -535 1682 -167 -1223 1212 743 -1606 -2 1287 -1066 -839 1549 79 -1415
4332a415K298M8k443J325J672k174l43K481j097j914K049N17k419R26K054j886
$$ -1415 883 931 -1512 -187 1485 -689 -1032 1449 352 -1562 487 1004 -1415 -489 1565 -321
4348c21p59K475o90k295J729J021k392M55K334j543j234K359j94k416J381J412
$$ -321 -1080 1395 705 -1590 139 1160 -1232 -777 1557 14 -1220 1139 945 -1471 -90 1322
4364A322k272k8K464j223j694K158L35k419J029J883k035n32K423r39k087J849
$$ 1322 -950 -978 1486 263 -1431 727 1062 -1357 -328 1555 -480 -1012 1411 472 -1615 234
4380B34P99k407P08K277j689r93K356m86k362J491J217k282K29K415j363j462
$$ 234 1033 -1374 -666 1611 -78 -1071 1285 799 -1563 -72 1145 -1137 -908 1507 144 -1318
4396a318K246O1k446J218J673k074l12K371j117j914J972O26k305R82K138j831
$$ -1318 928 989 -1457 -239 1434 -640 -952 1419 302 -1612 360 986 -1319 -337 1801 -30
4412c0r14K217p97k279J652J151k136N91K356j564j380K123k65k387J428J610
$$ -30 -944 1273 476 -1803 -151 1000 -1136 -545 1811 247 -1133 990 725 -1662 -234 1376
4428A376k070p3K267j355j795K016M36k143J263J950k001q04K071j053k142J926
$$ 1376 -694 -767 1500 145 -1650 366 802 -1341 -78 1872 -129 -933 1138 85 -2057 -131
4444a31J129j956Q36K199j826j346J991n96k274J728J529k048K11K240j506j623
$$ -131 998 -958 -122 2077 251 -1095 896 300 -1974 -246 1283 -765 -554 1686 180 -1443
4460a443K093J94k196J329J733k167n38K158j142j866K125Q51k116Q81J972j949
$$ -1443 650 844 -1352 -23 1710 -457 -995 1163 21 -1845 280 1131 -985 -104 1868 -81
4476h1j028K110p08k157J734J201k151M86K322j438j310K151k82k470J167J380
$$ -81 -1109 1001 293 -1864 -130 1071 -1080 -594 1728 290 -1020 1131 849 -1621 -454 926
4492I26k056Q0K584r76j635J995J97k588Q15J882j721l90K440q16k224J501O49
$$ 926 -1130 -1050 1534 558 -1077 918 1115 -1473 -658 1224 -497 -887 1553 737 -1487 14 663
4509F63k287Q46K547j238r26K078q51k829J034J277j779P66K891r75j603J584
$$ 663 -1624 -778 1769 531 -395 1683 832 -1997 -963 314 -1465 -699 2192 1217 -386 1198
4525A198n51k899R90J970j359J84K563j054k307J318K99k267J157K566j329p93
$$ 1198 647 -2252 -1262 708 -651 -467 2096 1042 -1265 53 352 -1915 -758 1808 479 -314
4541c14J927j164k706J300J332j642J007K668j336j662J539p23k575J380J943
$$ -314 1613 449 -2257 -957 375 -1267 -260 2408 1072 -590 949 226 -2349 -969 974
4556I74j526K04K381j274k069J641K91k218J198K045j774p90K074r27k066J886
$$ 974 -552 -348 2033 759 -1310 331 622 -1596 -398 1647 -127 -917 1157 230 -1836 50
4572E0J207k060N86K016j831j354K099k93k017J579J422k190q7K163j237j403
$$ 50 1257 -803 -217 1799 -32 -1386 713 420 -1597 -18 1404 -786 -873 1290 53 -1350
4588a350K295L48k327Q60J308k245m94K460m52j361K149N84k659J03J546j800
$$ -1350 945 1293 -1034 -174 1134 -1111 -1605 855 403 -958 1191 1775 -884 -781 765 -1035
4604a035o26K727L6j798J466O70k750j11K214j021p86K569P5k595O52J001k266
$$ -1035 -1661 1066 1102 -696 770 1440 -1310 -1421 793 -228 -1014 1555 1630 -965 -313 688 -1578
4621a578j2K819m23j293J934K8k986L43J685j542j14K789l16k089J239L95k606
$$ -1578 -1590 1229 806 -487 1447 1475 -1511 -1168 517 -1025 -1139 1650 1334 -755 484 879 -1727
4638a727M30K403j065p85K276m22k613J001J252j940L64K602j025j684J690j55
$$ -1727 -1297 1106 41 -744 1532 1110 -1503 -502 750 -1190 -826 1776 751 -933 757 602
4654F02k502J124K020j498k59K264j087k224J474O82k013R92K313j597j119J871
$$ 602 -1900 -776 1244 -254 -513 1751 664 -1560 -86 596 -1417 -425 1888 291 -828 1043
4670A043p87k220J664J555j829L44K038j675j770J845N8j866J732J868j956n59
$$ 1043 256 -1964 -300 1255 -574 -230 1808 133 -1637 208 266 -1600 132 2000 44 -515
4686e15J768j490j923K021R56j747J176J880k089j209J838p55j810K059J365k036
$$ -515 1253 -237 -2160 -139 817 -930 246 2126 37 -1172 666 -89 -1899 160 1525 -511
4702e11K53J796j835j410K165J57j758J637J352k319n01J868j321j413K362P13
$$ -511 -258 1538 -297 -1707 458 615 -1143 494 1846 -473 -974 894 -427 -1840 522 1235
4718A235j980R87J550k239q39K117p37j689K003Q58k289N06J914j656r36K345
$$ 1235 -745 242 1792 -447 -1286 831 94 -1595 408 1266 -1023 -517 1397 -259 -1195 1150
4734A150k60k096J333R68k315N5K274j083j166K241J05k341R30J444k091l10K314
$$ 1150 890 -1206 127 1095 -1220 -1165 1109 26 -1140 1101 1206 -1135 -205 1239 -852 -1162 1152
4751A152q46j711J879M98k277Q55K066j605q03K195p64k271J389Q98k047O01K442
$$ 1152 306 -1405 474 972 -1305 -450 1616 11 -792 1403 639 -1632 -243 655 -1392 -791 1651
4768A651j213j151K025l80k439J109J385j997J3K362j049j588J918L18k201J016
$$ 1651 438 -713 1312 932 -1507 -398 987 -1010 -997 1365 316 -1272 646 964 -1237 -221
4784b21J842j886o93K116r78k030J721R60j981Q37K233j552j168J925o10k322
$$ -221 1621 -265 -958 1158 180 -1850 -129 831 -1150 -313 1920 368 -800 1125 515 -1807
4800a807J389J317j970K52K367j174j444J991O9k232J087J569k046m71K191j006
$$ -1807 -418 899 -1071 -819 1548 374 -1070 921 990 -1242 -155 1414 -632 -1103 1088 82
4816H2j777K012P93k011R03J949j859j140J898p65k101J711J316j872N72K219
$$ 82 -1695 317 1110 -901 2 1951 92 -1048 850 85 -2016 -305 1011 -861 -289 1930
4832A930j529j483J858k35k178J329J548j945j40K098j172j656K035O25j987J095
$$ 1930 401 -1082 776 541 -1637 -308 1240 -705 -845 1253 81 -1575 460 1085 -902 193
4848A93J688k074j042J829q75j813K068J357j799P17J887j944j585J818l80j962
$$ 193 1881 -193 -1235 594 -281 -2094 -26 1331 -468 249 2136 192 -1393 425 45 -1917
4864a917J738J640j899L4J970j488j622K069L63j970J152J583k193p62J951q48
$$ -1917 -179 1461 -438 -404 1566 78 -1544 525 888 -1082 70 1653 -540 -1302 649 -199
4880a99j554K200J070j950O41J574k094j317K035m18j749J878J354k010J88J934
$$ -199 -1753 447 1517 -433 208 1782 -312 -1629 406 -12 -1761 117 1471 -539 -351 1583
4896A583j543j376K076rk174J232J391k055k01K353q75j509J950L73k337P06J605
$$ 1583 40 -1336 740 731 -1443 -211 1180 -875 -1076 1277 402 -1107 843 1216 -1121 -415 1190
4913A190j823n81K317n76j904J586Q88k168N84K193j409j159J924n50k387J174
$$ 1190 -633 -1214 1103 527 -1377 209 1097 -1071 -487 1706 297 -862 1062 512 -1875 -701
4929g01J391j688M77K562j093j709J499k56k474J032J942j425o7K349j029k200
$$ -701 690 -998 -521 2041 948 -761 738 482 -1992 -960 982 -443 -510 1839 810 -1390
4945a390J380N03k023J008K325j424j029J794r10k325J434J455j575P52K341j556
$$ -1390 -10 493 -1530 -522 1803 379 -650 1144 234 -2091 -657 798 -777 -25 2316 760
4961G60j784J466l83k196J447K001j488oK061j387k076J616M84j928J175K023
$$ 760 -1024 442 59 -2137 -690 1311 -177 -183 1878 491 -1585 31 515 -1413 -238 1785
4977A785j752r49J875q39j913J785J250j863N03J831j817j448J970j26j815J633
$$ 1785 33 -916 959 120 -1793 -8 1242 -621 -118 1713 -104 -1552 418 292 -1523 110
4993A10J504k020k05J877j330j498K079M91k054R93J459k087o52K210n77j496
$$ 110 1614 -406 -611 1266 -64 -1562 517 1008 -1046 -53 1406 -681 -1333 877 300 -1196
5009a196J940P57k297K95J567j785q04K411k5j781J456R16k448r9J966j124j000
$$ -1196 744 1501 -796 -501 1066 -719 -1523 888 863 -918 538 1454 -994 -1093 873 -251 -1251
5026a251K305J87k187Q49J164k147k21K407o62j401J868L50k483M76J636j607
$$ -1251 1054 1241 -946 -97 1067 -1080 -1301 1106 444 -957 911 1261 -1222 -746 890 -717
5042g17m53K434l88j873J374O79k296K99K104j234r71K148j90k178J116J213j940
$$ -717 -1170 1264 876 -997 377 1056 -1240 -941 1163 -71 -1042 1106 916 -1262 -146 1067 -873
5059h73J8K219j068j525J806K59k171R99J754j694m99K024q91j919J682Q13j956
$$ -873 -855 1364 296 -1229 577 836 -1335 -336 1418 -276 -775 1249 358 -1561 121 934 -1022
5076a022P14J939j634j092J883m46j948J582J383j865J08J855j572j499J936K42
$$ -1022 -308 1631 -3 -1095 788 342 -1606 -24 1359 -506 -398 1457 -115 -1614 322 564
5092E64j811J381J648j949n93J722j192j631J991Q79j736R07J661j972j092J814
$$ 564 -1247 134 1782 -167 -760 962 -230 -1861 130 1009 -727 180 1841 -131 -1223 591
5108E91n63j673J855J236j863K02J673j708j310J977R6j740J529J407k092l81
$$ 591 28 -1645 210 1446 -417 -215 1458 -250 -1560 417 513 -1227 302 1709 -383 -764
5124g64J762j220j449K054O32j846R32J536k032p74J922p34j621J893R38j939
$$ -764 998 -222 -1671 383 1015 -831 101 1637 -395 -1169 753 19 -1602 291 1229 -710
5140g10M71J699j685j058J980k67j829J506J202j987J8J914j286j324J957J89
$$ -710 -239 1460 -225 -1283 697 430 -1399 107 1309 -678 -660 1254 -32 -1356 601 790
5156G90j943J104J437j879l74J988r53j601J799O05j951P32J724j653q21J915
$$ 790 -1153 -49 1388 -491 -865 1123 170 -1431 368 973 -978 -246 1478 -175 -996 919
5172I19n91j830J553J015j877L81J923j423j205J829j50j939J231J384j791r3
$$ 919 328 -1502 51 1066 -811 -430 1493 70 -1135 694 544 -1395 -164 1220 -571 -664
5188f64J943j134j517J798L62j940R24J671j714o46J921p50j704J625Q63j908
$$ -664 1279 145 -1372 426 788 -1152 -228 1443 -271 -917 1004 254 -1450 175 1038 -870
5204h70N43J799j599j025J895k92j836J412J247j877N2J856j272j321J846K09
$$ -870 -327 1472 -127 -1152 743 451 -1385 27 1274 -603 -551 1305 33 -1288 558 767
5220G67j884J036J445j794m72J891q38j530J782O52j916O24J589j710q23J944
$$ 767 -1117 -81 1364 -430 -902 989 151 -1379 403 1055 -861 -237 1352 -358 -1181 763
5236G63m01j696J605R95j943J15J706j374j131J965M8j767J209J274j915l03J854
$$ 763 362 -1334 271 1266 -677 -562 1144 -230 -1361 604 652 -1115 94 1368 -547 -850 1004
5253A004j014j357J870M57j841P63J436j733o84J942n93j541J677Q43j964L41
$$ 1004 -10 -1367 503 960 -881 -118 1318 -415 -1099 843 250 -1291 386 1229 -735 -394
5269c94J631j503r97J929j17j719J386J124j905p5J759j219j265J845K81j819
$$ -394 1237 -266 -1263 666 549 -1170 216 1340 -565 -640 1119 -100 -1365 480 761 -1058
5285a058J009J416j742m63J798q47j540J680P02j860O75J621j568q91J780m49
$$ -1058 -49 1367 -375 -838 960 113 -1427 253 955 -905 -230 1391 -177 -1068 712 263
5301B63j658J495J097j772K05J744j428j276J770K8j726J301J413j706l01J661
$$ 263 -1395 100 1197 -575 -370 1374 -54 -1330 440 468 -1258 43 1456 -250 -551 1110
5317A110j133j509J705N65j696R65J603j674q17J664p18j616J613J039j698M31
$$ 1110 -23 -1532 173 738 -958 7 1610 -64 -881 783 65 -1551 62 1101 -597 -166
5333a66J586j531j161J690j34j629J472J309j776j60J605j232j331J765L75j640
$$ -166 1420 -111 -1272 418 284 -1345 127 1436 -340 -500 1105 -127 -1458 307 682 -958
5349i58J044J378j773o31J720p62j403J702P95j819N03J470j573q44J869k75j583
$$ -958 86 1464 -309 -940 780 18 -1385 317 1112 -707 -204 1266 -307 -1151 718 443 -1140
5366a140J424R27j887lJ722j174j015J860J09j812R53J097j797k13J958p05j257
$$ -1140 284 1211 -676 -679 1043 -131 -1146 714 823 -989 -36 1061 -736 -949 1009 304 -953
5383i53J619L24k053N21J450j457m33K021l98j577J228N50j937L02J825j031p88
$$ -953 666 990 -1063 -542 908 -549 -982 1039 641 -936 292 842 -1095 -793 1032 1 -787
5400g87J798k39j915Q87R97j652J53K024q12j241J511j0k001P33J454j345k67
$$ -787 1011 772 -1143 -256 741 -911 -758 1266 454 -787 724 714 -1287 -554 900 -445 -712
5417g12J966o64j564J295M25j853N86J700j280p86J752l95j726J219J041j597
$$ -712 1254 590 -974 321 746 -1107 -521 1179 -101 -887 865 470 -1256 -37 1004 -593
5433e93J81J698j179j254J595L4j700J101J362j592l65J680q68j380J619O07j686
$$ -593 -412 1286 107 -1147 448 482 -1218 -117 1245 -347 -712 968 100 -1280 339 946 -740
5450g40O33J342j678q40J722k58j249J627R70j814j5J198j500j039J893K87j277
$$ -740 -107 1235 -443 -1283 439 181 -1068 559 1529 -285 -300 898 -602 -1641 252 539 -738
5467g38J318J039j963m85J427r73j014J985N90j643O23R46j936o27J842j97r80
$$ -738 580 1619 -344 -829 598 -375 -1389 596 1186 -457 166 1112 -824 -1451 391 194 -786
5484g86J731O49k010q8J038j556o60K121L10j195J295P09k117l66J403j016q40
$$ -786 945 1594 -416 -504 534 -1022 -1682 439 749 -446 849 1558 -559 -925 478 -538 -1378
5501a378J971M17j633P37R57j774l65J856m93j108J557L69j985L21J259j391m70
$$ -1378 593 1010 -623 114 1071 -703 -1068 788 295 -813 744 1113 -872 -551 708 -683 -1153
5518a153J992j36j394J260O31j913M2J485j158r18J772Q0j531J084J140j597j48
$$ -1153 839 703 -691 569 1200 -713 -671 814 -344 -1262 510 590 -941 143 1283 -314 -462
5535d62J552j035j354J437L04j588Q81J519j366m74J610p01j474J290O74j582
$$ -462 1090 55 -1299 138 442 -1146 -265 1254 -112 -586 1024 323 -1151 139 813 -769
5551g69M43J436j368r36J603j10j377J386J151j564j45J313j329j357J565L63
$$ -769 -326 1110 -258 -1194 409 299 -1078 308 1459 -105 -250 1063 -266 -1623 -58 305
5567C05j302J244J403j559n31J376r82j423J449O60j439O71J385j450p61J623
$$ 305 -997 247 1650 91 -440 936 -46 -1469 -20 640 -799 -128 1257 -193 -954 669
5583F69l56j308J378Q75j707j7J262j282j024J751K61j248J196J072j672m19J357
$$ 669 313 -995 383 1258 -449 -466 796 -486 -1510 241 502 -746 450 1522 -150 -569 788
5600G88j017j256J608N01j450P97J297j452n72J596n41j349J324O30j727K56J420
$$ 788 -229 -1485 123 624 -826 -29 1268 -184 -756 840 299 -1050 274 904 -823 -567 853
5617H53j193p41J782K3j387J080Q47j791k10J401j028r83J695M02j443Q63J128
$$ 853 -340 -1081 701 724 -663 417 1264 -527 -737 664 -364 -1347 348 750 -693 170 1298
5634A298j571m74J527o90j288J419N55j625M63J353j290n89J771k31j402J112
$$ 1298 -273 -747 780 90 -1198 221 776 -849 -386 967 -323 -912 859 628 -774 338
5650C38O63j812k4J451j033p03J830K27j466Q28Q78j754l58J545p09j055J622
$$ 338 1001 -811 -835 616 -417 -1120 710 937 -529 299 1177 -577 -935 610 -99 -1154 468
5667D68M27j629N59J195j383m78J750l96j377J182M98j782K10J485r91n59J768
$$ 468 895 -734 -175 1020 -363 -841 909 513 -864 318 816 -966 -756 729 -262 -821 947
5684I47r0j560Q44O95j678n2J600p36r19J580J64j658P50J130j424k76J613o77
$$ 947 857 -703 141 836 -842 -894 706 -30 -949 631 795 -863 -113 1017 -407 -683 930 253
5702B53j397J234N08j564N93J551j132o49J504m71j614J065Q44j411K68J584j062
$$ 253 -1144 90 598 -966 -373 1178 46 -603 901 430 -1184 -119 725 -686 -418 1166 104
5719A04j065J382J4j500J022J220j376k18J382r90j366J382O04j356Q45J392j428
$$ 104 -961 421 435 -1065 -43 1177 -199 -417 965 -25 -1391 -9 595 -761 84 1476 48
5736D8q00J307o82j337J432R80j334L63J333j435j075J440k7j243J254J095j548
$$ 48 -752 555 -127 -1464 -32 948 -386 -23 1310 -125 -1200 240 213 -1030 224 1319 -229
5753b29k50J218j041j090J690N20j352P96J030j670o69J469n02r90J605P08j637
$$ -229 -479 739 -302 -1392 298 818 -534 262 1292 -378 -1047 422 -80 -1070 535 1243 -394
5770c94J94J064j451o79J782J9j210J152O66j810j71J409q14o78J779J49j625
$$ -394 -200 864 -587 -1266 516 535 -675 477 1143 -667 -838 571 -243 -921 858 1007 -618
5787f18N24P71j641j48J853l09r22J364J53k002K03J123j102j40K019j79j420
$$ -618 -94 677 -964 -1112 741 432 -490 874 1027 -975 -772 351 -751 -891 1128 949 -471
5804d71Q94K56j874J90J649o41m78J637k78j857N85P86j399K76K001n37j123J157
$$ -471 423 679 -1195 -1005 644 3 -475 1162 884 -973 -388 398 -1001 -725 1276 739 -384 773
5822G73k19j979N45J362r45L0J842n34j552R05K13j714M96J663q85n64J522m12
$$ 773 554 -1425 -880 482 -463 -433 1409 875 -677 228 441 -1273 -777 886 1 -563 959 547
5840E47j629R48Q63j382K45J576r83j101J289l9j541R58J268j259k12J473p93
$$ 547 -1082 -134 729 -653 -408 1168 185 -916 373 334 -1207 -249 1019 -240 -452 1021 228
5857B28j246J330M35j563N28J218j330n96J597k32j157J353P57j725q8J108j254
$$ 228 -1018 312 747 -816 -288 930 -400 -996 601 369 -788 565 1322 -403 -491 617 -637
5874f37p66J801L23j190J061Q02j821n03J308p60p92J785M90j544M08Q61j657
$$ -637 -1403 398 721 -469 592 1394 -427 -930 378 -382 -1174 611 1101 -443 -35 826 -831
5891h31m71J793q4q73J450L95j998j84R66j193l73K110L20j151R78M37k067m13
$$ -831 -1302 491 407 -466 984 1379 -619 -803 163 -1030 -1403 707 1027 -124 854 1291 -776 -1189
5909a189J346o66n37J915L20j590N06P16j651k80J765k82r58J391K16j901J55
$$ -1189 157 -509 -1046 869 1189 -401 105 821 -830 -1110 655 373 -585 806 1022 -879 -724
5926g24J167j162k37J952r5j317R83M13j923j9J459q94o16J774R9j502Q15Q55
$$ -724 443 -719 -956 996 901 -416 567 980 -943 -962 497 -397 -1013 761 860 -642 173 1028
5944A028j606j95J563p66j090J444K93j561O61J254j278m18J542n61j287J200
$$ 1028 -578 -773 790 24 -1066 378 671 -890 -229 1025 -253 -671 871 310 -977 223
5960B23N59j590L35J393j159p50J602q9j328J138Q78j599j72J311j047j038J566
$$ 223 782 -808 -473 920 -239 -989 613 524 -804 334 1212 -387 -559 752 -295 -1333 233
5977B33L66j321R41J161j536n48J372p28j219J443O27j459N28J247j344p02J568
$$ 233 599 -722 219 1380 -156 -704 668 -60 -1279 164 791 -668 -140 1107 -237 -939 629
5994F29k85j294J212Q02j640j9J324j066q44J675J98j338R59R32j653l91J422
$$ 629 344 -950 262 1064 -576 -595 729 -337 -1181 494 692 -646 313 1245 -408 -799 623
6011F23p90j019J529M60j474O52J144j419n39J559m30j246J259O02j641K26J364
$$ 623 -167 -1186 343 803 -671 -19 1125 -294 -833 726 296 -950 309 911 -730 -504 860
6028H60j099p00J698q2j447R83P37j612j32J506q17r07J567K21j515P26J034j480
$$ 860 -239 -939 759 677 -770 213 950 -662 -794 712 -105 -1012 555 776 -739 -13 1021 -459
6046d59l69J535n38j208J380M54j622M63J312j183n69J608k94j401J101O81j681
$$ -459 -828 707 169 -1039 341 795 -827 -364 948 -235 -804 804 510 -891 210 891 -790
6063g90J44J493r74p68J582M9j505Q01R21j536j88J565o81j059J444L17j575N69
$$ -790 -646 847 -127 -895 687 736 -769 32 953 -583 -771 794 113 -946 498 815 -760 -191
6081a91J171j328m70J581m22j308J211N69j620L21J424j116o93J595j09j491R48
$$ -191 980 -348 -818 763 341 -967 244 813 -807 -486 938 -178 -871 724 615 -876 72
6098G2Q21j576k3J539q47r10J473J85j549P43J061j416l41J546n56j206J311M58
$$ 72 893 -683 -706 833 -14 -924 549 734 -815 -72 989 -427 -768 778 222 -984 327 785
6116G85j534M63J320j240o17J584l34j395J114P56j572J35J469r50r14J531kj483
$$ 785 -749 -286 1034 -206 -823 761 427 -968 146 902 -670 -535 934 -16 -930 601 599 -884
6134h84Q71R73j447j85J537p66j140J384L43j524O27J228j280n25J559m88j349
$$ -884 -13 960 -487 -672 865 99 -1041 343 686 -838 -211 1017 -263 -788 771 283 -1066
6151a066J216O42j548L60J436j100p78J483j66j479R63Q91j432L7J557q67j055
$$ -1066 150 792 -756 -396 1040 -60 -838 645 479 -1000 -37 854 -578 -541 1016 149 -906
6168i06J374J62j558P54J150j304k75J531o30j330J208M81j556N48J419j080o49
$$ -906 468 630 -928 -174 976 -328 -603 928 298 -1032 176 657 -899 -351 1068 -12 -661
6185f61J495l90j526R88P87j443K66J588r12r72J383j12j603Q27J107j322o8J626
$$ -661 834 444 -1082 -94 693 -750 -484 1104 192 -780 603 491 -1112 -285 822 -500 -568 1058
6203A058p58j201J226K40j562O10J405j171m35J556n12j515J059N73j486M42J551
$$ 1058 300 -901 325 565 -997 -387 1018 -153 -588 968 456 -1059 0 573 -913 -471 1080
6220A080r71p43J459k38j636Q49R09j435R3J632p25j010J378L6j692O43J144j303
$$ 1080 109 -634 825 587 -1049 -200 709 -726 -633 999 274 -736 642 678 -1014 -371 773 -530
6238e30j79J689n00j286J137L32j654M16J415j039m66J668k81j571Q37N59j602
$$ -530 -709 980 480 -806 331 663 -991 -575 840 -199 -665 1003 722 -849 -12 547 -1055
6255a055K20J716o67p01J502j24j782N22Q39j393M2J855m26j042J224Q3j838L61
$$ -1055 -835 881 214 -487 1015 891 -891 -369 470 -923 -881 974 548 -494 730 813 -1025 -664
6273f64J258j089j85J816l67j447R06L37j703L00J637p38m96J551l05j745O08
$$ -664 594 -495 -680 1136 769 -678 228 565 -1138 -838 799 61 -435 1116 811 -934 -326
6290c26O69j420J99J848n45q61J327n5j849M55J093j213j22J780m28j260J124
$$ -326 343 -1077 -878 970 425 -436 891 836 -1013 -558 535 -678 -800 980 552 -708 416
6307D16K83j676L85J394r83n19J610k82j519R04O59j495J55J589p91q14J502r
$$ 416 699 -977 -592 802 -181 -700 910 628 -891 13 672 -823 -668 921 130 -684 818 809
6325H09j684O76Q92j423j81J676n08j001J387L59j627L47J055j331m90J652k53
$$ 809 -875 -199 693 -730 -911 765 257 -744 643 1002 -625 -278 777 -554 -1044 608 355
6342C55j176J209O45j648Q9J289j047o95J632M1j402Q54P19j598j53J503n86p93
$$ 355 -821 388 1033 -615 -526 763 -284 -979 653 694 -708 146 865 -733 -886 617 31 -762
6360g62J548K50j621M21Q64j487l50J689k49r71J351M82j710J22J107j173n41
$$ -762 786 1036 -585 -164 700 -787 -1137 552 303 -668 683 1165 -545 -423 684 -489 -1030
6377a030J651l9j287R68O20j590LJ411p65p43J548N9j546N63Q60j446j51J673
$$ -1030 621 582 -705 263 883 -707 -704 707 -58 -801 747 806 -740 -177 683 -763 -914 759
6395G59m85r77J331L00j686L31J126j238l88J636k60j223J075N88j549J77J342
$$ 759 274 -703 628 928 -758 -427 699 -539 -927 709 449 -774 301 889 -660 -483 859
6412H59r64p44J448o9j483Q74Q70j387L4J501p20r98J324J46j563N63J101j204
$$ 859 -105 -849 599 530 -953 -79 791 -596 -562 939 219 -779 545 691 -872 -309 792 -412
6430d12l27J527m25j198J176M58j515L07J273j089o47J505k33j344R92P91j413
$$ -412 -739 788 363 -835 341 799 -716 -409 864 -225 -872 633 400 -944 48 839 -574
6447e74Q9J399q81q71J318Lj424P28J040j263j66J496o17j143J210L09j483N13
$$ -574 -485 914 33 -838 480 483 -941 -213 827 -436 -602 894 277 -866 344 653 -830 -317
6465c17J184j107m47J439l63j305J060O46j411K40J320r99p72J382j04j376Q84
$$ -317 867 -240 -687 752 389 -916 144 790 -621 -381 939 -60 -832 550 446 -930 -46
6482d6R32j280o7J339p85j069J254K63j358O58J135j235l69J325n53j171J189
$$ -46 886 -394 -461 878 93 -976 278 541 -817 -159 976 -259 -628 697 144 -1027 162
6499A62O05j375L61J227j146p00J376j79j214J042Q03j400l2J219r14q89J449
$$ 162 767 -608 -247 980 -166 -866 510 331 -883 159 962 -438 -470 749 -165 -1054 395
6516C95K29j233P78R08j402l94J292o24r74J392M88j385M22J038j280n52J425
$$ 395 624 -609 169 1077 -325 -719 573 -51 -1025 367 855 -530 -108 930 -350 -902 523
6533E23k07j075J087N83j488N1J193r32n98J502P9j339P26P19j475j96J413n87
$$ 523 316 -759 328 911 -577 -526 667 -265 -863 639 718 -621 105 824 -651 -847 566 -21
6551b1q02J401K28j455M55R88j179l40J471m10j174R96M07j426L79J405q48m91
$$ -21 -823 578 806 -649 -194 794 -385 -725 746 336 -838 158 565 -861 -482 923 75 -416
6569d16J318l27j513O83P24j226K34J563o62r11J087j34j479P30J113j008j08
$$ -416 902 575 -938 -255 469 -757 -523 1040 378 -533 554 420 -1059 -329 784 -224 -332
6586c32J334p46j336R55L71j201Q14J483r29o37J014p98j491R45Q88r13N66J497
$$ -332 1002 256 -1080 -125 246 -955 -141 1342 413 -224 790 -8 -1499 -554 334 -579 -13 1484
6604A484r67j064Q73l17j326R88J202r86j7J181r85j242J094L78j055R13J245
$$ 1484 517 -547 326 9 -1317 -329 873 -113 -130 1051 66 -1176 -82 296 -759 154 1399
6621A399j159o47Q90p27j247J223Q88r41N44J217j184r91J026k97j210J051R50
$$ 1399 240 -407 483 -244 -1491 -268 620 -321 223 1440 256 -735 291 -6 -1216 -165 785
6638G85j127J8J226q37r22J254K04j247O31R03j313l95J297m48q93J239M52j327
$$ 785 -342 -324 902 65 -857 397 601 -646 -15 888 -425 -820 477 29 -864 375 827 -500
6656e00L05J054j094m81J348k49j222Q12N44j315K40J436n49n98J273k75j629
$$ -500 -195 859 -235 -716 632 383 -839 -27 517 -798 -558 878 329 -269 1004 729 -900
6673i00M03O66j138J75J739k61q31R54j27j685L02J082p98o9J552l92j349O47
$$ -900 -497 169 -969 -794 945 684 -147 807 680 -1005 -703 379 -419 -488 1064 672 -677 -30
6691c0K25j320N16J582n23m80J084n97j716N03P41r13N55J725m87r55P75l92j633
$$ -30 195 -1125 -609 973 450 -30 1054 457 -1259 -756 -15 -928 -373 1352 865 -90 685 293 -1340
6710a340N16J164p45J04J468n70j259P72K12j244O08J351q28n26J035n62j348
$$ -1340 -824 340 -405 -301 1167 597 -662 110 322 -922 -314 1037 209 -317 718 156 -1192
6727a192Q32P92r81M40J390q49r36R33k20j312P46R44r64k9J308o21r81J079K24
$$ -1192 -360 432 -549 -109 1281 432 -504 429 209 -1103 -357 587 -377 -406 902 281 -700 379 603
6746F03j272M73R48j122m52J270k90r39J113N56j272J58J010r90o66J295k3j128
$$ 603 -669 -196 752 -370 -822 448 158 -781 332 888 -384 -226 784 -206 -872 423 400 -728
6764g28Q13O45j243n3J236n65o98J257J32j366L60P10j194k23J482j82q03J088
$$ -728 85 730 -513 -566 670 105 -593 664 796 -570 -210 500 -694 -917 565 383 -420 668
6782F68K50j469J13Q91r59l66J456p2j049P90M63j365P8J230o49o05J233n5j377
$$ 668 918 -551 -438 453 -506 -872 584 512 -537 253 716 -649 -571 659 10 -595 638 583 -794
6801g94N32P32j127k4J492m29q40R84J27j427L30R67r25k29J386k89j054Q27L96
$$ -794 -262 470 -657 -681 811 382 -458 526 653 -774 -444 523 -402 -631 755 466 -588 239 635
6820F35j266K06J163p70n94J175j48j204P11P36j083L8J285o50r03J016O5j264
$$ 635 -631 -425 738 -32 -626 549 401 -803 -92 644 -439 -401 884 234 -669 347 412 -852
6838h52N69R79r88k27J259m53j050R58L69j203L53J063r05n49J201k16j108Q58
$$ -852 -283 696 -292 -519 740 287 -763 195 564 -639 -286 777 -128 -677 524 308 -800 58
6856E8O64j162J01J131q09p48J140M6j179O73Q71j049j85J181n78r40J059K61
$$ 58 722 -440 -339 792 -17 -765 375 421 -758 -85 786 -263 -448 733 155 -785 274 535
6874E35j220N13R79j011m03J238l45j054Q93N47j175J73J114q62o52J172n6j105
$$ 535 -685 -172 807 -204 -607 631 286 -768 125 672 -503 -330 784 -78 -730 442 386 -719
6892g19P20P58j148p3J128o60q32J113K01j125O06Q61j050l70J140m09r79R97
$$ -719 1 759 -389 -462 666 6 -826 287 488 -637 -31 830 -220 -590 550 141 -838 159
6910A59M77j148L13R88r29n78J152j05j048Q47O64j172%J042p72o91J178J54j077
$$ 159 636 -512 -199 789 -140 -718 434 329 -719 128 792 -380 -380 662 -110 -801 377 531 -546
6929e46O52P19j159k78J069m93q14J174M03j147L64Q76j096n01J172k31r19R79
$$ -546 106 825 -334 -612 457 -36 -850 324 727 -420 -56 820 -276 -777 395 164 -755 224
6947B24N21j192R4J029q61o35J219N4j032O97O78j251j07J089n95p24J180K65
$$ 224 745 -447 -353 676 -185 -820 399 453 -579 118 796 -455 -562 527 -68 -792 388 653
6965F53j115M49Q00j074l90J140l80r06J027N06j159K98R84r06o01J117j93j062
$$ 653 -462 -13 787 -287 -677 463 83 -823 204 710 -449 -151 833 -73 -674 443 250 -812
6983h12Q28O84j072O3J073p28q23J078R6j095O98Q75j033k87J042o19r49J012
$$ -812 16 700 -372 -309 764 36 -787 291 387 -708 -10 865 -168 -455 587 -32 -981 31
7001C1M25r79N36J001j009o04R76m10j028R77P54r07K56R98r56q24R57j16r76
$$ 31 456 -523 13 1014 5 -599 377 -33 -1061 -84 670 -237 19 1017 61 -763 194 78 -898
7020h98Q64R36r70j10R63q22r58J026L17r49P12R62j034m87R01n60r99J042O67
$$ -898 -34 902 -68 -178 785 -37 -995 31 348 -601 111 1073 39 -448 453 -107 -1106 -64 603
7039F03r23L91R92j020p58R54k80r88R82Q27r43P5J006q77r10R81O6r85P64R22
$$ 603 -320 71 1063 43 -715 239 -41 -1029 -47 780 -163 -88 918 41 -869 112 178 -807 -43 879
7059H79r59k47J005o56r85R70M49r98N04J045r42n84J006m20j064Q90O74r32K62
$$ 879 -80 -327 678 22 -963 7 456 -542 -38 1007 65 -519 487 67 -997 -107 567 -365 -103
7078a03J097q48p57R55j74j118P62R07r57M8J113p15r82R08J18j112O27J024q45
$$ -103 994 146 -611 344 170 -948 -186 721 -236 -188 925 210 -772 136 254 -858 -231 793 -52
7097e2k84J051n16j100Q15M66j000M32J151p99o29R73l13j194P93P43r29J49J213
$$ -52 -336 715 199 -901 -86 380 -620 -188 963 164 -465 508 195 -999 -206 537 -392 -243 970
7116I70p21q65R34l1j189O31R83q81j18J144n47j064Q64K86j146M78J079q15m38
$$ 970 249 -616 318 287 -902 -271 712 -169 -287 857 310 -754 110 396 -750 -272 807 -8 -446
7135d46J123l97j130P64N59j027K55J143p20o65J019j40j231O75P90r70K4J195
$$ -446 677 280 -850 -86 473 -554 -299 844 124 -541 478 338 -893 -218 572 -398 -374 821
7153H21n90q67R21J35j233M84J024q76k61J173m04j053Q27M01j148K91J115p51
$$ 821 231 -636 285 420 -813 -329 695 -181 -442 731 327 -726 101 502 -646 -355 760 9
7171In10J088j92j153O78O68j067Q7J185o17p67R94K8j189N55Q66r73j58J145
$$ 9 -501 587 395 -758 -80 588 -479 -392 793 176 -591 403 431 -758 -203 663 -310 -468 677
7190F77m53r02R01K86j151L67R95q66m04J113k56j056P85N74j123J61J092p42
$$ 677 224 -678 223 509 -642 -275 720 -146 -550 563 307 -749 36 610 -513 -352 740 -2
7208bo74J091k2j110O23Q12j070j04J144n39q46J026K09j130M10Q93r59l57J181
$$ -2 -676 415 393 -717 -94 718 -352 -456 688 149 -697 329 538 -592 -182 711 -248 -605 576
7227E76l24r34Q90M80j152J91J023q44o06J139j04j045P49O77j071n1J047n98
$$ 576 252 -682 208 688 -464 -273 750 -94 -700 439 335 -710 39 716 -355 -406 641 43
7245D3p53J054J33j147N42Q28j018k49J159m19q83R87L79j163K85R10r27m69J154
$$ 43 -710 344 477 -670 -128 700 -318 -567 592 173 -710 277 656 -507 -222 688 -239 -708 446
7264D46j74r87Q96N77j143P8J025p63o71J080M6j077O71P32j078j45J137n31q11
$$ 446 272 -715 181 758 -385 -307 718 -45 -716 364 410 -667 4 736 -342 -487 650 119 -692
7283f92J042K46j161L54Q88r97l66J175k27q77R30M18j217J21R45q16n37J171
$$ -692 350 596 -565 -211 677 -320 -686 489 262 -615 315 733 -484 -363 582 -234 -771 400
7301D00j8r91P01O17j118k5J068o01p30J090J29j171M56P87r81k09J260l37q58
$$ 400 382 -609 92 709 -409 -434 634 33 -697 393 522 -649 -193 594 -387 -596 664 327 -531
7320e31R15K85j269K07R55q54l88J235q5j003P57M99j195QJ077o96o14J121Pj128
$$ -531 384 669 -600 -393 562 -292 -680 555 470 -533 224 723 -472 -464 613 -83 -697 424 431 -697
7340f97O06Q02j055q9J178n25q71R12J96j194M23R59r01l52J186k53r77R02M70
$$ -697 -91 711 -344 -433 745 220 -651 261 457 -737 -314 645 -256 -608 578 325 -652 250 720
7359G20j165J44R68q87o14J129qr68Q75P57j094j48R48p68q87J092L16r93O80
$$ 720 -445 -301 667 -220 -834 295 287 -681 194 951 -143 -291 657 -111 -998 94 410 -583 97
7378I7Q78j080m22J005m50q69J099N33j116J98Q23j083o34J215J1p16J008O57
$$ 97 975 -105 -527 478 28 -841 258 791 -325 -127 696 -387 -1021 194 205 -511 497 1154
7396A154j287k24P88r15p15J289M08q46P29P42j311m58R32n26o99J232M90j075
$$ 1154 -133 -357 431 -484 -1199 90 498 -348 381 1123 -188 -646 286 -240 -939 293 783 -292
7414b92K85P17j153m69J268o3p54J013M48j333j13P81q53m85J378K03q75P28N59
$$ -292 -7 710 -443 -912 356 293 -461 552 1000 -333 -446 335 -518 -1003 375 578 -297 431 990
7433I90j318k58R69n69o68J180K45j101M59Q05r94k87J187l64r76Q73L10j172
$$ 990 -328 -586 383 -186 -854 326 571 -530 -71 734 -260 -547 640 276 -700 173 483 -689
7451f89L11J047q06m36J160j84j068P24N96j062N9J092p71q02R97L4r79P55J003
$$ -689 -378 669 -137 -573 587 403 -665 59 655 -407 -348 744 -27 -829 168 202 -777 -22 981
7470I81r08k23R59p71j098Q54L77q71O92J144q58n56Q10n30j082R21P12q71L06
$$ 981 73 -150 809 38 -1060 -206 171 -700 -8 1136 278 -278 532 2 -1080 -159 553 -318 -12
7489a2J013r42q96R03m1q56R65R38r63k39P80q99r99J036M48p37P58J009j099
$$ -12 1001 59 -837 66 25 -831 134 1072 109 -130 650 -249 -1248 -212 236 -501 257 1266 167
7508A67o12P97n41r16J072O69r15L22Q76j019p12J045o0q36R33O53j124j66Q85
$$ 167 -445 352 -189 -1105 -33 636 -279 43 919 -100 -812 233 173 -663 270 923 -201 -367 518
7527E18p77o80J182L25r36N90O97j219l51J042m25p46J057L46j108L21Q38r20
$$ 518 -259 -939 243 568 -368 222 919 -300 -651 391 -34 -780 277 623 -485 -164 674 -246
7545b46l69J154j71r26P24L75j205J31J043n96m70J172l4j170N11N61j048lJ222
$$ -246 -615 539 368 -558 166 541 -664 -533 510 -86 -556 616 582 -588 -77 484 -564 -567 655
7564F55m25p12R01P7j231M23Q84q05j79J209l82j073P20L15j110L58J148o63m49
$$ 655 230 -482 419 496 -735 -312 572 -233 -412 797 415 -658 62 377 -733 -375 773 110 -339
7583c39R96k54j201O19O19r71J72J203o03p83Q63Nj131N87Q86q69j15J022n27
$$ -339 657 403 -798 -179 440 -531 -359 844 241 -542 321 326 -805 -218 668 -201 -316 706 179
7602A79r59Q56L32j041M73R94q79m82R65k76r70Q08O25r59J62R70q04p09R76L1
$$ 179 -780 76 408 -633 -160 834 -45 -527 438 162 -808 0 625 -334 -172 798 -6 -715 261 292
7622B92r62O90P31r90j23R54n97p51J005L11j010M20P72j008l90J096k96p62Q97
$$ 292 -670 20 751 -239 -362 592 -5 -756 249 560 -450 -30 742 -266 -656 440 144 -618 279
7641B79M59j079J18Q55r00n36J118j7r01P67N94j081q9R88o52o49J078J41j028
$$ 279 738 -341 -223 632 -268 -804 314 297 -604 163 757 -324 -413 575 -77 -726 352 493 -535
7660e35M65O92r82k12J093l20p68R32K96j165K20Q31q77l46J147r2q92P84M93
$$ -535 -70 622 -360 -572 521 201 -567 365 661 -504 -284 547 -330 -676 471 379 -513 271 764
7679G64j137rR54o89o06J079K8r84N75O92r91q9J029m60p48R19J76j119L35Q05
$$ 764 -373 -382 572 -117 -723 356 384 -600 -25 667 -324 -413 616 156 -592 327 503 -616 -281 524
7699E24q54k34J134k18q79Q07L60j153P6R02p25m06J129m8r35O61N33j049m8R96
$$ 524 -330 -564 570 352 -527 280 640 -513 -437 465 -260 -666 463 415 -520 141 674 -375 -423 573
7719E73n29o82R90J10j103M65P41r06j13J136l10q33P93J97j203K03Q85o97k58
$$ 573 44 -638 352 462 -641 -176 565 -341 -454 682 372 -461 332 529 -674 -471 414 -283 -541
7738e41J135j08q98O15L92j118N1R69o10n06J032J3j017M99O74q92r6J039m63
$$ -541 594 486 -412 203 595 -523 -472 497 -113 -619 413 426 -591 -92 582 -310 -406 633 170
7757A70p56Q31J55j111L77Q81p47k02J064k47q96P05L46j110J15R10p02m05J055
$$ 170 -586 245 400 -711 -334 547 -200 -402 662 415 -481 224 570 -540 -425 485 -217 -622 433
7776D33pq90O42N73j016j18Q86o07o29R58K17r05M61P36r48k89R63l39p65Q86
$$ 433 426 -464 178 751 -265 -383 503 -104 -733 225 442 -463 -2 734 -214 -503 460 121 -644 242
7796B42L92j055J53P48q23l95J100Pp17P62M23j167j83P63o73m53J185K79p91
$$ 242 634 -421 -268 480 -343 -738 362 369 -348 414 837 -330 -513 250 -423 -876 309 588 -203
7815b03N22M94j116l73R25l80n43J061L45r95K04N87r27l41J102m8o37P87K99
$$ -203 319 813 -303 -676 249 -131 -674 387 732 -263 -59 528 -399 -740 362 314 -323 464 763
7834G63j186p8P40o42l23J192J72q32N23L82j160k09Q93m23m75J047K32r74L42
$$ 763 -423 -501 239 -403 -726 466 638 -194 329 711 -449 -658 235 -188 -663 384 616 -358 -16
7853a6N69r13k28R92k25o94P80K91j033J64Q01o92l32J044j12q80O12M47r96J
$$ -16 553 -360 -588 404 179 -515 265 556 -477 -313 488 -204 -536 508 396 -484 128 575 -421 -420
7873d20Q93n49n47R49R3q74N14O55q59k43Q82n04p52Q40L20q37L96Q11p98m20
$$ -420 473 -76 -623 326 419 -455 59 714 -145 -388 494 -10 -762 78 398 -439 -43 768 -30 -450
7893d50Q33l06q18P81N09q59J53Q21p45n95R08m6p76O84O70r03j67P73n97o86
$$ -450 383 77 -741 40 549 -310 -157 664 -81 -676 232 186 -590 94 764 -139 -306 467 -130 -816
7913h16R08L13p88M92P33r34l93P92l53p14Q50M89q49K27P39p80n06R06r2p67
$$ -816 92 405 -383 109 842 -92 -485 307 -46 -760 90 579 -270 -43 696 -84 -590 316 224 -543
7933e43O97N26r10r4P84n78n48R35J38q22M63O04r05k31Q38l18o44Q44K86r47
$$ -543 154 680 -230 -324 460 -118 -666 269 407 -415 48 652 -253 -484 354 36 -608 236 522 -425
7953d25K87P09p43l33R15j75p90O73L47r22J12Q53n61m36R66p1r06M69M96q64
$$ -425 -138 571 -172 -505 410 235 -555 118 465 -457 -345 508 -53 -489 477 406 -500 -31 465 -399
7973c99n6R65l95n66P89P6r15L24P15p25k15R39k66p88O79K47r13K34Q17n79l75
$$ -399 -455 510 115 -451 338 414 -501 -177 538 -187 -402 537 271 -517 162 409 -504 -270 547 -32 -407
7994d07Q90j55q67N18M62q81N2R24m54n53Q31K8r35M29O35p93j39R08l35o97P21
$$ -407 483 328 -539 -21 441 -440 -388 536 82 -471 360 388 -547 -118 517 -276 -415 493 158 -539 182
8015A82K41q94K67P23o71k92Q79j75p74O25M07q87P7P93n11m81Q69J1q61M52N53
$$ 182 423 -471 -204 519 -152 -444 435 260 -514 111 518 -369 -292 501 -10 -491 378 389 -472 -20 533
8036E33q67q8Q54l88n65P96J90q65L03O07p51k60Q81j86p06O88L12q94J23P66
$$ 533 -334 -422 432 44 -521 275 465 -400 -97 510 -241 -501 380 194 -512 176 488 -406 -283 483
8056D83o00l80Q75o1p58N10M31q78l4Q51m53m81Q25J04q56L80N47p83j89Q99k90
$$ 483 -117 -497 378 317 -441 69 500 -378 -412 439 -14 -495 330 434 -422 -42 505 -278 -467 432 142
8077A42o07P24K44q82J69P08o48l26Q87j57p37N69L69q67R1Q12m92m49Q23K5q59
$$ 142 -465 259 503 -379 -210 498 -150 -476 411 254 -483 86 455 -412 -321 491 -1 -450 373 398 -461
8098d61L98M83p63r1Q82l42n73P41J40q43K52O55o83k39Q95k40p33O12L27q30
$$ -461 -63 420 -343 -434 448 106 -467 274 414 -429 -177 478 -205 -444 451 211 -522 90 417 -413
8118d13J82P63n46l83P85r2q18M50M93p61K4Q15l91n00P33L5q53L74N56o73j91
$$ -413 -231 532 -14 -397 388 296 -522 -72 421 -340 -316 499 108 -392 341 376 -477 -103 453 -220 -411
8139d11Q65l03o46O81K40q21K30O72o26l29Q23j58p49N50M10q10O7Q05m72m43
$$ -411 454 151 -495 186 426 -395 -165 507 -119 -448 375 217 -532 18 428 -382 -315 490 18 -425
8159d25P87jq06L48M94p57r8Q66k84m94P37J58q78J70N68o75k14Q94j27o30O08
$$ -425 362 361 -445 -97 397 -360 -458 408 124 -370 367 525 -353 -183 385 -290 -504 390 263 -367 241
8180B41K36q53K8P44m96l17Q86j0q45M05L37
$$ 241 477 -376 -348 396 -100 -417 469 459 -386 19 356
8191C56
$$ Imaginary data points
##PAGE= N=2
##DATA TABLE= (X++(I..I)), XYDATA
0@%%%%%%%%%%%%%%%%%%%%%jKkRj6J6j7J8j8J8k0K8l5L6l7M5n3N5o3P1p9Q8r7J08
$$ 0 0 0 0 0 0 0 0 0 0 0 0 0 0 0 0 0 0 0 0 0 0 -1 1 -1 8 -8 8 -9 9 -9 9 -11 17 -18 18 -19 26 -27 28 -35 36 -43 45 -52 56
45E6j18J32j45J59j75J92k12K35k60K86l16L50l88M33m85N45o19P10q25R76j186
$$ 56 -62 70 -75 84 -91 101 -111 124 -136 150 -166 184 -204 229 -256 289 -330 380 -445 531 -655
66f55J500k018L095r494J6744J3341m094J1157k4858k9459J5707Q560k9830J6693
$$ -655 845 -1173 1922 -7572 9172 22513 18419 29576 4718 -24741 -9034 -474 -30304 -13611
80a3611M8643j2921l6649J6359R220k9277m79K6155n3K014J1739k1289k0863J9950
$$ -13611 35032 22111 -14538 1821 11041 -18236 -18715 7440 7387 9401 21140 -149 -21012 -1062
94a062j096k8946K2229M3029j7807k4406K1549J337l2148k46J5399o219O883J5512
$$ -1062 -2158 -31104 -8875 34154 16347 -8059 13490 14827 -17321 -17567 -2168 -8387 -1504 14008
108A4008j5626n998K5449q068l0755J9430K5450k8704j6712K6917J216k0655J1426
$$ 14008 -1618 -7616 17833 9765 -20990 -1560 23890 -4814 -21526 5391 6607 -14048 -2622
121b622J2530j0285O147O852k2375j735K5717j1974k3296K5535J6855l1935q033
$$ -2622 9908 -377 5770 12622 -9753 -11488 14229 2255 -21041 4494 21349 -10586 -18619
134a8619K6329m072j3485J7580O866j3093N509k067k6818L928K5895j1848j0292
$$ -18619 7710 3638 -9847 7733 14599 1506 7015 4948 -21870 -17942 7953 -3895 -14187
147a4187L3454R794l3530m849J6017j5460j0718K0097N207n544J3525l670k5228
$$ -14187 19267 29061 -4469 -9318 6699 -8761 -19479 618 5825 281 13806 10136 -15092
160a5092P419J7334j9314m992L3676K198k9534L096J1376j9082n070K0021J691
$$ -15092 -7673 9661 -9653 -14645 19031 21229 -8305 -5209 6167 -12915 -17985 2036 3727
173C727q42J6480p475k3330R332Q034k4853N49L3158k054k1051J2790Q844k0856
$$ 3727 2885 19365 11890 -11440 -2108 5926 -18927 -18378 14780 12726 -8325 4465 13309 -7547
187g547k559J3812o581j50J6326r786j6374J6296M762k4865O219K8358j0315j7395
$$ -7547 -10106 3706 -2875 -3025 13301 3515 -12859 3437 8199 -16666 -10447 17911 7596 -9799
201i799J6191L703k0251K609J0579r566L965J5626j2591j0500J9631j008k4516
$$ -9799 6392 10095 -10156 -7547 3032 -6534 -2569 13057 466 -10034 9597 8589 -15927
214a5927J0415K1757j6395j1882J8321m74j6185Q396P343j0675P102J1367j6909
$$ -15927 -5512 16245 -150 -12032 6289 5815 -10370 -1974 5369 -5306 1796 13163 -3746
227c746o190J9596o374k0797J5848J6915j7924n077J7581n925j3413J0234K120
$$ -3746 -9936 9660 3286 -17511 -1663 15252 -2672 -7749 9832 3907 -9506 728 2848
240B848j0826J0433Q235j7416K2J8939j1130j6847J8380J0212j9038O93J5712
$$ 2848 -7978 2455 10690 -6726 -6704 12235 1105 -15742 2638 12850 -6188 -5495 10217
253A0217r863r109J1976k206r524J3285M515j7400N128J6184j5747j2362J9946
$$ 10217 354 -8755 3221 1015 -8509 4776 9291 -8109 -2981 13203 -2544 -14906 5040
266E040L795j8055O876J3582j2264m506J1658p272q064J4479O1j5821J0607J3321
$$ 5040 8835 -9220 -2344 11238 -1026 -5532 6126 -1146 -9210 5269 5330 -10491 116 13437
280A3437j8126o510J9974k755j6558J0808R480j3749j0J0321j0214m274J5247
$$ 13437 -4689 -11199 8775 6020 -10538 270 9750 -3999 -4009 6312 -3902 -8176 7071
293G071l928j2914J4433Q575j9872j929J7508q374j3185J4126O213j2163M792
$$ 7071 3143 -9771 4662 13237 -6635 -8564 8944 570 -12615 1511 7724 -4439 353
306C53Q057j2213j189J2875r012j0216J6695M224j8782M033J5581j1553q842J5053
$$ 353 8410 -3803 -4992 7883 -1129 -11345 5350 9574 -9208 -5175 10406 -1147 -9989 5064
320E064J242j1358P571M355j3455K594J1085j2138n701J8743L0j6853Q883J2021
$$ 5064 6306 -5052 2519 6874 -6581 -3987 7098 -5040 -10741 8002 8032 -8821 62 12083
334A2083j4817n307J3630m443r644J0612J840j1698Q375R874j4218k287J6755
$$ 12083 -2734 -8041 5589 1146 -8498 2114 3954 -7744 631 10505 -3713 -6000 10755
347A0755p063j6207J1800Q323j4438J494J4055p333o659J0920l471j1511J0997
$$ 10755 3692 -12515 -715 7608 -6830 -5336 8719 1386 -5273 5647 2176 -9335 1662
360A662O812j4374K564J4942j1484j3128J3403L964j2813P415J3089r095m010
$$ 1662 8474 -5900 -3336 11606 122 -13006 397 4361 -8452 -1037 12052 2957 -1053
373a053Q413r678j1363J1988M183j0935J0014J4920j3145r862J1200m179j4238
$$ -1053 7360 -2318 -13681 -1693 2490 -8445 1569 16489 3344 -6518 4682 503 -13735
386a3735R702J1020p908K446R562j1631r145J0934j916j0765J3677J2829j3478
$$ -13735 -4033 6987 -921 1525 11087 -544 -9689 1245 -671 -11436 2241 15070 1592
399A592m326J0899r736j3968J0838P189p095Q541J0610j1975n742Q651r499j2191
$$ 1592 -2734 8165 -1571 -15539 -4701 2488 -4607 3934 14544 2569 -3173 5478 -4021 -16212
413a6212J4592R379j1686M189J3544j1067j1335R408p43r876R850Q558j0348J414
$$ -16212 -1620 7759 -3927 262 13806 2739 -8596 812 69 -9807 43 8601 -1747 -333
427c33J0259j1882j0209J3688K437j2645Q423J2948j0688n759R534o099j0674
$$ -333 9926 -1956 -12165 1523 3960 -8685 -262 12686 1998 -3761 5773 -326 -11000
440a1000R322L917r336P920J1777j1250n763J2048n442j5014Q584R287r531K147
$$ -11000 -1678 2239 -7097 823 12600 1350 -4413 7635 2193 -12821 -4237 5050 -4481 -2334
454b334J2711o485p887Q160l509j2255Q917R514j0152J362J4179p975j3447Q428
$$ -2334 10377 3892 -3995 4165 656 -11599 -2682 6832 -3320 -1958 12221 4246 -9201 -773
468g73K702j1711N915J2978o307k596R383p942j3231Q401M430j0764P166J5875
$$ -773 1929 -9782 -3867 9111 2804 208 9591 1649 -11582 -3181 1249 -9515 -2349 13526
482A3526p900q576R214l887j4749O182R316o985L556J2515p916r711Q482k338
$$ 13526 5626 -2950 6264 2377 -12372 -6190 3126 -3859 -303 12212 4296 -5415 3067 729
496G29j3519Q240J2841q325j810J2319n879j3183O443L241r687N936J1962p358
$$ 729 -12790 -4550 8291 -34 -1844 10475 4596 -8587 -2144 1097 -8590 -2654 9308 1950
510A950l680J0230o141j3672Q172P093j0371K892J3964n850q520Q086j658j1883
$$ 1950 -1730 8500 2359 -11313 -3141 3952 -6419 -3527 10437 4587 -3933 4153 2495 -9388
524i388N877P980q373J697J2533o797j0275R234J327j3304M396J1999o838l303
$$ -9388 -3511 4469 -3904 -2207 10326 3529 -6746 2488 3815 -9489 -5093 6906 68 -3235
538c235J0830l543j0676O682K950j0919M359J2034p753n527J1673k097j3502N747
$$ -3235 7595 4052 -6624 58 3008 -7911 -3552 8482 729 -4798 6875 4778 -8724 -2977
552b977P893r370K60J1765m852p197Q806q79j2031N991Q998r785j431J2983m163
$$ -2977 4916 -4454 -4194 7571 2719 -4478 4328 3449 -8582 -2591 6407 -3378 -4809 8174 4011
567D011j0857P953L769j1280K538R959o938l507J0619l034j0339P954N155j1591
$$ 4011 -6846 1107 4876 -6404 -3866 6093 -845 -4352 6267 3233 -7106 848 6003 -5588
581e588J154J1716o461p294J0178Q75j0696N021P072r230j039J0346n225p487
$$ -5588 -4434 7282 821 -6473 3705 4580 -6116 -1095 5977 -3253 -4292 6054 829 -6658
595f658J0103K182j1651L830R199r080m252J1063j784r002P631M388j0464J391
$$ -6658 3445 5627 -6024 -2194 7005 -2075 -6327 4736 2952 -6050 1581 5969 -4495 -3104
609c104Q979p631m752J1343o54j0391O929O571j1130j547J0630m800o952R743
$$ -3104 5875 -1756 -6508 4835 4181 -6210 719 7290 -3840 -5387 5243 443 -6509 3234
623C234J918j0129M369O938r828k145J1156l899q552R534M009j1482J801R468
$$ 3234 5152 -4977 -608 6330 -3498 -5643 5513 1614 -6938 2596 6605 -4877 -3076 6392
637F392p476m889J0109j189q902O998M696j0460J045J0246o691o416J0591R12
$$ 6392 -1084 -5973 4136 2947 -5955 1043 5739 -4721 -3676 6570 -121 -6537 4054 4966
651D966j0858M683P463q977k142R782l886p021Q756K083j0196L979Q443q979m094
$$ 4966 -5892 -1209 6254 -2723 -4865 4917 1031 -5990 2766 4849 -5347 -1368 7075 -1904 -5998
666e998J0608k125r323P305N264r357J189Q852o609n125R352j249r719O613O373
$$ -5998 4610 2485 -6838 467 5731 -3626 -2437 6415 -194 -5319 4033 2784 -6935 -322 6051
681F051r918n30J0702m785p390Q840J887r919L845P091q731k380J0029l649p877
$$ 6051 -3867 -4397 6305 1520 -5870 2970 4857 -5062 -1217 5874 -2857 -5237 4792 1143 -6734
696f734Q978L848j0468K395R071p775n400R427j214q968O823N692q985Q89R453
$$ -6734 2244 6092 -4376 -1981 7090 -685 -6085 3342 2128 -6840 -17 5675 -3310 -2421 7032
711G032o442o499R183K98j0132N225P447q861k146R804l615p253Q430L138r190
$$ 7032 590 -5909 3274 3572 -6560 -1335 6112 -2749 -4895 4909 1294 -5959 2471 5609 -3581
726c581L143P157q931m529R213k167p736Q821O299q911M95P779p753o918Q354
$$ -3581 -438 6719 -2212 -6741 2472 305 -7431 1390 7689 -1222 -727 7052 -701 -7619 735
741G35M64p377P248O657r289j499Q311o118p005J0021L589q724L681O394j0050
$$ 735 1199 -6178 1070 7727 -1562 -3061 5250 -868 -7873 2148 5737 -2987 694 7088 -2962
756b962m853Q562k007n122J0699N314r539P43N492j0725o683J0248J608n864Q839
$$ -2962 -7815 747 -1260 -6382 4317 9631 92 835 6327 -4398 -11081 -833 775 -5089 3750
771C750O548j0079k529O128p144n519J0753K818p847N225N403j1216l951R450
$$ 3750 10298 219 -2310 3818 -3326 -8845 1908 4726 -3121 2104 7507 -3709 -7660 1790
785A790k129m950J0243M154r843L13M295r923l966J0846O52n288R049M754j0958
$$ 1790 -339 -5289 4954 9108 -735 -422 3873 -6050 -10016 830 1482 -3806 5243 9997 -961
800i61j586O699p101n431R735J498p597N596N591q941r29R201m538o652Q210J429
$$ -961 -2547 4152 -2949 -8380 1355 2853 -4744 852 6443 -2498 -3427 5774 1236 -5416 2794 4223
816D223r975L226P524p354k430R684k501p889O989L719q751K497Q294p543n933
$$ 4223 -5752 -2526 4998 -2356 -4786 4898 2397 -5492 1497 5216 -3535 -1038 7256 -287 -6220
831f220P724j977q514P859Q262o268J047Q075q007r868N340O5p148Q200J0402
$$ -6220 1504 -473 -8987 -1128 7134 866 1913 9988 1981 -7887 -2547 -2482 -9630 -1430 8972
846H972n962j889O716p494j0474O992M788n884N746R102q274p149N120l847p118
$$ 8972 3010 1121 7837 343 -10131 -3139 1649 -4235 1511 10613 2339 -4810 310 -3537 -10655
861a0655R993Q745n513J706N940j0907j0365O229J351m753J0048J0140o874l234
$$ -10655 -662 8083 2570 4276 10216 -691 -11056 -4827 -3476 -8229 1819 11959 5085 1851
875A851M156q771q948Q406M749n226O462P833r607o260O567k963o262R568O545
$$ 1851 6007 -2764 -11712 -3306 1443 -3783 2679 10512 905 -5355 1212 -1751 -8013 1555 8100
890H100p602N06M911r598o185R254J438n456Q449O217r949k819O403o176n903
$$ 8100 498 1004 5915 -3683 -9868 -614 824 -4632 3817 10034 85 -2734 3669 -2507 -8410
905h410R493K852p684M249N719q903k135R594k554o591P511J990j0669J034P449
$$ -8410 1083 3935 -3749 500 6219 -2684 -4819 4775 2221 -4370 3141 5131 -5538 -4504 2945
920B945n763j824J0742n60q517M451K409j0046Q21R786l678l946Q554r63j0687
$$ 2945 -2818 -4642 6100 5540 -2977 1474 3883 -6163 -5342 4444 766 -3180 5374 4411 -6276
935f276L089N893o580J179J0795l203p897M831o98j0234L682R543l929m35R312
$$ -6276 -3187 2706 -3874 -2695 8100 4897 -3000 1831 1133 -9101 -5419 4124 195 -240 9072
950I072l994j0831L595K544p861L706J0932l977m609O545l133j0224M911O606
$$ 9072 5078 -5753 -2158 386 -7475 -3769 7163 3186 -1423 5122 1989 -8235 -3324 3282
964C282n922J926R451n802q467N758K76q240N691R064n763k144P094n459q957
$$ 3282 -2640 -714 8737 2935 -5532 226 502 -7738 -2047 7017 1254 -890 6204 745 -8212
979h212O707M020o869M308Q644p305n831O904k136p808P159O461p152L22O828
$$ -8212 -1505 2515 -4354 -46 8598 1293 -4538 2366 230 -7578 -419 6042 -1110 -788 6040
994F040p063o421Q321J726o890N901O355q940l569O925m077n729R119M370p295
$$ 6040 -1023 -7444 877 2603 -4287 1614 7969 -971 -4540 2385 -1692 -7421 1698 6068 -1227
1009a227K450N195r103m663Q418p90n623Q199M884r005p61O010o620m412R478
$$ -1227 1223 6418 -2685 -7348 1070 280 -5343 2856 7740 -1265 -2026 3984 -2636 -7048 2430
1024B430J455o963N035M098r717j971Q147l389m205R490K448q993J839M568q785
$$ 2430 3885 -3078 1957 6055 -3662 -5633 2514 -875 -5080 4410 6858 -2135 -296 4272 -4513
1039d513k645R525r86n411P843L095r641L95O445o665l508R390k18p684N416M271
$$ -4513 -7158 2367 1381 -4030 3813 6908 -2733 -2338 4107 -2558 -6066 3324 3106 -4578 838 5109
1055E109q821o9Q642m148m776Q129L63r271L067N312p627r60R540k337n934P253
$$ 5109 -3712 -3781 4861 713 -4063 4066 4429 -4842 -1775 3537 -4090 -5050 4490 2153 -3781 3472
1071C472K149r277J466O458o649l110Q595j276o980O330M172q115Q93P747n572
$$ 3472 5621 -3656 -2190 4268 -2381 -5491 3104 1828 -5152 1178 5350 -2765 -1872 5875 303
1086C03n231P570k71q390M494N713o952j14Q707l707n943P087Q96r336K607O379
$$ 303 -4928 2642 2371 -6019 -1525 4188 -2764 -2878 5829 2122 -3821 3266 4162 -5174 -2567 3812
1102C812o896k132R122j607o475O701L237q645J125O804o586m302Q283p34p666
$$ 3812 -3084 -5216 3906 2299 -4176 2525 5762 -2883 -1758 5046 -1540 -5842 2441 1707 -5959
1117e959N862N503p494J50Q064m813n950P000K03q599L933O312o809j108Q918
$$ -5959 -97 5406 -2088 -1938 6126 1313 -4637 2363 2566 -6033 -2100 4212 -2597 -3705 5213
1132E213k755o491O736K328q778J629O265o756l464Q370q12o282O895M810p946
$$ 5213 2458 -4033 2703 5031 -3747 -2118 4147 -2609 -6073 2297 1485 -4797 2098 6908 -1038
1147a038j12O359o431n698P570Q08o709N664O048p487j717P213m240n876P711
$$ -1038 -1150 5209 -1222 -6920 650 1458 -5251 413 6461 -1026 -2743 4470 230 -5646 2065
1162B065K580p847K555N362p987l364Q433q16m848Q162M117r033r31M608p690
$$ 2065 4645 -3202 -647 4715 -3272 -6636 1797 981 -3867 4295 8412 -621 -1552 3056 -4634
1177d634m466R289K036m794O881M587r631k749N786n274m484R518L050p097L097
$$ -4634 -9100 189 2225 -2569 4312 8899 -732 -3481 2305 -2969 -7453 2065 5115 -1982 1115
1192A115M187r019k935Q412j152l927Q632K718r831o53M262p491k873J0327J902
$$ 1115 5302 -3717 -6652 1760 608 -3319 5313 8031 -1800 -2453 1809 -5682 -8555 1772 3674
1207C674m683O264K862j0301k249N684n049l304R808K149p102L705M219q546k018
$$ 3674 -1009 5255 8117 -2184 -4433 1251 -3798 -7102 2706 4855 -2247 1458 5677 -2869 -4887
1222d887Q046k462m811P331J646q862J643N724o423k040R122q47o413N722K839
$$ -4887 3159 697 -4114 3217 4863 -3999 -2356 3368 -3055 -5095 4027 3180 -3233 2489 5328
1237E328q650K78O749n329l967Q000l1p055N440N379p237p00P003n260o512O535
$$ 5328 -3322 -3044 3705 -1624 -5591 2409 2378 -4677 763 6142 -1095 -1795 5208 -52 -6564 -29
1253b9J453o726N054P239o375k575O549m332p361O496L843o409L123O960o820
$$ -29 1424 -5302 -248 6991 616 -1959 4590 258 -7103 -607 3236 -3173 -50 6910 90
1268I0n064O338j653o239P272O115o576j39N559p091o685O816J749n060O547O710
$$ 90 -4974 1364 -289 -6528 744 6859 283 144 5703 -1388 -8073 -1257 492 -4568 1979 8689
1284H689p337l154N155n351o455P630M261n564L637O008p630m835O183j904n466
$$ 8689 1352 -1802 3353 -1998 -8453 -823 3438 -2126 1511 7519 -111 -4946 1237 -667 -6133
1299f133P530M919p176J35N449o775n091P811J368n471N709M788q165k127O091
$$ -6133 1397 6316 -860 -725 4724 -2051 -7142 669 2037 -3434 2275 7063 -1102 -3229 2862
1314B862m499m819Q129K544p021L165N207p501k832P641j884n506O609K685q188
$$ 2862 -1637 -6456 1673 4217 -2804 361 5568 -1933 -4765 2876 992 -4514 2095 4780 -3408
1329c408J141O347n692k980Q395l95p102M476L373q010l3P691l549l972P329K33
$$ -3408 -2267 4080 -1612 -4592 3803 3408 -3694 782 4155 -3855 -3888 3803 254 -3718 3611 3844
$$ [...]
8191b91
##END NTUPLES=NMR FID
##END=
