##TITLE=1H ikalashn
LY-790.60(CCl4)
19.10.2018
##JCAMPDX= 6.0         $$ Bruker NMR JCAMP-DX V2.0
##DATA TYPE= NMR FID
##DATA CLASS= NTUPLES
##ORIGIN= UXNMR, Bruker Analytische Messtechnik GmbH
##OWNER= root
$$ TOPSPIN		Version 1.3
$$ 2018-10-19 16:32:25.296 +0400  Irina@DPX200
$$ Compression mode = diff/dup
##.OBSERVE FREQUENCY= 200.131
##.OBSERVE NUCLEUS= ^1H
##.DELAY= (6, 6)
##.ACQUISITION MODE= SIMULTANEOUS
##.ACQUISITION SCHEME= undefined
##.AVERAGES= 8
##.DIGITISER RES= 18
##SPECTROMETER/DATA SYSTEM= spect
##.PULSE SEQUENCE= zg
##.SOLVENT NAME= CDCl3
##.SHIFT REFERENCE= INTERNAL, CDCl3, 1, 15.96001
##AUDIT TRAIL= $$ (NUMBER, WHEN, WHO, WHERE, WHAT)
$$ ##TITLE= Audit trail, TOPSPIN		Version 1.3
$$ ##JCAMPDX= 5.01
$$ ##ORIGIN= Bruker BioSpin GmbH
$$ ##OWNER= Irina
$$ $$ F:/spectra/data/iren/nmr/1H/4/audita.txt
$$ ##AUDIT TRAIL=  $$ (NUMBER, WHEN, WHO, WHERE, VERSION, WHAT)
(   1,<2018-10-19 16:31:21.171 +0400>,<Irina>,<DPX200>,<TOPSPIN 1.3>,
      <created by zg
	started at 2018-10-19 16:30:43.765 +0400,
	POWCHK disabled, PULCHK disabled
       configuration hash MD5:
       BE 6D 3F 07 2A EA 11 49 91 17 2B D3 AF B3 58 0D
       data hash MD5: 16K
       ED D2 88 E2 07 F1 FA D3 A1 7E E0 F7 98 50 AA 1B>)
$$ ##END=
$$ 
$$ $$ hash MD5
$$ $$ 45 E0 7B CF 19 92 16 A0 6B A1 D0 63 7A 02 92 13
##$RELAX= 
##$RELAX= 
##$RELAX= 
##$RELAX= 
##$RELAX= 
##$RELAX= 
##$RELAX= 
$$ Bruker specific parameters
$$ --------------------------
##$DU= <F:/spectra>
##$EXPNO= 4
##$NAME= <1H>
##$PROCNO= 1
##$TYPE= <nmr>
##$USER= <iren>
##$AMP= (0..31)
100 100 100 100 100 100 100 100 100 100 100 100 100 100 100 100 100 100 
100 100 100 100 100 100 100 100 100 100 100 100 100 100 
##$ANAVPT= -1
##$AQSEQ= 0
##$AQ_mod= 1
##$AUNM= <au_zg>
##$AUTOPOS= <>
##$BF1= 200.13
##$BF2= 200.13
##$BF3= 200.13
##$BF4= 200.13
##$BF5= 200.13
##$BF6= 200.13
##$BF7= 200.13
##$BF8= 200.13
##$BYTORDA= 1
##$CFDGTYP= 0
##$CFRGTYP= 5
##$CHEMSTR= <none>
##$CNST= (0..63)
1 1 145 1 1 1 1 1 1 1 1 1 1 1 1 1 1 1 1 1 1 1 1 1 1 1 1 1 1 1 1 1 1 1 
1 1 1 1 1 1 1 1 1 1 1 1 1 1 1 1 1 1 1 1 1 1 1 1 1 1 1 1 1 1 
##$CPDPRG= <>
##$CPDPRG1= <>
##$CPDPRG2= <>
##$CPDPRG3= <>
##$CPDPRG4= <mlev>
##$CPDPRG5= <mlev>
##$CPDPRG6= <mlev>
##$CPDPRG7= <mlev>
##$CPDPRG8= <mlev>
##$CPDPRGB= <>
##$CPDPRGT= <>
##$D= (0..63)
0 2 0 0 0 0 0 0 0 0.06 0 0.03 0 0 0 0 0.0002 0 0 0 0 0 0 0 0 0 0 0 0 0 
0 0 0 0 0 0 0 0 0 0 0 0 0 0 0 0 0 0 0 0 0 0 0 0 0 0 0 0 0 0 0 0 0 0 
##$DATE= 1539952277
##$DBL= (0..7)
120 120 120 120 120 120 120 120 
##$DBP= (0..7)
150 150 150 150 150 150 150 150 
##$DBP07= 0
##$DBPNAM0= <>
##$DBPNAM1= <>
##$DBPNAM2= <>
##$DBPNAM3= <>
##$DBPNAM4= <>
##$DBPNAM5= <>
##$DBPNAM6= <>
##$DBPNAM7= <>
##$DBPOAL= (0..7)
0.5 0.5 0.5 0.5 0.5 0.5 0.5 0.5 
##$DBPOFFS= (0..7)
0 0 0 0 0 0 0 0 
##$DE= 6
##$DECBNUC= <off>
##$DECIM= 32
##$DECNUC= <off>
##$DECSTAT= 4
##$DIGMOD= 1
##$DIGTYP= 9
##$DL= (0..7)
0 120 120 120 120 120 120 120 
##$DP= (0..7)
150 150 150 150 150 150 150 150 
##$DP07= 0
##$DPNAME0= <>
##$DPNAME1= <>
$$ [...]
##$SW= 21.9926370762362
##$SWIBOX= (0..15)
0 0 2 0 0 0 0 0 0 0 0 0 0 0 0 0 
##$SW_h= 4401.40845070423
##$TD= 16384
##$TD0= 1
##$TE= 300
##$TE2= 300
##$TE3= 300
##$TEG= 300
##$TL= (0..7)
0 120 120 120 120 120 120 120 
##$TP= (0..7)
150 150 150 150 150 150 150 150 
##$TP07= 0
##$TPNAME0= <>
##$TPNAME1= <>
##$TPNAME2= <>
##$TPNAME3= <>
##$TPNAME4= <>
##$TPNAME5= <>
##$TPNAME6= <>
##$TPNAME7= <>
##$TPOAL= (0..7)
0.5 0.5 0.5 0.5 0.5 0.5 0.5 0.5 
##$TPOFFS= (0..7)
0 0 0 0 0 0 0 0 
##$TUNHIN= 0
##$TUNHOUT= 0
##$TUNXOUT= 0
##$USERA1= <user>
##$USERA2= <user>
##$USERA3= <user>
##$USERA4= <user>
##$USERA5= <user>
##$V9= 5
##$VALIST= <valist>
##$VCLIST= <CCCCCCCCCCCCCCC>
##$VD= 0
##$VDLIST= <DDDDDDDDDDDDDDD>
##$VPLIST= <PPPPPPPPPPPPPPP>
##$VTLIST= <TTTTTTTTTTTTTTT>
##$WBST= 1024
##$WBSW= 8
##$XGAIN= (0..3)
0 0 0 0 
##$XL= 0
##$YL= 0
##$YMAX_a= 47745
##$YMIN_a= -34346
##$ZGOPTNS= <>
##$ZL1= 120
##$ZL2= 120
##$ZL3= 120
##$ZL4= 120
##$ABSF1= 10
##$ABSF2= 0
##$ABSG= 5
##$ABSL= 3
##$ALPHA= 0
##$AQORDER= 0
##$ASSFAC= 0
##$ASSFACI= 0
##$ASSFACX= 0
##$ASSWID= 0
##$AUNMP= <proc_1d>
##$AXLEFT= 0
##$AXRIGHT= 0
##$AXTYPE= 0
##$AXUNIT= <>
##$AZFE= 0.1
##$AZFW= 0.1
##$BCFW= 1
##$BC_mod= 2
##$BYTORDP= 1
##$COROFFS= 0
##$CY= 7568.61572265625
##$DATMOD= 1
##$DC= 2
##$DFILT= <>
##$DTYPP= 0
##$F1P= 12.6985496478733
##$F2P= 1.34767866218088
##$FCOR= 0.5
##$FTSIZE= 32768
##$FT_mod= 4
##$GAMMA= 1
##$GB= 1
##$INTBC= 1
##$INTSCL= 1
##$ISEN= 128
##$LB= 0.01
##$LEV0= 0
##$LPBIN= 0
##$MAXI= 945.577
##$MC2= 0
##$MEAN= 0
##$ME_mod= 0
##$MI= -402.1523
##$NCOEF= 0
##$NC_proc= 0
##$NLEV= 6
##$NOISF1= 8.587773
##$NOISF2= 6.764455
##$NSP= 1
##$NTH_PI= 0
##$NZP= 0
##$OFFSET= 15.96001
##$PC= 1
##$PHC0= 200.1955
##$PHC1= 4.567311
##$PH_mod= 0
##$PKNL= yes
##$PPARMOD= 0
##$PPDIAG= 0
##$PPIPTYP= 0
##$PPMPNUM= 100
##$PPRESOL= 1
##$PSCAL= 0
##$PSIGN= 0
##$REVERSE= no
##$SF= 200.130006627338
##$SI= 32768
##$SIGF1= 18.5376
##$SIGF2= -6.396296
##$SINO= 400
##$SIOLD= 32768
##$SREGLST= <1H.CDCl3>
##$SSB= 3
##$STSI= 0
##$STSR= 0
##$SW_p= 4401.40845070423
##$SYMM= 0
##$S_DEV= 0
##$TDeff= 0
##$TDoff= 0
##$TI= <>
##$TILT= no
##$TM1= 0
##$TM2= 0
##$TOPLEV= 0
##$USERP1= <user>
##$USERP2= <user>
##$USERP3= <user>
##$USERP4= <user>
##$USERP5= <user>
##$WDW= 1
##$XDIM= 8192
##$YMAX_p= 0
##$YMIN_p= 0
$$ End of Bruker specific parameters
$$ ---------------------------------
##NTUPLES= NMR FID
##VAR_NAME=  TIME,          FID/REAL,        FID/IMAG
##SYMBOL=    X,             R,               I
##VAR_TYPE=  INDEPENDENT,   DEPENDENT,       DEPENDENT
##VAR_FORM=  AFFN,          ASDF,            ASDF
##VAR_DIM=   8192,          8192,            8192
##UNITS=     SECONDS,       ARBITRARY UNITS, ARBITRARY UNITS
##FACTOR=    0.0002272,     1,               1
##FIRST=     0,             0,               0
##LAST=      1.8609952,     880,             -304
##MIN=       0,             -34346,          -34346
##MAX=       1.8609952,     47745,           47745
$$ Real data points
##PAGE= N=1
##DATA TABLE= (X++(R..R)), XYDATA
$$ plain form
0 0 0 0 0 0 0 0 0 0 0 0 0 0 0 0 0 0 0 -1 1 -1 8 -8 8 -9 9 -9 12 -17 17 -18 25 -26 28 -34 36 -43 46 -52 60 -67 72
41 72 -81 90 -99 112 -123 134 -149 165 -182 200 -221 242 -267 297 -327 363 -403 453 -511 579 -662
62 -662 768 -907 1098 -1376 1823 -2660 4780 -21783 -34346 -3010 -19199 -28965 -18726 -422
76 -422 5453 10985 5506 3549 20007 33456 8430 -13973 5591 24131 -6660 -34331 -13367
89 -13367 9728 -8949 -26125 -9428 10006 8304 4260 5992 10758 21676 26630 8500 -5094
102 -5094 13155 25938 -2027 -24400 -2189 16628 -7018 -26619 -7231 11013 -492 -12592
114 -12592 -6381 2278 4703 1703 -9232 -13450 2298 10434 -10996 -23667 955 17687 -5406
127 -5406 -21056 2920 21056 3340 -12172 -776 10461 4313 -5238 -9266 -6699 3149 5137
$$ packed form
0@%%%%%%%%%%%%%%%%%jKkRj6J6j7J8j8K1k9L4l5M3n1N4o2P0p9Q9r8J12j27J39
41G2j53J71j89K11k35K57k83L14l47L82m21M63n09N64o24O90p66Q56r64J090j241
62f62J430j675K005k474L199m483P440k6563j2563L1336j6189r766J0239J8304
76d22N875N532n479j957J6458J3449k5026k2403J9564J8540l0791k7671K0964
89a3367K3095j8677j7176J6697J9434j702m044J732M766J0918M954j8130j3594
102e094J8249J2783k7965k2373K2211J8817k3646j9601J9388J8244j1505j2100
114a2592O211Q659K425l000j0935m218J5748Q136k1430j2671K4622J6732k3093
127e406j5650K3976J8136j7716j5512J1396J1237o148r551m028K567R848J988
$$ plain form
140 5137 -9932 -13946 9627 22032 873 -9467 16294 31430 9092 -7049 8095 18507
152 18507 3367 -11364 -9970 -4716 -3923 -8932 -18230 -16365 2047 8625 -8715 -12864 12610 24224
166 24224 1807 -10172 9352 19048 -907 -15649 -7336 138 -6239 -14855 -16882 -10306 1639
179 1639 2990 -9165 -7767 14731 21830 1352 -5469 16169 23835 1363 -11200 2768 10813
192 10813 -1953 -12694 -8701 -345 3183 -1090 -8620 -3999 12176 13166 -5114 -7647 12977 16913
206 16913 -6216 -15002 3271 10650 -6292 -16219 -5701 3727 152 -6816 -7785 -117 9322 5545
220 5545 -7993 -5961 11818 11776 -9350 -13215 6872 11785 -7352 -14288 1377 9914 345 -6960
234 -6960 -1383 7314 9285 2290 -5642 -648 11691 7516 -10214 -10043 8320 9144 -10502 -13998 4167
$$ packed form
140E137j5069m014K3573J2405k1159j0340K5761J5136k2338j6141J5144J0412
152A8507j5140j4731J394N254P93n009r298J865J8412O578j7340m149K5474J1614
166B4224k2417j1979J9524R696j9955j4742Q313P474o377q616k027O576J1945
179A639J351j2155J398K2498P099k0478o821K1638P666k2472j2563J3968Q045
192A0813j2766j0741L993Q356L528m273p530M621J6175R90j8280k533K0624L936
206A6913k3129q786J8273P379j6942r927J0518R428l575o968r69P668R439l777
220E545j3538K032J7779m2k1126l865K0087M913j9137o936J5665Q537r569p305
234f960N577Q697J971o995p932M994J2339m175j7730J71J8363Q24j9646l496J8165
$$ plain form
249 4167 9950 -4159 -10243 650 8871 4497 -3328 -4668 2506 9117 2461 -10032 -6090 9049
263 9049 6256 -11698 -11258 7466 9751 -7011 -10676 4197 10743 1178 -5900 -986 6803 7288 -936
278 -936 -7552 -875 9535 3262 -11744 -7867 9056 7207 -10496 -11007 5908 9426 -4054 -8883
292 -8883 1274 8178 2981 -5038 -5187 2928 7854 -549 -10769 -3978 9529 4283 -11548 -8269
306 -8269 8717 8667 -6489 -7823 6055 10626 915 -5150 341 7824 6855 -2189 -7239 607 8952
321 8952 1085 -11414 -5491 9010 5031 -10071 -8026 7237 8471 -4187 -7507 2211 7717 1767
335 1767 -6149 -5626 2392 5581 -3311 -11116 -2931 8144 1272 -11819 -6172 8995 6804 -7073
349 -7073 -6897 5916 8841 -788 -6046 10 7312 5519 -3076 -5482 3949 10623 1505 -8607 -667
$$ packed form
249D167N783j4109o084J0893Q221m374p825j340P174O611o656j2493L942J5139
263I049k793j7954M40J8724K285j6762l665J4873O546r565p078M914P789M85q224
278i36o616O677J0410o273j5006L877J6923j849j7703n11J6915L518j3480m829
292h883J0157O904n197q019j49Q115M926q403j0220O791J3507n246j5831L279
306h269J6986n0j5156j334J3878M571r711o065N491P483r69r044n050P846Q345
321H952p867j2499N923J4501l979j5102K045J5263J234j2658l320R718N506n950
335A767p916N23Q018L189q892p805Q185J1075o872j3091N647J5167k191j3877
349g073J76J2813K925r629n258O056P302j793q595k406R431O674r118j0112P940
$$ plain form
364 -667 11720 5318 -8958 -5952 7149 5945 -6618 -8893 823 5743 -403 -7052 -3933 5567
378 5567 7857 -1391 -6929 2391 10950 1772 -10599 -4970 6525 1237 -12306 -11228 459 2272
392 2272 -6434 -9452 -1272 7334 6286 -701 -571 9534 14296 4302 -4498 2939 11377 2241 -11222
407 -11222 -7753 3275 652 -10491 -10678 -16 5528 730 -3811 1262 10858 11721 2242 -1826 7040
422 7040 12115 628 -10814 -4901 4302 -2614 -14985 -12447 -1114 128 -7811 -9316 -221 7744
436 7744 5190 -1885 -307 9833 12281 1222 -5610 2972 10019 320 -10970 -5764 4376 728
450 728 -9639 -8691 1588 5440 -832 -5554 72 9095 8404 -737 -2397 7630 11929 1439 -6615
465 -6615 1039 8941 1212 -9801 -6798 2531 1145 -8276 -10605 -2951 2961 -991 -7544 -4356 6037
$$ packed form
364f67J2387o402j4276L006J3101j204j2563k275R716M920o146o649L119R500
378E567K290r248n538R320Q559r178j2371N629J1495n288j3543J078J1687J813
392B272q706l018Q180Q606j048o987J30J0105M762r994q800P437Q438r136j3463
407a1222L469J1028k623j1143j87J0662N544m798m541N073R596Q63r479m068Q866
422G040N075j1487j1442N913R203o916j2371K538J1333J242p939j505R095P965
436G744k554p075J578J0140K448j1059o832Q582P047r699j1290N206J0140l648
450G28j0367R48J0279L852o272m722N626R023o91r141j660J0027M299j0490q054
465f615P654P902p729j1013L003R329j386r421k329P654N912l952o553L188J0393
$$ plain form
480 6037 7989 -1127 -4090 6390 12679 3325 -5757 103 8198 2520 -8418 -8298 -199 1208 -6319
495 -6319 -10719 -4436 4180 2896 -4691 -3012 8796 12871 3230 -2214 6549 13215 4552 -5854 -2922
510 -2922 4549 1120 -9163 -11375 -3827 869 -4270 -10194 -5247 5543 6519 -2164 -3073 7911 12810
525 12810 3267 -3997 2589 9363 2642 -7601 -6609 1102 1314 -6808 -10783 -4249 3239 499 -6752
540 -6752 -4022 6905 9075 -223 -3427 6060 11615 3240 -4960 -440 6813 3096 -6275 -7568 -518
555 -518 2635 -3658 -9365 -4397 4476 3147 -5512 -5038 5816 9388 362 -4646 3200 9695 3414
570 3414 -5134 -2861 4540 3645 -4853 -8203 -1650 4014 -837 -8374 -4944 5127 5519 -3733 -5249
585 -5249 4644 9290 1215 -5027 947 7875 3611 -5155 -5139 2346 4441 -2869 -8123 -2597 5020 1890
$$ packed form
480F037J952r116k963J0480O289r354r082N860Q095n678j0938J20Q099J407p527
495f319m400O283Q616j284p587J679J1808M075r641n444Q763O666q663j0406K932
510b922P471l429j0283k212P548M696n139n924M947J0790R76q683r09J0984M899
525A2810r543p264O586O774o721j0243R92P711K12q122l975O534P488k740p251
540f752K730J0927K170r298l204R487N555q375q200M520P253l717r371j293P050
555e18L153o293n707M968Q873j329q659M74J0854L572r026n008P846O495o281
570C414q548K273P401q95q498l350O553N664m851p537L430J0071L92r252j516
585e249R893M646q075o242N974O928m264q766J6P485K095p310n254N526P617l130
$$ plain form
601 1890 -6667 -5129 4938 6574 -2522 -5831 2620 8086 1441 -5761 -2050 5506 4267 -3661 -5729
616 -5729 1240 5737 -46 -6759 -2685 5873 4143 -5171 -5724 3553 6484 -1772 -6699 -131 6346
631 6346 2274 -5014 -3481 4154 5479 -1632 -5724 356 6612 1959 -6417 -4306 4697 4664 -4492 -6795
647 -6795 1588 5996 -635 -6439 -1539 5921 4118 -3430 -4209 3263 6792 101 -6180 -1448 6154
662 6154 3035 -5895 -5339 3642 5216 -3195 -6845 404 6230 1404 -5502 -3072 4586 5022 -2479 -5636
678 -5636 951 6261 848 -6498 -3030 5449 4141 -4661 -5663 2788 6122 -881 -6034 -850 5723
693 5723 3071 -4140 -4029 3315 5742 -1093 -5902 -126 6694 2793 -5317 -3586 4853 5235 -3020 -5782
709 -5782 1209 5705 232 -5974 -2831 4244 3456 -4044 -5892 1266 5682 -342 -6662 -2208 5515
$$ packed form
601A890q557J538J0067J636r096l309Q451N466o645p202L711P556j239p928k068
616e729O969M497n783o713M074Q558j730r314n53R277K931q256m927O568O477
631F346m072p288J533P635J325p111m092O080O256m653q376K111R003l3r156k303
647f795Q383M408o631n804M900P460j803p548p79P472L529o691o281M732P602
662F154l119q930N56Q981J574q411l650P249N826m826o906K430P658M36p501l157
678e636O587N310n413p346L468Q479j308q802j002Q451L334p003n153N184O573
693E723k652p211J11P344K427o835m809N776O820l901q110J731Q439L82q255k762
709e782O991M496n473o206L143P075p88p500j848P158M416o024o320M454P723
$$ plain form
724 5515 3195 -5053 -4857 3381 5354 -2033 -6158 -215 5736 2103 -4901 -3596 4063 5576 -1616
739 -1616 -5310 1220 7156 2329 -4980 -1961 6152 5219 -3190 -4890 2464 6023 -171 -5920 -2166
754 -2166 4488 2828 -4450 -5137 2289 5618 -869 -6088 -856 5952 2447 -5573 -4686 2940 3713 -3967
770 -3967 -7472 -1627 3367 -702 -6710 -4064 3782 4826 -1791 -3846 3489 8657 3362 -3212 117
785 117 6955 4573 -3900 -5169 1577 3856 -2691 -7274 -2207 4691 2972 -3302 -2170 6089 8878
800 8878 2161 -2327 2993 8118 2667 -5855 -4932 1505 378 -8009 -10740 -4056 891 -3156 -7910
815 -7910 -3552 4939 5531 -833 -1817 5596 9145 2335 -4226 -634 5110 1258 -7238 -7418 -189 1962
831 1962 -3984 -6889 -477 6385 4365 -1152 952 8762 9930 2388 -1570 3741 7761 1739 -5827
$$ packed form
724E515k320q248J96Q238J973p387m125N943N951l633p004J305P659J513p192
739a616l694O530N936m827p309L019Q113r33q409j700P354L559o194n749L754
754b166O654j660p278o87P426L329o487n219N232O808l505q020Q87P626P73p680
770c967l505N845M994m069o008K646P846J044o617k055P335N168n295o574L329
785A17O838k382q473j269O746K279o547m583N067O898j719o274J132Q259K789
800H878o717m488N320N125n451q522R23O437j127q387k731O684M947m047m754
815g910M358Q491N92o364r84P413L549o810o561L592N744l852q496j80P229K151
831A962n946k905O412O862k020n517K104P810J168p542l958N311M020o022p566
$$ plain form
846 -5827 -3826 2663 1366 -6062 -7361 -477 3365 -1668 -6447 -2320 4482 2968 -4358 -5152 1917
861 1917 4653 -1911 -6563 -1355 4893 1623 -5224 -3655 3739 4701 -2285 -5630 -190 4493 49
876 49 -6550 -4503 2922 3591 -2951 -4220 3661 8999 4409 -577 3793 10742 8507 212 -1675 3601
892 3601 4492 -3194 -9308 -5966 -559 -3208 -9623 -8021 886 4466 -609 -2695 4408 10619 6522
907 6522 -619 285 5531 3583 -5358 -9460 -4997 -1924 -7071 -12470 -8341 302 1657 -3182 -2132
922 -2132 6826 11710 6721 1974 5884 10916 6720 -2061 -3663 1382 1682 -5601 -9823 -4524 1872
937 1872 -199 -5327 -2397 6176 8094 1873 -714 5124 8788 2670 -4766 -3234 2288 365 -7279
952 -7279 -8937 -2334 1622 -2947 -7112 -2311 5030 3765 -2953 -3061 3877 5675 -1409 -6131 -1365
$$ packed form
846e827K001O489j297p428j299O884L842n033m779M127O802j514p326p94P069
861A917K736o564m652N208O248l270o847J569P394R62o986l345N440M683m444
876D9o599K047P425O69o542j269P881N338m590m986M370O949k235q295j887N276
892C601Q91p686o114L342N407k649o415J602Q907L580n075k086P103O211m097
907F522p141R04N246j948q941m102M463L073n147n399M129Q643J355m839J050
922b132Q958M884m989m747L910N032m196q781j602N045L00p283m222N299O396
937A872k071n128K930Q573J918o221k587N838L664o118p436J532N522j923p644
952g279j658O603L956m569m165M801P341j265o718j08O938J798p084m722M766
$$ plain form
967 -1365 4146 768 -5562 -3758 3800 5436 -353 -2627 3471 8330 3901 -2881 -1319 4782 3559
982 3559 -4420 -6983 -837 2953 -2004 -6576 -1967 5370 4751 -1109 -960 5828 8121 1664 -3913 -756
998 -756 3791 -148 -8009 -8185 -1651 -101 -5916 -8113 -1143 5310 2785 -2047 914 8092 8091 954
1014 954 -2177 2581 5358 -638 -7328 -5086 1067 -71 -6486 -6459 1476 5638 935 -2739 2321 8475
1030 8475 5863 -1292 -1787 3879 4385 -2931 -7486 -2952 2110 -1344 -7250 -4761 3194 4690 -1267
1045 -1267 -3047 3437 7744 2825 -3313 -1237 4275 2495 -4981 -6688 -550 2908 -1987 -6260 -1546
1060 -1546 5562 4511 -1533 -1105 5710 7434 804 -3828 45 4233 4 -6976 -6163 288 1388
1075 1388 -4452 -6582 -254 5274 2035 -3013 -179 6499 5845 -1360 -3565 1905 4493 -1499 -7063
$$ packed form
967a365N511l378o330J804P558J636n789k274O098M859m429o782J562O101j223
982C559p979k563O146L790m957m572M609P337o19n860J49O788K293o457n577L157
998g56M547l939p861j76O534J550n815k197O970O453k525m832K961P178jp137
1014I54l131M758K777n996o690K242O153j138o415K7P935M162m703l674N060O154
1030H475k612p155m95N666N06p316m555M534N062l454n906K489P955J496n957
1045a267j780O484M307m919o138K076N512j780p476j707O138L458m895m273M714
1060a546P108j051o044M28O815J724o630m632L873M188m229o980Q13O451J100
1075A388n840k130O328N528l239n048K834O678o54p205k205N470K588n992n564
$$ plain form
1090 -7063 -3878 2083 671 -5395 -5075 2217 5462 558 -2913 2160 7923 4939 -1858 -1370 4866
1105 4866 5232 -1930 -5648 -707 3651 -407 -6113 -3677 3166 3422 -2852 -4440 1815 5742 836
1120 836 -4694 -1705 4305 2560 -4522 -5546 594 3060 -2484 -6554 -2087 3766 1558 -4477 -3647
1135 -3647 3191 5037 -784 -4121 908 5851 2310 -3665 -1981 4530 4676 -1689 -3859 1951 5865
1150 5865 1443 -3828 -991 5148 4217 -2269 -3586 2363 5124 -321 -5074 -1330 4265 1815 -4908
1165 -4908 -4846 1593 3265 -2732 -6292 -1447 3566 381 -5556 -4074 2501 3233 -2990 -5399 353 4753
1181 4753 490 -5032 -2295 4271 3781 -2569 -3688 2540 5784 831 -3746 5 5879 4040 -2440
1196 -2440 -2699 3608 5676 -63 -4079 389 5564 2608 -3542 -2511 3800 4447 -1863 -4859 87
$$ packed form
1090g063L185N961j412o066L20P292L245m904l471N073N763k984o797M88O236
1105D866L66p162l718M941M358m058n706K436O843K56o274j588O255L927m906
1120H36n530K989O010j745p082j024O140K466n544m070M467N853k208o035Q30
1135c647O838J846n821l337N029M943l541n975J684O511J46o365k170N810L914
1150E865m422n271K837O139r31o486j317N949K761n445m753L744N595k450o723
1165d908O2O439J672n997l560M845N013l185n937J482O575P32o223k409N752M400
1181D753m263n522K737O566m90o350j119O228L244m953m577L751N874j839o480
1196b440k59O307K068n739m016M468N175k956o150J031O311O47o310k996M946
$$ plain form
1211 87 4089 -265 -6230 -4497 1485 1240 -5010 -6591 -579 3308 -966 -5332 -1467 4897 3756 -2410
1227 -2410 -2891 3090 5101 -784 -5364 -1723 3229 489 -5565 -4641 2124 4065 -1052 -3206 2841
1242 2841 8293 5258 -196 1626 7507 6876 -360 -3468 913 3340 -2255 -8028 -5462 510 -265
1257 -265 -5915 -5839 1402 5183 838 -2773 1627 7164 4517 -2284 -2814 2324 2518 -4412 -8499 -4222
1273 -4222 420 -2612 -7761 -5280 2134 3865 -973 -2025 4291 8753 4725 -594 1566 6711 4949
1288 4949 -2253 -4228 917 3330 -1852 -6285 -2567 3363 2097 -3452 -2904 3634 5724 267 -3376
1303 -3376 894 5488 2112 -4176 -3446 2365 2833 -3255 -5775 -684 3511 -324 -5539 -3267 2720
1318 2720 2206 -4080 -5535 275 3660 -837 -5162 -1361 4766 3696 -1851 -1536 4819 6943 1438
$$ packed form
1211H7M002m354n965J733N982k45o250j581O012L887m274m366L865O364j141o166
1227b410m81N981K011n885m580L641M952k740o054R24O765J941n117k154O047
1242B841N452l035n454J822N881o31p236l108M381K427n595n773K566N972p75
1257b65n650P6P241L781m345l611M400N537k647o801n30N138J94o930m087M277
1273d222M642l032n149K481P414J731m838j052O316M462m028n319K160N145j762
1288D949p202j975N145K413n182m433L718N930j266n549N48O538K090n457l643
1303c376M270M594l376o288P30N811M68o088k520N091M195l835n215K272N987
1318B720n14o286j455N810L385m497m325L801O127j070n547L15O355K124n505
$$ plain form
1333 1438 -2679 1059 5422 1944 -4731 -4552 1120 1907 -3974 -6392 -836 4242 1410 -3063 -115
1348 -115 6493 6623 571 -1488 3348 5822 265 -5607 -3812 887 -982 -7252 -7725 -1361 1824 -2324
1364 -2324 -5118 -19 6139 4610 -703 -59 5671 6474 223 -3787 -208 3300 -695 -6560 -5031
1379 -5031 1087 1758 -3536 -4764 1392 5825 2365 -2038 789 6331 5023 -1434 -3005 1949 3926
1394 3926 -1563 -6023 -2568 2731 922 -4696 -4030 2381 4444 -724 -3763 749 5199 1855 -3975
1409 -3975 -2891 2797 3021 -2997 -5292 -76 4048 492 -4178 -1465 4599 4148 -1724 -2994 2363
1424 2363 4866 -177 -4860 -1817 3283 1457 -4397 -4457 1522 3799 -890 -3905 518 5445 2910
1439 2910 -2611 -1800 3764 4184 -1765 -4718 -340 3392 -327 -5359 -3329 2504 2587 -2733 -3804 1771
$$ packed form
1333A438m117L738M363l478o675J79N672P87n881k418N556N078k832m473K948
1348a15O608J30o052k059M836K474n557n872J795M699j869o270m73O364L185m148
1364b324k794N099O158j529n313O44N730Q03o251m010L579L508l995n865J529
1379e031O118O71n294j228O156M433l460m403K827N542j308o457j571M954J977
1394C926n489m460L455N299j809n618O66O411K063n168l039M512M450l344n830
1409c975J084N688K24o018k295N216M124l556m670K713O064m51n872j270N357
1424B363K503n043m683L043N100j826n854o0N979K277m689l015M423M927k535
1439B910n521Q11N564M20n949k953M378L732l719n032K030N833Q3n320j071N575
$$ plain form
1455 1771 5115 962 -3393 -460 4803 3284 -2723 -3428 1982 3914 -1178 -4839 -963 3877 1491
1470 1491 -3952 -3143 2734 3853 -1591 -4348 261 4397 1038 -4195 -2474 3274 3315 -2255 -3806 1469
1486 1469 4784 612 -4024 -1342 3990 2738 -3155 -4119 1175 3421 -1406 -5124 -1415 3665 1880
1501 1880 -3328 -2600 3350 4926 -110 -3066 1165 5257 2045 -3443 -2506 2606 2565 -3098 -5200 -440
1517 -440 3099 -534 -4860 -2134 3648 3366 -1829 -2625 2729 5291 770 -3379 -432 4104 2014 -3761
1533 -3761 -4031 1232 2704 -2330 -5377 -1171 3572 1271 -3543 -2109 3669 4391 -803 -2929 1702
1548 1702 5175 1323 -3683 -1909 3185 2472 -3243 -4617 437 3301 -850 -4704 -1507 3758 2446
1563 2446 -2755 -2705 2813 4674 -215 -3621 3 4329 1750 -3600 -2962 2258 2928 -2260 -4594 -126
$$ packed form
1455A771L344m153m355K933N263j519o007p05N410J932n092l661L876M840k386
1470A491n443Q09N877J119n444k757M609M136l359n233J721N748M1n570j551N275
1486A469L315m172m636K682N332j252n893r64N294K246m827l718L709N080j785
1501A880n208P28N950J576n036k956M231M092l212n488R37N112m1n663k102M760
1517d40L539l633m326K726N782k82n195p96N354K562m521m149K947M536k090n775
1533c761k70N263J472n034l047M206M743k301m814J434N778P22n194k126M631
1548A702L473l852n006J774N094p13n715j374N054K864m151l854L197N265j312
1563B446n201N0N518J861m889l406L624M326k579n350O38N220O70n188k334M468
$$ plain form
1579 -126 3792 693 -3897 -1876 3576 3548 -1669 -3126 1705 4616 598 -3647 -1184 3536 2150 -3315
1595 -3315 -3861 1261 3298 -1203 -4597 -1031 3679 1778 -3202 -2550 2842 3977 -988 -3617 445
1610 445 4135 978 -3986 -2650 2516 2552 -2676 -4350 438 3807 320 -3636 -975 4243 3455 -1708
1626 -1708 -2349 2726 4822 231 -3685 -797 3487 1385 -3968 -3813 1313 2691 -1945 -4482 -223
1641 -223 4067 1643 -2940 -1450 3869 4220 -1018 -3198 844 3679 -154 -4838 -3038 1706 983 -4079
1657 -4079 -4844 356 3328 -229 -3427 6 4978 3771 -1094 -1187 3619 4799 -144 -3546 -428 3208
1673 3208 419 -4589 -3727 1466 2386 -2147 -3876 767 4557 1740 -2332 -306 4574 3972 -1344 -2929
1689 -2929 1320 3463 -841 -4986 -2500 1976 640 -4288 -4301 808 2834 -1309 -4002 -176 4181
$$ packed form
1579a26L918l099m590K021N452k8n217j457M831K911m018m245K463M720j386n465
1595c315n46N122K037m501l394L566M710j901m980O52N392J135m965k629M062
1610D45L690l157m964J336N166L6n228j674M788L369l487l956K661N218p88n163
1626a708o41N075K096m591l916K888M284k102n353J55N126J378m636k537M259
1641b23M290k424m583J490N319L51n238k180M042K835l833m684J800M744p23n062
1657d079p65N200K972l557l198L433M972j207m865r3M806J180m943l402L118L636
1673C208k789n008Q62N193R20m533j729M643L790k817m072K026M880o02n316j585
1689b929M249K143m304m145K486M476j336m928j3N109K026m143k693L826M357
$$ plain form
1704 4181 2041 -2688 -1883 3178 3965 -881 -3173 843 4208 1080 -3378 -1781 3007 2665 -2422 -3856
1720 -3856 642 3411 -245 -4031 -1337 3560 2798 -1814 -1993 2963 4946 805 -2476 523 4293
1735 4293 1793 -3553 -3747 628 1314 -3489 -5972 -2115 1807 -370 -4086 -2052 3452 4244 -1 -1286
1751 -1286 3050 5741 1927 -2672 -1260 2600 1174 -4185 -5242 -825 1394 -2149 -4826 -1043 4030
1766 4030 3170 -901 -226 4817 6001 1322 -1836 1030 3927 554 -4587 -4030 423 672 -3826 -5134
1782 -5134 -412 3336 773 -2720 -336 4544 4018 -839 -2129 1870 3506 -850 -4761 -2313 1864
1797 1864 524 -3939 -3531 1660 3633 -93 -2473 1090 4872 2553 -2174 -1774 2393 2445 -2454 -4682
1813 -4682 -880 2460 -171 -3801 -1647 3413 3658 -583 -1553 2679 4795 839 -3213 -1399 2258
$$ packed form
1704D181k140m729Q05N061P87m846k292M016L365l128m458J597M788l42n087j434
1720c856M498K769l656l786K694M897p62m612j79M956J983m141l281K999L770
1735D293k500n346j94M375O86m803k483L857L922k177l716K034N504P92m245j285
1751a286M336K691l814m599J412L860j426n359j057M417K219l543k677L783N073
1766D030q60m071O75N043J184m679l158K866K897l373n141N57M453K49m498j308
1782e134M722L748k563l493K384M880n26m857j290L999J636m356l911K448M177
1797A864j340m463M08N191J973l726k380L563L782k319m727M00M167N2m899k228
1813d682L802L340k631l630K154N060K45m241r70M232K116l956m052J814L657
$$ plain form
1828 2258 540 -4440 -4826 -256 1703 -1783 -4007 -191 4357 2997 -960 -88 4430 4864 -10 -2790
1844 -2790 272 2936 -359 -4875 -3624 926 1143 -3000 -3705 1052 4206 1339 -1973 414 4596
1859 4596 3348 -1709 -2743 1164 2490 -1757 -5003 -2218 1777 343 -3626 -2766 2228 3618 -350
1874 -350 -2553 920 4160 1403 -3076 -2314 1867 1877 -2503 -3872 325 3502 974 -2194 220 4788
1890 4788 4218 -304 -1338 2460 3889 -360 -4146 -2143 1338 -321 -4596 -4116 792 2646 -717
1905 -717 -2495 1358 5158 3064 -1221 -710 3069 2642 -2517 -5020 -1966 318 -2807 -6359 -4124 840
1921 840 1256 -2193 -2043 3018 5855 2890 -143 2152 5623 3623 -1476 -2320 1233 1944 -2440 -5161
1937 -5161 -1966 1935 452 -2993 -1498 3560 4686 906 -798 2630 5129 1882 -2542 -1740 1832
$$ packed form
1828B258j718m980l86M570J959l486k224L816M548j360l957Q72M518M34m874k780
1844b790L062K664l295m516J251M550K17m143p05M757L154k867l312K387M182
1859D596j248n057j034L907J326m247l246K785L995j434l969Q60M994J390l968
1874c50k203L473L240k757m479P62M181J0m380j369M197L177k528l168K414M568
1890D788n70m522j034L798J429m249l786K003L481j659m275M80M908J854l363
1905g17j778L853L800k094m285N11L779m27n159k503L054K284l125l552K235M964
1921H40M16l449J50N061K837k965l033K295L471k000n099q44L553P11m384k721
1937e161L195L901j483l445J495N058J126l780j704L428K499l247m424Q02L572
$$ plain form
1952 1832 940 -3901 -5351 -1568 835 -2138 -5012 -2347 2090 1516 -2360 -2383 1976 3607 -173 -3037
1968 -3037 -280 3170 1248 -2934 -2528 1811 2791 -975 -2788 790 4062 1719 -1986 -610 3624
1983 3624 3594 -730 -2137 1573 3954 877 -2538 -568 3384 2565 -1754 -2355 1594 3120 -691 -3768
1999 -3768 -1324 2098 290 -4076 -3905 230 1287 -2450 -4382 -872 2533 475 -3195 -1876 2456
2014 2456 2703 -1435 -2943 647 3192 227 -3262 -1432 2638 2178 -1803 -2229 2039 4180 995 -1761
2030 -1761 880 4681 3299 -931 -1077 2764 3650 -410 -3002 -269 2742 467 -3538 -2735 1404 1907
2046 1907 -2024 -3607 -41 2769 143 -3442 -1950 1953 1459 -2772 -3775 -54 1864 -1457 -4509
2061 -4509 -2116 1831 1016 -2718 -2453 1995 3705 423 -1734 1346 4752 2778 -1278 -826 3011 3236
$$ packed form
1952A832q92m841j450L783K403k973k874K665M437n74l876k3M359J631l780k864
1968c037K757L450j922m182M06M339R80l766j813L578L272k343l705J376M234
1983C624l0m324j407L710K381l077l415J970L952q19m319o01L949J526l811l077
1999c768K444L422j808m366J71M135J057l737j932L510L405k058l670J319M332
2014B456K47m138j508L590K545k965l489J830M070m60l981m26M268K141l185k756
2030a761K641L801j382m230j46L841Q86m060k592K733L011k275m005Q03M139N03
2046A907l931j583L566K810k626l585J492L903m94m231j003L721J918l321l052
2061d509K393L947q15l734K65M448J710l282k157L080L406j974m056M52L837K25
$$ plain form
2077 3236 -1065 -3135 54 2798 303 -3192 -1522 2774 2911 -849 -1567 2378 4597 1363 -2166
2092 -2166 -480 2781 1253 -3471 -4349 -869 358 -3227 -5643 -2643 1258 243 -2976 -1840 2805
2107 2805 4073 508 -1493 1542 4173 1441 -2699 -2126 1340 1034 -3095 -4286 -434 2401 81
2122 81 -2498 14 4408 4161 409 -97 3537 4823 982 -2368 -496 2360 340 -3936 -3818 245
2138 245 1358 -2065 -3748 -296 3159 1349 -2163 -1106 2768 2636 -1651 -3383 -141 2093 -858
2153 -858 -4213 -2347 1766 1566 -2096 -2376 1769 3866 747 -2088 125 3395 1763 -2549 -2727 1110
2169 1110 2212 -1340 -3398 -183 3391 1885 -1462 -388 3710 4087 18 -1949 873 2917 -267
2184 -267 -4239 -3172 477 187 -3534 -4046 145 2835 452 -1887 710 4500 3454 -671 -1256 2087
$$ packed form
2077C236m301k070L189K744k495l495J670M296J37l760p18L945K219l234l529
2092b166J686L261j528m724q78L480J227l585k416L000L901j015l219J136M645
2107B805J268l565k001L035K631k732m140N73L466l06m129j191L852K835k320
2122H1k579K512M394k47l752n06L634J286l841l350J872K856k020m276J18M063
2138B45J113l423j683L452L455j810l512J057L874j32m287j732L242K234k951
2153h58l355J866M113k00l662k80M145K097l119k835K213L270j632m312j78L837
2169A110J102l552k058L215L574j506l347J074M098L77m069j967K822K044l184
2184b67l972J067L649k90l721n12M191K690k383k339K597L790j046m125n85L343
$$ plain form
2200 2087 2838 -1314 -4345 -2085 913 -744 -4272 -3205 1363 2691 -404 -1560 2105 5038 2634
2215 2634 -1108 -256 3105 2330 -2259 -3929 -748 1230 -1632 -4424 -1977 2252 1959 -1470 -1421 2739
2231 2739 4357 831 -2092 25 2831 715 -3548 -3493 275 1178 -2212 -3691 0 3534 1888 -1195
2247 -1195 230 4225 4165 -27 -1863 899 2492 -902 -4555 -3042 592 144 -3375 -3329 1112 3564
2263 3564 1027 -1192 1490 4876 3284 -1011 -1556 1508 1674 -2669 -5264 -2619 303 -1533 -4679
2278 -4679 -3101 1629 2803 -205 -985 2794 5419 2770 -788 357 3487 2284 -2337 -3638 -340
2293 -340 1331 -1774 -4357 -1736 2281 1688 -1614 -1179 2998 4343 818 -1568 956 3686 1367 -2802
2309 -2802 -2506 1068 1365 -2460 -4053 -710 2059 -223 -3399 -1845 2064 1839 -2028 -2932 621 2660
$$ packed form
2200B087P51m152l031K260K998j657l528J067M568J328l095j156L665K933k404
2215B634l742Q52L361p75m589j670L181J978k862k792K447M229k93l429M9M160
2231B739J618l526k923K117K806k116m263N5L768R03l390j479L691L534j646l083
2247a195J425L995o0m192j836K762J593l394l653J513L634m48l519M6M441K452
2263C564k537k219K682L386j592m295n45L064J66m343k595K645K922j836l146
2278d679J578M730J174l008p80L779K625k649l558J145L130j203m621j301L298
2293c40J671l105k583K621M017n93l302M35M177J345l525k386K524K730k319m169
2309b802K96L574K97l825j593L343K769k282l176J554L909k25l867r04L553K039
$$ plain form
2325 2660 -285 -3127 -972 2792 2098 -1501 -1531 2352 3811 366 -2153 269 3223 1213 -2814 -2627
2341 -2627 1075 1743 -1817 -3423 22 3201 1373 -1598 -42 3993 3980 61 -1352 1714 3309 -177
2357 -177 -3923 -2714 413 -607 -4506 -4728 -687 1334 -1318 -3174 12 3914 2874 -631 -234 3427
2373 3427 3873 -200 -2724 -332 1989 -557 -4284 -3249 710 1133 -2250 -2912 1104 4031 1846 -960
2389 -960 920 4576 3843 -283 -1324 1844 2984 -704 -3802 -1782 1431 110 -3602 -3329 758 2136
2405 2136 -1036 -2847 170 3286 1505 -2064 -1331 2338 2469 -1510 -3189 -125 2309 -236 -3505
2420 -3505 -2010 1754 1550 -2097 -2702 1040 3126 268 -2385 -157 3409 2341 -1452 -1583 2131 3303
2436 3303 -147 -2515 48 2983 1114 -2562 -1977 1802 2218 -1494 -3077 136 2825 518 -2762
$$ packed form
2325B660k945k842K155L764o94l599l0L883J459l445k519K422K954k010m027J87
2341b627L702O68l560j606L445L179j828k971J556M035j3l919j413L066J595l486
2357a77l746J209L127j020l899k22M041K021k652j856L186L902j040l505L97L661
2373C427M46m073k524K392K321k546l727J035L959M23l383o62M016K927k185k806
2389i60J880L656p33m126j041L168J140l688l098K020L213j321l712K73M087J378
2405B136l172j811L017L116j781l569P33L669J31l979j679L064K434k545l269
2420c505J495L764k04l647o05L742K086k858k653K228L566j068l793j31L714J172
2436C303l450k368K563K935j869l676N85L779M16l712j583L213K689k307l280
$$ plain form
2451 -2762 -1393 2368 2178 -1664 -2625 845 2774 -220 -3216 -1291 2194 1196 -2662 -2885 933 2473
2467 2473 -681 -2939 -273 3014 1546 -2047 -1524 2326 3004 -667 -2589 366 3020 745 -2737
2482 -2737 -1678 2103 2149 -1518 -2581 848 3136 469 -2489 -661 2925 2164 -1748 -2371 1146 2599
2498 2599 -688 -3323 -1042 2180 769 -2864 -2468 1425 2489 -925 -2758 294 3224 1203 -2284
2513 -2284 -1333 2341 2429 -1404 -2798 359 2577 -138 -3264 -1520 2251 1793 -1872 -2388 1347 3225
2529 3225 254 -2312 -12 3271 1969 -1860 -1918 1697 2544 -1057 -3285 -619 2359 480 -2986 -2119
2545 -2119 1699 2250 -1253 -2574 695 3263 847 -2390 -939 2647 2249 -1628 -2615 770 2569 -421
2561 -421 -3231 -1191 2227 1278 -2361 -2403 1357 2737 -508 -2667 42 3197 1541 -2044 -1502 2151
$$ packed form
2451b762J369L761j90l842r61L470J929k994k996J925L485r98l858k23L818J540
2467B473l154k258K666L287j468l593N23L850O78l671j922K955K654k275l482
2482b737J059L781M6l667j063L429K288k667k958J828L586p61l912o23L517J453
2498B599l287k635K281L222j411l633L96L893J064l414j833L052K930k021l487
2513b284R51L674Q8l833j394L157K218k715l126J744L771m58l665n16L735J878
2529C225k971k566K300L283j302l829n8L615Q47l601k228K666K978j879l466Q67
2545b119L818N51l503j321L269K568k416l237J451L586l98l877r87L385J799k990
2561d21k810K040L418r49l639m2L760J380l245k159K709L155j656l585N42L653
$$ plain form
2577 2151 2619 -1003 -2687 271 2771 363 -3004 -1778 1910 1821 -1898 -2821 696 2872 166 -2640
2593 -2640 -659 2874 2039 -1708 -2022 1565 2850 -482 -3025 -616 2470 928 -2723 -2338 1427 2240
2609 2240 -1186 -2843 223 3010 945 -2388 -1337 2354 2348 -1361 -2582 646 2796 114 -2849 -1162
2625 -1162 2415 1824 -1768 -2179 1417 3023 -101 -2699 -514 2654 1279 -2434 -2342 1285 2202 -1159
2641 -1159 -3008 -85 2916 1170 -2124 -1124 2634 2877 -824 -2397 534 2615 -125 -3447 -2156
2656 -2156 1272 828 -2774 -3234 551 2651 53 -2263 193 3730 2741 -901 -1009 2361 3123 -554
2672 -554 -3063 -781 1853 -129 -3640 -2836 1047 1812 -1360 -2479 991 3784 1774 -1220 108 3500
2688 3500 2944 -1073 -2355 636 2172 -992 -4020 -2248 1115 358 -3069 -3002 850 2462 -397 -2415
$$ packed form
2577B151M68l622j684K958K500k408l367J226L688q9l719r23L517K176k706k806
2593b640J981L533q35l747l14L587J285l332k543K409L086j542l651L85L765Q13
2609B240l426j657L066K787k065l333J051L691ol709j221L228K150k682k963J687
2625a162L577n91l592m11L596J606l124k598K185L168j375l713R2L627R17l361
2641a159j849K923L001j746l294J000L758K43l701j573K931K081k740l322J291
2656b156L428m44l602m60L785K100k598k316K456L537r89l642j08L370P62l677
2672e54k509K282K634j982l511Q04L883P65l172j119L470K793k010k994J328L392
2688C500n56m017j282K991J536l164l028J772L363p57l427O7L852J612k859k018
$$ plain form
2704 -2415 254 3365 1847 -1713 -1342 2184 2692 -918 -2780 4 2529 433 -2788 -1665 1908
2719 1908 1924 -1663 -2686 665 2844 297 -2456 -601 2967 2436 -1045 -1369 2184 3633 520 -2021
2735 -2021 53 2796 1023 -2917 -2994 311 920 -2560 -4392 -1477 1518 -35 -2795 -1289 2733 3271
2751 3271 48 -1075 2020 3979 1099 -2358 -1364 1513 502 -3469 -4206 -801 1025 -1453 -3360
2766 -3360 -529 3344 2836 -160 355 4092 5069 1604 -876 1100 3182 677 -3289 -3070 58 259
2782 259 -3133 -4299 -931 1895 149 -2368 -526 3277 3204 -292 -1280 1698 3022 -204 -3270 -1777
2798 -1777 1116 -73 -3684 -3740 -59 1434 -1256 -2964 -79 3166 1892 -1207 -529 3020 3485 -4
2814 -4 -1714 1012 3260 936 -2277 -1188 2244 2096 -1413 -2353 824 2695 23 -2662 -905 2338
$$ packed form
2704b415K669L111j518l560L71L526N08l610j862K784K525k096l221J123L573
2719A908J6l587j023L351K179k547k753J855L568n31l481l24L553J449l113k541
2735b021K074K743j773l940p7L305O09l480j832K915K995j553k760J506M022N38
2751C271l223j123L095J959k880l457R94K877j011l971p37L405J826k478j907
2766c360K831L873n08k996N15L737R77l465k480J976K082k505l966K19L128K01
2782B59l392j166L368K826j746k517J842L803p3l496r88K978J324l226l066J493
2798a777K893j189l611n6L681J493k690j708K885L245j274l099O78L549M65l489
2814dj710K726K248k324l213J089L432j48l509r40L177J871k672k685J757L243
$$ plain form
2830 2338 1535 -1997 -2330 1095 2474 -476 -2717 -427 2525 1084 -2387 -2170 1139 1675 -1736 -3554
2846 -3554 -927 1648 -257 -3290 -2142 1542 1956 -1101 -1914 1370 3642 1360 -1384 99 3279
2861 3279 2473 -1213 -1967 1068 2407 -558 -2967 -849 2236 1225 -1919 -1540 2044 3060 10 -1834
2877 -1834 708 3210 1183 -2281 -1789 1315 1311 -2202 -3574 -675 1506 -671 -3362 -1724 1781 1612
2893 1612 -1619 -2062 1290 2962 208 -2303 -418 2489 1330 -2110 -2131 1178 2182 -810 -2659 -25
2909 -25 2823 1400 -1633 -908 2576 3005 -256 -1681 981 3049 720 -2346 -1349 1763 1394 -2045
2925 -2045 -2895 190 2038 -413 -2792 -931 2276 1582 -1648 -1793 1454 2558 -492 -2749 -684 1970
2941 1970 437 -2840 -2475 913 1636 -1329 -2657 210 2834 1133 -1603 -430 2889 2780 -628 -1781
$$ packed form
2830B338q03l532l33L425J379k950k241K290K952j441l471K17L309N36l411j818
2846c554K627K575j905l033J148L684M14l057q13L284K272k282k744J483L180
2861C279q06l686p54L035J339k965k409K118L085j011l144L79L584J016l050j844
2877a834K542K502k027l464M92L104ml513j372K899K181k177k691J638L505j69
2893A612l231m43L352J672k754k511J885K907j159l440k1L309J004k992j849K634
2909b5K848j423l033P25L484M29l261j425K662K068k329l066R97L112l69l439
2925b045q50L085J848k451k379J861L207o94l230j45L247J104l050k257K065K654
2941A970j533l277L65L388P23k965j328K867K624j701k736J173L319j09l408j153
$$ plain form
2957 -1781 983 2625 3 -2787 -1363 1654 1010 -2156 -2341 1031 2585 -7 -2022 195 3062
2972 3062 1765 -1583 -1547 1501 1985 -1300 -3153 -779 1631 -113 -2880 -1746 1767 2103 -855 -1792
2988 -1792 1165 3210 902 -1919 -723 2089 1358 -2105 -2697 305 1815 -705 -2722 -512 2608
3003 2608 1794 -1178 -1007 2219 3013 -82 -2168 -187 1953 2 -3235 -2652 580 1018 -1899 -2815
3019 -2815 304 2805 1130 -1343 59 3171 2748 -661 -1694 905 2089 -767 -3360 -1730 1182
3034 1182 452 -2454 -2140 1387 2864 450 -1163 1159 3694 2073 -1224 -1072 1693 1718 -1653 -3317
3050 -3317 -906 1240 -567 -3129 -1786 1633 1811 -1048 -1713 1202 2835 328 -2322 -979 1697
3065 1697 802 -2450 -2732 365 1794 -559 -2259 151 3061 2013 -928 -614 2360 2744 -484 -2400
$$ packed form
2957a781K764J642k622k790J424L017o44l166j85L372J554k592k015K217K867
2972C062j297l348L6L048M84l285j853K374K410j744k767J134L513L36k958r37
2988a792K957K045k308k821J196K812p31l463n92L002J510k520k017K210L120
3003B608q14k972J71L226P94l095k086J981K140j951l237N83L232M38k917r16
3019b815L119K501j675k473J402L112m23l409j033K599J184k856k593J630K912
3034A182p30k906L14L527J477k414j613K322K535j621l297J52K765K5l371j664
3050c317K411K146j807k562J343L419J78k859o65K915J633k507k650J343K676
3065A697q95l252k82L097J429k353j700K410K910j048k941L14K974L84l228j916
$$ plain form
3081 -2400 -276 1769 -84 -2908 -1865 1517 1973 -609 -1164 1897 3983 1826 -840 257 2735
3096 2735 1595 -2215 -3317 -974 -74 -2769 -4761 -2593 594 161 -2107 -1155 2536 3820 1288 -315
3112 -315 1778 3658 1422 -2106 -2122 250 -79 -3315 -4378 -1496 904 -511 -2210 -59 3709 3967
3128 3967 1337 948 3718 4719 1769 -1127 -137 1768 88 -3415 -3703 -840 182 -2222 -3476 -749
3144 -749 2240 1280 -1182 -424 2621 2837 -319 -1896 205 1802 -517 -3385 -2457 462 359 -2408
3160 -2408 -2856 189 2087 79 -1979 -225 2576 1816 -1118 -1313 1634 2630 97 -1657 499 3109
3176 3109 1967 -764 -347 2514 2809 -260 -1883 156 1840 -306 -3184 -2405 494 566 -2119 -2579
3192 -2579 510 2585 774 -1225 361 3037 2202 -1110 -1877 436 1005 -2036 -4378 -2701 -226 -1109
$$ packed form
3081b400K124K045j853k824J043L382M56k582n55L061K086k157k666J097K478
3096B735j140l810j102K343R00k695j992K168L187m33k268R52L691J284k532j603
3112c15K093J880k236l528j6K372l29l236j063K882K400j415j699K151L768K58
3128C967k630l89K770J001k950k896R90J905j680l503k88K863J022k404j254K727
3144g49K989r60k462P58L045K16l156j577K101J597k319k868R28K919j03k767
3160b408m48L045J898k008k058J754K801p60k934j95K947R96k533j754K156K610
3176C109j142k731M17K861K95l069j623K039J684k146k878P79K899P2k685m60
3192b579L089K075j811j999J586K676q35l312p67K313N69l041k342J677K475q83
$$ plain form
3208 -1109 -3479 -2634 988 2369 367 -461 2315 4672 3084 196 587 2939 2397 -1149 -2700 -667
3224 -667 821 -1279 -3502 -1901 1268 1361 -960 -869 2339 3847 1576 -575 841 2966 1453 -1952
3240 -1952 -2386 -25 355 -2524 -4099 -1862 602 -545 -2770 -1666 1629 2184 -418 -1369 1121 2857
3256 2857 804 -1766 -768 1803 1303 -1681 -2210 556 2068 -90 -1988 -192 2482 1767 -998 -1023
3272 -1023 1755 2549 -103 -1829 87 2313 932 -1825 -1325 1534 1925 -815 -2081 224 2080 196
3288 196 -2367 -1465 1175 877 -2001 -2693 -73 1556 -437 -2447 -820 1964 1450 -1265 -1383 1368
3304 1368 2380 -147 -1986 -174 2045 752 -2035 -1677 1153 1790 -733 -1930 417 2585 1086
3319 1086 -1333 -459 2318 2225 -677 -1679 689 2132 -50 -2414 -1153 1418 893 -1829 -2095 661
$$ packed form
3208a109k370Q45L622J381k002q28K776K357j588k888L91K352n42l546j551K033
3224f67J488k100k223J601L169R3k321R1L208J508k271k151J416K125j513l405
3240a952m34K361L80k879j575K237K464j147k225J104L295N55k602r51K490J736
3256B857k053k570R98K571n00k984n29K766J512k158j898J796K674p15k765k5
3272a023K778P94k652j726J916K226j381k757N00K859L91k740j266K305J856j884
3288A96k563R02K640k98k878o92K620J629j993k010J627K784n14k715j18K751
3304A368J012k527j839J812K219j293k787L58K830O37k523j197K347K168j499
3319A086k419Q74K777r3k902j002K368J443k182k364J261K571n25k722k66K756
$$ plain form
3335 661 1918 -349 -2115 -266 2141 1084 -1732 -1528 1175 1779 -904 -2367 -295 1758 274 -2185
3351 -2185 -1374 1502 1710 -930 -1761 719 2473 597 -1731 -550 2068 1631 -1200 -1731 809 1981
3367 1981 -305 -2260 -559 1891 1009 -1672 -1553 1223 2072 -391 -1930 70 2220 779 -1828 -1351
3383 -1351 1352 1555 -1167 -2274 22 1875 103 -2178 -1082 1678 1549 -1093 -1664 874 2269 96
3399 96 -1941 -440 2015 1184 -1636 -1755 922 1821 -600 -2178 -199 2048 864 -1668 -1203 1501
3415 1501 1878 -776 -1993 231 2025 305 -2147 -1235 1461 1354 -1281 -1888 667 2200 212 -1855
3431 -1855 -409 2126 1453 -1379 -1664 867 1798 -622 -2415 -631 1710 697 -1794 -1348 1499 2129
3447 2129 -316 -1560 638 2601 977 -1636 -1071 1431 1297 -1558 -2521 -179 1396 -479 -2528 -1104
$$ packed form
3335F61J257k267j766J849K407j057k816K04K703O04k683j463K072K053j484k459
3351b185Q11K876K08k640q31K480J754j876k328J181K618m37k831n31K540J172
3367A981k286j955J701K450q82k681J19K776Q49k463j539K000K150j441k607M77
3383a351K703K03k722j107K296J853j772k281J096K760j29k642n71K538J395k173
3399I6k037J501K455q31k820j19K677Q99k421j578J979K247j184k532M65K704
3415A501L77k654j217K224J794j720k452R12K696j07k635o07K555J533j988k067
3431a855J446K535o73k832k85K531R31k420j793J784K341j013k491M46K847O30
3447B129k445j244K198J963j624k613N65K502j34k855r63K342J575j875k049J424
$$ plain form
3463 -1104 1658 1420 -1081 -1276 1463 2691 473 -1450 50 2231 1065 -1813 -1837 681 1209 -1337
3479 -1337 -2740 -608 1645 413 -1882 -993 1880 2246 -250 -1129 1202 2789 833 -1579 -631 1745
3495 1745 1181 -1728 -2358 80 1334 -832 -2702 -1050 1499 839 -1596 -1368 1487 2405 58 -1447
3511 -1447 530 2614 1246 -1469 -1130 1374 1459 -1326 -2564 -446 1278 -443 -2652 -1485 1331 1353
3527 1353 -1078 -1470 1268 2853 943 -1014 367 2693 1778 -1138 -1559 797 1397 -1227 -3029 -1281
3543 -1281 905 -158 -2539 -1883 1088 1855 -378 -1280 1088 3091 1525 -886 -137 2276 1912 -1119
3559 -1119 -2202 -92 1186 -949 -3083 -1782 858 498 -1899 -1856 1116 2498 444 -1101 801 3103
3575 3103 1997 -784 -788 1604 1860 -959 -2613 -799 990 -609 -3034 -2186 652 977 -1345 -1919 793
$$ packed form
3463a104K762k38k501j95K739J228k218j923J500K181j166k878k4K518N28k546
3479a337j403K132K253j232k295Q89K873L66k496q79K331J587j956k412R48K376
3495A745n64k909o30K438J254k166j870J652K549o60k435K28K855R18k347j505
3511a447J977K084j368k715L39K504Q5k785j238K118J724j721k209J167K816K2
3527A353k431l92K738J585j910j957J381K326r15k916m21K356O00k624j802J748
3543a281K186j063k381O56K971P67k233r02K368K003j566k411P49K413l64l031
3559a119j083K110J278k135k134J301K640l60k397M3K972J382k054j545J902K302
3575C103j106k781mK392K56k819j654J814J789j599k425Q48K838L25k322n74K712
$$ plain form
3592 793 2738 1114 -919 368 2852 2326 -589 -1278 969 1822 -740 -2832 -1443 794 -133 -2640
3608 -2640 -2374 578 1646 -418 -1486 797 3079 1835 -600 -63 2441 2398 -568 -1927 -73 1316
3624 1316 -711 -3115 -2140 473 332 -2082 -2270 562 2195 370 -1312 423 2917 2076 -665 -911
3640 -911 1445 1991 -668 -2448 -767 1223 -90 -2556 -1976 859 1458 -867 -1778 631 2634 1092
3656 1092 -1148 -210 2338 2062 -712 -1551 740 1945 -260 -2406 -1081 1347 717 -1917 -2076 601
3672 601 1654 -572 -2133 -242 2050 1026 -1487 -1127 1558 2073 -522 -1802 230 2080 457 -2016
3688 -2016 -1302 1250 1168 -1487 -2204 209 1828 7 -1992 -566 2116 1745 -830 -1091 1443 2488
3704 2488 184 -1726 -178 1926 784 -1996 -1909 708 1297 -1139 -2416 -288 1892 615 -1668 -874
$$ packed form
3592G93J945j624k033J287K484n26k915o89K247Q53k562k092J389K237r27k507
3608b640K66K952J068k064j068K283K282j244k435N37K504m3k966j359J854J389
3624A316k027k404R75K613j41k414j88K832J633j825j682J735K494q41k741k46
3640i11K356N46k659j780J681J990j313k466N80K835N99k325r11K409K003j542
3656A092k240R38K548k76k774q39K291J205k205k146J325K428o30k634j59K677
3672F01J053k226j561J891K292j024k513L60K685N15k595j280K032J850j623k473
3688b016P14K552q2k655p17K413J619j821j999J426K682l71k575k61K534J045
3704B488k304j910J548K104j142k780Q7K617N89k436j277K128K180j277k283P94
$$ plain form
3720 -874 1823 1953 -649 -1589 648 2171 182 -2147 -1128 1317 923 -1726 -2116 473 1805 -229
3736 -229 -1945 -251 2182 1373 -1208 -1151 1456 2143 -383 -1967 -135 1908 514 -1958 -1439 1220
3752 1220 1526 -990 -1963 377 2182 463 -1775 -768 1776 1501 -1204 -1825 560 1883 -230 -2201
3768 -2201 -736 1690 966 -1613 -1580 1113 2013 -288 -1845 -2 2153 924 -1608 -1205 1357 1685
3784 1685 -883 -2036 121 1902 303 -1994 -1037 1594 1540 -1084 -1731 692 2110 110 -1964 -630
3800 -630 1731 1045 -1642 -1859 695 1691 -575 -2242 -444 1853 891 -1577 -1186 1504 2098 -439 -1732
3817 -1732 321 2190 594 -1860 -1146 1445 1450 -1153 -1958 444 2091 333 -1679 -402 2178 1688
3833 1688 -1019 -1445 964 1970 -396 -2359 -867 1311 321 -2257 -2027 704 1464 -750 -1934 244
$$ packed form
3720h74K697J30k602r40K237J523j989k329J019K445l94k649l90K589J332k034
3736b29j716J694K433q09k581N7K607O87k526j584J832K043j394k472N19K659
3752A220L06k516r73K340J805j719k238J007K544k75k705o21K385J323k113j971
3768b201J465K426p24k579L3K693R00k301j557J843K155j229k532M03K562L28
3784A685k568j153K157J781j599k297R57K631n4k624o47K423J418k000k074J334
3800f30K361o86k687k17K554R96k266j667J798K297r62k468L91K690N94k537j293
3817a732K053J869j596k454P14K591Nk603q05K402J647j758k012J277K580m90
3833A688k707m26K409J006k366j963J492K178r90k578K30K731P60k214j184K178
$$ plain form
3849 244 2380 1029 -1387 -780 1729 1729 -1045 -2178 -84 1438 -426 -2544 -1333 1399 1247 -1137
3865 -1137 -1305 1474 2917 910 -896 608 2801 1727 -1152 -1422 870 1399 -1151 -2766 -852 1314
3881 1314 123 -2149 -1409 1461 1942 -446 -1480 738 2373 525 -1916 -1175 1185 797 -1971 -2615
3897 -2615 -176 1263 -636 -2421 -805 1766 1291 -1178 -1199 1425 2295 0 -1640 110 2288 1120
3913 1120 -1414 -979 1734 2233 -168 -1319 777 2548 828 -1632 -967 1421 1164 -1626 -2418 -122
3929 -122 1414 -408 -2291 -749 1959 1648 -779 -978 1473 2373 -145 -2176 -848 994 -384 -3179
3945 -3179 -3104 -501 253 -1832 -2666 -92 2395 1511 -371 712 3488 3549 781 -460 1379 2373 -41
3962 -41 -2658 -1901 331 -120 -2538 -2594 308 2004 440 -858 1195 3705 2871 191 -48 2023 2110
$$ packed form
3849B44K136j351k416O07K509%k774j133K094J522j864k118J211K732j52k384
3865a137j68K779J443k007j806J504K193j074k879k70K292N29k550j615J914K166
3881A314j191k272P40K870M81k388j034K218J635j848k441P41K360l88k768o44
3897b615K439J439j899j785J616K571m75k469k1K624Q70k295j640J750K178j168
3913A120k534M35K713M99k401j151K096J771j720k460O65K388k57k790p92K296
3929a22J536j822j883J542K708l11k427j99K451R00k518k031J328J842j378k795
3945c179P5K603P54k085q34K574K487q84j882J083K776O1k768j241J839R94k414
3962d1k617P57K232m51k418n6K902J696j564j298K053K510q34k680k39K071Q7
$$ plain form
3979 2110 -937 -2938 -1515 68 -1503 -3874 -3127 -227 405 -1650 -2049 685 2722 1229 -815 170
3995 170 2508 1957 -941 -1715 459 1429 -734 -2600 -1022 1473 944 -1355 -1120 1678 2590 382 -1101
4012 -1101 687 2630 1263 -1295 -948 1530 1762 -753 -1785 427 2244 606 -1655 -834 1512 1168
4028 1168 -1629 -2471 -358 817 -1267 -3162 -1716 838 503 -1663 -1438 1434 2653 605 -926 704
4044 704 2622 1219 -1578 -1623 581 714 -1890 -3108 -891 1220 113 -1672 -387 2668 3019 775
4060 775 162 2402 3598 1319 -1197 -510 1298 290 -2653 -3157 -782 393 -1528 -2814 -738 1871
4076 1871 1331 -759 -316 2261 2710 113 -1510 10 1502 -285 -2876 -2368 68 253 -2000 -2512
4092 -2512 73 2005 636 -1105 239 2728 2307 -320 -944 1240 2093 -194 -2141 -735 1415 596
$$ packed form
3979B110l047k001J423J583j571k371P47K900O32k055l99K734K037j493k044R85
3995A70K338n51k898p74K174R70k163j866J578K495n29k299K35K798R12k208j483
4012a101J788J943j367k558L47K478K32k515j032K212J817j638k261Q21K346l44
4028A168k797q42K113J175k084j895J446K554l35k166K25K872J219k048j531J630
4044G04J918j403k797m5K204J33k604j218K217K111j107j785J285L055L51k244
4060G75o13K240J196k279k516O87J808j008k943n04K375J175j921j286K076K609
4076A871n40k090M43K577M49k597j623J520J492j787k591N08K436J85k253n12
4092b512K585J932j369j741J344K489m21k627o24K184Q53k287j947J406K150q19
$$ plain form
4108 596 -1738 -1489 1209 2059 -113 -1408 454 2342 981 -1513 -1196 1100 1153 -1407 -2425 -310
4124 -310 1368 -147 -2082 -918 1695 1577 -831 -1377 906 2066 -20 -1994 -806 1333 566 -1969
4140 -1969 -1974 564 1536 -466 -1739 193 2394 1377 -926 -581 1788 2006 -532 -1786 47 1592
4156 1592 -54 -2275 -1407 1088 1092 -1217 -1706 690 2170 405 -1437 -186 2029 1296 -1278 -1592 639
4173 639 1460 -742 -2303 -629 1529 602 -1651 -1243 1312 1915 -327 -1445 468 2194 669 -1632
4189 -1632 -1019 1329 1295 -1160 -1933 225 1678 21 -1849 -653 1687 1282 -1105 -1434 862 1813 -263
4206 -263 -1949 -517 1555 644 -1717 -1579 853 1501 -632 -1798 100 1990 731 -1473 -841 1576
4222 1576 1674 -729 -1588 444 1901 233 -1741 -754 1544 1276 -1113 -1466 825 1939 -7 -1714
$$ packed form
4108E96k334K49K698Q50k172j295J862J888j361k494L17K296N3k560j018K115
4124c10J678j515j935J164K613j18k408n46K283J160k086j974J188K139p67k535
4140a969nK538R72k002j273J932K201j017k303L45K369K18k538j254J833J545
4156A592j646k221Q68K495Mk309m89K396J480j765j842J251K215p33k574l14K231
4173F39Q21k202j561J674K158r27k253M08K555O03k242j118J913J726j525k301
4189a632O13K348l4k455p73K158J453j657j870J196K340m05k387l29K296R51k076
4206b63j686J432K072r11k361J38K432O48k133j166J898J890j259k204O32K417
4222A576R8k403q59K032J457j668j974R87K298k68k389l53K291J114j946j707
$$ plain form
4238 -1714 -321 1801 1018 -1403 -1448 813 1463 -727 -2095 -386 1474 334 -1867 -1375 1068 1385
4254 1385 -843 -1778 279 1864 365 -1671 -811 1436 1223 -1144 -1698 478 1701 -55 -1795 -432
4270 -432 1823 1344 -879 -932 1404 2248 169 -1332 199 2000 811 -1552 -1392 820 1126 -1137 -2173
4287 -2173 -262 1523 262 -1629 -772 1627 1617 -665 -1323 669 1858 -70 -2098 -1191 814 249
4303 249 -2098 -2313 41 1144 -604 -1804 -34 2180 1509 -591 -285 2016 2437 126 -1291 256
4319 256 1700 255 -1974 -1477 737 878 -1287 -1834 412 2009 630 -1088 2 2228 1826 -559
4335 -559 -1089 860 1634 -449 -2245 -1079 790 -31 -2230 -2094 285 1066 -835 -1919 -122 1774
4351 1774 780 -1242 -743 1557 1702 -503 -1429 485 1915 366 -1574 -742 1428 1198 -1068 -1557 528
$$ packed form
4238a714J393K122p83k421m5K261O50k190j368J709J860j140k201M92K443L17
4254A385k228r35K057J585j499k036Q60K247k13k367n54K176J223j756j740J363
4270d32K255m79k223n3K336Q44k079j501J531J801j189k363J60K212L06k263j036
4287b173J911J785j261j891Q57K399j0k282o58J992J189j928k028R07K005n65
4303B49k347k15K354J103j748j200J770K214o71k100L06K301M21k311j417J547
4319B56J444j445k229M97K214J41k165n47K246J597j379j718J090K226m02k385
4335e59n30J949P74k083j796J166J869q21k199J36K379P81j901j084J797J896
4351A774r94k022M99K300J45k205r26J914J430j549j940Q32K170k30k266m89K085
$$ plain form
4368 528 1632 -123 -1714 -372 1731 1182 -949 -888 1403 2203 257 -1111 348 1995 826 -1482
4384 -1482 -1357 592 712 -1637 -2667 -887 705 -494 -2213 -1203 1313 1516 -418 -798 1315 2553
4400 2553 850 -982 -73 1658 788 -1682 -2133 -165 618 -1226 -2479 -788 1372 848 -904 -339
4416 -339 2120 2713 729 -406 1151 2518 923 -1399 -1145 658 457 -1817 -2591 -648 791 -539
4432 -539 -2049 -748 1601 1425 -549 -755 1330 2246 339 -1302 -199 1443 487 -1768 -1793 259 794
4449 794 -1122 -2127 -361 1431 467 -1335 -707 1582 1803 -230 -977 811 2106 609 -1273 -463
4465 -463 1509 1162 -1095 -1534 405 1376 -374 -1891 -677 1232 627 -1394 -1302 871 1587 -246 -1392
4482 -1392 236 1924 871 -1181 -871 1162 1317 -858 -1828 -196 1154 -240 -2033 -1203 949 911
$$ packed form
4368E28J104j755j591J342K103n49k131O1K291Q00j946j368J459J647j169k308
4384a482J25J949J20k349j030J780J592j199j719J010K516K03j934l80K113J238
4400B553j703j832R09J731q70k470m51J968P83j844j253J691K160n24j752N65
4416c39K459N93j984j135J557J367j595k322K54J803k01k274p74J943J439j330
4432e39j510J301K349j76j974k06K085R16j907j641J103J642r56k255k5K052N35
4449G94j916j005J766J792r64j802O28K289K21k033p47J788J295j497j882Q10
4465d63J972l47k257m39J939R71j750j517J214J909o05k021R2K173P16j833j146
4482a392J628J688j053k052L10K033J55k175r70J632J350j394j793Q30K152l8
$$ plain form
4498 911 -1032 -1349 760 1927 425 -1111 36 1941 1326 -845 -1100 799 1391 -579 -1930 -550
4514 -550 1187 325 -1579 -1223 951 1442 -424 -1261 442 1930 661 -1211 -601 1321 1189 -952 -1599
4531 -1599 191 1290 -201 -1839 -776 1229 835 -1123 -1258 761 1590 -151 -1490 -147 1599 824
4547 824 -1245 -1088 952 1386 -535 -1571 32 1571 451 -1387 -841 1194 1252 -783 -1471 300 1565
4564 1565 149 -1538 -627 1292 1007 -984 -1288 658 1572 -67 -1511 -269 1521 809 -1234 -1162 792
4581 792 1314 -536 -1645 -168 1392 366 -1458 -995 1049 1227 -728 -1456 340 1633 308 -1380
4597 -1380 -573 1339 1100 -910 -1329 552 1501 -124 -1582 -448 1313 771 -1211 -1181 816 1466 -281
4614 -281 -1420 33 1635 690 -1183 -840 1132 1344 -641 -1502 62 1390 141 -1601 -934 995
$$ packed form
4498I11j943l17K109J167j502j536J147J905o15k171k55J899N92j970j351J380
4514e50J737q62j904L56K174M91j866q37J703J488j269j872O10J922j32k141o47
4531a599J790J099j491j638J063K005l94j958j35K019Q29j741j339J343J746p75
4547H24k069J57K040M34j921j036J603J539j120j838N46K035N8k035o88J771J265
4564A565j416j687R11J919k85j991l04J946R14j639j444J242J790p12k043P2J954
4581G92N22j850j109J477J560j026j824M63K044J78j955p28J796J293j325j688
4597a380Q07J912k39k010m19J881R49j625j458J134J761n42j982L0J997O50j747
4614b81j139J453J602r45j873L43J972K12j985q61J564J328j249j742O67J929
$$ plain form
4630 995 923 -1025 -1444 390 1508 30 -1447 -385 1462 988 -1004 -1156 705 1423 -311 -1563 -313
4647 -313 1321 509 -1351 -1041 945 1395 -420 -1329 252 1729 627 -1127 -570 1331 1308 -671 -1343
4664 -1343 306 1408 -45 -1618 -714 1131 809 -1116 -1321 617 1463 -101 -1394 -208 1458 687
4680 687 -1249 -1201 680 1106 -750 -1811 -343 1146 208 -1494 -917 1106 1338 -457 -1088 658 1857
4697 1857 537 -1096 -389 1390 1042 -986 -1413 358 1245 -283 -1583 -362 1427 940 -875 -769
4713 -769 1207 1764 1 -1155 137 1542 430 -1500 -1257 506 634 -1244 -1980 -302 1045 -93
4729 -93 -1599 -707 1261 1230 -588 -1048 728 1671 158 -1367 -409 1230 681 -1240 -1361 560 1285 -346
4747 -346 -1452 -36 1610 851 -894 -602 1305 1613 -153 -1050 451 1735 547 -1211 -675 1164
$$ packed form
4630I95p2j948m19J834J118j478j477J062J847m74j992j52J861P18j734j252J250
4647c13J634q12j860L10J986M50j815r09J581J477j102j754N57J901k3j979o72
4664a343J649J102j453j573R04J845l22j925k05J938Q46j564j293J186J666p71
4680F87j936M8J881M26j856j061J468J489r38j702N77K023K32j795o31J746J199
4697A857j320j633P07J779l48k028m27J771Q87j528j300J221J789m87j815J06
4713g69J976N57j763j156J292J405j112j930K43J763J28j878p36J678J347j138
4729i3j506Q92J968l1j818m60J776R43j513j525R58J639n49j921j21J921P25j631
4747c46j106J416J646p59j745K92J907L08j766q97J501J284j188j758N36J839
$$ plain form
4763 1164 1092 -886 -1482 123 1109 -324 -1859 -1001 763 415 -1401 -1505 445 1303 -155 -1300 13
4780 13 1740 1054 -812 -740 1010 1249 -670 -1791 -449 862 -208 -1922 -1285 790 1131 -448 -769
4797 -769 1136 2465 1292 -231 533 2153 1585 -588 -1217 261 782 -1029 -2455 -1377 395 -35
4813 -35 -1618 -1221 903 1697 221 -654 829 2202 1083 -910 -799 733 565 -1488 -2383 -879 344
4830 344 -762 -2087 -1045 1074 1171 -398 -548 1391 2349 850 -641 247 1716 979 -1080 -1297 434
4847 434 952 -685 -1716 -253 1374 674 -1027 -614 1305 1548 -337 -1199 219 1393 144 -1550
4863 -1550 -966 871 780 -1008 -1423 351 1433 49 -1415 -509 1134 627 -1331 -1555 183 876 -696
4880 -696 -1758 -366 1391 807 -770 -386 1591 2034 278 -717 571 1678 373 -1519 -1205 474
$$ packed form
4763A164p2j978n96J605R86j433j535Q58J764l48j816j04J950Q58j458j145J313
4780A3J727o86j866P2J750K39j919j121J342J311j070j714O37K075L41j579l21
4797g69J905J329j173j523P64J620n68k173o29J478N21j811j426J078J772m30
4813c5j583L97K124P94j476q75J483J373j119j993J11J532j68k053q95J504J223
4830C44j106j325J042K119R7j569j50J939R58j499j491Q88J469p37k059k17J731
4847D34N18j637j031J463J627p00j701M13J919K43j885q62J418J174j249j694
4863a550N84J837r1j788m15J774J082j384j464R06J643n07j958k24J738O93j572
4880f96j062J392J757n84j577L84J977M43j756r95J288J107j305j892L14J679
$$ plain form
4896 474 366 -1438 -1892 -56 1257 207 -1031 74 1986 1717 -131 -481 1126 1621 -235 -1776
4912 -1776 -884 506 -315 -2096 -1883 140 853 -611 -1241 396 2006 1151 -495 -85 1620 1466 -603
4929 -603 -1477 -92 884 -462 -1984 -1153 785 733 -870 -950 969 1923 519 -825 173 1641 855 -1196
4947 -1196 -1382 303 755 -966 -1913 -504 1122 432 -1115 -507 1467 1742 -74 -893 542 1549 159
4964 159 -1611 -1077 619 418 -1362 -1660 198 1367 144 -1019 178 1966 1480 -399 -605 1021
4980 1021 1429 -439 -1745 -663 718 -174 -1874 -1499 483 972 -598 -1199 450 1849 799 -845
4996 -845 -335 1341 1131 -842 -1548 7 907 -447 -1826 -816 1050 793 -873 -884 1041 1808 295
5013 295 -877 277 1717 866 -1025 -944 765 1130 -622 -1494 -24 1383 404 -1211 -703 1102 1179
$$ packed form
4896D74j08j804m54J836J313j050j238J105J912k69j848l50J607M95j856j541
4912a776Q92J390q21j781K13K023P13j464o30J637J610q55j646M10J705j54k069
4929f03q74J385R76j346j522Q31J938n2j603q0J919R54j404j344R98J468p86k051
4947a196j86J685M52j721r47J409J626o90j547O08J974K75j816q19J435J007j390
4964A59j770N34J696k01j780k98J858J169j223j163J197J788m86j879k06J626
4980A021M08j868j306J082J381q92j700L75J982M89j570o01J649J399j050j644
4996h45N10J676k10j973p06J555R00j354j379J010J866k57j666j1J925P67j513
5013B95j172J154J440q51j891Q1J709L65j752q72J470J407r79j615N08J805P7
$$ plain form
5030 1179 -671 -1336 194 1183 -180 -1712 -913 815 558 -1223 -1402 435 1331 -122 -1316 -164
5046 -164 1417 749 -1081 -1046 719 1134 -609 -1583 -160 1309 482 -1122 -567 1332 1614 -101 -694
5063 -694 879 1957 630 -1003 -357 1252 914 -1036 -1482 199 1061 -352 -1616 -553 1162 684
5079 684 -1036 -984 824 1317 -405 -1524 -289 1104 133 -1653 -1350 447 673 -1029 -1658 -58 1288
5096 1288 248 -1210 -405 1459 1412 -381 -826 847 1760 302 -1167 -271 1381 908 -922 -1016 755
5113 755 1464 -95 -1184 102 1664 924 -839 -661 1072 1309 -510 -1509 -175 1025 -170 -1853
5129 -1853 -1315 470 463 -1273 -1719 41 1235 61 -1310 -368 1402 1010 -799 -1050 636 1262 -354
5146 -354 -1657 -531 1062 387 -1280 -1027 969 1523 11 -763 770 2195 1202 -513 -133 1538 1408
$$ packed form
5030A179j850o65J530R89j363j532P99J728k57j781j79J837Q96j453j194J152
5046a64J581o68j830L5J765M15j743r74J423J469q27j604N55J899K82j715n93
5063f94J573J078j327j633O46J609l38j950m46J681Q62j413j264J063J715m78
5079F84j720N2J808M93j722j119J235J393r71j786L03J797K26j702o29J600J346
5096A288j040j458Q05J864m7j793m45J673R13j458j469Q96J652m73j830r4J771
5113G55P09j559j089J286J562p40j763J78J733K37j819r99J334J200j195j683
5129a853N38J785pj736m46J760J194j174j371R42J770l92j809k51J686O26j616
5146c54j303J126J593o75j667K53J996N54j512p74J533J425r93j715L80J671j30
$$ plain form
5163 1408 -623 -1405 21 1025 -346 -1865 -1081 720 541 -1116 -1280 622 1509 63 -1184 -150
5179 -150 1361 657 -1265 -1345 323 702 -1004 -1982 -598 871 77 -1469 -900 1077 1395 -268 -916
5196 -916 700 1862 655 -933 -290 1392 1180 -667 -1045 646 1528 104 -1226 -209 1427 881
5212 881 -962 -1068 663 1186 -474 -1581 -295 1142 361 -1307 -939 973 1283 -446 -1247 160 1347
5229 1347 118 -1618 -1096 581 399 -1489 -1900 -176 947 -206 -1388 -205 1695 1479 -174 -257
5245 -257 1464 2041 358 -991 -55 1217 212 -1660 -1565 256 672 -907 -1564 121 1659 866 -581
5262 -581 85 1851 1784 -188 -936 419 1164 -420 -2052 -1343 267 -30 -1718 -1782 155 1158 -84
5279 -84 -1046 257 1886 1238 -580 -588 1055 1281 -536 -1627 -371 942 -20 -1573 -1022 923 1181 -424
$$ packed form
5163A408k031p82J426J004j371j519P84J801j79j657j64J902Q87j446j247J034
5179a50J511p04j922q0J668L79j706r78J384J469p94j546N69J977L18j663o48
5196i16J616J162j207j588O43J682k12j847l78J691Q82j424j330J017J636n46
5212H81j843j06J731N23j660j107J286J437p81j668L68J912L10j729q01J407J187
5229A347j229j736N22J677j82j888m11J724J123j153j182J183J900k16j653q3
5245b57J721N77j683j349R36J272j005j872R5J821M16j579o57J685J538p93j447
5262e81O66J766o7j972p48J355P45j584j632P09J610k97j688o4J937J003j242
5279h4r62J303J629o48j818qJ643K26j817j091J256J313r62j553N51J945K58j605
$$ plain form
5297 -424 -952 695 1843 600 -949 -325 1282 944 -953 -1374 239 1088 -314 -1509 -370 1318
5313 1318 812 -880 -846 935 1413 -293 -1386 -248 1074 152 -1607 -1228 560 848 -738 -1316 336
5330 336 1679 604 -884 -225 1488 1275 -639 -1179 326 1110 -350 -1752 -795 885 496 -1130 -1085
5347 -1085 846 1566 100 -945 258 1673 832 -992 -874 735 934 -850 -1686 -253 1039 57
5363 57 -1428 -735 1107 1178 -497 -972 611 1564 185 -1251 -493 1108 671 -1100 -1258 467 1241 -183
5381 -183 -1261 -81 1480 834 -887 -777 909 1161 -566 -1525 -223 1030 81 -1505 -975 882 1063
5398 1063 -558 -1027 584 1680 459 -991 -287 1237 815 -1062 -1459 127 880 -597 -1750 -588
5414 -588 1082 660 -873 -684 1178 1713 167 -813 435 1675 630 -1162 -943 658 682 -1070 -1753
$$ packed form
5297d24n28J647J148j243j549O24J607l38j897m21J613Q49j402j195J139J688
5313A318n06j692L4J781M78j706j093J138J322r22j759L79J788K88j586n78J652
5330C36J343j075j488O59J713k13j914n40J505P84j460j402R57J680l89j626M5
5347a085J931P20j466j045J203J415q41j824J18J609J99j784q36J433J292r82
5363E7j485O93J842P1j675m75J583R53j379j436P58J601m37j771j58J725P74j424
5381a83j078J180J561o46j721J10J686K52j727r59J302J253r49j586N30J857J81
5398A063j621m69J611J096j221j450P04J524m22j877l97J586P53j477j153J162
5414e88J670m22j533J89J862N35j546r80J248J240j045j792K19J601K4j752o83
$$ plain form
5431 -1753 -230 980 -57 -1381 -544 1241 1178 -487 -790 859 1643 153 -1203 -330 1122 504 -1285
5448 -1285 -1370 302 871 -655 -1574 -233 1244 527 -1028 -654 1127 1405 -261 -1005 381 1491 368
5465 368 -1176 -602 1032 854 -898 -1326 291 1187 -96 -1366 -491 1165 744 -921 -982 720 1320
5482 1320 -130 -1168 -60 1360 603 -1092 -901 754 1052 -607 -1456 -133 1094 97 -1393 -815
5498 -815 919 981 -630 -1092 460 1489 313 -1041 -257 1282 918 -812 -1095 478 1113 -312 -1482
5515 -1482 -376 1093 542 -1099 -911 858 1289 -235 -1110 208 1403 457 -1120 -690 917 933 -803
5532 -803 -1405 63 1120 -36 -1374 -599 1104 920 -723 -978 632 1408 -21 -1188 -206 1232 607
5549 607 -1093 -1094 562 1035 -454 -1321 -95 1275 498 -1024 -633 1087 1208 -428 -1116 273 1302
$$ packed form
5431a753J523J210j037j324Q37J785o3j665l03J649P84j490j356Q73J452o18j789
5448a285q5J672N69j526r19J341J477p17j555L74J781K78j666p44J386J110j123
5465C68j544N74J634j78j752m28J617Q96j283j270Q75J656m21j665o1J702O00
5482A320j450j038J108J420p57j695J91J655K98j659q49J323J227r97j490N78
5498h15J734O2j611m62J552J029j176j354P84J539l64j730k83J573O35j425j170
5515a482J106J469n51j641J88J769M31j524q75J318J195r46j577M30J607J6j736
5532h03o02J468J057j156j338P75J703j84j643k55J610P76j429j167R82J438o25
5549F07j700jJ656M73j489q67J226J370p77j522L91J720J21j636o88J389J029
$$ plain form
5566 1302 157 -1301 -705 843 688 -946 -1297 284 1139 -74 -1234 -247 1292 879 -743 -818 797
5583 797 1289 -195 -1221 -141 1156 375 -1218 -967 656 921 -608 -1286 103 1282 349 -1044 -466
5600 -466 1128 1093 -530 -968 479 1323 55 -1272 -498 997 594 -1063 -1234 370 999 -385 -1385
5617 -1385 -253 1158 583 -936 -702 958 1292 -218 -1006 257 1379 391 -1120 -756 764 746 -869
5634 -869 -1382 54 1046 -81 -1286 -453 1176 983 -515 -672 885 1533 177 -998 -95 1168 495
5651 495 -1204 -1166 347 679 -790 -1563 -278 1076 363 -978 -492 1163 1358 -181 -782 521 1412
5668 1412 230 -1195 -672 784 495 -1119 -1413 123 945 -213 -1218 -192 1323 876 -591 -548 968
5685 968 1366 -156 -1149 -87 1076 272 -1255 -995 603 826 -665 -1207 190 1261 307 -999 -412
$$ packed form
5566A302j145j458N96J548j55j634l51J581Q55j213j160R87J539m13j622p5J615
5583G97M92j484j026J080J297p81j593K51J623K65j529o78J389J179r33j393N78
5600d66J594l5j623m38J447Q44j268j327P74J495m03j657j71J604O29j384j000
5617a385J132J411n75j519K34J660L34j510p88J263J122r88j511L64J520j8j615
5634h69n13J436R92j127j205Q33J629j93j498j57J557O48j356j175R03J263o73
5651D95j699L8J513L32j469p73J285J354p13j341M86J655J95j539o01J303Q91
5668A412j182j425N23J456k89j614k94J536Q22j158j005J026J515m47j467M3J516
5685I68L98j522r93J062J163q04j527K60J598K23j491n42J397J071r54j306N87
$$ plain form
5702 -412 1092 907 -713 -1088 315 1075 -101 -1278 -385 1069 671 -802 -774 759 1282 -106 -1105
5719 -1105 -77 1122 364 -1186 -989 507 733 -666 -1282 37 1188 374 -885 -337 1184 1144 -411
5736 -411 -924 352 1122 -93 -1365 -702 687 383 -1098 -1159 431 1172 -18 -938 101 1484 902
5753 902 -626 -566 869 1108 -406 -1269 -162 937 83 -1254 -785 837 925 -503 -941 421 1332 234
5771 234 -1026 -441 900 583 -981 -1239 210 879 -291 -1295 -280 1143 699 -712 -653 833 1174
5788 1174 -300 -1189 -175 901 34 -1361 -988 597 810 -512 -884 523 1589 713 -494 126 1482
5805 1482 1165 -463 -933 263 808 -513 -1679 -836 540 189 -1142 -970 686 1308 134 -647 434
5822 434 1576 747 -797 -730 537 536 -1055 -1787 -622 374 -453 -1574 -827 804 955 -336 -535 935
$$ packed form
5702d12J504j85j620l75J403P60j176j177Q93J454l98j473K8J533N23j388r99
5719a105J028J199p58j550J97J496K26j399o16J319J151q14j259N48J521m0j555
5736d11n13J276P70j215j272O63J389l04j481o1J590P41j190r20J039J383n82
5753I02j528O0J435K39j514q63J107J099q54j337M69J622Q8j428m38J362R11j098
5771B34j260N85J341l17j564k58J449O69j170j004J015J423m44j411N9J486L41
5788A174j474q89J014J076q67j395L73J585K13j322l72J407J066q76j207O20J356
5805A482l17j628m70J196N45j321j166Q43J376l51j331J72J656O22j174p81J081
5822D34J142q29j544O7J267jj591p32J165R96q27j121P47J631J51j291j99J470
$$ plain form
5840 935 1725 620 -577 87 1293 771 -819 -1023 285 781 -479 -1324 -249 1057 534 -728 -483
5857 -483 997 1296 -65 -807 271 1216 299 -1075 -726 643 592 -847 -1283 26 854 -189 -1323
5874 -1323 -635 734 481 -975 -1144 247 877 -299 -1164 -188 1120 679 -685 -504 953 1320 -40
5891 -40 -818 226 1215 366 -1020 -717 709 758 -663 -1033 314 1266 394 -702 -25 1363 1153 -338
5909 -338 -627 577 1056 -273 -1402 -691 449 -84 -1482 -1392 85 596 -591 -1190 -38 1170 555
5926 555 -701 -404 938 1014 -429 -1071 42 897 -60 -1302 -709 729 673 -595 -766 642 1433 420
5944 420 -547 240 1474 1022 -440 -569 722 1073 -304 -1194 -315 808 159 -1120 -878 551 823 -503
5962 -503 -1091 88 1046 202 -1070 -645 685 560 -861 -1291 -42 714 -308 -1312 -546 811 578
$$ packed form
5840I35P90j105j197O64J206n22j590k04J308M96j260q45J075J306n23j262K45
5857d83J480K99j361p42J078R45r17j374L49J369n1j439m36J309Q28j043j134
5874a323O88J369k53j456j69J391O30j176q65R76J308m41j364J81J457L67j360
5891d0p78J044R89q49j386L03J426M9j421l70J347R52q72j096O77J388k10j491
5909c38k89J204M79j329j129P11J140n33j398R0J477N11j187n99J152J208o15
5926E55j256K97J342P6j443o42J113Q55r57j242N93J438n6j268j71J408P91j013
5944D20r67P87J234m52j462j29J291L51j377q90Q79J123o49j279K42J429K72j326
5962e03n88J179R58q44j272M25J330j25j421m30J249P56j022j004P66J357k33
$$ plain form
5979 578 -744 -761 661 1245 117 -768 134 1315 718 -654 -554 805 977 -333 -1010 76 1085
5996 1085 314 -883 -421 992 996 -327 -782 424 1200 158 -1015 -457 750 402 -1028 -1254 33
6013 33 612 -492 -1345 -431 826 421 -822 -667 737 1060 -214 -962 59 1042 260 -1034 -731 636
6031 636 728 -541 -990 267 1173 351 -734 -99 1199 997 -387 -682 554 1115 -37 -1062 -319 855
6049 855 432 -901 -847 522 951 -267 -1002 -37 1000 301 -1022 -843 455 622 -738 -1244 -82 859
6067 859 60 -986 -377 1010 948 -368 -698 523 1140 30 -1090 -430 735 355 -985 -994 376 945
6085 945 -129 -833 204 1421 874 -444 -265 980 1071 -336 -1097 -175 634 -252 -1448 -988 431 521
6103 521 -685 -923 469 1328 420 -595 33 1211 832 -642 -927 211 642 -586 -1466 -552 684
$$ packed form
5979E78j322j7J422N84j128q85R02J181n97j372J00J359J72j310o77J086J009
5996A085p71j197M62J413Mj323m55J206P76j042j173N58J207l48j430k26J287
6013C3N79j104q53R14J257m05j243J55J404L23j274p48J021R83p82j294L03J367
6031F36R2j269m49J257R06q22j085O35J298k02j384k95J236N61j152j025P43J174
6049H55m23j333N4J369M29j218p35R65J037o99j323J79J298J67j360n06J162R41
6067H59p99j046O09J387o2j316l30J221O17j110j120O60J165l80j340rJ370N69
6085I45j074p04J037J217n47j318J79J245R1j407p61R22Q09q86j196M60J419R0
6103E21j206k38J392Q59r08j015O28J178l79j474k85J138M31j228q80R14J236
$$ plain form
6120 684 284 -866 -586 867 1273 73 -584 461 1322 424 -922 -663 523 455 -903 -1318 -80 817
6138 817 16 -958 -212 1175 976 -329 -545 640 1088 -162 -1199 -514 576 47 -1246 -1126 343
6155 343 824 -205 -742 447 1543 881 -356 -126 1076 1008 -520 -1172 -204 570 -420 -1503 -905 527
6173 527 556 -620 -643 766 1488 474 -500 165 1236 626 -853 -1050 83 369 -894 -1643 -623 551
6191 551 68 -994 -553 954 1207 11 -514 556 1374 452 -822 -464 706 549 -805 -1100 165
6208 165 905 -18 -969 -163 1108 822 -491 -589 645 1055 -181 -1084 -254 814 249 -982 -773 641
6226 641 895 -327 -897 145 1065 204 -1075 -728 462 348 -995 -1364 -129 664 -195 -1046 -210 1176
6244 1176 1049 -170 -245 1026 1474 242 -777 -92 809 144 -1233 -1167 138 472 -641 -1135 122 1294
$$ packed form
6120F84m00j150K80J453M06j200o57J045Q61q98j346K59J186o8j358m15J238Q97
6138H17q01r74P46J387j99j305k16J185M48j250j037O85J090n29j293J20J469
6155C43M81j029n37J189J096o62j237K30J202o8j528o52R68P74r90j083N98J432
6173E27K9j176k3J409P22j014r74O65J071o10j479j97J133K86j263p49J020J174
6191E51m83j062M41J507K53j196n25J070Q18r22j274L58J170j57j354k95J265
6208A65P40r23r51Q06J271k86j313r8J234M10j236r03Q30J068n65j231K09J414
6226F41K54j222n70J042R20q61j279L47J190j14j343l69J235P93q59q51Q36J386
6244A176j27j219p5J271M48j232j019O85R01o65j377O6J305L34j113m94J257J172
$$ plain form
6262 1294 762 -300 147 1447 1393 -29 -666 300 842 -346 -1568 -1132 37 -162 -1402 -1467 -20 792
6280 792 -89 -789 178 1434 1007 -311 -325 862 1061 -324 -1181 -312 620 -78 -1280 -903 497 727
6298 727 -430 -760 511 1450 621 -471 16 1252 1031 -392 -762 376 944 -155 -1178 -441 744
6315 744 311 -967 -964 376 823 -337 -1111 -212 850 258 -987 -724 599 795 -447 -982 135 1029
6333 1029 198 -958 -523 791 663 -672 -1014 177 894 -64 -1041 -295 1031 769 -488 -500 842 1344
6351 1344 215 -681 162 1160 509 -862 -811 453 605 -627 -1264 -213 784 64 -1037 -530 881 899
6369 899 -423 -796 342 1034 40 -1091 -511 671 356 -981 -1127 184 755 -310 -1088 -180 1059
6386 1059 637 -592 -476 893 1163 -92 -821 163 1071 324 -915 -599 672 780 -523 -961 210
$$ packed form
6262A294n32j062M47J300n4j422o37R66N42j188j222M36J169j99j240o5J447Q12
6280G92q81p00R67J256m27j318j4J187J99j385q57Q69R32o98j202L77J400K30
6298G27j157l30J271R39q29j092M87J236k21j423l70J138N68j099j023P37J185
6315G44m33j278LJ340M47j160p74Q99J062n92j245K63J323J96j242n35J117Q94
6333A029q31j156M35J314j28j335l42J191P17r58r77P46J326k62j257j2J342N02
6351A344j129q96Q43R98o51j371N1J264J52j232o37J051R97p20j101N07J411J8
6369H99j322l73J138O92r94j131N80J182l15j337j46J311N71j065p78R08J239
6386A059m22j229J16J369K70j255p29R84R08p47j239L16J271J08j303m38J171
$$ plain form
6403 210 1061 197 -884 -285 956 762 -584 -842 368 908 -194 -1169 -407 732 336 -939 -906 402
6421 402 830 -362 -1035 11 1033 366 -853 -565 732 843 -433 -974 135 989 115 -977 -452
6438 -452 829 728 -556 -813 461 1139 106 -856 -131 1056 667 -640 -718 526 894 -271 -1068 -173
6456 -173 899 295 -976 -757 605 812 -413 -1012 112 1041 235 -941 -506 794 704 -640 -972 227
6474 227 932 -63 -1087 -398 830 544 -754 -802 517 1002 -105 -938 -39 1072 525 -747 -617 704
6492 704 935 -329 -973 76 1021 247 -905 -522 740 777 -572 -955 255 1007 56 -1013 -390 831
6510 831 633 -684 -857 430 971 -121 -1030 -212 917 412 -847 -765 549 876 -349 -1043 -27 957
6528 957 282 -923 -580 761 834 -449 -900 236 1080 205 -915 -329 905 747 -586 -842 406 964
$$ packed form
6403B10Q51q64j081N99J241j94j346k58J210N40j102r75P62J139l96j275L3J308
6421D02M28j192o73J046J022o67j219K88J297J11j276n41J109Q54q74j092N25
6438d52J281j01j284k57J274O78j033r62P25J187l89j307p8J244L68j165p97Q95
6456a73J072o04j271K19J362K07j225n99J124R29q06j176M35J300r0j344l32J199
6474B27P05r95j024O89J228k86j298m8J319M85j107q33Q99J111n47j272J30J321
6492G04K31j264o44J049R45p74j152L83J262L7j349l83J210P52r51j069O23J221
6510H31j98j317j73J287N41j092r09Q18J129n05j259Q2J314L27j225o94J016R84
6528I57o75j205L43J341P3j283m51J136Q44q75j120N86J234j58j333k56J248N58
$$ plain form
6546 964 -91 -1038 -278 881 443 -853 -827 502 889 -264 -973 -22 1045 439 -792 -549 768 892
6564 892 -432 -999 71 888 17 -1109 -610 635 549 -720 -988 292 1031 62 -860 -82 1127 791
6582 791 -554 -645 635 1022 -177 -1038 -193 841 255 -1032 -815 516 775 -420 -967 180 1134 410
6600 410 -729 -310 986 918 -427 -844 293 952 -65 -1162 -530 655 376 -977 -1078 254 825
6617 825 -255 -1059 -125 1017 561 -697 -501 829 1086 -143 -827 140 1052 262 -993 -711 568 577
6635 577 -717 -1137 34 880 24 -916 -273 1089 952 -306 -469 779 1344 187 -817 -162 849
6652 849 274 -1122 -1137 90 435 -753 -1370 -299 851 340 -760 -359 1039 1224 -54 -568 482
6669 482 1188 173 -1070 -645 503 282 -1071 -1320 -50 688 -234 -1035 -121 1190 913 -257 -233 1050
$$ packed form
6546I64j055r47P60J159m38j296K6J329L87j153p09R51J067o06j231K43J317J24
6564H92j324n67J070Q17q71j126M99J245q6j269k68J280P39r69r22P78J209l36
6582G91j345r1J280L87j199q61Q45J034n86j287K17J331K59j195n47J147R54p24
6600D10j139M19J296o8j345m17J137O59j017j097O32J185k79j353j01J332N71
6617H25j080q04R34J142m56j258J96J330K57j229o84R67R12p90j255K82J279R
6635E77j294m20J171Q46q56r40O43J362j37j258j63J248N65j157j004O55J011
6652H49n75j396j5J227L45j188o17J071J150n11j100M01J398J85j278n14J050
6669D82P06j015j243M25J148k21j353k49J270P38r22q01R14J311k77j170K4J283
$$ plain form
6687 1050 1394 122 -744 76 1030 231 -1080 -940 296 472 -771 -1230 -69 851 127 -912 -330 949
6705 949 905 -417 -718 457 1058 15 -1001 -399 745 364 -945 -1010 254 728 -388 -1154 -215 944
6723 944 435 -771 -544 795 1052 -120 -716 386 1250 491 -708 -346 871 757 -572 -1025 104
6740 104 771 -184 -1206 -561 688 492 -697 -756 572 1131 78 -778 54 1116 579 -777 -796 372
6758 372 577 -654 -1366 -388 586 -40 -1089 -688 712 888 -243 -619 569 1372 476 -634 -171 975
6776 975 701 -669 -942 203 776 -287 -1154 -363 824 543 -650 -562 745 1107 -20 -760 128 1075
6794 1075 340 -910 -716 497 566 -708 -1222 -111 762 -13 -1060 -493 776 711 -507 -780 409 1055
6812 1055 12 -968 -280 858 527 -761 -795 461 906 -185 -921 -12 1024 469 -703 -495 753
$$ packed form
6687A050L44j272q66Q20R54p99j311J40J236J76j243m59J161R20p24j039N82J279
6705I49m4j322l01J175O01j043j016O02J144l81j309o5J264M74j116p66R39J159
6723I44n09j206K27J339K57j172n96J102Q64p59j199L62J217j14j329m53J129
6740A04O67r55j022O45J249j96j189n9J328N59j053q56Q32J062n37j356j9J168
6758C72K05j231p12R78R74o26j049M01J400J76j131l76J188Q03q96j110M63J146
6776I75k74j370k73J145N73j063q67P91J187k81j193Q8J307L62j127p40Q88R47
6794A075p35j250J94J213O9j274n14J111Q73p75j047N67J269o5j218k73J189O46
6812A055j043r80O88J138l31j288l4J256M45j091p36R09J036n55j172K08J248
$$ plain form
6829 753 930 -291 -872 155 1007 220 -898 -498 723 649 -592 -946 241 914 -11 -977 -346 812
6847 812 569 -694 -840 406 851 -217 -1009 -203 837 333 -848 -676 559 843 -302 -913 88
6864 88 1033 321 -773 -430 781 767 -462 -881 219 923 19 -957 -388 825 617 -620 -749 442
6882 442 976 -33 -901 -144 921 410 -830 -783 436 757 -404 -1029 -69 889 300 -805 -485 765
6900 765 868 -350 -782 238 962 110 -975 -501 685 532 -666 -872 303 936 20 -814 -80 1034
6918 1034 658 -578 -609 562 850 -344 -1063 -246 679 122 -1027 -754 495 752 -371 -796 299 1122
6936 1122 368 -719 -290 856 692 -548 -933 153 773 -177 -1060 -352 856 592 -562 -570 658 1099
6954 1099 48 -710 26 946 392 -847 -736 432 603 -559 -1064 -22 876 186 -815 -395 795
$$ packed form
6829G53J77j221n81J027Q52p87j118M00J221p4j241l54J187O73r25r66O31J158
6847H12k43j263j46J246M45j068p92Q06J040n04j181J72J235K84j145o11J001
6864H8R45p12j094L43J211j4j229m19J100P04r04r76N69J213k08j237j29J191
6882D42N34j009q68P57J065n11j240M7J219L21j161o25R60R58n89j105L20J250
6900G65J03j218m32J020P24q52j085M74J186j53j198k06J175O33r16q34P34J114
6918A034l76j236l1J171K88j194p19Q17R25n57j149K73J249K57j123m25J095Q23
6936A122p54j087M29J146j64j240l85J086O20r50q83P08J208k64j154qJ228M41
6954A099j051p58P36R20n54j239J11J168J71j162n05J042Q98o90j001M20J190
$$ plain form
6971 795 768 -464 -862 134 732 -195 -1180 -600 564 354 -760 -779 507 1077 155 -579 255 1231 713
6990 713 -542 -524 529 674 -525 -1218 -277 671 58 -909 -450 883 1060 -13 -332 705 1378 456
7008 456 -670 -335 606 218 -1093 -1409 -329 194 -660 -1366 -503 733 562 -457 -260 966 1286 186
7026 186 -577 168 915 155 -1100 -971 142 258 -824 -1152 -15 882 338 -506 70 1287 1222 24
7044 24 -267 724 1170 128 -891 -362 591 239 -920 -943 249 670 -300 -939 -96 883 368 -769 -662
7063 -662 473 640 -529 -1074 -116 724 34 -908 -468 724 692 -433 -754 276 853 -57 -1008 -492 595
7082 595 333 -758 -788 473 1022 177 -431 435 1481 1029 -109 -101 910 954 -318 -1059 -340 354 -355
7101 -355 -1384 -999 247 405 -556 -719 495 1275 531 -368 121 1046 687 -672 -1040 -123 173 -862
$$ packed form
6971G95k7j232l98R96N98r27r85N80J164k10j114j9J286N70r22p34Q34R76n18
6990G13j255J8J053J45j199o93R41R48o13r67M59J333J77j073l19J037O73r22
7008D56j126L35R41l88j311l16J080N23q54p06Q63J236j71j019J97J226L20j100
7026A86p63P45P47p60j255J29J113J16j082l28J137Q97n44q44N76J217o5j198
7044B4k91R91M46j042j019N29R53l52j159k3J192M21r70o39Q43R79n15j137J07
7063f62J135J67j169n45R58Q40o90r42M40J192l2j125l21J030N77r10r51N16J087
7082E95k62j091l0J261N49q45o08Q66J046m52j138QJ011M4j272p41P19O94p09
7101c55j029L85J246J58r61j63J214P80p44q99M89R25l59j359l68R17K96j035
$$ plain form
7119 -862 -1655 -862 209 -11 -929 -617 759 1221 360 -187 717 1534 817 -336 -237 729 616 -638 -1134
7138 -1134 -195 548 -160 -993 -374 842 812 -228 -364 703 1180 234 -660 -129 763 305 -941 -1006 69
7157 69 400 -569 -1150 -315 640 187 -858 -604 564 690 -386 -877 46 801 103 -834 -401 752 694
7176 694 -343 -557 518 1075 219 -643 -93 888 534 -605 -726 343 721 -197 -859 -46 940 508 -498
7195 -498 -316 801 961 -137 -737 63 727 -23 -1115 -849 218 235 -826 -1079 -3 727 10 -762
7213 -762 -114 956 762 -348 -499 530 846 -164 -939 -269 613 166 -859 -692 465 765 -146 -648
7231 -648 280 1127 551 -471 -198 814 821 -368 -795 99 725 -86 -1030 -483 579 448 -623 -735 346
7250 346 858 -33 -767 -141 797 395 -735 -707 346 612 -398 -990 -153 734 216 -731 -497 632 770
$$ packed form
7119h62p93P93J071k20r18L12J376M62q61n47R04Q17p17j153R9R66j13j254m96
7138a134R39P43p08q33O19J216l0j040j36J067M77r46q94N31Q92m58j246o5J075
7157F9L31r69n81Q35R55m53j045K54J168J26j076m91R23P55o98r37M33J153n8
7176F94j037k14J075N57q56q62N50R81l54j139j21J069L78r18o62Q13R86m32j006
7195d98J82J117J60j098o00Q00O64p50j092K66J067J7j061k53J076P30p17p72
7213g62O48J070j94j110j51J029L16j010p75O70Q82m47j025J67J157L00r11n02
7231f48R28Q47n76j022K73J012Pj189m27Q94O26q11r44N47J062j31j071j12J081
7250C46N12q91p34O26R38m02j130K8J053K66j010n92Q37Q87n18r47K34J129J38
$$ plain form
7269 770 -283 -698 233 909 213 -746 -311 709 573 -500 -743 291 839 1 -777 -171 827 515 -538
7288 -538 -567 488 813 -183 -844 -86 765 236 -784 -590 492 639 -380 -831 64 827 188 -760 -371
7307 -371 672 632 -447 -740 229 814 -8 -826 -271 702 443 -614 -675 374 802 -84 -776 -43 815
7326 815 406 -640 -525 507 687 -328 -855 -9 751 131 -837 -483 607 618 -402 -707 276 901 143
7345 143 -707 -225 771 490 -591 -724 286 709 -192 -919 -192 737 405 -632 -515 585 865 -107 -670
7364 -670 136 871 270 -752 -504 498 504 -569 -948 -44 645 -32 -834 -361 713 596 -424 -598 442
7383 442 931 52 -744 -140 766 392 -683 -694 345 648 -292 -890 -69 788 308 -671 -400 679 817
7402 817 -225 -668 233 898 219 -688 -304 670 561 -531 -786 184 671 -132 -919 -364 589 309 -700
$$ packed form
7269G70j053m15R31O76o96r59M35J020j36j073k43J034N48q38p78O06R98l12j053
7288e38k9J055L25r96o61P58Q51n29j020J94J082J47j019m51Q95P63o39r48L89
7307c71J043m0j079k93R69N85q22q18N55R73k59j057o1J049M28q86o92P33Q58
7326H15m09j046J15J032J80j015n27Q46P60o20r68L54J090J1j020l05R83O25p58
7345A43q50M82R96k81j081j33J010M23r01p27P27R29l32j037J17J100K80r72n63
7364f70Q06P35o01j022K48J002Oj073l79R04O89o77q02M73J074j17j020j74J040
7383D42M89q79p96O04R06l74j075j1J039L03r40n98Q21Q57m80r79K71J079J38
7402H17j042m43R01O65o79r07L84R74j09j092k55R70M87q03p87N55R53k80j009
$$ plain form
7421 -700 -706 341 746 -116 -751 39 923 437 -554 -409 587 708 -330 -859 -80 613 -36 -969 -601 474
7441 474 491 -454 -629 389 1039 325 -449 72 1041 757 -381 -576 338 648 -357 -1095 -427 420 3
7460 3 -936 -765 390 690 -198 -584 296 1108 516 -451 -194 728 684 -469 -908 -64 491 -283 -1157 -638
7480 -638 408 327 -612 -631 443 987 178 -441 206 1091 693 -379 -407 546 729 -300 -971 -210 531 -19
7500 -19 -956 -705 402 544 -392 -696 287 969 312 -551 -110 871 711 -361 -617 264 672 -215 -1022 -481
7520 -481 448 141 -894 -844 265 658 -214 -739 74 995 548 -395 -190 804 854 -183 -689 101 693 -9
7540 -9 -969 -654 398 338 -671 -836 162 813 69 -606 -26 987 728 -303 -402 581 829 -119 -881 -238
7560 -238 578 80 -950 -824 262 479 -433 -872 55 863 322 -577 -206 825 825 -263 -589 285 802
$$ packed form
7421g00oJ047M05q62o35P90Q84m86r91J45R96J21j038n29P79O93o49r33L68J075
7441D74J7r45j75J018O50p14p74N21R69k84j138j95R14L10j005p38O68Q47m17
7460Cr39J71J155L00q88l86Q80Q12n92r67K57R22m4j153m39Q44N55p74q74N19
7480f38J046q1r39j9J074N44q09o19O47Q85l98j072k8R53J83j029o71P61P41n50
7500a9r37K51J107J42r36l04R83O82o57q63M41R81j60j072k56Q81M08q87q07N41
7520d81R29l07j035N0J109L93q72n25Q13R21m47r43K05R94N0j037n06P90N92p02
7540ir60L15J052o0j009j65R98O51p44o75N80J013k59j031r9R83K48r48p62O43
7560b38Q16m98j030J26J086K17r12m39R27Q08n41q99L71J031%j088l26Q74N17
$$ plain form
7579 802 0 -911 -421 530 298 -756 -851 210 673 -171 -783 -70 868 521 -464 -362 676 848 -149
7598 -149 -680 61 790 153 -842 -610 437 453 -563 -877 44 735 53 -728 -240 808 650 -376 -553
7617 -553 421 900 -15 -765 -221 674 302 -754 -719 321 606 -328 -850 -40 811 314 -634 -373 677
7636 677 773 -253 -695 190 811 84 -792 -402 613 492 -552 -764 240 753 -35 -783 -177 769 494
7655 494 -553 -563 450 763 -191 -817 -99 745 275 -711 -540 495 662 -353 -770 96 788 145 -754
7674 -754 -413 635 558 -485 -749 219 795 -11 -793 -218 741 499 -538 -602 438 802 -98 -770 -79
7693 -79 794 334 -669 -570 489 675 -309 -797 26 783 184 -736 -412 644 632 -412 -749 175 787 9
7713 9 -815 -318 630 461 -603 -733 291 722 -147 -813 -125 809 428 -618 -508 519 771 -209 -738
$$ packed form
7579H02q02r11M90R51k32j054r5J061M63q44o12P13R38l47r85J02J038J72r97
7598a49n31P41P29o37r95K32J047J6j016l14R21O91o82p81M88J048j58j026j77
7617e53R74M79r15p50N44Q95l72j056L5J040K85r34n22Q10Q51m97r48K61J050
7636F77R6j026m42Q85O21p27q76L90J015j21j044k12J004N13p88p48O06R46k75
7655D94j047j0J013L13r54o26P18Q44m70r86J71J035J67j015m17Q66O92o43q99
7674g54L41J048p7j043k64R68N76q06p82N75R59k42j037o4J040L64r00o72O91
7693g9Q73m60j003R9J059J86r84m88Q23P57n99r20L24J056j2j044l37R24O12p78
7713Iq24M97R48j69j064j30J024M31q69o66O88R34l81j046J10J027K52r80n29
$$ plain form
7732 -738 66 816 234 -745 -477 561 613 -374 -722 210 857 154 -705 -255 733 589 -495 -704 270 717
7752 717 -172 -922 -297 609 300 -744 -687 368 719 -197 -792 4 831 300 -676 -487 539 611 -413
7771 -413 -838 42 716 62 -831 -384 686 644 -392 -568 445 937 139 -647 -97 836 514 -561 -629
7790 -629 361 683 -253 -886 -152 725 250 -715 -558 533 649 -343 -845 35 733 72 -849 -493 533
7809 533 490 -525 -780 196 741 -23 -818 -267 708 434 -612 -691 316 694 -165 -778 -53 907 512 -434
7829 -434 -276 788 990 -36 -592 178 870 184 -843 -605 353 349 -683 -983 18 707 43 -716 -157
7848 -157 925 746 -320 -494 431 789 -227 -1023 -474 362 -101 -1143 -1017 88 469 -391 -760 181
7866 181 1085 644 -242 9 1024 1005 -108 -600 171 721 -111 -1059 -613 415 313 -657 -724 411 982
$$ packed form
7732g38Q04P50n82r79K68J038N2r87l48R32O47p03q59M50R88j44j084k09R74M47
7752G17q89p50O25R06l09j044N7J055L51r16n95P96Q27n31r76J89J026P2j024
7771d13m25Q80O74o54q93M47J070m2j036j76J013M92p98p86N50R33l22j075o8
7790f29R90L22r36o33P34Q77m75r65J57J091J16r92n02Q80O98o61r21L56J026
7809E33m3j015k55R76N45p64p95N51R75k74j046p9J007L78q59o13P25R60l95r46
7829d34J58J064K02j026n56P70O92o86j027K38R58mj032l00J001O89o64p59N59
7848a57J082j79j066j74R25L58j016p96N49Q36m63j042J26J105L81q60l69R41
7866A81R04m41q86K51J015j9j113m92P71N50q32r48M46J028j02r70o7J135N71
$$ plain form
7885 982 219 -463 187 1058 687 -431 -486 437 622 -424 -1105 -394 435 -80 -1033 -755 340 528 -445
7904 -445 -785 127 836 181 -692 -353 684 567 -458 -693 286 850 53 -688 -118 856 590 -474 -546
7923 -546 461 760 -188 -861 -150 738 297 -629 -421 705 925 -44 -480 363 1042 335 -683 -448 457
7942 457 281 -874 -1231 -295 273 -430 -1133 -448 655 556 -354 -347 742 1170 235 -515 40 795 250 -896
7962 -896 -896 93 280 -653 -1082 -141 771 345 -438 22 1132 1165 153 -245 563 1034 129 -854 -512 384
7982 384 112 -941 -1023 26 532 -223 -796 -65 924 612 -412 -394 613 766 -272 -888 -200 524 -46
8001 -46 -996 -686 396 531 -412 -726 243 950 279 -585 -173 764 608 -489 -728 237 749 -88 -807 -136
8021 -136 827 559 -443 -419 598 854 -67 -722 -37 706 114 -908 -724 286 453 -491 -830 86 832
$$ packed form
7885I82p63o82O50Q71l71j118n5R23J85j046o81P11Q29n15r53K78J095J88r73
7904d45l40R12P09o55q73L39J037j17j025k35R79N64p97p41N70R74k66j064p2
7923e46J007K99r48o73P11Q88m41r26K08J126K20r69m36Q43O79p07j018K35R05
7942D57j76j155l57R36N68p03p03O85J103r9r10PJ089M28r35p50N55P55n45j146
7962h96%R89J87r33m29R41R12m26p83M60J110L3j012l98Q08M71r05r83L42Q96
7982C84k72j053q2J049N06p55n73P31R89l12j024J8J007J53j038o16O88P24n70
8001d6r50L10J082J35r43l14R69P07o71q64M12R37j56j097k39R65N12q37p19O71
8021a36R63k68j002K4J017K56r21o55O85P43n92j022J84J010J67r44l39R16P46
$$ plain form
8040 832 257 -613 -193 786 671 -394 -704 168 647 -239 -1026 -486 455 256 -705 -697 431 833 35 -558
8060 -558 155 1005 537 -482 -413 518 624 -419 -922 -151 609 14 -808 -435 607 672 -328 -568 403
8079 403 946 143 -695 -262 677 365 -679 -784 195 593 -242 -849 -107 811 435 -525 -393 613 803
8098 803 -190 -730 10 729 114 -822 -548 461 503 -490 -743 180 830 171 -634 -206 749 549 -482 -659
8118 -659 214 622 -237 -929 -284 571 271 -652 -595 485 779 -106 -615 145 902 371 -588 -375 555 587
8138 587 -407 -803 71 730 79 -744 -321 692 600 -370 -532 380 859 60 -702 -161 685 382 -688 -724
8158 -724 266 560 -329 -899 -204 650 208 -704 -510 500 647 -293 -746 100 770 138 -743 -422 553 503
8178 503 -469 -726 231 774 62 -681 -151 798 602 -371 -444 502 880
$$ packed form
8040H32n75q70M20R79j15j065l10Q72M79q86p87N40R41j99r61QJ128M02p98n93
8060e58P13Q50m68j019O9R31J06j043n03P71P60n95q22L73J042O5j000k40R71
8079D03N43q03q38M33R39l12j044j05R79L98q35o07P42R18l76r60J32J006J90
8098H03r93n40P40P19o15r36K74J009M2r93k53R23O50o59q05M28R55k00j031j77
8118f59Q73M08q59o92O45Q55l00r23N7J080K94q85n09P60P57n31r59K13R30L2
8138E87r94l96Q74O59o51q23M23J013r2r70j62R12M79p99p62N41Q46l03j070l6
8158g24R90K94q89n70O95Q54m42r12J94J010J47r40m53Q46O70o32q81L21R75n0
8178E03r72k57R57N43p12p43N30R49j96r73p3R46L78
8191H80
$$ Imaginary data points
##PAGE= N=2
##DATA TABLE= (X++(I..I)), XYDATA
$$ plain form
0 0 0 0 0 0 0 0 0 0 0 0 0 0 0 0 0 0 0 0 0 0 0 -1 1 -1 4 -8 8 -8 9 -9 9 -9 16 -17 17 -18 20 -26 26 -29 35 -35 43 -45 52
45 52 -55 61 -68 77 -82 90 -100 112 -122 135 -148 166 -184 208 -234 264 -302 350 -413 499 -624
66 -624 820 -1187 2079 -9103 -1892 23317 6611 -7145 20282 47745 20979 -6764 12763
79 12763 33099 6777 -20074 -11175 2016 -6516 -15754 -16104 -11019 2600 13221 1273 -7142 17145
93 17145 36535 11992 -10186 12204 30739 2728 -23193 -8156 7344 -7746 -22832 -17346
105 -17346 -8138 -4245 -3964 -11407 -13429 4657 15763 -4908 -19094 4774 21502 -4010 -23501
118 -23501 -1081 17597 30 -15132 -1670 12183 8187 1057 -975 2035 11450 12603 -5351
131 -5351 -13860 6395 16988 -7330 -21391 3737 20970 688 -13153 6583 22320 10928
$$ packed form
0@%%%%%%%%%%%%%%%%%%%%%jKkNj2J6j6J7j8J8j8K5l3L4l5L8m6N2n5O4p0P8q8R7
45E2j07J16j29J45j59J72j90K12k34K57k83L14l50L92m42M98n66O52p63R12j123
66f24J444k007L266j1182P211K5209j6706j3756K7427K7463k6766k7743J9527
79A2763K0336k6322k6851Q899J3191q532r238l50N085J3619J0621j1948q415K4287
93A7145J9390k4543k2178K2390J8535k8011k5921J5037J5500j5090j5086N486
105a7346R208L893K81p443k022J8086J1106k0671j4186K3868J6728k5512j9491
118b3501K2420J8678j7567j5162J3462J3853l996p130k032L010R415J153j7954
131e351q509K0255J0593k4318j4061K5128J7233k0282j3841J9736J5737j1392
$$ plain form
143 10928 -1063 2657 8864 8869 1575 -12035 -15740 -1964 1200 -20415 -28638 -3981 9481 -11025
157 -11025 -20313 4811 21207 6044 -5242 6571 16445 9959 -577 -6281 -4807 2121 -713
170 -713 -17320 -19984 1010 8830 -10734 -15808 10371 23742 5371 -4351 12834 23267 10754
183 10754 -1221 430 5110 4606 -3138 -14073 -12661 2297 3604 -14449 -16313 7435 15629 -4713
197 -4713 -11868 8573 17859 1028 -9875 -706 6821 736 -8621 -11604 -5452 3869 813 -12662
211 -12662 -10288 9769 12755 -6907 -10267 11201 17303 -2515 -10974 3871 11587 50 -9348
224 -9348 -5012 3328 5702 -581 -8080 -2449 11669 9573 -7524 -7197 12085 13468 -7473 -12650
238 -12650 5025 10416 -5364 -13217 -3039 5221 1120 -6051 -6715 1168 9090 3807 -8168 -4047
$$ packed form
143A0928j1991L720O207Np294j3610l705J3776L164k1615q223K4657J3462k0506
157a1025r288K5124J6396j5163j1286J1813R874o486j0536n704J474O928k834
170g13j6607k664K0994P820j9564n074K6179J3371j8371r722J7185J0433j2513
183A0754j1975J651M680n04p744j0935J412J4958J307j8053j864K3748Q194k0342
197d713p155K0441R286j6831j0903R169P527o085r357k983O152R321l056j3475
211a2662K374K0057K986j9662l360K1468O102j9818q459J4845P716j1537r398
224i348M336Q340K374o283p499N631J4118k096j7097L27J9282J383k0941n177
238a2650J7675N391j5780p853J0178Q260m101p171o64P883P922n283j1975M121
$$ plain form
252 -4047 11984 9705 -9306 -10290 8216 10537 -7392 -12475 1823 8259 -1393 -8200 -2795 5592
266 5592 6962 -332 -6668 208 11625 6105 -9561 -6826 10172 8664 -9798 -11545 4998 8419
280 8419 -5671 -10970 -525 6923 2193 -5468 -5475 3145 9212 1672 -8877 -2687 11207 6317 -10361
295 -10361 -8076 8871 8627 -7766 -10162 3844 8913 -749 -6952 -1177 7085 7172 -1050 -5908 2109
310 2109 11064 3338 -9947 -4659 9939 5646 -10989 -10224 5011 6587 -6285 -9815 298 6594
324 6594 1522 -5567 -4430 4105 7936 -772 -9216 -1550 9748 2801 -11531 -7208 7805 5890
338 5890 -8232 -8333 4744 8215 -923 -5830 517 8145 6694 -2064 -5289 3617 10612 1758 -9079
353 -9079 -1824 10973 5235 -9013 -5905 7917 7317 -5423 -8083 1509 6312 -411 -8137 -6274
$$ packed form
252d047J6031k279j9011r84J8506K321j7929n083J4298O436r652o807N405Q387
266E592J370p294o336O876J1417n520j5666K735J6998j508j8462j747J6543L421
280H419j4090n299J0445P448m730p661pQ620O067p540j0549O190J3894m890j6678
295a0361K285J6947k44j6393k396J4006N069r662o203N775Q262Q7q222m858Q017
310B109Q955p726j3285N288J4598m293j6635P65J5235J576j2872l530J0113O296
324F594n072p089J137Q535L831q708q444P666J1298o947j4332M323J5013j915
338E890j4122j01J3077L471r138m907O347P628j451q758l225Q906O995q854j0837
353i079P255J2797n738j4248L108J3822o00j2740k660R592M803o723p726J863
$$ plain form
367 -6274 2521 4862 -4315 -9996 -208 9755 1954 -9530 -2675 10738 6637 -7086 -6599 4734
381 4734 5744 -4656 -9915 -3919 2952 698 -7155 -7349 3516 10047 1911 -5126 4667 16194 9249
396 9249 -3494 67 11018 7525 -5623 -8567 -833 1906 -5400 -11952 -8169 1411 3498 -4379
410 -4379 -6672 4764 13459 5222 -4318 2798 13080 6354 -7060 -6512 2568 1246 -9642 -13962
424 -13962 -7019 -78 -2700 -9552 -7358 4455 9635 1297 -3548 6976 16013 7467 -3857 981
438 981 10713 5895 -6643 -8082 352 2844 -4663 -10448 -5560 3598 3599 -4834 -5708 5618 11635 2164
454 2164 -5428 3174 12467 5459 -5869 -3318 5776 4139 -6048 -9425 -2803 2182 -2750 -10446 -8273
469 -8273 1770 3834 -5471 -8640 2509 10477 2792 -5030 2134 11877 7635 -2513 -2092 5904 6705
$$ packed form
367f274Q795K341r177n681R788R963p801j1484O855J3413m101j3723M87J1333
381D734J010j0400n259N996O871k254p853j94J0865O531q136p037R793J1527o945
396I249j2743L561J0951l493j3148k944P734K739p306o552L783R580K087p877
410d379k293J1436Q695q237r540P116J0282o726j3414N48R080j322j0888m320
424a3962O943O941k622o852K194J1813N180q338m845J0524R037q546j1324M838
438I81R732m818j2538j439Q434K492p507n785M888R158Jq433q74J1326O017r471
454B164p592Q602R293p008j1328K551R094j637j0187l377O622M985m932p696K173
469h273J0043K064r305l169J1149P968p685p822P164R743m242j0148M21P996Q01
$$ plain form
484 6705 -2051 -8314 -4210 2556 -280 -9649 -9793 1194 5775 -2865 -7212 3307 12430 6187 -2266
499 -2266 2437 11528 8976 -1496 -4867 1085 4126 -3049 -11603 -9341 -461 -494 -9837 -10915 1038
514 1038 7831 167 -5406 3436 12780 8090 -1268 35 7737 7563 -1675 -7420 -2883 2784 -1736
529 -1736 -10831 -9476 1180 3736 -5329 -8177 2563 10129 3556 -3435 2233 10687 7830 -1362 -2932
544 -2932 3700 6099 -1321 -8703 -5292 2651 694 -8839 -9321 1305 5462 -2831 -7285 1490 9262
559 9262 4195 -3467 -394 7831 7582 -916 -5016 658 5768 342 -8292 -6265 2932 2949 -6728 -8722
575 -8722 1397 6813 -589 -6371 357 8607 5574 -2650 -2569 4960 7121 -315 -6318 -1699 5327
590 5327 1563 -7903 -7137 2886 4810 -4362 -7882 948 7386 1534 -5335 -1313 6636 5693 -2304
$$ packed form
484F705q756o263M104O766k836r369j44J0987M581q640m347J0519R123o243q453
499b266M703R091k552j0472l371N952L041p175q554K262Q880l3r343j078J1953
514A038O793p664n573Q842R344m690r358J303P702j74r238n745M537N667m520
529a736r095J355J0656K556r065k848J0740P566o573o991N668Q454k857r192j570
544b932O632K399p420p382L411P943j957r533m82J0626M157q293m454Q775P772
559I262n067p662L073Q225k49q498m100N674N110n426q634K027R197J7r677j994
575h722J0119N416p402n782O728Q250l033q224Q1P529K161p436o003M619P026
590E327l764r466P66J0023J924r172l520Q830O438n852o869M022P949r43p997
$$ plain form
605 -2304 -4588 2187 6665 572 -6837 -3249 5435 3913 -5602 -6539 2805 6208 -1853 -6759 -121
620 -121 6545 2427 -5167 -3849 3882 5496 -1665 -5997 -39 6653 2532 -5798 -3856 5169 5367 -3843
636 -3843 -6444 1773 6223 -599 -6950 -2523 4906 3359 -4147 -5139 2335 6379 323 -5723 -884
651 -884 7021 4242 -4918 -4713 4235 5965 -2722 -7092 -266 5573 834 -6172 -3913 3851 4652 -2628
667 -2628 -5697 1145 6908 1645 -6016 -2853 5848 4824 -4266 -5703 2566 6014 -1037 -6379 -1264
682 -1264 5565 3047 -4333 -4347 3241 6055 -771 -6005 -562 6485 2845 -5395 -3959 4602 5252 -2981
698 -2981 -5888 1223 6002 618 -5829 -2977 4186 3817 -3664 -5927 924 5493 -297 -6697 -2472
713 -2472 5417 3342 -4987 -4951 3446 5843 -1422 -5822 -152 5959 2593 -4419 -3499 3920 5431 -1770
$$ packed form
605b304k284O775M478o093p409L588Q684j522r515r37R344L403q061m906O638
620a21O666m118p594J318P731J614p161m332N958O692m121q330J942R025J98r210
636c843k601Q217M450o822o351M427P429j547p506r92P474M044o056o046M839
651h84P905k779r160K05Q948J730q687m370O826N839m739p006K259P764Q01p280
667b628l069O842N763n263p661L163Q701j024r090j437Q269L448p051n342N115
682a264O829k518p380j4P588K814o826n234N443P047l640q240J436Q561O50q233
698b981k907P111M779n384o447K852P163l69p481k263O851M569n790o400M225
713b472P889k075q329L6Q397K397p265m400N670O111l366p012R20P419J511p201
$$ plain form
729 -1770 -5717 721 6878 2205 -5364 -2583 5738 5284 -3034 -4964 2445 6270 266 -5546 -1849
744 -1849 4849 3083 -4632 -5805 1502 5016 -1626 -7235 -2093 5205 2232 -5512 -4359 3739 5077
759 5077 -2380 -5825 144 5299 922 -5869 -4180 3069 3702 -3454 -6165 821 6360 1668 -4333
774 -4333 -199 7729 6501 -1307 -2192 4888 7386 506 -5222 -1653 3944 1146 -6307 -6435 1065 3960
790 3960 -2253 -6030 516 7469 3959 -3142 -1195 6301 5971 -2403 -6105 -888 2482 -3278 -10035
805 -10035 -7438 -205 -193 -6747 -7352 1299 6903 2239 -2533 2715 10173 7693 -460 -1127 5179 5923
821 5923 -1964 -7173 -2794 2528 -702 -7233 -5463 3054 5733 -192 -2675 4347 10152 5520 -1413
836 -1413 726 6961 4972 -3786 -6721 -1196 1638 -4183 -9731 -6083 1023 359 -6032 -6066 1776 5345
$$ packed form
729a770l947O438O157m673p569K781Q321m54q318j930P409L825o004n812L697
744a849O698j766p715j173P307L514o642n609N142P298k973p744J153Q098J338
759E077p457l445N969N155m377o791J689P249O33p156k711O986N539m692o001
774d333M134P928j228p808q85P080K498o880n728L569N597k798p453j28P500K895
790C960o213l777O546O953l510p101J947P496l30q374l702N217L370n760o757
805a0035K597P233J2o554o05Q651N604m664m772N248P458k480q153o67O306P44
821E923p887n209M379N322l230o531J770Q517K679n925k483P022N805m632o933
836a413K139O235j989q758k935N525K834n821n548L648P106o64o391l4P842L569
$$ plain form
852 5345 -591 -5210 -9 6222 2809 -4580 -3695 3544 4727 -1945 -5126 607 5852 2132 -4189
867 -4189 -2250 4864 5021 -2514 -5308 1262 5753 506 -5216 -1033 6580 5798 -831 -1021 6097 8864
883 8864 2584 -2972 320 5232 1289 -7519 -8790 -2516 -1057 -7894 -11413 -4710 2338 59 -4783
898 -4783 -964 7669 8856 2338 -285 4960 8026 1608 -6321 -5456 -187 -1871 -9554 -10804 -3066
913 -3066 1940 -1946 -4774 1948 10416 9689 3669 4059 10477 11362 3503 -2626 -60 3320 -1702 -9762
929 -9762 -9334 -2222 -653 -6418 -7895 -17 6512 3356 -1731 1478 8249 7083 -807 -3744 1044
944 1044 3084 -3493 -9736 -6547 120 -998 -7237 -6589 1821 5667 430 -3199 2260 8060 4573
959 4573 -2609 -2099 4169 4575 -2453 -5813 -111 5331 1809 -3968 -1279 6210 6487 -538 -2906 3006
$$ packed form
852E345n936m619N201O231l413p389Q85P239J183o672l181N733N245l720o321
867d189J939P114J57p535k794O570M491n247n722M183P613p82o629j90P118K767
883H864o280n556L292M912l943q808j271O274J459o837l519O703P048k279m842
898d783L819Q633J187o518k623N245L066o418p929Q65N269j684p683j250P738
913c066N006l886k828O722Q468p27o020L90O418Q85p859o129K566L380n022q060
929i762M28P112J569n765j477P878O529l156n087L209O771j166p890k937M788
944A044K040o577o243L189O667j118o239O48Q410L846n237l629N459N800l487
959D573p182N10O268M06p028l360N702N442l522n777K689P489K77p025k368N912
$$ plain form
975 3006 6057 -204 -6558 -3752 2195 434 -6357 -6600 694 4475 -251 -3971 1038 7486 5099
990 5099 -1996 -2241 3780 4109 -3699 -8384 -3755 983 -2759 -8432 -5717 2214 3986 -1067 -2028 4885
1006 4885 9769 5345 -699 1386 6871 4606 -3861 -6383 -818 1712 -4173 -8632 -3834 3132 2117
1021 2117 -3240 -1799 5790 8196 2116 -2159 2082 6589 2126 -5633 -5336 796 983 -5862 -8115
1036 -8115 -1462 3946 433 -4256 -494 6739 6379 -415 -2329 3348 6024 -143 -6140 -3242 2553
1051 2553 526 -6140 -5750 1824 4980 -267 -3505 1870 7637 4564 -2168 -1867 3854 3928 -3341 -7207
1067 -7207 -2454 1971 -1960 -7533 -4605 3017 3790 -2001 -2960 3823 7772 2885 -2531 227 5470
1082 5470 3074 -4286 -5558 350 2725 -2885 -6930 -2028 4541 2770 -2971 -1541 5756 7337 1034
$$ packed form
975C006L051o261o354K806N947j761o791k43P294L781m726l720N009O448k387
990E099p095k45O021L29p808m685M629M738l742n673K715P931J772n053r61O913
1006D885M884m424o044K085N485k265q467k522N565K530n885m459M798O966j015
1021B117n357J441P589K406o080m275M241M507m463p759K97O132J87o845k253
1036h115O653N408l513m689L762P233l60o794j914N677K676o167n997K898N795
1051B553k027o666L90P574L156n247l238N375N767l073o732L01N721P4p269l866
1067g207M753M425l931n573K928P622P73n791r59O783L949m887n416K758N243
1082E470k396p360j272N908K375n610m045M902O569j771n741J430P297J581o303
$$ plain form
1097 1034 -2445 2336 6324 1637 -5157 -3910 2075 1796 -5015 -7161 -1067 3419 -770 -5670 -2096
1112 -2096 4743 3820 -2836 -3674 2663 5173 -799 -5648 -1835 3708 1291 -5153 -4762 2000 4156 -1405
1128 -1405 -4617 718 6111 2960 -3072 -1392 5282 5647 -927 -3633 1769 5618 1201 -4323 -1787
1143 -1787 4369 3620 -2867 -4230 1808 4938 -292 -5197 -1609 4266 2169 -4521 -4742 1481 3298
1158 3298 -2557 -6269 -1629 3495 427 -5569 -4265 2418 3461 -2625 -5217 403 5070 1154 -4376
1173 -4376 -1775 4735 4317 -2138 -3542 2636 6012 1010 -3882 -347 5714 4159 -2334 -2804 3477
1188 3477 5680 -41 -4224 135 5340 2265 -4254 -3535 2850 3843 -2406 -5457 -350 4142 355
1203 355 -5429 -3597 2535 2322 -4151 -6134 -519 3109 -1590 -6592 -3291 3108 2309 -3550 -3690 2930
$$ packed form
1097A034l479M781L988m687o794J247N985k79o811k146O094M486m189m900L574
1112b096O839r23o656q38O337K510n972m849L813N543k417o444L91O762K156n561
1128a405l212N335N393l151o032J680O674L65o574k706N402L849m417n524K536
1143a787O156p49o487j363O038L130n230m905L588N875k097o690k21O223J817
1158C298n855l712M640N124l068n996J304O683J043o086k592N620M667l916n530
1173d376K601O510m18o455j404O178L376n002m892L535O061j555o493m70O281
1188C477K203n721m183M359N205l075o519P19O385R93o249l051N107M492l787
1203C55n784J832O132k13o473j983N615L628m699n002L301O399p99n859j40O620
$$ plain form
1219 2930 5864 1014 -2885 1206 6486 3865 -2714 -2765 3110 4179 -2037 -5544 -665 4373 1366
1234 1366 -3887 -1533 5421 6235 520 -1351 4168 7585 2536 -3656 -2036 2942 977 -6332 -8130
1249 -8130 -2561 274 -4596 -8306 -3498 3279 2331 -2838 -1657 5298 7277 1378 -2609 1270 5183
1264 5183 995 -5889 -5432 202 549 -5448 -7278 -932 4343 1424 -2718 976 7948 7932 1907 399
1280 399 5546 7663 1731 -4051 -1794 2859 362 -6238 -6564 -268 2268 -2657 -5740 -716 4968
1295 4968 2696 -2864 -1805 4177 4667 -1656 -4888 -290 3634 -406 -6056 -4073 2081 2121 -3766 -5179
1311 -5179 725 4385 -51 -4655 -1361 4441 3037 -3021 -3328 2957 5565 669 -3024 1289 6645
1326 6645 4283 -1793 -1395 4273 4818 -1745 -5429 -1140 2866 -1068 -6745 -4693 1812 2504 -2817 -3848
$$ packed form
1219B930K934m850l899M091N280k621o579n1N875J069o216l507M879N038l007
1234A366n253K354O954Q14n715j871N519L417n049o192J620M978j965p309j798
1249h130N569K835m870l710M808O777r48n169J181O955J979n899l987L879L913
1264E183m188o884M57N634L47n997j830O346N275k919m142L694O972j6o025j508
1280C99N147K117n932n782K257M653k497o600l26O296K536m925l083N024N684
1295D968k272n560J059N982M90o323l232M598L924m040n650J983O154M0n887j413
1311e179N904L660m436m604L294N802j404o058l07O285K608m896l693M313N356
1326F645k362o076L98N668N45o563l684M289M006l934n677K052O505O92n321j031
$$ plain form
1342 -3848 2395 6565 2658 -2052 630 5864 3918 -3189 -5021 -112 1662 -4034 -8456 -4656 1052
1357 1052 -353 -5185 -3617 3589 6142 1530 -1026 3753 8160 4531 -1847 -1436 3525 2963 -3773
1372 -3773 -6599 -1842 1903 -1791 -6119 -2777 3869 3996 -1253 -1778 4161 7028 2066 -2783 -138
$$ packed form
1342c848O243M170l907m710K682N234j946p107j832M909J774n696m422L800N708
1357A052j405m832J568P206K553m612k556M779M407l629o378M11M961n62o736
1372c773k826M757L745l694m328L342O646J27n249n25N939K867m962m849K645
$$ [...]
8191c04
##END NTUPLES=NMR FID
##END=
