##TITLE=abcd
##JCAMPDX= 6.0         $$ Bruker NMR JCAMP-DX V2.0
##DATA TYPE= NMR FID
##DATA CLASS= NTUPLES
##ORIGIN= UXNMR, Bruker Analytische Messtechnik GmbH
##OWNER= root
$$ XWIN-NMR		Version 3.5
$$ Sat Feb  1 16:03:04 2025 Russian Standard Time (UT+4h)  servis@DPX200
##.OBSERVE FREQUENCY= 200.131235884673
##.OBSERVE NUCLEUS= ^1H
##.DELAY= (6, 6)
##.ACQUISITION MODE= SIMULTANEOUS
##.ACQUISITION SCHEME= undefined
##.AVERAGES= 32
##.DIGITISER RES= 18
##SPECTROMETER/DATA SYSTEM= spect
##.PULSE SEQUENCE= zg
##.SOLVENT NAME= D2O
##.SHIFT REFERENCE= (INTERNAL, D2O, 0, 16.5164)
##AUDIT TRAIL= $$ (NUMBER, WHEN, WHO, WHERE, WHAT)
$$ ##TITLE= Audit trail, XWIN-NMR		Version 3.5
$$ ##JCAMPDX= 5.01
$$ ##ORIGIN= Bruker BioSpin GmbH
$$ ##OWNER= servis
$$ F:\spectra/data/av/nmr/H1/1/audita.txt
$$ ##AUDIT TRAIL=  $$ (NUMBER, WHEN, WHO, WHERE, WHAT)
(   1,<2025-02-01 16:00:21.06 +0400>,<servis>,<DPX200>,
      <created by zg, POWCHK disabled, PULCHK disabled
       configuration hash MD5:
       00 E9 B6 7A A2 85 ED C7 34 08 36 98 17 FE 4E 26
       data hash MD5: 32K
       42 87 C5 06 2C 57 BB D6 95 D0 76 78 A3 6E 6B 1A>)
$$ ##END=
$$ 
$$ hash MD5
$$ 15 6B 15 95 66 D2 F5 8C D9 EC DC 95 13 47 89 8E
##$RELAX= 
##$RELAX= 
##$RELAX= 
##$RELAX= 
##$RELAX= 
##$RELAX= 
##$RELAX= 
##$RELAX= 
$$ Bruker specific parameters
$$ --------------------------
##$DU= <F:\spectra>
##$EXPNO= 1
##$NAME= <H1>
##$PROCNO= 1
##$TYPE= <nmr>
##$USER= <av>
##$AMP= (0..31)
100 100 100 100 100 100 100 100 100 100 100 100 100 100 100 100 100 100 
100 100 100 100 100 100 100 100 100 100 100 100 100 100 
##$AQSEQ= 0
##$AQ_mod= 1
##$AUNM= <au_zg>
##$AUTOPOS= <>
##$BF1= 200.13
##$BF2= 200.13
##$BF3= 200.13
##$BF4= 200.13
##$BF5= 500.13
##$BF6= 500.13
##$BF7= 500.13
##$BF8= 500.13
##$BYTORDA= 1
##$CFDGTYP= 0
##$CFRGTYP= 5
##$CHEMSTR= <none>
##$CNST= (0..31)
1 1 145 1 1 1 1 1 1 1 1 1 1 1 1 1 1 1 1 1 1 1 1 1 1 1 1 1 1 1 1 1 
##$CPDPRG= <>
##$CPDPRG1= <>
##$CPDPRG2= <>
##$CPDPRG3= <>
##$CPDPRG4= <mlev>
##$CPDPRG5= <mlev>
##$CPDPRG6= <mlev>
##$CPDPRG7= <mlev>
##$CPDPRG8= <mlev>
##$CPDPRGB= <>
##$CPDPRGT= <>
##$D= (0..31)
0 2 0 0 0 0 0 0 0 0.06 0 0 0 0 0 0 0.0002 0 0 0 0 0 0 0 0 0 0 0 0 0 0 
0 
##$DATE= 1738411220
##$DBL= (0..7)
120 120 120 120 120 120 120 120 
##$DBP= (0..7)
150 150 150 150 150 150 150 150 
##$DBP07= 0
##$DBPNAM0= <>
##$DBPNAM1= <>
##$DBPNAM2= <>
##$DBPNAM3= <>
##$DBPNAM4= <>
##$DBPNAM5= <>
##$DBPNAM6= <>
##$DBPNAM7= <>
##$DBPOAL= (0..7)
0.5 0.5 0.5 0.5 0.5 0.5 0.5 0.5 
##$DBPOFFS= (0..7)
0 0 0 0 0 0 0 0 
##$DE= 6
##$DECBNUC= <off>
##$DECIM= 32
##$DECNUC= <off>
##$DECSTAT= 4
##$DIGMOD= 1
##$DIGTYP= 9
##$DL= (0..7)
0 120 120 120 120 120 120 120 
##$DP= (0..7)
150 150 150 150 150 150 150 150 
##$DP07= 0
##$DPNAME0= <>
##$DPNAME1= <>
##$DPNAME2= <>
##$DPNAME3= <>
##$DPNAME4= <>
##$DPNAME5= <>
##$DPNAME6= <>
##$DPNAME7= <>
##$DPOAL= (0..7)
0.5 0.5 0.5 0.5 0.5 0.5 0.5 0.5 
##$DPOFFS= (0..7)
0 0 0 0 0 0 0 0 
##$DQDMODE= 0
##$DR= 18
##$DS= 0
##$DSLIST= <SSSSSSSSSSSSSSS>
##$DSPFIRM= 0
$$ [...]
##$SUBNAM0= <"">
##$SUBNAM1= <"">
##$SUBNAM2= <"">
##$SUBNAM3= <"">
##$SUBNAM4= <"">
##$SUBNAM5= <"">
##$SUBNAM6= <"">
##$SUBNAM7= <"">
##$SUBNAM8= <"">
##$SUBNAM9= <"">
##$SW= 20.6817932712277
##$SWIBOX= (0..15)
0 0 3 0 0 0 0 0 0 0 0 0 0 0 0 0 
##$SW_h= 4139.07284768212
##$TD= 32768
##$TD0= 1
##$TE= 0
##$TE2= 300
##$TE3= 300
##$TEG= 300
##$TL= (0..7)
0 120 120 120 120 120 120 120 
##$TP= (0..7)
150 150 150 150 150 150 150 150 
##$TP07= 0
##$TPNAME0= <>
##$TPNAME1= <>
##$TPNAME2= <>
##$TPNAME3= <>
##$TPNAME4= <>
##$TPNAME5= <>
##$TPNAME6= <>
##$TPNAME7= <>
##$TPOAL= (0..7)
0.5 0.5 0.5 0.5 0.5 0.5 0.5 0.5 
##$TPOFFS= (0..7)
0 0 0 0 0 0 0 0 
##$TUNHIN= 0
##$TUNHOUT= 0
##$TUNXOUT= 0
##$USERA1= <user>
##$USERA2= <user>
##$USERA3= <user>
##$USERA4= <user>
##$USERA5= <user>
##$V9= 5
##$VALIST= <valist>
##$VCLIST= <CCCCCCCCCCCCCCC>
##$VD= 0
##$VDLIST= <DDDDDDDDDDDDDDD>
##$VPLIST= <PPPPPPPPPPPPPPP>
##$VTLIST= <TTTTTTTTTTTTTTT>
##$WBST= 1024
##$WBSW= 30
##$XGAIN= (0..3)
0 0 0 0 
##$XL= 0
##$YL= 0
##$YMAX_a= 267950
##$YMIN_a= -146586
##$ZGOPTNS= <>
##$ZL1= 120
##$ZL2= 120
##$ZL3= 120
##$ZL4= 120
##$ABSF1= 10
##$ABSF2= 0
##$ABSG= 5
##$ABSL= 3
##$ALPHA= 0
##$AQORDER= 0
##$ASSFAC= 0
##$ASSFACI= 0
##$ASSFACX= 0
##$ASSWID= 0
##$AUNMP= <proc_1d>
##$AZFE= 0.1
##$AZFW= 0.1
##$BCFW= 1
##$BC_mod= 2
##$BYTORDP= 0
##$COROFFS= 0
##$CY= 19
##$DATMOD= 1
##$DC= 2
##$DFILT= <>
##$DTYPP= 0
##$F1P= 11.0000007629395
##$F2P= -0.999999237060547
##$FCOR= 0.5
##$FTSIZE= 0
##$FT_mod= 4
##$GAMMA= 1
##$GB= 1
##$INTBC= 1
##$INTSCL= 1
##$ISEN= 128
##$LB= 0.05
##$LEV0= 0
##$LPBIN= 0
##$MAXI= 10000
##$MC2= 0
##$MEAN= 0
##$ME_mod= 0
##$MI= 0
##$NCOEF= 0
##$NC_proc= 0
##$NLEV= 6
##$NOISF1= 0
##$NOISF2= 0
##$NSP= 1
##$NTH_PI= 0
##$NZP= 0
##$OFFSET= 16.51637
##$PC= 1
##$PHC0= -267.6811
##$PHC1= 1.301534
##$PH_mod= 0
##$PKNL= yes
##$PPARMOD= 0
##$PSCAL= 4
##$PSIGN= 0
##$REVERSE= no
##$SF= 200.13
##$SI= 16384
##$SIGF1= 0
##$SIGF2= 0
##$SINO= 400
##$SIOLD= 16384
##$SREGLST= <1H.CDCl3>
##$SSB= 0
##$STSI= 0
##$STSR= 0
##$SW_p= 4139.07284768211
##$SYMM= 0
##$S_DEV= 0
##$TDeff= 0
##$TDoff= 0
##$TI= <>
##$TILT= no
##$TM1= 0
##$TM2= 0
##$TOPLEV= 0
##$USERP1= <user>
##$USERP2= <user>
##$USERP3= <user>
##$USERP4= <user>
##$USERP5= <user>
##$WDW= 1
##$XDIM= 8192
##$YMAX_p= 0
##$YMIN_p= 0
$$ End of Bruker specific parameters
$$ ---------------------------------
##NTUPLES= NMR FID
##VAR_NAME=  TIME,          FID/REAL,        FID/IMAG
##SYMBOL=    X,             R,               I
##VAR_TYPE=  INDEPENDENT,   DEPENDENT,       DEPENDENT
##VAR_FORM=  AFFN,          ASDF,            ASDF
##VAR_DIM=   16384,         16384,           16384
##UNITS=     SECONDS,       ARBITRARY UNITS, ARBITRARY UNITS
##FACTOR=    0.0002416,     1,               1
##FIRST=     0,             0,               0
##LAST=      3.9581328,     0,               0
##MIN=       0,             -146586,         0
##MAX=       3.9581328,     267950,          0
$$ Real data points
##PAGE= N=1
##DATA TABLE= (X++(R..R)), XYDATA
$$ [...]
4514 20 37 -49 -15 66 18 23 77 12 42 -21 -54 46 16 58 54 -143 72 3 41 -143 64 -35 30 -30 24 162 69 73 -1
4543 -1 128 14 -65 7 -43 -116 59 152 -10 -6 37 48 36 18 78 26 20 80 -19 -3 -1 -2 25 9 -109 0 -154 -55 59
4572 59 2 -62 -81 63 -30 -53 49 -81 -99 26 -139 -6 -74 77 24 26 -70 152 81 -47 -27 -3 28 -51 86 86
4598 86 130 63 5 -22 18 -6 -5 9 -106 40 -88 9 24 8 18 -52 54 55 72 -70 43 59 -48 58 -72 -49 12
4625 12 91 -44 -1 19 13 -28 -81 -29 11 135 -36 -63 15 -61 -56 -38 -41 33 -22 -12 -18 59 -35 -59 -13 61 -19 -52 43 -20 -26
4656 -26 -74 61 56 -31 -29 -55 -38 -35 -39 92 -36 110 67 -30 -48 61 33 -43 20 -3 69 -66 -23 41 80 -17 -92 -83 43
4685 43 -20 -71 -4 -100 -20 -9 -85 -113 0 -64 71 42 1 -40 -27 -20 -96 -12 -58 12 12 -105 -24 63 -8 4 126 25 -5
4714 -5 -77 33 -5 9 -45 -35 -10 -31 -49 -97 139 -83 54 107 -103 -24 -37 72 -57 34 -33 43 -31 -2 -53 -93 62
4741 62 2 110 18 -12 57 9 -30 -33 55 39 143 12 -113 67 -8 73 -71 -12 18 -19 106 -94 -11 57 6 -106
4767 -106 8 -24 28 -115 -81 19 4 86 -87 -52 44 -53 7 27 23 75 -181 -23 14 -34 32 24 -13 13 48 22 87 -63
4795 -63 26 0 26 -13 -93 -135 -82 -8 43 19 24 -22 -73 -84 -13 -22 -76 82 -26 -1 -35 -118 80 15 -146 -26 -81 -49 9
4824 9 -40 -11 -84 2 -90 -12 -2 -56 121 -44 -85 89 52 17 31 -68 38 -32 -30 -33 -4 -51 -24 -4 31 -46 -111 -24 25 -7
4854 -7 -29 -59 -15 27 -85 -13 -119 43 -94 27 -147 32 -14 30 -59 6 18 66 25 -52 44 23 61 -94 -106 76
4880 76 -46 21 12 36 -132 -107 135 -24 -13 -5 -61 4 30 -13 42 -16 -46 -66 20 -38 -121 4 0 18 -18 -31 -5 -26 -157
4909 -157 52 52 -98 30 -132 42 -84 90 39 -95 -142 111 -160 88 12 -50 57 -37 7 -105 -1 -16 -95
4932 -95 56 0 101 111 -63 98 44 -39 49 29 91 -96 -6 -25 88 -82 -37 -93 13 95 -60 -34 64 -14 -200
4957 -200 108 -30 -68 60 -6 43 -49 -14 -11 42 6 -38 154 56 69 16 10 75 87 -22 -5 54 -102 101 -6 66 -86
4984 -86 46 58 30 -70 18 17 -13 -56 117 19 -47 -68 27 9 -38 -42 -13 -23 -100 15 -37 -53 -28 2 -12 27 171 -86
5012 -86 -64 -96 -96 -30 114 -72 -9 179 26 99 41 71 -17 40 -62 46 -17 123 -40 71 2 135 49 38 16 -59
5038 -59 -47 53 -4 -38 -48 77 76 -160 -51 38 70 -135 -105 49 26 -26 -20 -82 24 -132 -90 21 -21 -37 -1 -126
5064 -126 21 63 138 -89 -62 25 156 113 -61 81 -119 59 -51 15 0 -133 -11 -79 -20 16 -92 67 72 -36
5088 -36 -53 64 -129 83 46 45 -6 -69 14 -27 15 -107 90 119 -62 48 54 -6 60 40 -51 -25 -98 -45 26 -67 -23 -86
5116 -86 48 2 39 -129 40 -47 22 28 99 -28 -12 135 80 -75 80 -164 -40 -15 115 -67 -33 76 -175 -1
5140 -1 -137 -59 -35 -61 -32 -35 -98 1 -84 -86 -94 -12 4 -41 15 83 19 11 -57 -44 -47 50 25 -49 -102 49 0 -70 40 38 -92 -42
5172 -42 91 27 -74 32 118 -48 -44 43 88 8 145 -144 4 -51 -64 -14 -65 -36 -29 -79 19 -26 -182 -13 -66 95
5198 95 -50 -24 -2 100 2 159 3 11 -42 41 -18 47 -27 -9 -34 50 60 -46 15 -106 44 -54 -7 -49 -63 9 6 40
5226 40 32 -21 -11 32 20 40 89 -131 -78 124 36 55 -7 12 76 25 16 -48 -125 -37 -66 99 73 45 97 29 83 36 -98
5255 -98 -122 6 -65 -51 58 48 118 -5 -79 -125 3 -27 -87 -8 -10 -79 116 -28 60 1 -16 -62 14 9 37 3 115 25
5283 25 42 -11 -29 -127 -84 -44 116 -24 -42 -73 -46 75 -58 -6 -82 -45 -40 12 126 1 -64 -81 4 -62 21 -34 52 40
5311 40 -25 -24 104 -61 0 -38 -105 77 15 37 17 -68 54 -140 16 -11 -20 58 35 81 -2 -11 60 45 -82 121 -69
5338 -69 -54 19 95 35 64 -59 2 25 56 9 17 50 -43 -123 -107 15 -99 -19 48 -33 80 84 42 22 60 127 -134 101
5366 101 74 5 83 35 102 17 -45 3 -2 21 15 4 48 -107 35 -64 -86 10 -64 -100 -151 11 -12 -132 9 -11 -3 8 90
5395 90 -78 4 -69 -24 23 -26 -60 -111 -46 -7 52 99 37 9 -5 46 -18 -97 61 -5 44 37 -39 -3 95 20 53 37 19 -68
5425 -68 -57 -58 9 -28 101 33 9 -76 152 -24 -29 -91 -34 35 -69 -13 24 -152 30 -108 37 33 18 36 26 -43 121
5452 121 95 -96 80 -42 -36 -128 48 -52 8 -32 57 -4 -51 14 -99 -119 -165 -14 43 -63 40 25 31 -3 180 53
5478 53 56 -48 -93 -65 -8 -47 -110 79 78 -37 -38 -31 -77 69 -30 -18 84 -25 78 13 -71 -127 -20 -58 -49 -4 -38 11 -126
5507 -126 7 93 3 98 -33 77 111 -79 -63 38 -43 39 -46 81 -3 48 -61 36 -129 -42 89 -1 15 -38 -169
5532 -169 -108 26 68 -29 2 62 -45 -57 -57 -4 23 56 11 -34 -5 -10 -9 112 -27 -29 7 -9 -5 23 -12 22 -10 -7 26 -92
5562 -92 49 148 -48 52 -47 23 25 -138 -37 -47 -70 -68 -22 0 -53 22 91 -55 58 10 -15 41 65 -17 97 69 41
5589 41 98 -19 -22 -19 -60 -57 60 37 95 -22 43 55 -78 153 -54 14 59 38 -2 10 117 -27 -12 -21 51 -31 52 31
5617 31 -12 8 3 -57 -103 55 -18 -28 -4 34 -83 -59 -5 -34 62 -53 -36 -47 35 -15 -101 -32 -83 29 22 -41 -47 21 122
5646 122 -87 -26 -61 -31 16 77 9 51 -118 -75 67 106 67 69 80 -16 61 -90 -128 -82 -34 -182 -115 -77 -42 74 85
5673 85 -29 32 -79 26 34 26 -85 16 -32 47 -43 -14 -43 5 12 3 143 19 -2 2 -79 -57 79 34 -4 -92 -78 -11 22
5702 22 15 -16 -58 12 28 -44 -36 24 -3 -3 68 -89 38 -11 -70 -25 -126 -76 -69 -23 -80 -87 43 129 -49 40 -41 -5 49 -73
5732 -73 -35 125 -33 -100 79 69 49 -48 36 69 -12 53 -45 37 59 -43 -11 -42 -78 -24 90 55 17 -3 82 -29 34
5759 34 37 84 -15 -64 19 -67 30 -42 -50 22 17 -21 -74 -130 -37 52 -65 -8 -154 -64 -39 155 27 69 85 16 162 53 24
5788 24 40 30 4 -34 -35 50 -34 18 -15 -100 64 -19 -116 18 -21 91 14 -39 43 -99 13 66 5 -114 -45 135 147
5815 147 46 -6 139 -49 12 -55 -74 -14 -46 11 3 -60 -29 41 -41 45 65 10 34 73 30 14 -114 48 -9 51 -41 -41
5843 -41 -35 122 -20 -25 9 81 24 -108 29 15 36 -88 35 4 -20 -69 -44 -16 4 -55 -69 -3 24 -98 -38 -19 72 -108
5871 -108 -38 14 65 23 -110 -116 84 92 42 38 -98 144 1 -110 65 50 -51 172 -46 -70 42 30 -36 -73 168
5896 168 30 4 -100 43 -44 7 -106 27 13 74 64 -104 60 -81 -99 -18 111 -60 -15 68 137 60 48 18 -39
5921 -39 50 -21 85 101 113 -43 -34 -90 31 -6 -38 -104 -10 17 -77 -22 -50 97 4 -4 11 64 -16 -53 3 -63 -29 13 84
5950 84 -74 -1 21 -114 19 -64 1 -88 33 45 -86 38 -33 24 18 -13 6 -68 -82 -5 56 61 2 32 81 75 120 -133
5978 -133 -137 5 -1 -51 -92 -1 32 -125 -54 9 -25 26 -57 -22 -15 0 -69 75 -16 -69 26 61 -106 -25 44 15 73 36 37 -20
6008 -20 -101 -104 -81 98 -139 -54 107 -78 -104 -31 -92 -10 34 93 38 63 -52 -6 6 -38 76 0 -80 21 140 -85
6034 -85 90 -11 29 63 -24 47 -69 62 214 71 23 -43 -11 17 -68 77 51 -87 -78 50 12 6 -75 30 81 23
6060 23 -37 40 133 22 63 -35 -6 29 108 19 -83 -15 127 -65 -31 57 -152 44 -56 -56 -102 121 -64 80 11 40
6086 40 -2 20 -63 -59 -118 40 -139 -45 -42 88 -89 102 21 28 99 -37 -19 -26 -17 1 -52 -128 -66 51 -11 -153 -13 38
6114 38 103 30 59 -69 141 29 46 -108 -62 64 47 -39 -98 -156 59 1 16 158 3 -27 -49 53 -36 84 162
6139 162 -145 57 -63 84 0 -9 -68 -60 59 -117 -24 -42 -63 -7 34 -57 -76 64 21 -144 9 45 51 -65 -64 -87 4
6166 4 -129 -96 38 145 -35 -21 93 10 54 -71 3 149 48 -81 -65 -21 26 18 -77 -10 5 74 -107 106 25 -103
6192 -103 62 -28 28 -51 20 80 -135 -9 -76 20 -29 -114 79 22 -119 14 -68 -53 35 25 -15 17 -126 77 -97
6217 -97 86 13 43 -117 -18 15 -21 17 -56 -79 69 -149 51 23 -7 5 -4 18 50 5 22 -6 -55 122 34 122 31 26
6245 26 -31 48 -48 -51 -41 -9 44 58 91 45 -13 40 -38 -22 47 69 -129 -13 -48 -45 50 151 57 47 89 -28 49 -111 -65
6274 -65 36 -41 -1 -63 -13 149 59 64 -117 39 -17 -49 -119 20 -25 39 -147 -42 -115 -55 -23 -49 -32 29 50 -16 -54
6301 -54 -20 -1 -21 39 -41 30 39 -52 -119 32 160 105 28 -4 -10 48 -37 -17 23 -97 -151 89 -37 -91 74 106 7 -30
6329 -30 0 96 26 11 35 -67 -81 48 -52 -31 -12 52 -84 -27 61 -126 -55 -53 -31 -112 -106 -40 -76 43 -114 25 -66
6356 -66 31 26 -41 -47 22 -59 4 29 -19 74 -106 -53 62 -33 83 61 71 -10 13 103 -23 53 57 74 -32 -140 -49 -43 110
6385 110 -67 79 98 43 22 67 17 -70 -35 -82 -75 141 32 196 28 0 -1 -172 -61 -12 111 35 -41 -73 10 30
6411 30 45 49 5 21 58 58 -65 -25 15 102 50 -5 20 -101 40 90 -14 -37 42 -141 -94 39 53 -69 101 31 -187
6438 -187 39 -33 -23 -87 -1 -101 28 64 50 -12 56 94 1 -4 45 -18 113 -6 -26 12 137 76 -48 -74 61 27
6464 27 60 102 -50 -55 -34 46 -43 -90 46 -34 18 -72 48 -7 63 11 -104 -105 -125 5 -49 -84 83 -121 -9 -97 -74
6491 -74 -36 -87 -30 -32 -35 -33 -1 56 -40 -5 60 -146 -8 -42 -5 26 -31 26 20 22 -49 110 -35 6 -40 -25 -39 -65 15 -79 -134
6522 -134 -59 50 33 -21 -28 -36 -49 -33 24 10 -95 -36 66 -49 -54 -86 -2 -41 43 -121 -12 2 58 -105 88 45 -105
6549 -105 -40 -90 56 53 19 -28 35 -7 21 59 59 -26 -36 12 12 119 -20 -102 166 3 112 -53 4 -29 -6 -53 -4 -3
6577 -3 -20 71 -8 40 -31 83 -30 -105 -57 -65 -53 28 26 -13 -46 87 -19 7 -33 -3 -13 -46 -10 -116 84 176 5 118
6605 118 -3 28 -70 -31 -43 -98 88 7 3 -48 9 -48 29 49 -59 31 -34 65 72 -46 4 -80 135 66 -58 4 -66 44
6633 44 26 -117 98 -72 37 130 -24 -27 54 -138 19 -23 43 4 81 -16 23 -22 -36 -12 -5 -33 59 19 63 -38 -7
6660 -7 164 28 -16 -13 39 -161 39 -21 116 -8 22 -84 60 45 98 -151 -31 23 -11 -24 -120 -136 33 47 -27 20
6686 20 -172 91 -38 -11 78 -1 64 38 6 -4 -25 5 33 54 74 15 -25 1 58 -23 -85 65 146 63 -152 -44 -6
6713 -6 91 47 -79 -41 -3 -14 17 14 91 21 41 -62 -42 14 34 3 21 21 -77 -8 -47 41 -26 -63 -13 -24 -52 27 90 -11
6743 -11 -44 130 63 42 99 82 -20 6 111 56 55 -108 -134 -74 73 -99 -102 -24 45 -72 -75 -32 -21 65 -32 -21 -83 -13
6771 -13 -60 32 -45 -88 53 -22 -9 -76 -2 -8 -45 0 -52 57 -66 35 74 77 -59 50 -92 94 -58 122 55 -42
6797 -42 11 53 68 39 -14 -30 -2 26 36 -61 7 -78 -9 37 -59 31 61 -2 44 64 -19 27 58 -19 -10 -150 -29 56 -91
6826 -91 -47 -70 -27 -42 50 -123 -160 40 85 21 -32 28 69 16 29 25 -64 -25 32 -56 -23 20 -83 -94 40 42 -10 77 20
6855 20 96 27 71 -137 63 29 -108 27 -107 32 -137 -107 109 23 87 81 -105 20 -75 3 79 -127 -28 -88 -43
6880 -43 -63 17 -6 -19 60 28 47 -125 -74 35 -104 27 -44 -36 151 -19 14 61 52 74 6 70 67 4 20 -62 -106 96
6908 96 17 70 -105 -31 -13 -43 -125 86 10 74 -13 -61 -55 55 -42 32 -99 -133 -4 26 9 40 72 109 -31 107 -145
6935 -145 35 -120 4 -4 -111 74 -19 -40 -45 -57 89 127 -19 -45 -108 -53 -108 -37 -46 19 74 58 -59 -114 103 -39
6961 -39 -18 -36 -18 25 -86 -64 -36 30 -35 73 -90 -31 37 -37 79 70 31 -65 79 0 43 -120 -64 -75 11 -41 -39 180
6989 180 -85 108 -39 32 141 31 97 33 -39 -49 -46 -31 7 20 0 -21 -17 -96 17 -6 84 -16 109 -114 13 -28
7015 -28 81 -11 11 -101 -56 138 44 3 -67 -20 40 -68 -13 53 0 23 24 16 -3 -18 -44 -39 3 130 -29 -53 56 -101
7043 -101 -70 -51 -134 83 -7 76 25 15 11 60 9 55 13 -41 -60 -25 112 -61 64 -78 41 -50 24 127 -85 -58
7069 -58 -32 65 41 12 -10 1 132 -9 8 -81 -1 -40 -48 136 3 128 41 23 6 -3 27 152 26 -25 -37 145 -13
7096 -13 -54 -20 18 37 -90 -44 14 -52 67 51 -32 182 -17 24 -44 -44 74 30 -25 -49 -9 -107 24 28 53 -85 63
7123 63 -95 26 -19 35 -34 41 -5 -83 100 141 -23 -32 106 -43 15 -16 66 -21 -38 1 -50 -22 -41 -10 24 -75 -72 61
7151 61 -22 -47 -74 -45 -32 -115 95 -80 -30 -19 -127 -67 126 -113 -26 -41 1 -37 -9 166 -3 -91 84 99 72 -73
7177 -73 58 64 -90 61 -60 47 -12 19 85 31 50 -4 -27 -47 182 -40 64 4 -97 -27 -29 5 -7 -35 41 48 74
7204 74 128 -7 -145 -6 -18 7 62 25 76 -72 31 -69 -1 64 25 -69 105 -60 37 114 -22 -74 6 57 72 134
7230 134 -37 -80 -39 -32 39 129 -50 52 25 30 -2 30 -21 -96 95 -23 -60 6 59 -37 39 31 75 134 45 98 18 -105
7258 -105 -45 -2 134 -74 37 109 47 -31 -76 -33 16 -107 31 102 7 -32 -119 -50 -107 0 127 -4 -14 -69 -34 54
7284 54 -37 -57 -24 127 -7 57 36 -29 62 45 -30 -31 10 7 135 19 109 -43 68 23 -52 -120 10 24 -30 -13 23 -118
7312 -118 37 -1 -64 0 -18 114 38 104 9 41 -97 113 13 41 69 -1 43 48 -34 -11 78 6 51 59 20 11 6 -44 2
7341 2 86 -38 39 50 70 7 -10 -90 18 -88 -136 -9 39 -43 -13 30 -111 -145 -75 -102 -50 -11 -108 87 -51 -77 -75 46
7369 46 -50 -70 -56 66 35 -84 58 -57 -36 -38 68 -19 -1 52 -62 -74 -92 31 36 20 79 -48 -143 28 -44 -13 63
7396 63 85 -8 -44 5 -4 97 -75 -101 -131 -77 -57 -45 -12 -43 123 30 -110 -47 -67 20 -2 42 -38 22 -43 -38 -19 -122 -63
7425 -63 61 -17 34 67 177 20 67 -40 -1 -53 -40 29 9 86 5 -34 75 0 -83 77 -11 -100 -37 40 -35 -58 4
7452 4 9 -29 -33 17 -57 122 3 18 35 -86 77 -85 45 -17 -11 111 23 36 -96 42 -109 -14 -3 52 -29 -30 -31 64
7480 64 70 12 -67 10 -39 82 -20 -46 100 28 -28 -14 29 -91 38 1 41 -37 -59 64 9 40 -61 78 -41 -50 -110
7507 -110 17 -6 82 -30 140 -25 7 21 8 36 -121 41 -4 127 -54 23 68 -87 60 172 26 -57 102
7530 102 -42 1 36 -28 -16 -18 -15 -38 24 -81 -36 29 -22 -7 -60 -32 2 -39 13 107 49 -2 -8 21 -84 -58 56 -7 2 26
7560 26 19 -99 -7 64 -1 23 60 109 -28 87 4 -13 -23 -38 145 23 9 -27 -2 69 -18 -2 -46 -141 -58 -89 -59 -29
7588 -29 -23 2 -46 31 -19 -74 70 -61 27 -27 -85 27 -36 11 123 60 47 -19 23 -27 29 32 19 5 -62 -26 4 -15 8
7617 8 32 9 -22 47 34 24 149 -114 62 -115 95 -79 -39 -19 -94 -38 -29 -143 -74 -64 28 -15 30 -44 31 53 -7 33
7645 33 8 69 -155 87 -10 -52 -33 51 -30 72 28 75 0 -1 -20 47 13 67 34 -39 -47 87 79 131 -108 63 -10 -78 81
7674 81 -38 12 -84 77 -33 2 -8 -38 1 66 -17 50 -15 -42 18 43 5 -31 -18 -72 -171 118 6 -5 -127 -14 -121
7701 -121 -128 -90 56 -82 26 81 13 -28 -56 -57 98 -33 57 102 124 -39 23 11 -97 10 -38 -101 49 -47 -17 121
7727 121 48 55 30 91 9 84 125 -15 -99 116 112 -46 40 -10 165 56 -11 -60 -7 23 -25 21 94 -82 -103 -4 15 -56
7755 -56 59 -51 60 94 14 36 -132 16 180 0 103 -21 -18 -85 -9 126 -23 -8 -74 62 94 53 104 -68
7779 -68 57 -27 10 -20 90 32 83 81 -75 -130 -64 -89 -37 -134 56 25 84 66 27 54 49 112 -41 97 -36 68 -11
7806 -11 -6 23 -8 25 32 -46 -42 -42 31 -72 10 61 -33 -84 -16 105 161 -15 -30 -104 -24 -114 -11 19 -132 -81 14 12 -106 -4
7836 -4 2 -28 -64 -67 -99 29 -61 64 34 18 -39 -61 -34 -87 92 -87 142 -14 72 -43 -37 90 -21 -62 56 63 2 -79
7864 -79 -70 35 -51 46 -77 11 -31 -1 -16 51 -32 17 -30 -106 55 -44 -33 -10 2 -36 48 -69 -1 14 -113 14 -97
7891 -97 -47 -38 84 -31 -26 30 30 35 -86 16 9 -17 77 -89 -33 46 48 52 30 -51 41 -27 -102 -10 -13 22 -95 -47 52 -66 39
7922 39 -56 -62 -5 7 -26 -2 -30 -79 3 85 35 -97 -76 -59 22 104 31 -70 61 -93 97 9 54 -36 -19 10 83 -4
7950 -4 25 34 1 22 -1 78 -22 -81 -6 -49 55 12 40 31 -223 78 146 53 -123 -12 -33 -66 -8 43 8 -9 91 14
7978 14 -97 6 -55 -39 -76 -109 -71 -60 80 121 -55 15 -61 16 89 17 212 2 88 -75 -98 -129 28 15 16 130
8004 130 -53 152 -35 -185 56 -53 -79 -51 16 48 24 109 12 -106 2 -47 -53 17 23 -11 14 -36 -13 -61 15 21 -9
8031 -9 -14 -85 118 -62 46 23 -40 71 98 -26 80 47 -48 25 -102 -10 -28 41 39 88 -39 -14 -36 9 -57 -84 -46 -33
8059 -33 -70 -50 -22 7 19 -74 -52 38 -111 107 25 142 -100 -55 135 105 128 -22 -75 -17 -26 -8 -74 38 18 -43 -43 -27
8087 -27 6 29 127 43 80 54 101 113 37 60 -16 -52 -55 -87 -18 74 0 -30 71 42 -4 -109 -14 -200 49 -94 42 32
8115 32 82 76 -17 101 -82 -23 -36 0 57 44 -24 17 27 124 2 148 -1 -15 72 -69 -103 5 126 19 132 54
8141 54 48 -23 42 -80 83 56 103 -93 -79 28 87 28 -61 53 -29 7 52 -41 -55 19 22 -33 31 -11 35 41 39 -113 -85
8170 -85 3 3 -39 -73 132 -21 78 -35 168 -59 -96 36 -15 -11 44 55 -15 100 92 -32 85 -72 -55 106 -7 -34
8196 -34 43 16 -35 2 14 -102 -26 -48 -43 -36 -120 144 -135 -115 -13 -72 29 -52 57 -98 17 -37 -1 7 63 10 -56 -70
8224 -70 -21 1 14 26 -61 -95 20 33 133 102 24 -44 13 133 29 2 62 41 64 -34 -67 11 13 34 -48 -61 -82 -106 49
8253 49 -56 17 -54 -26 -62 25 -86 -42 -87 0 34 22 12 50 1 -84 -88 -112 0 -159 -83 -34 36 -56 2 76 76 -51 -3
8282 -3 59 21 143 -56 -65 -1 -20 -9 -47 81 -23 47 44 -41 -46 -67 -32 -39 22 -147 -56 -105 37 -67 -97 -80 49 69 6
8311 6 -2 16 125 -35 -8 -35 48 -50 40 53 -4 -100 141 127 144 -77 -53 -35 -38 -51 137 2 29 30 14 -61 -34 31 -62
8340 -62 -41 47 1 -100 -20 16 148 -14 32 -128 -37 -9 -35 9 -72 -25 -75 -10 -150 69 -13 -50 -4 -48 -6 37 -7
8367 -7 80 84 -6 -18 51 41 70 15 46 55 -50 20 74 -37 91 232 14 -82 -74 -75 -63 36 -10 -37 111 23 61 53 -7 -27
8397 -27 6 11 -15 104 -33 33 -96 -82 -91 -39 60 62 -151 17 76 -40 -21 -13 13 98 -81 -33 -30 59 84 -23 119 -37
8425 -37 -115 6 26 -105 98 23 9 -57 55 13 -1 -59 107 35 -37 96 -87 -64 -117 71 -89 -31 6 87 -89
8450 -89 24 55 -110 -54 -111 -12 41 -20 -18 -92 -46 93 4 -31 -49 -42 -101 9 71 -56 46 100 66 -36 -51 -91 78
8477 78 -45 9 3 13 -30 18 -30 47 17 36 -15 30 -33 -48 136 -6 -70 -60 -18 -9 -5 -8 -2 -61 -67 18 2 -39 -70 64 -109
8508 -109 10 21 -34 -52 71 74 13 19 23 -24 -60 147 -11 51 35 64 15 -136 -34 -38 -85 -116 -21 -24 23 21 34 -35 58 24
8538 24 20 73 60 -41 54 50 -98 -97 -44 56 -63 34 -10 -67 44 -32 0 -26 -53 -26 -99 15 -61 -29 61 107 -10 -78
8566 -78 89 55 26 50 86 -81 50 30 28 9 -74 1 -89 13 32 78 42 19 -50 -53 -107 77 -16 -29 -49 -1 -113 -100
8594 -100 -133 -16 -46 -117 122 -2 7 -106 -40 -151 -53 48 34 69 24 123 97 77 -92 -102 46 93 10 -34 118 0
8620 0 -100 -14 49 -66 -56 15 140 -131 110 -19 108 -92 90 27 -100 7 -112 -4 -58 6 -40 -37 -9 35 -57
8645 -57 -173 -122 -48 -61 43 -15 85 -91 -64 98 162 57 46 90 -123 87 175 -12 171 24 124 42 153 11
8669 11 -53 9 140 -77 42 -20 -57 42 -7 30 -79 58 -60 97 -144 -14 68 122 24 -23 -36 -36 -43 -19 124 -27
8695 -27 61 -13 -46 18 32 53 47 -38 26 67 40 53 -36 -29 26 14 93 -4 -11 -7 65 -25 -61 40 -43 95 41 -14 57 88 -38
8726 -38 -65 -95 27 54 -13 25 -3 41 -130 35 -98 29 59 36 23 -162 -73 -157 23 -93 -129 -23 -33 59 21 -82
8752 -82 68 -16 -40 82 64 -5 130 66 95 -139 -62 30 81 -68 3 -21 91 38 26 58 58 101 -8 -129 54 34
8778 34 -81 159 7 69 102 -106 80 -109 21 111 73 41 35 -21 -16 58 -7 -36 11 -56 -6 -41 25 119 -87 -4 -92
8805 -92 18 64 -14 -5 -21 32 -46 20 66 42 -8 -93 -23 -1 82 -62 -6 0 -21 48 -34 -2 -3 52 -48 -48 -55 4 -18 -94 -52
8836 -52 -13 -175 -28 -39 -11 58 26 68 -83 -13 -16 28 27 -6 44 -75 66 2 78 38 -61 53 7 32 86 -82 -6 109
8864 109 -55 2 42 -53 -15 33 -53 -53 23 58 -88 -108 84 -138 18 -41 -30 -60 -17 2 -94 25 -41 25 16 -55 104
8891 104 105 4 -139 -57 14 77 99 69 -73 -47 96 45 89 66 55 -60 -53 -17 39 -12 121 38 35 -15 73 7 22 -38
8919 -38 66 78 -104 99 -109 8 72 -45 42 -35 -29 -27 -87 -136 -136 -15 0 -42 36 -3 -48 14 -18 -147 -53 -66 -26 -34
8947 -34 36 12 47 -11 71 66 -38 10 118 67 13 -84 58 -27 87 -17 -56 194 -44 -21 131 23 13 13 -58 24 -176
8974 -176 55 62 -3 81 -5 22 -32 48 -7 -26 -110 -45 4 31 35 42 33 55 64 -42 99 16 76 45 30 28 10 81 -63 -45 -87
9005 -87 -24 45 -111 -2 88 -74 -14 -93 -12 -133 -17 158 -138 12 -78 -72 -40 -3 62 16 -10 -42 -20 -13 -105 -91 -56
9032 -56 -29 -90 102 -55 -8 12 -61 74 7 -53 -2 22 94 -78 49 14 -18 49 22 110 -116 168 38 -5 -82 72
9058 72 130 11 46 73 28 -36 -102 -13 -19 44 -82 -50 54 46 61 -35 24 -50 -69 -94 59 -19 5 42 -124 -60 22 3 7
9087 7 83 6 22 53 -42 103 48 43 -53 -37 23 -105 -218 81 -2 16 77 -45 -101 137 -119 -33 17 89 -101 113 -86
9114 -86 -123 -67 -104 -89 38 -63 75 7 -7 -57 -19 24 -68 89 110 88 -15 -56 20 -47 -56 90 20 95 -39 21 -22
9141 -22 -23 43 -34 9 67 2 127 -37 -143 11 120 39 -51 22 45 -132 38 -27 163 54 94 -23 -42 -82 -93 -3
9167 -3 8 -59 -104 39 38 -33 74 50 99 52 41 -122 -68 59 23 32 56 62 17 40 3 25 93 118 -34 -32 -8 -27 37 -60
9197 -60 47 -18 10 -120 -33 159 -48 -37 5 59 84 -76 -67 43 -23 24 -36 -64 45 -72 -35 -76 93 -70 33
9222 33 3 -16 36 15 60 -21 16 50 -97 45 -42 91 13 14 -48 -52 22 21 191 -63 -81 65 -39 76 -68 23 126
9249 126 0 5 -59 -56 29 -115 76 -120 -79 1 -21 -40 -63 32 -102 -30 -17 -86 -86 -4 76 -98 -66 -96 103 -77 -11
9276 -11 47 -26 -59 -28 125 -38 -28 -112 55 81 30 -62 28 -24 41 -156 18 97 -7 8 35 -5 3 -57 117 -1 94
9303 94 42 -91 48 -18 -39 80 -131 -13 51 -109 -25 128 -3 37 -22 -31 5 -104 77 39 107 -62 -9 -56 16
9328 16 20 99 92 -126 40 19 69 86 -37 -88 -57 -12 -78 3 -75 86 -15 -10 -94 16 -74 46 50 -78 -47 -18 -28 -2
9356 -2 -16 42 25 -87 11 -56 31 -8 24 15 -42 -39 67 4 -54 -151 46 -24 26 41 -68 99 -109 19 -20 -165 -20
9383 -20 -105 167 -66 31 -37 -25 22 -17 -64 -90 0 -41 20 -85 26 -80 24 94 38 -112 -3 84 -41 -55 -67 -34
9409 -34 -3 -96 -92 -18 -60 -40 25 -18 -53 34 -96 121 61 57 -17 46 -20 -121 19 47 84 6 12 -11 43 52 -99 143 -32
9438 -32 27 -39 -35 -78 12 -103 -24 -75 -154 119 -107 18 -100 -37 -67 -44 -41 -43 -94 4 -5 -97 13 -86 -19 43 -32 -26 72 -66
9468 -66 -7 -31 28 23 -25 -62 -70 -48 -25 12 -60 22 -97 46 29 -30 -1 75 -67 -69 50 147 -15 -29 -7 -65 14 -3 -126
9497 -126 9 67 -85 -15 77 -16 -78 57 -103 -7 36 71 81 32 0 -55 -116 -52 -100 -18 22 -8 -17 138 -27 -1 48
9524 48 52 -6 90 27 -106 -78 -16 -33 -104 86 73 159 1 64 -32 20 31 -71 95 -43 9 -58 21 87 -160 -41 0
9551 0 -116 -9 -58 -94 16 -121 155 -35 23 -86 -86 -87 -95 -27 -23 108 98 61 -7 110 -62 48 55 -22 69 -40 9
9578 9 94 82 20 -62 100 3 7 -12 -27 70 -1 -28 -69 -75 -94 96 -38 -14 86 -31 -47 45 -37 -56 -7 54 94 53 -80
9607 -80 -99 -19 -21 -9 -95 -77 68 -10 16 -88 -46 0 47 -96 -20 60 26 36 24 16 -20 71 -4 103 -19 -5 20 -104
9635 -104 -45 85 64 -44 -51 -26 -58 -22 -10 -1 158 -36 149 -87 54 -17 44 17 -12 -41 28 10 143 43 -12 -70
9661 -70 -60 42 176 130 60 18 9 -108 3 10 -21 83 49 33 41 41 23 -19 -29 47 -77 51 40 -37 -97 -92 -148 4 -45
9690 -45 -197 88 25 -72 -47 18 -82 41 37 -84 55 -90 -53 -116 -111 -34 0 -76 29 -11 -18 5 -92 6 12 -15 -25 89
9718 89 22 45 -124 -29 -13 68 94 72 15 -91 45 45 -8 -134 -16 -71 -50 13 -18 31 -56 1 -21 -21 13 -27 3 -4 -57
9747 -57 -60 -24 -32 37 -29 14 -23 -118 -69 70 57 84 -53 38 22 -38 67 -25 -35 57 -61 22 62 -73 21 -119 -121 -118 -20
9776 -20 34 -66 -99 -137 -23 -6 6 -8 108 -41 -79 7 -81 -40 -13 42 -72 32 -53 14 49 -53 -21 -22 -122 -67 -34
9803 -34 -18 150 43 39 14 130 39 116 10 -37 -15 -81 34 121 -129 -104 65 84 73 147 117 24 61 1 -125 78
9829 78 -152 0 31 29 76 -32 -55 -9 -11 -23 -63 -96 -39 -17 -31 83 -10 18 42 -5 -78 100 43 34 -36 -76 66 -27 -36
9858 -36 128 -1 -70 -152 -3 12 137 -74 39 57 -69 -11 39 48 86 -59 43 -91 -28 -41 -38 2 20 -20 -76 -31
9884 -31 -61 -94 -104 -82 -31 23 21 -129 23 39 49 -90 6 -107 -45 -81 35 27 5 46 65 34 -62 90 -41 97 -69
9911 -69 20 -28 69 -9 39 11 40 54 30 42 -53 -2 79 -43 -20 -18 28 -160 50 -40 -101 33 -45 -90 29 -12 -26 3
9939 3 -52 58 40 -72 0 -30 100 28 -49 -2 18 -109 9 13 -134 -25 59 55 -35 -52 -65 18 23 54 41 27 35 -71 17
9968 17 -73 -77 -16 0 -160 -16 24 103 -43 -100 56 38 66 113 116 22 -47 -3 -11 -18 -4 -78 21 41 -42 21 65 -37 63
9997 63 -70 -57 -30 61 157 28 8 29 49 67 -35 13 73 39 80 40 34 -50 83 -51 -24 16 2 -13 49 -6 68 1
10025 1 44 18 18 6 22 -24 -27 58 -52 62 83 24 -39 -11 3 16 -76 -32 -35 15 38 -21 80 -81 40 24 63 13 -68
10054 -68 114 11 -100 -55 84 58 13 -3 18 -2 41 22 20 14 -20 -6 -50 34 -76 -85 -18 -86 -4 36 165 56 70 -6
10082 -6 -4 -59 67 78 -38 65 -121 -62 -18 -6 2 -71 14 12 -30 54 6 -43 40 56 -30 35 61 58 7 -71 7 51 -30 31
10112 31 20 10 -8 -72 -13 72 -59 -34 -23 1 -36 -67 -84 -54 -46 -16 53 -25 8 -8 53 25 -51 6 123 -9 64 -105
10140 -105 10 -27 -54 42 61 44 50 17 -72 5 138 -9 55 -44 -48 23 78 27 30 -31 -73 13 27 132 15 -98 44
10167 44 72 -46 -96 -107 18 94 18 27 6 -22 -66 -72 -13 -40 -14 -112 59 -35 56 -53 65 26 -116 -43 118 -38 40
10194 40 -29 81 39 3 74 49 23 165 -22 120 112 -192 93 66 -61 51 77 108 -15 13 73 -25 -86 74 -19
10219 -19 17 -35 19 -35 44 -56 -18 -106 -176 -42 129 135 56 6 -47 -45 22 -35 15 -36 37 51 -97 -1 -41 28 97 58 25
10248 25 62 56 127 5 -34 4 -72 -72 -3 -88 -12 -23 -58 -24 -20 -36 -106 -31 -194 -82 -113 -67 91 49 -115 -63 69 -188
10276 -188 -73 61 6 -87 87 14 81 -46 -41 45 -87 -79 -11 -32 -95 -155 61 12 34 8 -17 95 48 110 31 63 28
10303 28 -124 -86 -32 -64 -44 -42 -32 -89 42 15 -47 -52 -67 -101 -29 54 2 -128 38 106 -113 -38 89 112 -30 51 153
10330 153 -67 -7 -92 139 89 -75 -66 -29 -31 30 -102 -68 23 56 -30 46 124 -23 102 12 61 12 117 -39 115 68
10356 68 42 -100 -45 -80 -88 -116 -33 -62 -22 -98 46 92 -45 112 -58 56 -91 -31 52 40 108 -117 -10 -87 -38 -73
10382 -73 57 -62 -84 16 -56 75 16 174 66 -79 -94 87 -19 -42 33 49 -15 -43 40 76 56 52 -80 5 -116
10407 -116 32 125 -96 11 -108 45 -91 12 32 32 -53 51 19 43 84 -32 32 -24 60 70 69 36 26 26 -77 81
10433 81 44 29 97 -60 5 10 4 35 -36 118 43 -10 115 29 61 22 13 -64 -24 30 -19 -19 -35 16 22 -49 96 -153 25
10462 25 -101 -111 16 -20 69 15 -44 -20 -8 -175 20 -54 32 -34 23 32 11 163 68 97 -93 54 147 54 72 21 -116
10489 -116 2 189 4 114 76 54 135 -2 109 64 21 45 17 71 -41 28 6 53 -139 61 -44 1 -56 -7
10513 -7 79 142 -32 -70 -2 -106 69 -8 15 27 -72 -45 92 90 -61 -24 88 21 96 20 31 -100 128 -43 -64 7
10539 7 -66 82 56 40 57 -102 38 49 125 -98 65 -69 18 -3 -36 -73 6 16 -73 -40 37 34 12 91 1 10 56 56 137
10568 137 -24 10 -15 -8 -22 -9 125 197 89 -55 78 -125 -91 35 -29 -23 43 -125 35 7 -158 88 -13 -51
10592 -51 98 49 54 -64 -94 5 -25 -203 -94 52 20 77 24 -64 -102 10 -124 72 -136 100 2 -66 -26 4 94
10617 94 -10 -16 18 -113 24 -63 -38 -127 -57 127 44 -13 13 8 -8 -1 -22 35 71 99 -2 16 12 31 -4 -78 75 -44
10645 -44 -13 -4 -63 -130 21 51 -28 -84 10 -3 -39 89 21 -30 46 -2 -26 31 12 -105 -8 -109 84 -69 -45 -78 -55
10672 -55 -1 -59 -70 -13 14 -137 76 91 -80 99 62 -30 -34 -33 44 91 -187 -59 18 -28 -67 -40 46 -94 -151 -37 -32
10699 -32 -65 -37 46 -3 85 13 21 -10 84 -82 76 117 84 -123 -17 12 107 -57 -13 -31 -34 -10 61 0 -25 10 -112 -29
10727 -29 -122 -25 -46 190 -68 105 -7 1 -37 -17 -103 -138 -39 -10 45 1 28 -1 -1 -80 -50 3 -39 -21 55 -7 -156 -44
10755 -44 30 -128 -178 55 46 -31 -3 47 75 38 53 59 95 -15 25 -103 -59 139 43 25 -36 99 -16 -69 126 6
10781 6 45 54 3 6 113 -36 -11 26 -159 -84 1 84 -127 56 12 -109 119 -24 -44 -20 32 4 -27 -149 -108 44
10807 44 -55 -69 -91 -14 1 -12 -90 136 71 71 -54 -66 -33 16 89 -3 14 20 -28 -75 -59 -5 35 -31 -18 38 -72 53 45
10836 45 -35 -64 -92 47 -58 114 -6 -27 -24 -121 8 -72 28 -79 -15 24 -61 79 -9 20 76 62 28 -23 -19 34 -22
10863 -22 -24 -37 72 1 88 45 6 36 19 -54 62 28 -60 -39 -66 -39 -18 129 -96 158 -6 -143 -40 -74 -74 -162 -109
10890 -109 77 27 -105 -114 80 -13 31 105 76 -50 -39 -28 -39 -54 66 154 -5 -21 42 -44 -29 210 103 -126 -103
10915 -103 -74 -28 15 22 36 0 60 17 -84 6 -65 -91 5 -59 114 117 -74 -122 70 -36 112 -16 -20 -39 -39 17 -59 18
10943 18 -59 -9 -101 -6 44 3 33 -50 -44 10 -87 50 -63 41 -9 21 -128 -27 52 -19 4 17 10 110 0 -42 63
10970 63 76 -44 -5 65 -30 118 51 -68 12 -63 -143 -106 -75 -12 119 -40 -84 -19 18 -52 -153 46 -56 49 5
10995 5 -84 -81 -20 -4 -36 -50 16 68 23 38 16 -87 -14 10 -5 63 98 62 20 9 58 -30 -42 251 -30 60 -75 -25 -6
11024 -6 -93 86 79 -90 -12 40 -13 -18 -33 -33 -50 38 4 90 -7 93 32 4 4 -24 -77 70 43 56 67 8 23 68 56 19
11054 19 112 0 73 21 -67 -59 -98 -90 69 90 14 -20 -12 -58 -126 -68 30 -4 4 -59 46 -45 -29 3 44 81 27 28 -64 71
11084 71 21 87 87 18 -29 -1 35 17 -132 70 -1 14 73 -103 46 114 30 12 78 20 47 -93 148 -27 -95 120
11110 120 -7 -31 -16 -7 18 52 34 -21 70 -91 -21 14 -113 -8 -106 67 72 -22 -35 -97 -3 28 -57 102 12 -57 6
11137 6 33 -20 75 59 -42 -60 -2 61 -23 58 -121 -8 -29 5 45 50 165 -50 -28 49 26 -98 30 50 63 39 -14
11164 -14 43 159 27 -73 -87 53 95 79 66 -118 8 43 -17 11 38 -31 -66 -12 55 22 -131 -25 -51 -15 63 -41
11190 -41 69 -55 16 -13 -16 -15 66 6 -9 53 88 120 -5 -3 -104 -58 4 -15 52 -63 55 -104 -79 -20 2 -43 -110 49
11218 49 -44 -82 -54 35 18 -54 -44 -14 22 -66 -36 -77 19 -23 7 5 21 1 -14 -70 29 73 42 -51 -20 -47 3 52 65 -89
11248 -89 97 88 7 -112 91 -14 -29 71 27 -24 -57 38 -67 -9 36 -56 -123 -73 38 -30 42 -24 -5 -57 19 -3 133
11275 133 -2 -107 -55 26 148 94 -33 -4 69 -5 -67 -4 -46 -63 -23 -6 -3 34 -108 -68 23 28 55 -21 -67 92 27
11302 27 -80 -60 79 30 60 -111 47 -30 6 -7 -142 -6 -89 -31 -49 -62 -96 30 46 75 -121 8 128 58 -144
11327 -144 14 92 -74 29 -38 -22 93 -1 -10 27 54 -38 78 -85 7 -10 -76 109 -29 31 -52 78 30 -68 9
11352 9 139 24 52 -28 -103 133 52 155 -52 71 -70 34 58 -21 44 -133 -25 -64 -3 -71 8 52 -10 -19 27 -58
11378 -58 -83 34 58 43 54 -65 -71 -29 19 -104 52 -103 84 -50 -41 -6 92 -39 60 -43 -98 30 17 -18 -113 125
11404 125 -36 -37 -114 -80 182 160 -35 -29 -36 -127 -43 -26 -53 94 33 35 -38 27 92 -67 66 162 108 -16 -85 7 27 -2
11432 -2 35 -32 141 -118 152 -53 57 -37 5 25 93 52 95 79 -83 -45 102 -20 -17 83 -38 -20 17 35 -45 20
11458 20 13 -21 -102 35 -33 -19 66 -73 0 -64 -114 24 54 41 -158 -8 -60 11 -39 18 -12 42 -61 -143 38 -19 118
11485 118 9 207 22 67 -50 -137 21 40 -11 -74 1 16 43 124 -26 78 17 46 53 2 -92 -60 111 -15 -40
11510 -40 -40 60 -89 -33 9 -127 70 65 -65 62 7 27 -5 149 70 -63 11 31 -115 14 75 97 -7 -51 69
11535 69 -26 -66 25 17 71 -56 -20 -17 72 29 -107 -23 15 -88 -27 24 63 -90 60 -101 -172 4 -5 8 -12 -69 30 12
11563 12 -58 -52 -40 -52 -76 -61 -74 30 22 56 23 0 90 136 116 35 55 80 16 98 31 -21 196 47 24 -98 15 127
11591 127 -27 -44 30 49 -19 81 -54 -77 -4 -45 -57 -37 30 50 7 -52 46 -48 -41 -44 -10 13 -67 -53 28 79 -16 -52 15
11620 15 137 -31 85 33 -49 1 0 21 -82 67 -14 -31 -4 21 -30 -19 55 36 32 -9 -14 -3 153 22 -43 -22 111
11647 111 -38 -1 21 -67 -16 -105 -91 -95 -47 -86 -75 36 -50 -96 -121 67 20 18 47 -51 158 69 103 -11 91 -57 21
11674 21 -10 -6 -69 61 24 7 55 85 42 -47 73 31 -13 -17 -17 15 81 21 62 172 -40 64 35 20 -72 11 -138 74
11702 74 -124 -90 41 -118 -64 -93 142 -162 -73 -144 -49 144 79 -46 0 -10 39 9 -85 -15 59 -27 49 -62 -114 19
11728 19 -13 107 -26 -13 106 -63 10 51 -91 -5 -42 -55 -21 -39 -143 36 -20 40 -45 -47 -1 59 113 -109 -19 -55
11754 -55 60 53 -9 41 -15 -100 -30 -25 -42 4 -74 101 -152 -71 -61 113 10 -115 -11 195 20 -2 -2 7 76 66 -17
11781 -17 88 -81 -4 -6 -56 18 -37 -54 -73 29 81 -53 -73 35 121 -15 49 65 -26 -8 -54 37 12 -60 16 6 -59
11808 -59 70 31 -53 39 -12 84 109 135 -12 33 35 -87 36 0 -1 43 9 42 -78 -7 -12 58 74 95 -7 -89 60 -49
11836 -49 53 111 -96 94 1 -92 -66 -109 -82 -42 -15 -61 -71 -124 -10 66 69 -148 -75 65 -101 -149 -4 -75 -8 15
11862 15 134 76 -5 125 -19 2 45 -22 104 -64 119 47 67 79 3 -24 -87 80 101 108 79 85 24 94 -86 -155 10
11889 10 107 -121 -65 -41 -79 -56 -31 176 -5 56 -27 -164 -117 -50 22 97 -8 34 19 85 45 53 -33 -60 67 4 -1 13
11917 13 87 56 37 168 -82 121 145 77 -48 -15 91 -19 79 80 -86 41 90 54 77 163 -61 11 36 41 -21 -59
11943 -59 55 30 -2 13 89 -4 -67 51 -48 -27 -55 81 115 48 -88 13 4 -22 0 54 203 111 68 -32 -21 16 -51
11970 -51 -32 78 -115 70 -1 124 13 -160 22 -95 108 14 31 43 22 -27 26 106 88 -56 -26 -30 20 28 81 18
11996 18 -92 163 -12 -109 -83 2 51 -19 -119 37 77 3 140 41 97 49 57 49 -2 26 -3 -67 99 -6 -75 8 49
12023 49 115 -83 21 29 -52 -14 5 13 27 37 41 -1 118 -87 -2 -38 42 -43 114 58 87 47 -102 22 78 32 -26 -56
12051 -56 -11 -23 111 13 10 -30 -14 -116 13 23 -36 73 -56 63 14 96 25 33 33 132 67 -73 -79 -15 54 10 -80 -1
12079 -1 25 56 39 84 47 50 80 -70 68 -74 36 49 52 -59 40 -70 40 -37 10 12 -145 -8 23 6 -50 143 1
12106 1 33 168 -1 143 90 34 54 51 43 8 14 -32 -59 -25 -1 72 63 53 140 61 -16 -74 -58 -60 -24 -21 -48 -34 26 10 -101
12137 -101 38 54 -26 -14 -79 -55 21 -112 32 -69 -6 -36 32 102 -152 -140 -71 4 -44 2 -58 15 -28 128 -43 -105
12163 -105 48 -81 -76 -35 25 -21 29 -109 14 -60 68 32 -23 -66 -74 -68 48 8 -79 73 140 -88 -23 71 7 -71 -105
12190 -105 -115 70 -94 18 33 82 -1 -25 35 33 18 -78 -10 -43 40 5 38 -40 39 88 -23 -83 32 -18 -3 47 -94
12217 -94 45 55 43 -20 29 -11 44 -50 -70 -47 -169 18 -7 -61 -180 110 23 62 -67 49 -3 -46 1 -23 97 41
12243 41 11 70 -14 24 -22 92 -59 44 66 -33 -1 -41 64 27 -26 -111 -64 92 106 26 -149 -47 -59 62 101 -10
12269 -10 145 64 -52 73 -77 83 -133 -241 31 -17 -133 -183 23 24 20 -14 3 -38 -96 -69 5 -44 11 92 56 15
12295 15 -32 -73 -19 -65 30 -75 50 2 -46 -30 10 -71 -2 -6 -27 -9 50 -27 1 -57 -40 35 -26 -10 -31 109 15 -16 23
12324 23 123 91 -4 63 92 42 -120 -63 201 -8 5 -27 -110 -4 -98 14 -1 38 -58 96 70 6 -52 -39 73 96
12350 96 83 77 -92 18 63 100 -63 65 136 -32 32 76 -101 -1 -47 23 1 -38 -64 -32 49 25 -39 -66 7 -78 -4
12377 -4 30 36 -5 -87 5 -27 27 -22 37 -52 56 19 179 82 53 42 -36 89 29 -117 53 17 28 114 70 75 120 48 -22
12406 -22 39 55 124 4 69 36 -3 105 44 -22 -172 29 -86 0 -3 -7 -99 139 19 -123 -21 79 -35 -38 -70 69
12432 69 -79 -2 53 54 -12 58 90 68 -2 33 -87 -37 -100 26 75 -91 78 -60 40 -48 -8 17 19 -79 -69 6 16
12459 16 56 -3 -41 68 43 -32 71 -51 23 -18 -62 44 -13 119 65 -128 52 -34 -69 25 -53 50 83 -107 -49
12484 -49 128 144 75 47 36 24 31 -31 -14 -8 -54 73 58 -42 -25 58 -2 -110 -116 -72 29 -89 66 -40 41 22 18 -52
12512 -52 -69 85 73 30 22 -5 -80 -50 -32 -22 -78 115 35 58 -53 -14 -14 -125 -85 45 -67 29 -5 -7 81 -63 -23 -38
12540 -38 -22 -22 55 -32 75 -88 141 2 2 -82 -41 95 -20 30 91 -51 -3 38 -73 -169 -112 53 -109 -92 -82 -73
12566 -73 27 -57 22 -90 -1 -8 -76 60 45 64 -10 -8 42 32 -73 2 43 32 31 36 25 24 68 -139 -39 -42 6 -195 14
12595 14 13 -124 59 -6 -104 11 209 19 152 -60 36 5 17 -95 7 -67 22 -38 -24 71 12 -89 22 -4 -13
12620 -13 2 -4 24 -58 21 -6 -74 65 -82 -21 -106 30 13 16 -26 7 12 66 47 16 -14 -1 22 -6 31 18 36 -67 -50
12649 -50 28 2 69 56 -3 -49 81 -59 -20 -22 30 34 32 24 -23 77 -17 -72 -99 -30 -30 28 -17 14 -146 -55 97 -55 27
12678 27 30 -59 123 -69 100 -63 -42 6 46 44 -40 -15 -32 25 30 50 77 76 -78 14 -58 -53 1 27 70 -3 25 20 26 140
12708 140 19 -86 -97 -52 48 63 -17 -9 15 -28 93 23 46 -17 74 -34 46 -67 16 14 -22 -35 1 -96 -79 -75 130
12735 130 63 32 23 -119 45 47 26 21 -20 29 -56 -25 -124 92 -30 18 1 -65 -28 100 3 -42 -5 44 82 -123 96
12762 96 6 -38 -44 -38 15 7 -66 -25 27 -99 -127 -26 -67 -2 -61 103 -45 -102 138 21 -67 37 62 9 9 34 -20 45
12790 45 78 -76 48 -52 -91 25 27 -117 -51 21 54 -71 -44 -73 -89 77 -9 4 -34 133 15 40 3 -41 87
12815 87 87 72 5 73 -64 32 56 127 19 21 -20 108 38 -5 39 -2 63 -22 12 56 71 52 30 -27 62 -29 41 22 38
12844 38 -14 -39 57 -15 -49 -186 50 -121 58 -1 18 -62 -59 -29 -15 -70 10 -50 -19 -3 1 42 -78 1 116 -79 11
12871 11 -41 35 -1 84 24 -10 31 111 12 -4 115 22 -54 -108 -82 -78 -39 -58 -91 -13 -22 -99 -10 -56 -84 -80 14 -31 14 -55 -26
12902 -26 58 15 -117 95 -7 5 55 -109 -18 -20 -94 -3 11 -145 15 -24 24 24 76 57 14 26 -103 6 -41 -15 79
12929 79 -80 209 55 22 -31 63 -26 -70 58 29 113 71 -123 104 125 -59 -6 16 -74 5 -99 -132 -19 -21 -73 -95
12955 -95 26 -60 91 2 4 -20 13 61 29 -5 50 -77 -79 -81 -83 33 25 -6 28 4 52 -78 4 -104 4 -74 -18 51 -2
12984 -2 40 14 -79 111 -61 31 124 -122 -67 -45 -24 28 -69 122 -46 -62 56 -32 29 -14 -41 72 -44 -3 12 -44
13010 -44 7 -101 35 -3 54 -107 -5 -23 -33 -16 101 -72 -12 9 45 -109 6 68 -59 -8 -79 57 -48 -19
13034 -19 64 3 62 41 -24 9 104 18 -43 -37 -18 -5 10 2 -31 -52 68 32 87 -122 10 -103 -81 -104 -80 -5 -60 106
13062 106 6 -137 5 57 49 -22 -27 101 -27 -77 61 41 56 45 40 -40 -106 -69 6 37 -63 -59 1 21 33 23 -107
13089 -107 4 82 41 -57 -70 76 17 -134 -108 -38 -81 62 98 -61 -8 98 -45 -56 43 -20 43 -68 18 18 84 -5
13115 -5 -73 94 104 -38 -105 -5 76 132 -63 105 111 71 -28 4 55 -57 65 -36 85 -57 -43 0 -48 -1 -9 -66
13141 -66 -33 -18 -23 12 69 -55 -86 -106 3 -6 -64 -13 -2 -125 22 -3 -85 17 12 22 -103 146 -28 -72 66 -33 -91
13168 -91 7 80 -61 -102 3 -56 9 12 -59 -92 131 -33 -34 27 28 -24 -13 55 103 -4 -54 -47 2 -88 -66 -79 -20 128 11
13197 11 -19 -41 13 -81 -39 32 32 68 -26 26 19 -25 -97 9 26 88 -40 -23 -64 39 48 110 29 24 210 -55 -62 -124 145
13226 145 11 88 -107 -83 53 -32 -44 -115 -23 -6 -12 96 -8 -113 -32 58 -23 27 66 -26 -3 144 8 31 84 -28
13252 -28 89 -67 20 -11 -44 3 -20 -40 74 -4 -81 76 10 41 -1 76 -55 127 50 -32 -64 15 -2 -100 74 -6
13278 -6 -35 41 52 -32 -56 -19 123 31 -32 -43 -56 -37 -3 27 76 36 84 -29 -11 59 -50 150 79 -12 63 -24 -48 132
13306 132 -26 50 -93 -37 75 129 87 -37 -61 -22 -36 6 -101 -18 124 86 66 -22 -18 43 -23 57 66 49 -62 74
13332 74 39 -51 -55 50 38 -7 78 53 41 -40 4 93 25 47 1 103 71 136 -42 -3 47 84 -55 -28 77 -82 -35
13359 -35 51 -139 -51 41 -64 -172 29 -31 5 1 3 14 109 200 91 36 -39 -46 55 -24 -17 -85 -65 55 36 69 4 53
13387 53 14 4 17 -30 28 40 33 127 -49 109 -21 117 90 87 3 41 61 24 82 -6 4 50 19 -5 -35 17 -28 -55 74
13416 74 26 21 -61 3 -10 18 -78 -55 -39 70 22 2 -66 48 2 38 -27 -29 55 91 94 -64 -53 -53 61 76 -28 42 94
13445 94 77 -49 24 -91 50 -22 -6 54 21 85 50 22 -79 115 -31 -12 -63 55 -129 -39 -22 -49 76 -28 -1
13470 -1 15 86 27 -71 -109 -42 36 6 -9 70 67 46 90 24 10 -5 3 44 -37 -49 67 109 -27 -43 2 53 123 16 -95
13499 -95 -27 -127 72 132 50 38 74 122 16 33 64 113 50 -79 -128 -11 62 -45 71 19 -110 50 31 25 -94
13524 -94 -8 42 112 -5 -9 25 18 3 -112 114 -68 76 -16 63 90 35 8 -5 65 -22 89 -37 -37 29 98 55 98 141
13552 141 4 22 191 -66 11 -12 7 64 51 76 -21 51 -42 74 -20 61 -1 -43 -99 -37 -35 93 -3 36 7 57 -113
13579 -113 -127 134 107 -39 60 -28 -110 107 -55 -93 30 10 -21 133 -39 116 -128 240 -40 -79 17 85 -16
13602 -16 12 -126 86 12 37 92 -31 8 -36 11 84 -91 104 -33 -126 -1 -42 -46 -7 33 -21 15 -71 12 -19 48 163
13629 163 43 142 63 -41 -63 -135 -54 72 -115 -79 24 -155 7 -78 77 38 -68 72 98 49 53 -68 -73 106
13653 106 -25 -25 -83 55 7 -12 9 -50 18 -44 59 93 -90 -69 53 -77 -40 -36 -55 109 -18 -60 35 -62 44 85
13679 85 11 -5 32 -51 15 139 13 -36 5 -56 50 114 123 65 111 -57 -55 8 35 58 6 8 30 113 65 17 26 -41 26 42
13709 42 -22 44 104 7 -2 -46 -10 108 0 1 -44 -24 -67 47 18 27 23 -94 11 -63 -29 28 135 -52 45 69 -2 -24
13737 -24 87 -88 33 27 161 17 77 -9 72 32 22 11 40 -140 -3 50 -142 -37 -111 87 14 16 72 32 -120
13762 -120 91 76 80 6 -13 12 69 -38 -71 -63 117 -28 9 -32 -17 -94 -21 -53 22 9 -7 -2 13 21 16 43 15 -45 -48 90
13792 90 -74 -100 -146 35 -54 21 -117 61 3 -27 -29 -10 2 67 -99 -110 42 61 51 -62 -11 -25 -74 98 -55 -15
13818 -15 114 -31 -31 -10 -58 96 -23 -76 -32 -7 -2 18 6 -81 -7 -94 9 160 59 1 -14 -1 42 74 14 5 32 56
13846 56 -24 -74 22 -35 87 7 61 -13 12 -193 46 87 125 36 -17 14 -70 35 22 -61 -36 107 -8 -8 -1 0 -51 4
13874 4 24 -28 111 24 53 48 87 69 51 -101 -111 -36 40 -59 5 3 117 -91 41 17 -32 46 -13 -52 -8 76 23 62 -41
13903 -41 -55 21 -34 -43 27 -138 -94 103 -23 -48 -130 34 -59 68 -117 23 56 2 -7 -13 45 60 46 -86 -51 56 -62
13930 -62 -1 48 -3 36 -146 -66 -117 -1 126 63 -71 33 80 -62 41 27 61 56 41 48 136 -46 16 129 72 78 -33
13957 -33 -36 -4 -49 -17 48 30 -42 -124 -20 -88 -1 28 -52 34 84 -50 119 -53 -59 15 133 119 107 105 151 19 -84 -120
13985 -120 78 5 -9 -85 63 -48 -5 -99 -60 -25 8 -38 -23 64 41 87 5 -9 76 -61 108 104 -153 -13 -113 29
14011 29 -18 17 137 41 5 60 18 -98 7 -54 -39 31 124 -5 -58 84 -7 99 -59 139 -67 23 -31 42 8
14036 8 53 6 -52 -63 -33 9 85 49 59 -90 -89 5 -12 -14 39 -63 117 47 -52 -69 41 -13 -67 -49 -81 105 90 -82
14064 -82 26 103 9 78 -1 -38 -59 -78 56 -123 16 58 -80 24 67 10 3 62 -88 94 -63 -6 39 -1 82 -86
14090 -86 -102 1 -30 14 87 89 -67 -55 45 -47 -251 -7 77 -80 -56 88 28 71 8 -1 21 -30 -57 -32 -12 -18 95
14117 95 -33 29 -129 -57 62 -24 128 -55 -60 -39 54 11 -44 -38 32 -2 79 60 44 49 -66 -11 19 -67 44 -74 28
14144 28 -21 -43 -71 -162 -7 -44 -137 -107 23 47 -34 73 -121 -32 -10 28 -7 -5 -15 22 52 -35 26 -16 -6 -122 92
14171 92 15 -28 37 -4 19 -56 -129 -57 -49 82 -15 36 -35 -86 -64 4 123 21 -15 1 -82 76 -45 -41 -148 -107 51
14198 51 -13 52 65 -22 9 -4 78 35 -11 -30 31 51 -90 23 -56 64 93 -13 -80 26 1 -49 72 -66 86 88
14224 88 -21 97 -55 69 152 89 -89 -36 14 -43 9 6 26 -18 -58 35 -91 -26 126 -50 93 72 -43 15 52
14249 52 27 -77 80 -108 -66 62 49 45 186 146 76 84 -12 87 -38 -53 -24 65 -63 -99 -33 -24 43 89 32 13 56 -48
14277 -48 106 -19 62 71 27 -134 14 -61 16 12 -87 -15 0 -57 44 3 -40 -62 -98 79 -63 -5 -204 -31 27 -35
14303 -35 71 -22 -90 -97 91 -39 68 35 79 -27 -99 -22 -105 -16 26 -5 -20 -51 -33 -5 -11 -38 82 -65 20 -106 -153
14330 -153 71 103 -15 -53 -17 27 -17 -17 12 67 9 -31 -81 16 43 91 68 9 32 28 63 -21 -59 49 69 -91 -75 -9
14358 -9 30 44 -31 -148 46 -12 -4 4 -3 43 13 -60 -54 -3 -84 -39 -46 79 44 -13 115 -32 -7 -221 7 20 -71 -39 56
14387 56 -47 -7 -78 -54 73 12 -23 -14 47 -86 104 -44 -74 12 -34 12 -48 52 4 -16 -37 35 -67 -4 -59 45
14413 45 78 -189 4 -27 51 -52 75 35 -95 26 -22 -218 0 90 13 -33 -52 12 -14 -26 6 8 31 44 9 -66
14439 -66 -133 -29 -1 -41 42 107 -50 -41 24 -3 120 8 -61 66 111 -26 -30 70 -39 -12 75 40 -1 23 35 54 41
14466 41 41 40 -84 20 138 19 -103 46 -80 11 -53 -93 -120 -39 64 -35 -23 1 -23 -55 98 158 -27 -47 60
14491 60 12 42 22 2 28 83 77 32 -49 14 77 45 4 -3 60 5 46 39 55 26 131 -35 -103 -71 60 11 6 -6 -23 58
14521 58 58 13 -60 -108 -13 -126 -39 -122 -41 99 -71 80 52 -41 -42 54 44 -26 -26 59 -30 18 -45 -14 4 29 58 -99 13
14550 13 -33 28 -21 -101 38 123 -78 -80 52 63 63 84 -6 130 40 -32 52 -42 6 -5 -35 40 21 42 -41 -164 30 62
14578 62 -61 -53 -14 76 -106 -39 7 -109 -148 -34 100 -59 -121 122 -20 -91 -26 -92 -63 41 18 -79 38 -6 -30
14603 -30 14 -100 -15 6 -16 -50 23 -84 -68 6 -56 13 -178 -18 53 -103 39 -36 -31 45 18 53 -143 -72 35 34 -79
14630 -79 -13 44 -74 -88 73 -93 -71 27 -96 -79 -76 -65 38 -1 96 41 -49 88 -79 -134 -22 60 -74 56 11
14655 11 7 -103 74 -91 -36 9 -38 13 -86 27 -7 71 -35 11 -57 0 12 68 -20 38 14 57 77 -52 -23 -116 -35
14682 -35 31 31 41 -23 -132 -131 18 -94 -48 46 -40 31 -80 -114 -10 95 14 -110 -106 19 -21 65 -38 53 -110 14
14708 14 -23 -57 7 50 -67 -85 -38 15 31 -130 21 -8 -58 -104 4 19 -26 -60 17 -37 158 -38 -21 61 -14 14 74
14735 74 102 16 -58 -82 -53 74 63 -1 -13 -146 43 -15 42 -23 -33 -132 171 116 64 -36 -43 -152 108 15 -122 178
14761 178 -30 4 23 24 -38 -14 130 -50 33 -20 41 -63 90 44 54 72 75 -19 -75 -38 -58 -69 -19 6 -77 -10 -15 -34
14789 -34 -26 -20 91 12 -42 -59 24 96 42 7 41 -105 37 33 -74 34 -40 -110 -121 -31 -21 -102 27 -9 7 24 -45 -132
14817 -132 -105 -35 -56 -12 -92 26 -12 88 -3 3 -102 -25 63 1 29 65 -36 -68 49 -19 8 124 145 -56 -24 -88
14843 -88 27 14 117 -134 72 -49 7 -71 -1 -53 -55 10 68 71 -126 -37 110 -108 -56 7 -14 4 -139 -29 25 21
14869 21 -59 -37 -11 -36 0 -39 -60 -44 17 -99 54 34 -4 12 -17 77 73 29 16 -25 81 63 -12 -3 33 57 -10 -44 -32
14898 -32 20 -36 -58 -15 -116 -54 47 52 -70 19 89 -63 15 53 61 55 76 70 -97 40 76 -5 18 19 39 15 87 -85 -46
14927 -46 17 90 -57 -54 10 133 2 -17 -68 82 112 79 -12 101 50 37 30 -28 27 23 29 -12 -63 5 -94 -9 37 -26 25
14956 25 -30 2 -20 -44 -37 -17 36 -72 -37 -25 67 -108 -66 -63 13 114 -123 -132 -106 -31 42 129 25 -22 60 -93 -21 -57
14984 -57 5 101 -31 39 62 11 10 35 -20 -126 -121 35 1 1 -59 -83 -31 -30 46 -18 39 -67 -42 -128 -47 -54 -61 -91 -94 10 45
15015 45 -42 48 82 -49 -68 13 35 -63 25 -99 -2 79 -52 15 105 -9 71 -60 77 -12 -108 28 57 -59 45
15040 45 -102 -22 -145 16 23 -46 -82 -105 -7 -154 -68 -30 -87 -33 -89 -47 -42 49 -73 -37 65 4 88 -9 85 170 -84
15067 -84 -145 83 106 -5 54 -99 -32 71 -48 71 -27 10 -143 42 -4 46 -77 39 71 31 -146 79 111 18
15091 18 74 -52 41 112 -14 57 -6 75 -22 -6 -1 -8 -29 -109 -136 2 -44 -6 -127 -170 -29 29 -34 -18 -3 92 -11 33
15119 33 20 74 132 38 -34 46 -109 -38 -4 35 -29 62 -28 -66 -43 30 -91 3 65 -97 -152 -71 68 45 -84 102 -28
15146 -28 48 15 64 -81 -66 8 -77 16 39 8 -50 -61 -56 -39 -73 54 -58 -2 162 -30 65 -9 -56 -69 85 -14 -86
15173 -86 5 -22 -101 11 127 56 63 18 -52 9 -14 -54 -4 37 -69 -14 -8 25 58 -41 -27 -48 -74 -1 -143 -11 -15 54 85
15202 85 32 7 -36 -108 -24 -121 -53 63 -53 113 134 -67 108 89 26 13 59 -39 115 15 37 31 -92 -40 105 116
15228 116 -38 -16 -12 66 83 78 -39 -64 -8 -39 -29 7 -33 11 -32 42 -11 1 -1 -22 162 -92 -72 128 9 -9 47 -21
15256 -21 -26 30 16 69 -28 49 -43 -93 -15 -2 43 -8 50 -100 -26 92 -71 -66 -25 58 60 -3 -79 46 63 31 -65 93 59
15285 59 -130 19 34 47 17 79 104 -82 -24 -29 22 -33 174 -4 -73 -63 1 54 65 -29 -10 -66 30 -85 23 42 129
15312 129 -18 27 10 -5 5 -103 -35 -133 -72 87 -72 -59 10 -68 43 68 -37 -115 -48 -40 4 -38 59 -30 -113 -52 -16
15339 -16 -79 -50 -37 -28 -129 -10 -36 -21 37 -4 39 17 -65 -99 51 4 -48 13 -33 134 -42 -44 74 42 -7 -25 -14 -64
15367 -64 11 -30 105 43 28 -93 -9 -118 -29 7 -12 -90 12 5 6 37 -86 -23 -32 -24 13 -73 -51 -93 -16 38 109 37 5
15396 5 -42 -99 -9 -173 -33 0 12 81 89 -1 33 -117 87 -4 17 -129 21 30 21 -52 -156 93 -40 -12 41 -66 137
15423 137 -108 -82 -54 -4 -12 -34 54 5 -136 43 -51 -41 -1 48 -38 -16 -44 -28 25 97 -41 -153 -65 -40 -17 -69 36
15450 36 -155 30 36 78 -61 23 -60 132 0 57 45 -43 -39 -18 -26 -44 10 24 -30 76 91 72 105 0 98 -26 -95
15477 -95 -1 -2 -93 -13 -44 -41 -26 33 30 -12 -49 10 -71 -119 -67 -39 -65 107 -8 5 28 104 -42 -74 57 -12 137 -84
15505 -84 96 57 -68 -24 53 -60 -48 -49 5 -49 -183 -134 1 -108 17 59 -75 38 -81 -2 6 8 119 -2 21
15530 21 45 51 -36 -28 12 -61 -23 2 -58 1 -110 43 -40 -43 -42 30 -3 64 14 59 18 -20 -56 -118 69 103 0 -67 -16 25
15560 25 -24 -31 -87 -17 34 71 65 -1 -60 -76 1 63 26 -33 183 -4 -17 1 60 -22 64 76 -88 39 39 -97 -40 -7 -48
15589 -48 -12 23 4 17 0 -13 30 55 -73 -57 -43 134 5 110 -46 -83 -85 24 15 64 1 137 139 -29 -31 -2 139
15616 139 -93 -101 93 28 52 -47 -3 -35 65 29 -36 17 1 136 -39 93 -82 45 59 -112 -53 -111 62 -55
15640 -55 -70 -45 -4 34 55 70 73 69 -83 8 -39 -30 -21 -79 -51 -101 -83 -49 -93 -40 16 24 -30 -102 35 -63 -33 7 -51 98 11
15671 11 65 -4 64 40 15 -68 -71 -37 57 20 68 -40 -57 30 -25 21 -24 -49 -99 -26 38 102 -55 -52 76 -5 8 36 26
15700 26 31 75 -33 35 107 50 -19 -57 -40 6 34 69 -33 29 34 -97 -37 -79 -130 13 6 -1 10 4 -8 13 70 14 49 13
15730 13 -27 26 3 -145 64 0 56 35 -58 69 -88 33 -61 -13 18 96 -17 39 42 76 46 -11 11 -54 58 -6 9
15757 9 -1 -93 -32 -8 126 167 -40 -81 -9 124 131 -55 -84 31 -17 -32 88 -46 -30 -38 -2 -103 -10 59 6 78 -28
15784 -28 7 -117 64 63 -61 60 -51 -8 61 -72 33 -5 -9 48 87 110 -63 -9 -47 -84 34 -16 -47 61 119 33
15810 33 58 -59 4 -21 27 3 -61 -81 -50 -62 -135 -85 66 10 -1 61 15 -107 66 10 37 -74 -55 143 35 -18
15836 -18 29 -117 -87 -53 20 117 7 -130 27 -64 35 -33 -46 -140 62 25 -13 58 4 -1 72 9 -61 -82 -12 -31 -46 -22
15864 -22 -14 -48 -69 154 -1 -43 -88 -64 -6 -67 75 0 52 31 2 5 66 19 57 75 48 -84 65 125 71 64 62 21 34
15893 34 -14 72 -5 79 -9 3 58 -50 0 24 27 -112 -78 -77 -80 36 21 -63 48 11 54 -29 62 108 -49 -128 25 -12
15921 -12 49 8 -6 -17 18 118 86 62 -35 62 205 18 58 50 -18 -75 -67 -34 60 29 79 -5 -60 26 37 -1 -10 87 -85
15950 -85 -4 -89 92 -71 -177 35 19 -102 -15 21 -84 101 42 -174 58 -92 -13 13 58 79 43 13 75 51 -79
15975 -79 -58 38 -32 -35 111 -65 -30 -98 -60 47 -42 -4 100 -14 83 8 -9 -12 34 0 -25 -31 -105 -45 -115 155 -54 32
16003 32 -74 0 -36 -64 73 92 -60 8 -29 -49 -3 8 13 51 70 15 17 15 66 -94 108 28 61 57 -3 75 2 59 28
16032 28 -169 -148 -56 186 18 1 139 -185 20 79 -2 90 -11 69 79 126 15 43 -47 65 68 -38 -81 -43 -65
16057 -65 65 23 85 -64 54 -50 63 -6 139 14 -17 40 -58 -28 11 30 12 -53 121 -102 -63 6 25 148 -30
16082 -30 48 -128 -16 39 37 32 -23 80 -56 64 -97 80 23 -17 8 -65 -20 -134 -41 188 -161 -75 -50 -10 -5 -65
16108 -65 102 65 42 -70 38 9 -50 -57 -89 -64 -10 -55 -2 -10 -13 11 -88 113 25 -39 -2 96 -98 -28 -62 -20 -12 93 31
16137 31 94 -14 -22 -87 -27 -26 71 -35 56 24 14 38 70 -2 -14 -80 -8 -9 202 33 2 64 -43 106 151 -2 -51 34
16165 34 -45 60 -34 82 -116 19 -129 -5 12 -12 35 -31 -108 15 -11 75 -7 -55 -75 9 42 0 -18 -15 -72 -23 10
16192 10 68 -52 -28 127 92 34 40 -28 -53 65 25 79 -6 126 115 16 -28 -19 -34 -37 35 23 -64 -66 -21 76 132 -20 -30
16221 -30 139 44 -47 111 -15 -14 -34 36 -76 -47 -55 -72 -51 -15 43 -28 -9 98 106 -8 150 -60 41 -25 20 -13 -156
16248 -156 -67 -29 -139 60 101 -1 4 40 15 -13 118 -54 -22 -45 -39 67 80 18 7 101 91 37 -85 72 9 -45
16274 -45 -23 40 -1 28 -112 -65 52 -77 7 15 70 8 39 -50 125 29 -92 -66 94 -59 -75 27 142 7 -6
16299 -6 -98 -22 44 33 78 58 -44 43 -77 61 -33 84 -111 31 -84 -69 -5 -71 -11 -32 -33 -69 -26 16 21 -39 62
16326 62 -40 102 -28 -89 -21 5 31 -41 -24 58 -26 -71 114 82 -32 79 -176 -69 16 -37 4 -47 -20 61 50 40
16352 40 55 -51 25 -42 -80 -2 -115 -191 -23 19 82 43 20 21 -107 90 14 -87 -73 -20 2 -55 35 117 65 14 9 -21
16380 -21 0 49 -25
16383b5
$$ Imaginary data points
##PAGE= N=2
##DATA TABLE= (X++(I..I)), XYDATA
0 0 0 0 0 0 0 0 0 0 0 0 0 0 0 0 0 0 -1 32 -32 32 -32 32 -33 64 -64 65 -96 97 -97 129 -151 161 -193 223 -237
35 -237 260 -298 344 -385 418 -476 517 -579 642 -707 786 -867 957 -1054 1161 -1279 1409
52 1409 -1555 1716 -1895 2099 -2327 2599 -2903 3275 -3710 4253 -4934 5830 -7062 8866 -11771
67 -11771 17271 -31398 153491 267950 66719 67969 61858 -10202 -112997 -44424 43993 13116
79 13116 -93731 -78137 -18081 -39694 -102315 -41804 61473 56712 -30854 -31562 23717 8282
91 8282 -58260 -29735 57990 63259 -11181 -18948 39522 45304 -6010 9832 84937 89119 5827
104 5827 -37076 -11520 -17377 -71299 -65348 13647 47250 -3457 -36767 -13248 -16988 -75175 -91475
117 -91475 -31254 8709 -21804 -41817 -5126 14517 -23265 -41107 6330 41947 11333 -20089
129 -20089 1780 19723 -12988 -36337 -38 35491 12080 -21183 -8107 10479 -14367 -37870
141 -37870 -8352 29498 16175 -15960 -11254 3956 -17549 -42572 -19053 23285 25685 5333
153 5333 11440 26251 4873 -31438 -30314 -5694 -7419 -26596 -18106 9835 12478 -2222 10047
166 10047 42040 47791 27231 22025 32983 22845 -5886 -12459 5222 7384 -12097 -17635 -3553
179 -3553 -2298 -18091 -16834 7964 21306 11415 6542 16372 14218 -7712 -18304 -5403 4459 -2972
193 -2972 -4900 9940 17699 6170 -1696 8643 16057 6319 -2189 5097 10611 249 -7784 617
207 617 9358 2521 -6480 -3137 -68 -10129 -19838 -14508 -4879 -6152 -10051 -3168 5382 2373 -3588
222 -3588 1729 11165 10340 4827 6528 10146 3643 -7309 -9027 -4790 -6370 -11086 -8105 -621 -44
237 -44 -4753 -3495 1974 1104 -4931 -5904 -2312 -2888 -7568 -6328 569 4108 2416 3751 8301 8131 2103
254 2103 -975 468 54 -4507 -6031 -3032 -1540 -4095 -4259 73 3309 2397 2085 4774 5356 1490
270 1490 -2329 -2228 -2368 -5164 -6640 -3783 -750 -382 194 3729 6819 6330 5006 5399 5449 2441 -837
287 -837 -1462 -990 -2200 -3470 -2056 -171 -307 -1149 -325 950 509 -882 -463 481 382 -425 394 1892
305 1892 2344 1565 1802 2537 1603 -180 -1143 -1462 -2213 -3336 -3260 -1791 -786 -125 938 2745 3453 2979
323 2979 2701 2577 1689 -106 -1452 -1972 -2581 -3158 -3242 -2101 -1037 -323 660 1699 2373 2057 1430 851 311
342 311 -950 -1766 -1618 -1302 -1053 -541 329 1195 1304 954 814 431 -277 -1152 -1149 -1042 -963 -697 80 959 1289
363 1289 1232 1296 1210 671 -138 -630 -900 -1351 -1899 -1802 -1364 -966 -421 365 1369 1868 2239 2167 1790 1131 54
384 54 -776 -1430 -1775 -1895 -1674 -824 -219 388 745 1062 1068 569 -90 -299 -620 -813 -823 -268 218 249 580 906
406 906 882 500 146 84 9 -465 -637 -584 -385 -413 -452 -15 578 800 909 1233 1261 649 137 -321 -638 -1379 -1755
429 -1755 -1534 -979 -574 -135 712 1538 1530 1277 1033 820 118 -667 -646 -452 -387 -439 -41 372 242 37 76 219
451 219 -36 -441 -445 -328 -317 -591 -515 143 69 -128 202 635 577 297 177 346 -73 -709 -900 -788 -772 -890 -451
474 -451 530 983 1135 1188 1248 998 71 -530 -826 -849 -1229 -1173 -701 -233 -361 -53 396 644 376 142 322 334
496 334 -130 -673 -222 -170 -278 -627 -129 -23 23 -23 269 530 406 130 240 280 -205 -449 -312 226 250 291
518 291 795 985 619 144 70 -5 -467 -844 -560 -249 -30 -268 153 531 589 466 372 527 165 -381 -499 -208
540 -208 -170 -426 -112 197 277 66 184 636 600 355 342 619 415 -265 -394 -293 -326 -441 -272 214 340 237
562 237 71 331 232 -253 -585 -453 -460 -647 -640 -200 384 172 271 579 674 377 -41 -9 -14 -340 -449 -459 -93 -373
586 -373 -489 -148 64 -10 51 175 367 158 -371 -243 -123 -508 -565 -497 -125 -239 -175 -46 334 50 -95 22
608 22 126 50 -197 -364 93 -9 -48 200 431 411 161 41 59 -134 -375 -245 15 25 -292 -76 203 137 127
631 127 179 301 404 68 -57 -69 -156 -337 -495 -110 -125 -177 -28 332 424 409 417 582 405 235 -45 -7 -32 -255
655 -255 -136 79 303 152 176 174 335 -39 -4 -209 -102 -143 -304 -203 -61 -114 -38 133 213 182 197 47 178 -42
679 -42 -244 -234 -29 -129 -241 -199 113 54 44 154 210 134 55 -134 43 -268 -401 -179 -270 -108 -63 -1 89 6 -10
704 -10 56 118 -40 -167 -16 -26 25 38 -34 162 167 64 132 -5 69 -130 -131 -157 -89 -326 -294 17 -16 -2 -2 179 293
731 293 137 -12 7 -34 -180 -168 -249 -79 -65 -10 9 111 119 246 217 133 201 10 44 -105 -116 -188 -106 14 -72 88
757 88 133 158 68 72 141 116 6 -118 -19 -25 -139 -5 38 -5 158 22 24 41 -101 -51 1 -62 -154 19 -98 -22 -104 66
785 66 140 154 71 105 -65 14 4 -89 -196 -41 -142 -53 -65 35 260 278 56 142 44 -83 -107 -107 -104 52 -87 -86 -7
812 -7 52 -11 6 78 40 -50 40 -69 -92 -106 -151 -181 -105 -6 -22 -59 2 64 139 81 38 -10 -50 -89 -225 -25 19 -26 -101 85
842 85 143 27 159 9 140 -112 -42 -5 11 -145 -83 97 14 13 -8 61 156 109 -49 61 39 -161 -48 -24 -13 8
868 8 -1 -115 25 64 68 -43 -100 10 -4 -93 -79 -99 -79 62 10 6 100 63 -23 -33 -3 -27 44 -11 -91 -56 -46 9 145 32
898 32 163 135 238 38 26 94 -119 -76 -48 -148 -39 58 48 -44 -66 36 -113 21 -33 -107 -27 -30 -57 -140 -55 -53 -92
925 -92 -11 202 42 139 66 -2 6 -95 -6 -35 -34 -5 46 -53 62 7 48 75 58 -98 48 -67 -52 26 27 -2 20 81 134
954 134 53 4 26 -4 -113 58 -33 -96 -17 -16 -50 -53 -24 105 10 -6 2 -18 -29 33 -85 -123 102 44 81 -12 6 48 39 64
984 64 -32 63 -22 -59 56 62 -53 8 -6 -71 32 20 -17 123 47 131 9 -57 32 -19 -40 -37 -94 -118 99 -19 2 18
1012 18 -1 10 -50 27 -13 -19 -21 -61 -41 66 -58 44 -15 70 -66 -104 3 -39 -35 -63 26 31 91 -51 11 -33 49 -7 35
1041 35 43 50 11 21 -21 -1 -57 -17 -65 21 -3 -82 -55 83 2 -58 -41 55 -29 -139 -110 -14 35 22 -76 -43 15 -83 -10 26
1071 26 -117 -13 -96 -30 81 99 -13 7 -30 102 -14 23 77 -13 -55 -18 -24 79 -30 36 -104 23 70 23 -14 39
1097 39 43 39 64 97 1 -67 -112 -48 -34 -54 -25 -72 65 80 -52 -30 -107 -1 35 -30 -158 -34 49 -80 49 -11 12 -3
1125 -3 -4 4 67 14 19 17 -104 5 13 -4 21 60 22 128 19 40 -69 68 -62 81 -70 -210 -91 -79 186 72 -98
1152 -98 -12 40 -60 -80 -71 -138 -16 115 5 -139 32 -38 -57 59 3 -56 -30 8 54 28 -23 65 -89 -136 -86 -113 9
1179 9 185 69 18 66 30 43 67 -1 -28 72 20 -23 -7 -78 -26 -22 65 11 -89 -41 65 -25 -74 11 -52 -75 45 -26
1207 -26 -85 -26 -29 -69 -137 29 -84 56 -1 -31 44 -12 39 58 60 106 -36 -17 -57 32 124 5 108 70 97 9 -42 -7
1235 -7 -32 -11 -11 37 104 -108 -52 -27 18 -23 -78 -107 -1 32 85 20 -40 -18 -111 -106 -79 70 -147 -42 -13 -16 56 83 -56
1264 -56 62 39 21 -29 -75 -24 136 4 81 41 -27 -2 -22 32 77 -57 -64 -13 -25 7 17 -16 -63 -104 17 68 -119 71
1292 71 44 -12 -104 138 47 78 -120 14 5 -95 -87 -54 -79 79 -23 -128 -97 108 56 88 -43 -64 30 -41 158 -79
1318 -79 -22 -81 26 126 34 -38 63 -104 130 39 32 52 -7 62 -104 129 79 -52 -33 135 -35 45 65 28 8 -49
1344 -49 -42 -10 55 39 106 -99 -34 -170 38 -6 77 -45 49 25 18 -29 35 32 -47 47 -73 -16 82 73 -22 49 -18 136 110
1373 110 42 -32 -10 101 -23 18 55 -72 -30 61 -1 107 92 -4 -93 -50 18 -96 48 -57 -116 -5 -60 -27 31 -35
1399 -35 -81 166 -83 -23 60 -49 18 7 12 -120 -63 -34 74 -89 -16 6 56 57 61 66 -39 32 -42 -39 36 20 62 98 129
1428 129 106 -39 -87 -111 -71 56 -39 12 61 -59 16 -33 -24 -45 -105 -129 22 29 -188 42 -6 86 18 -32 22 87 -39
1455 -39 -15 50 -35 -16 64 27 -55 129 56 -47 23 -144 -101 96 75 82 -49 -88 91 -159 7 81 -55 62 -81
1480 -81 -39 15 46 35 64 -12 14 9 -61 -68 -5 -104 -33 34 98 -125 23 -20 91 -84 -23 3 9 -42 187 -23 5 13 47
1509 47 12 58 15 -82 46 38 -10 -35 -11 -7 -51 78 74 -10 42 50 88 -39 -42 80 -59 -194 4 -16 -49 -61 -79 -187 -98
1538 -98 -5 -35 -12 22 -34 11 5 23 -90 14 29 -9 21 -20 -25 -43 40 -28 127 -68 -22 76 -49 63 -51 42 10 -40
1566 -40 48 -20 94 129 -88 3 116 68 47 6 39 137 32 -156 -49 -19 56 21 -4 -95 -160 -63 152 -14 -103 -54
1592 -54 -65 64 -49 -48 -71 -50 -6 -47 -45 80 51 7 27 -16 45 -86 61 -10 -49 105 44 116 -41 22 3 88 23 -74
1620 -74 -70 -47 -2 -73 31 -86 -45 61 87 8 -45 -11 -46 -28 -25 -110 35 -67 -115 -106 3 -22 -61 10 -116 -49 30 -81
1648 -81 14 63 -10 -39 126 14 67 -27 -34 27 -37 73 11 -4 64 59 78 57 -74 26 49 38 115 -30 64 8 96 105 -82
1677 -82 -61 44 -60 -15 107 -102 -58 -95 53 -59 -6 -85 81 -70 10 -43 -17 -45 -127 69 33 93 -37 30 -19
1702 -19 -84 25 -14 1 71 -13 -7 162 33 -42 102 -40 36 59 -36 70 110 39 128 24 -5 77 -52 -26 -33 12 -46
1729 -46 -43 68 -79 24 111 42 202 -128 -133 -15 -113 -61 -47 -57 60 -25 -20 -30 -20 55 -11 -4 32 -21 -138 81 -5 -59
1757 -59 5 138 33 73 77 96 58 -21 -10 -25 -60 -32 -44 -41 74 -5 -50 -101 -13 -136 17 18 -16 18 -96 11 -17 -47
1785 -47 20 57 -28 -35 -57 -111 -53 64 0 -71 51 115 24 -14 0 -33 88 -107 -35 -7 56 -37 -82 90 85 7 -4 -7 -25
1814 -25 -164 -123 70 16 40 -43 59 -26 17 -50 143 79 -2 85 39 -58 -60 -93 -51 -116 -51 27 -39 -56 23 1 71 6 69
1843 69 22 -6 -16 -128 36 2 21 39 -8 12 61 -54 -82 4 -11 -47 -32 -5 -31 43 62 90 -62 40 48 55 71 91 15
1872 15 70 -34 102 63 -69 -85 -125 37 -84 -96 -23 51 48 -158 -7 104 86 -55 -86 118 114 61 -33 -44 42 63
1898 63 91 -57 -11 53 57 -19 -33 190 -3 154 48 -60 -6 -75 82 59 87 10 -16 103 -29 -11 -74 -7 43 124
1924 124 5 -18 165 56 13 -13 -25 13 -2 1 -10 50 4 151 -77 -71 100 8 84 -31 5 28 20 67 60 28 -89 -78
1952 -78 -103 27 119 20 98 33 126 12 21 -8 -60 -60 -82 4 -31 -64 -4 -136 -72 -121 -3 -34 -155 32 -7 11 -26 108
1980 108 94 -38 -87 31 -33 -72 59 -103 45 82 -59 -15 27 6 57 47 -61 -11 -45 11 75 96 -9 -28 16 29
2006 29 -85 -56 69 11 27 15 99 50 103 99 -22 -64 -19 -119 -123 -123 -11 -73 -5 -4 11 -95 22 23 -62 61 -21 -47 -34
2035 -34 66 77 -12 81 19 7 -1 74 -47 64 -19 79 -60 13 6 12 -32 -19 37 -11 -108 -90 54 8 50 -97 -33 25 -28
2064 -28 -200 124 -21 20 -100 -76 -11 70 66 68 -131 -125 3 55 2 -15 11 125 -88 -64 4 44 71 -40 124 -66
2090 -66 -26 -14 -50 -27 72 -59 46 107 71 2 -70 41 31 -111 118 -32 -32 4 4 37 24 29 -54 -116 -3 40 -18 -199
2118 -199 -77 -52 21 -36 -40 -32 65 -70 -44 -58 10 -1 -1 -56 -71 -14 -22 -9 154 2 33 21 60 101 63 24 20 127 99 -84
2148 -84 61 108 -81 55 20 -18 -34 14 -62 -9 -91 -137 -93 58 -12 -49 80 -143 -100 -50 -57 -28 -53 104 58 -24 70
2175 70 20 36 -93 -88 47 -114 26 -3 53 -36 71 -44 -123 -68 -26 15 40 -67 44 150 75 44 -10 58 9 -14
2201 -14 -8 5 -38 -53 58 56 69 74 -45 17 80 -10 -81 -64 -21 59 -3 -18 -56 -46 -52 -155 -123 -12 -95 48 76 57 59 -58
2231 -58 -73 42 58 73 -16 71 -38 8 -56 -108 12 -42 16 -19 134 39 -81 16 31 -10 -42 -33 -23 -26 169 -46 -62 -6
2259 -6 52 -40 -26 147 -55 -42 15 -14 43 -83 -112 -8 -15 -34 20 -31 56 102 2 68 -16 82 80 41 -50 25 83 -108 -3
2288 -3 18 31 -28 -132 76 138 -8 0 4 -74 -86 51 45 -30 10 -35 35 0 -94 -141 -64 -24 -32 -66 -48 23 114 -188 -39 22
2318 22 -155 -62 -18 118 -90 2 -13 -48 -56 -1 3 14 -22 20 -82 -7 53 46 -16 -5 62 65 -50 -200 -13 74 -52 85
2346 85 -48 38 -33 -11 6 16 -34 -25 -33 -21 40 -12 -15 -50 -46 -40 -18 -69 47 -3 -55 -42 30 78 -54 29 155 -48 67 -42
2376 -42 95 4 142 75 -8 56 57 30 20 -6 2 14 15 56 -14 91 21 16 72 -58 -103 44 -18 -50 43 -76 36 -66
2404 -66 69 -8 67 -99 42 -47 33 -72 -10 -20 61 25 -11 76 12 29 -88 16 -109 71 -75 50 -9 8 48
2429 48 106 63 12 137 4 52 57 41 20 28 66 67 15 -46 -86 -80 -24 -95 -1 -13 40 78 132 -100 -112 20 108 56 79 -23
2459 -23 6 47 -31 15 61 11 64 151 -87 -19 64 -78 -31 33 14 13 -30 -43 -95 4 -38 44 -4 22 67 -65 47 80 33
2488 33 -37 76 -9 -43 -96 -2 40 -50 -51 -73 -5 -33 -133 -21 84 18 25 68 -72 -16 -64 34 10 -53 -46 -72 -33 39 23
2517 23 -61 -6 11 93 37 137 113 35 77 -33 -4 13 159 13 -47 82 -2 -57 -54 -42 78 52 -113 46 -25 56 57
2544 57 -93 -11 -78 -28 -175 46 -75 -29 -10 18 -77 61 -76 68 77 -25 94 66 5 28 -24 68 -114 49 -4
2569 -4 46 138 86 79 -102 -11 124 -103 -53 -14 -125 -29 8 109 -66 -14 -59 140 63 -25 7 -52 120 93 -40 -29 75
2596 75 -5 -48 -80 -101 -176 -10 22 -104 -116 -18 -82 -42 2 -70 0 -34 2 -103 -10 28 -56 23 12 -27 -29 -99 91 131 1
2625 1 6 36 -8 -25 63 44 -53 -10 -4 -63 -25 32 -81 -123 -115 -66 -42 -78 -12 -94 -40 -17 5 -29 90 119 -187 41 -16 -85
2655 -85 -53 68 -161 16 11 38 -99 -14 -109 -5 59 -112 -56 143 141 -15 69 -49 24 43 -39 10 -15 48 5 -62 41
2682 41 34 65 -37 -34 -40 -21 -119 -16 14 87 -120 17 -23 2 2 84 -138 -42 58 -23 177 -170 120 -65 -52 47 17
2709 17 12 -22 -135 12 -34 27 58 68 -107 -61 27 11 -4 -69 -78 15 119 -3 42 -132 3 -124 -92 -87 -9 -20 10 4
2737 4 55 28 -52 -53 38 -49 22 -34 -125 73 75 -33 -12 -79 -92 -49 2 71 15 -61 35 -36 242 89 143 9 -98 -11 75
2766 75 -7 -41 -19 46 33 13 110 -90 54 -77 26 98 36 -144 -76 42 112 24 -13 -119 -41 -69 -33 56 -24 74 41
2793 41 -60 -15 -83 -36 -14 -8 -94 12 -27 -31 -47 85 -43 31 -49 -34 128 -19 109 48 78 48 121 43 69 -96 97
2820 97 -38 -62 -59 -89 -36 11 -8 -113 -143 -166 13 51 3 -27 -153 -96 52 -92 -28 -10 35 -125 -75 -24 3 77 -101
2847 -101 67 -109 -157 -104 81 10 4 42 -146 45 18 27 51 -52 72 121 1 63 -105 -7 11 31 -157 -39 4
2872 4 -73 36 -14 1 74 -7 -32 -50 39 -70 -47 -16 -33 -176 -105 23 -34 -37 -88 85 30 -73 22 -46 32 -50 29 -86
2900 -86 -69 42 -166 -34 39 -34 29 -36 -16 -93 57 -25 172 13 64 -56 -78 64 23 76 13 23 49 -46 -140 5
2926 5 -33 -1 -59 -106 -31 -63 -205 42 -18 -143 18 -201 74 -19 117 -51 8 164 12 44 10 68 -28 78 -50
2951 -50 15 52 -33 -15 26 84 15 73 6 -21 9 -7 7 -71 38 -56 -64 68 147 -6 -52 29 -43 -48 28 -147 15 -100
2979 -100 -114 -53 -70 -18 29 -96 20 -13 -73 -107 -2 78 -100 -4 -57 61 -61 8 75 20 86 -35 64 42 90 36
3005 36 -8 42 10 -9 44 112 43 -25 -22 -116 -78 7 -34 -30 -16 -88 -66 -91 -54 -36 -46 -78 100 -63 -33 -59 -78 -15 -102 39
3035 39 -68 -27 -9 -33 100 71 -7 99 -97 17 -61 12 57 81 18 101 -77 9 -15 -71 85 67 9 -1 95 -56
3061 -56 21 -17 -35 41 15 -21 16 4 -30 -18 -98 53 50 -76 -30 -97 -51 16 -85 -23 -76 73 143 -144 1 77 -7 -25
3089 -25 -49 -11 66 15 111 66 43 57 -18 47 -29 199 88 45 -11 4 129 17 16 15 1 -22 22 -85 -30 -25 -38 -63 36
3118 36 17 16 80 -16 -75 -4 -112 -56 23 -151 44 63 108 28 32 -119 -34 -12 -50 10 69 -55 48 -5 20 75 28 162
3146 162 0 61 -60 10 112 114 -21 53 57 -4 -17 191 -66 7 -28 111 -15 -32 -49 3 -104 -85 -18 -39 -41 -100 81
3173 81 -29 0 -68 -97 -92 14 57 0 32 -31 -114 28 -101 144 -72 -85 -41 55 -115 -9 1 -40 -55 61 155 73
3199 73 94 34 100 1 -36 -21 -79 97 10 -31 42 -103 -90 55 -9 -104 -19 -33 -83 36 -67 -100 -169 31 -48 -110 -49
3226 -49 -48 59 -28 109 -57 -38 26 -113 159 51 -4 31 31 62 59 74 -32 152 -122 -37 2 -35 39 -19 3 -8 -52
3253 -52 -88 3 -16 -46 209 -33 22 11 -33 2 77 24 -99 -2 -84 -105 25 -104 -34 24 -237 72 -13 -3 -36 -5 17
3280 17 25 6 -118 19 -19 101 -92 3 3 -117 -27 76 43 -69 -25 2 -10 -36 -34 72 45 -55 46 -101 18 10
3306 10 22 -51 2 51 62 -106 -9 -72 -63 42 -37 -110 -28 68 19 2 -101 -50 2 5 29 68 20 5 -71 -16 2 24 -51 28
3336 28 -20 86 170 -41 167 63 125 -24 80 14 15 18 -102 29 23 -23 -13 -40 6 -22 -62 -41 5 39 69 20 3 -124
3364 -124 -40 -72 -78 31 31 -31 -2 14 115 27 -32 -1 -72 83 77 94 44 -41 -121 114 22 35 54 50 -29 25 16 -2 60 0
3394 0 -15 10 61 -62 -11 -134 94 -14 -29 -44 59 -61 -12 -31 -99 -85 6 -63 -106 -87 9 -11 12 -40 -5 4 114 -42
3422 -42 18 15 -89 -33 -129 -113 141 96 -47 80 51 12 -12 58 -13 6 -76 -20 -58 45 67 12 134 -34 -15 -54 9
3449 9 31 -48 19 -5 33 -34 -39 76 -89 -30 32 -66 -90 -113 -47 -29 58 -67 15 38 9 -33 -6 58 -119 36 -57 -60 24
3478 24 94 -91 32 11 -21 39 -62 199 5 -105 -44 -98 -106 -91 -68 34 51 70 -10 -73 -136 -62 82 -35 -28 -7 -37
3505 -37 -51 -117 -105 -12 -16 -65 -204 23 -41 -134 -47 34 -1 -62 17 -11 -93 -49 113 34 60 61 -25 24 -21 -15 -69 64 38 7
3535 7 93 39 88 5 31 -72 -12 82 -19 87 -34 31 -13 -85 -64 -59 48 -50 -16 7 -64 41 -61 -61 -96 -11 -122 -48
3563 -48 64 -34 -43 88 35 44 -36 -1 -29 -8 -75 31 132 -105 72 12 -30 -2 36 42 -93 31 -20 34 -4 -14 54 -4
3591 -4 -117 -21 -20 -131 2 -46 -71 -86 -74 -65 26 -12 7 -26 -6 6 -101 -11 103 -45 26 49 -27 7 23 -92 -121 129
3619 129 46 59 -135 0 106 44 -81 28 118 2 -61 43 -77 88 8 28 -37 -66 -26 -77 26 -85 43 -99
3643 -99 -73 -28 23 31 -87 -45 5 -32 22 141 12 -60 -31 -16 -70 -76 -15 12 80 -45 18 -10 83 -104 115 69 58 -1
3671 -1 80 16 27 -45 15 -101 58 65 28 172 26 29 62 -56 -63 -41 -69 100 -22 40 -36 -66 56 79 -20 71 -129 -71
3699 -71 -11 45 -31 56 -37 -132 -25 -91 17 150 94 23 76 -22 -84 112 86 34 27 -16 54 110 5 84 -19 28 62 38
3727 38 83 21 47 3 40 28 -23 0 20 40 -117 -50 -15 -18 -36 -87 -23 19 -11 -44 11 67 -42 -99 -70 18 3 -67 -100 -16
3757 -16 -27 0 -31 65 88 -13 -39 -82 22 -3 -8 90 -9 67 -159 -2 -70 -19 107 -80 10 4 84 -43 168 9 32
3784 32 50 -126 -62 -21 156 -39 -59 -56 -14 -60 9 -39 -52 56 -46 -77 -113 -32 72 -11 50 -111 -14 9 21 37 -17
3811 -17 62 67 150 19 151 -94 -28 -1 -174 -7 28 25 -50 -109 40 -52 94 69 45 -48 -155 -22 47 24 -122 95
3837 95 -19 26 11 85 117 -41 -211 -65 25 -17 -116 -49 65 -176 3 24 34 46 -2 -23 -63 -41 -6 -28 125 -4
3863 -4 19 9 155 75 -78 -3 23 113 97 -33 54 -80 35 3 40 60 43 -95 1 86 -42 -63 -78 -19 66 53 -38
3890 -38 -121 -92 29 -94 -31 23 14 105 25 88 16 -33 -76 -37 113 -7 22 -133 -45 -43 -33 19 -98 56 -99 -31 54
3917 54 88 38 -121 35 44 52 83 38 104 41 15 -107 -78 -112 -7 14 -5 -21 -78 -70 -21 -93 -62 -27 28 -20 62 100 51 -69
3947 -69 -16 104 -39 -100 41 99 -44 92 54 -5 60 25 32 63 49 -43 -143 -11 54 -42 43 95 18 137 13 54
3973 54 -13 -28 -44 -165 -95 -14 10 -50 -24 -31 -63 -95 -6 -61 22 2 -7 -59 21 -90 15 -18 133 68 -62 -75 -61 -91 56
4002 56 54 76 -11 102 33 -48 -34 1 19 -51 44 81 21 47 5 -8 84 -70 -19 75 -56 11 -5 -69 -59 0 -10 -108 -57
4031 -57 -75 -54 0 -56 38 15 -12 -58 54 -48 4 -84 2 -81 -26 -161 -63 -107 -13 2 -54 -6 -23 -6 -74 20 46 122 -14
4060 -14 52 -30 122 20 21 -52 -2 -31 78 27 -4 -31 16 -128 6 -95 -53 -23 35 24 -45 16 -101 27 -12 -23 -133
4087 -133 -72 10 0 -7 -93 -16 3 -39 -87 -34 -2 74 65 72 33 90 -20 43 75 -95 17 71 -93 12 15 35 85 87 -74
4116 -74 12 -78 -165 -203 39 190 -63 -78 -58 -63 22 38 39 -125 -61 -5 13 18 -45 28 -67 -23 -80 -58 -39 -100 -130 86 34
4145 34 -89 71 14 -7 100 31 -93 59 -27 9 52 68 27 43 -66 -47 12 -13 80 -67 -90 -43 -114 85 -69 -89
4171 -89 -72 -62 -2 -22 6 -1 -31 2 -51 -90 -27 -47 -107 13 113 41 -105 111 -4 45 30 26 -139 -65 50 -76 23
4198 23 13 64 7 -1 -2 46 58 -3 79 14 74 -40 47 -44 55 -89 -151 -74 -71 -31 -70 -51 -105 -52 -5 59 5 -26 -76 -105 -63
4229 -63 -31 49 -16 -51 28 -126 40 125 -72 -114 13 49 20 38 47 36 31 70 -1 135 28 99 -132 71 46 -123 -13
4256 -13 -43 111 -9 -67 -55 -46 0 32 -55 -100 -79 -110 26 -8 -106 -190 -79 24 -19 52 -94 -90 -17 -36 -161 -37 -84
4283 -84 81 88 -90 63 24 -65 131 -30 -54 135 54 126 52 50 -141 -14 98 86 66 -36 105 -2 23 10 10 -80
4309 -80 22 125 -61 61 -17 -112 -103 27 -11 -91 -124 49 -37 36 64 -55 -49 35 171 69 -22 -76 -52 -133 172 -41
4335 -41 -32 29 -30 -13 61 -11 25 56 -13 0 51 110 63 47 41 93 -1 65 -108 -75 34 -26 48 6 7 -5 42 -9 -61 93
4365 93 -31 -42 -5 61 7 -109 -10 -69 -113 -43 32 -54 -63 202 -44 44 36 -12 59 -77 176 -91 -24 -25 20 73 -66 -53
4393 -53 84 -68 -33 76 74 22 -131 27 10 61 40 -6 57 79 36 -40 -36 -137 -60 -28 90 74 -111 17 6 21 -8
4420 -8 5 -84 11 9 -56 56 -23 -26 -146 5 -13 51 -39 -61 -3 2 131 -34 -50 69 -102 12 46 33 39 34 32 -17 -3 5
4450 5 27 -62 69 -15 55 38 12 -20 -86 2 -96 48 119 -78 72 9 78 -53 -232 20 6 -19 -178 -85 42 -24
4476 -24 -29 26 26 -50 31 108 -235 104 63 -105 120 -43 -24 41 130 89 -3 -42 98 -82 6 -75 133 29 -29 -77 2
4503 2 121 -91 -151 -10 -125 19 -36 -4 -105 -105 51 -56 -28 -113 68 -42 95 60 -244 62 258 -75 -59 24
4527 24 20 29 18 -129 -15 75 10 -2 5 16 -141 -49 56 7 32 63 92 11 122 23 -59 60 -22 -43 50 -30 -13 -17 26
4556 26 -53 -101 -37 22 -10 -2 -72 -13 36 -44 -76 -34 -58 -58 6 -58 -115 -177 -92 -77 6 28 34 -117 89 23 -69 37 118 -104
4586 -104 108 18 -23 -13 29 67 -8 29 -30 12 -132 -36 -59 117 -22 149 -18 -139 30 -31 -3 -28 3 -51 -147 -12
4612 -12 29 6 21 3 -25 42 130 -6 -41 23 -64 -21 36 8 40 -6 94 -18 31 98 -41 -58 -76 -11 14 31 -78 61
4640 61 -59 6 72 -52 76 38 -2 0 -117 -106 32 9 -102 -21 11 -141 0 9 -40 -57 -74 21 -98 17 -6 -24
4666 -24 -86 -53 61 -2 86 -7 127 90 7 73 94 24 67 -122 51 -71 35 3 -9 52 62 29 28 -4 21 70 -133
4693 -133 36 129 -62 -23 -55 -152 -6 -51 61 -71 94 -89 -8 -64 -128 -57 -29 -100 10 50 -25 82 4 -54 22
4718 22 44 -31 142 -22 27 27 -2 -33 -63 48 36 2 99 77 47 128 37 5 187 10 -14 115 19 -56 32 -40 3 11
4746 11 -91 -51 12 -145 -2 -83 -12 -19 0 64 -103 54 -15 -9 -24 -23 31 -70 105 -9 79 63 93 44 19 169 63
4773 63 15 121 204 86 15 41 -76 131 -10 71 16 91 -19 -108 31 -44 -20 -54 6 63 61 15 -50 -7 91 -8 -69
4800 -69 64 -49 18 -44 -30 -65 -27 -8 -42 -135 15 -37 -9 -6 50 -135 -146 21 -87 -37 81 145 -55 18 100 -39
4826 -39 70 103 43 -61 6 20 43 -8 -2 63 20 -39 68 -73 67 -46 37 79 -56 5 47 -159 -57 83 31 -1
4852 -1 36 20 57 73 -4 124 -2 58 75 29 -93 47 78 -2 -50 93 32 -43 93 11 -45 67 49 135 63 151 46
4879 46 84 -11 65 -53 -52 70 -76 62 -84 58 -3 -21 -16 -20 -96 -120 41 -31 -47 42 -21 -64 -1 -73 -42 -69 -43 9
4907 9 12 -101 28 79 161 16 95 -19 30 16 -123 203 78 58 -3 10 89 1 61 -7 -46 133 83 -38 -52 -23 -31
4934 -31 10 -84 4 -49 -123 15 -19 -17 -7 -65 27 -16 -109 38 28 13 -15 15 -112 60 -7 61 -12 -42 16 -108 9 -64
4962 -64 70 149 27 12 -36 40 1 -41 -60 -22 -85 -6 -16 -11 112 8 53 26 23 -84 36 -5 -83 33 -116 -69 -144
4989 -144 -60 -53 59 10 -26 -78 -17 -53 -11 62 42 -14 77 95 18 -18 15 -58 -84 -16 -113 69 -35 33 107 -45 -67 -56
5017 -56 -25 -15 40 5 59 0 -53 115 -190 26 -36 -61 88 91 35 -97 -42 29 0 -74 53 -34 -148 -37 -155 -21
5043 -21 -64 65 46 -15 -25 15 -46 -6 19 -5 0 6 -12 -76 76 -3 -44 51 -54 20 -29 -65 117 -2 47 -86 70 9
5071 9 -25 -40 103 -64 -26 36 -17 -115 10 3 8 134 -11 -66 -116 -15 108 -73 31 100 -59 -141 -96 -74 119 -8
5097 -8 -49 27 14 22 -36 59 -28 82 -61 -71 5 24 10 24 144 -45 1 -4 -22 -8 -32 21 -1 42 0 67 -12 -8 72 -21
5127 -21 -13 -123 -21 -99 28 -88 -45 -98 -55 22 -75 36 2 -17 32 40 -39 -251 -47 -23 -6 -74 4 43 -5 -2 -10 -27 97
5156 97 92 -41 -14 -115 -64 16 46 -94 51 4 39 -74 27 -28 26 33 50 -64 -50 -42 79 23 -3 -2 54 -56 -51 -25
5184 -25 57 -27 -59 29 59 -52 -24 -52 113 -22 18 68 2 79 9 103 81 21 -1 60 29 85 57 54 87 14 -67 -15 92
5213 92 135 119 12 -20 25 -17 -2 -19 -168 -10 -151 39 -70 -34 -36 6 -95 -95 25 -25 88 -15 16 75 -29 47
5239 47 -42 -137 -61 -42 -83 -27 -23 47 113 -40 109 -22 -9 -12 6 15 44 -89 17 100 -87 30 7 -10 0 -105 -82 3
5267 3 -72 105 72 -14 -138 -8 43 29 -2 78 -74 -15 23 -31 -149 -70 -74 -5 106 -48 29 -32 38 67 94 78 1 12
5295 12 -5 61 10 -13 -10 -36 62 17 -39 30 76 34 -8 -76 56 78 100 -18 -84 -16 -38 -105 -175 -79 -29 -42 14 -36 -120 2
5325 2 45 46 -85 -42 -55 -5 61 80 11 -53 -68 -89 35 101 -56 -87 27 65 -130 73 -45 84 129 -58 118 9
5351 9 13 10 -127 -20 -16 102 -33 4 -14 -24 1 28 59 -11 -32 -27 41 -68 -57 -77 20 -73 58 45 83 14 24 -41 -108 -62
5381 -62 -9 7 9 67 -56 113 -52 24 -46 104 95 81 89 -114 -62 68 53 -5 -13 129 -56 -11 11 -189 -17 88 -35
5408 -35 12 -106 131 125 -27 -21 -127 -73 -18 -25 70 57 31 59 9 19 -126 18 -25 -58 31 108 4 -16 -36 -132 -40 -28
5436 -28 -10 24 -112 -67 -36 44 -25 70 30 -26 0 7 22 62 163 -46 10 13 17 -111 -32 -22 76 -19 -21 -122 15 -56 -46
5465 -46 -61 80 22 84 26 -37 -27 -96 -15 28 -130 -69 -18 13 -24 96 -72 -5 -31 41 13 -84 -6 -116 111 100 -31
5492 -31 -18 1 61 -38 22 -40 88 47 -7 112 -17 146 -6 90 149 53 34 -20 -14 -21 -73 -31 43 80 -24 -65 15 -66
5520 -66 -66 -11 -27 -59 -35 -48 -59 96 -69 72 -87 21 42 -145 -39 -5 6 24 -59 -85 57 -3 113 13 15 30
5546 30 -12 136 51 -29 33 14 -7 58 -126 -93 -64 -34 -2 -127 -4 -129 14 -17 -47 -77 -95 -32 -73 23 -16 42 10
5573 10 -4 56 78 -20 70 -15 -5 31 74 -21 -117 -13 7 49 -1 -3 40 -79 -30 77 95 118 -89 -46 102 -106 -14 45
5601 45 96 -61 -25 -189 -12 -78 21 -11 -1 -15 51 11 62 35 16 -71 -151 -22 -5 5 49 -74 -4 99 136 -122 5
5628 5 -54 -33 151 -27 46 -44 38 -32 71 38 47 -60 95 -67 7 80 35 -31 -47 20 -33 -49 -5 -36 -63 61 -238
5655 -238 -30 -24 118 105 -33 -10 9 63 -38 -15 -40 -113 -153 -86 -7 -100 -24 -77 105 39 -49 -35 -85 -38 -26 31 34 -91
5683 -91 22 70 29 35 52 -97 1 13 -5 1 -128 -61 -48 -7 10 -57 -172 9 -39 -40 5 64 -32 25 55 49 -57 -18 13
5712 13 -26 -7 37 -14 3 38 -62 -1 -59 -76 138 90 -79 26 -22 10 -61 34 -14 -19 9 -146 9 90 116 78 85 -49
5740 -49 7 -31 8 -39 -69 -22 -21 -1 -31 101 4 -51 19 -63 -32 -10 -111 -20 -11 -116 57 -15 -86 -34 -61 -142 -33 -19 -26
5769 -26 19 -64 5 -32 26 -7 23 -51 2 -7 -56 33 -7 -21 -32 -49 24 0 24 -6 -110 83 27 -180 -34 -67 52 15
5797 15 -35 35 -191 76 -118 47 -94 -8 80 -111 -61 -154 49 -18 -33 -53 88 -27 -164 58 83 11 -54 -16 -19
5822 -19 -33 -18 79 82 0 240 -31 -59 94 28 -54 26 83 -25 69 14 50 30 74 -23 -39 -19 -14 64 -2 -8 -55 -55 -1 68
5852 68 -17 16 11 -10 47 -90 79 -29 -14 31 -84 -60 -39 0 -44 68 0 -18 105 8 -25 -38 137 -137 -138 105 13
5879 13 41 28 56 -96 38 82 88 103 -18 -138 5 34 16 -16 -41 -111 -105 -104 6 46 -85 7 -47 -115 81 68 6 -7
5907 -7 38 -7 -108 -135 -59 70 14 28 1 43 82 14 -12 123 48 11 19 21 53 -21 89 58 48 9 6 67 -106 -39 51 -28
5937 -28 26 -85 -151 56 135 -18 -2 -22 -134 7 -10 -54 -38 -96 23 -27 1 -58 -29 -122 17 -62 -80 57 -90 50
5963 50 -43 24 28 10 18 48 31 40 85 52 16 17 56 -34 46 68 -36 94 17 -44 -99 -156 97 49 -81 55 -23 -72 47
5992 47 -26 -6 -12 -7 54 -18 -48 -110 16 -55 10 92 -28 -26 -58 -10 -47 60 -91 -13 20 40 53 -23 -54 0 -23 -31 -38 23 28
6023 28 -70 69 -2 -122 -33 -7 -83 18 77 33 -93 -83 -134 -121 -109 -79 -40 8 -80 -92 -1 2 64 5 44 -26 -72 23 -10
6052 -10 -25 71 -72 -107 25 66 99 -118 31 21 -56 98 70 43 50 26 33 119 116 103 117 6 -66 10 -14 139 53 47 7
6081 7 -20 44 18 10 -108 -77 -47 -69 -85 3 110 -62 -46 39 32 119 -149 -77 2 -150 33 -6 -102 -85 -74 82 -149 -21
6109 -21 -94 -29 78 81 12 -53 -37 89 83 -22 -7 109 132 79 -44 132 5 -47 28 67 -23 -19 13 26 68 -51 -16 -11
6137 -11 16 -104 -65 -60 -73 43 -46 -26 -1 -25 -185 -3 10 -1 103 -28 -27 23 -15 -10 25 10 -22 21 30 59 21 58 10
6166 10 97 -72 -10 -93 110 -41 53 18 -80 12 53 66 55 7 38 57 -68 -20 -33 -12 23 18 -67 30 -27 -13 -39 45 -64
6195 -64 -108 -166 62 17 -25 20 68 -44 -13 -72 14 -36 -10 -9 22 57 10 -13 152 -27 -74 86 -56 184 31 -43 -8
6222 -8 -54 -5 3 -147 78 -76 34 18 -32 -74 -49 57 66 -35 -65 -32 -50 31 46 63 77 70 2 -108 -95 -98 5 -18 72
6251 72 60 9 100 57 -54 -1 -59 38 10 180 -2 -40 -72 114 -12 29 -31 10 32 -135 -24 -22 -58 99 20 140
6277 140 -36 6 -51 98 -62 -113 -78 31 -87 -50 -14 -77 -34 70 -58 -189 -42 52 75 -2 -114 22 42 7
6301 7 -21 -92 -34 -36 12 -134 1 132 33 -80 -30 -31 107 -27 -31 -83 24 74 107 59 -38 -54 -36 -21 -123 69 56 -3
6329 -3 -21 -113 -20 -74 -73 -21 87 2 -7 48 -123 -78 -103 48 -86 -1 100 128 3 -2 -2 -39 -149 -2 14 -21 22 13 -6
6358 -6 -43 52 -27 -24 -71 -46 -129 7 65 45 28 -154 53 80 -65 -39 -18 16 19 82 13 -42 59 -50 -112 34 -8 -94
6386 -94 49 -76 48 -42 -49 2 -45 -29 61 -45 -68 59 48 -9 82 -55 -39 -56 89 -22 -3 86 -55 -2 -32 -26 -58
6413 -58 -13 -92 -42 0 85 -121 43 70 5 -149 -58 91 -43 -57 -7 -68 -111 61 -69 -75 -8 -1 2 -62 -67 16 -71 -36 -57
6442 -57 -69 56 -11 32 -71 17 3 -48 93 88 -87 25 -73 57 42 75 54 -100 -33 42 -53 -25 27 49 26 21 -95
6469 -95 -11 63 -39 -28 5 47 -38 -72 -2 -82 -77 5 5 -14 65 -68 -121 34 -3 -1 -50 -41 -9 -14 -46 33 -74 22 51 -3 -24
6500 -24 50 -14 63 152 20 54 57 -97 26 -83 84 -97 42 128 -34 -71 13 58 -78 18 -4 -122 -114 12 -92
6525 -92 -54 15 -144 4 -92 87 87 -50 -60 -108 -56 -81 90 -2 -82 -6 56 7 36 58 -56 37 -6 -83 -98 89 14
6552 14 -43 4 11 61 23 -12 -51 -63 -11 -9 -15 21 -21 -109 -5 41 -42 -61 48 -132 72 -106 -20 -82 -20 203 -71 -2
6580 -2 55 -87 19 -28 45 89 -32 -21 23 -90 46 15 3 -76 -1 40 108 120 -27 59 -26 30 -40 27 -2 28 14 58
6608 58 17 -70 -120 -2 26 -112 0 22 6 -93 -6 -53 -118 -80 -37 -141 -90 29 -20 30 -151 -96 -79 -75 -3 59 -33 -222
6636 -222 -123 18 55 39 24 -98 76 -29 20 53 -7 -50 -69 17 -17 5 82 -29 1 -126 -45 2 -157 -89 -64 37
6662 37 60 -113 -28 -54 -38 58 -32 34 -84 -77 -169 -95 -25 28 4 101 -20 -39 74 7 48 28 -33 140 -101 -24 -34 57
6690 57 -46 -65 -51 28 -86 -77 87 -55 -105 3 -1 -127 24 45 6 35 -80 58 -30 -6 -17 73 -22 -33 161 -104
6716 -104 3 -29 -68 -144 -182 47 33 -85 -60 2 -8 48 23 -36 33 -59 -5 -5 40 -45 -51 -107 -60 -88 36 49 108 88 -13
6745 -13 -25 79 67 45 -37 24 -78 -124 -51 65 -90 0 18 -10 -22 -40 44 -2 27 -44 -13 -31 -131 -126 16 159 -92
6772 -92 100 97 -17 -43 -86 -138 114 -49 -61 9 -138 60 92 72 38 -88 88 51 -60 6 -103 15 -93 40
6796 40 -113 140 27 -177 -119 -12 42 110 -146 -41 -102 -163 47 40 -103 -60 5 38 93 -81 -44 -166 57 66 -1
6821 -1 17 -73 104 80 -27 48 -27 -31 60 50 23 55 96 7 -7 87 37 -57 -136 56 -50 76 1 -59 -130 52 -26 -79
6849 -79 -43 -64 -161 -70 98 18 -27 -71 -15 -155 -85 -39 63 -16 41 -119 -67 -22 57 -24 -16 5 53 -66 19 22 5 -28 -71
6878 -71 15 -116 53 158 -9 18 -122 49 -6 -25 -110 30 56 -102 95 32 62 -88 34 41 -106 -30 -18 -57 124
6903 124 10 74 -35 -79 -123 -73 -9 -144 25 56 -18 50 -18 -114 -70 -33 44 22 -13 84 -101 30 -74 65 43 -72
6929 -72 -33 42 -30 58 57 59 20 19 -5 -72 -4 24 9 42 -12 -117 39 -51 134 -10 -44 72 -15 115 -27 20 125 60
6957 60 57 -101 -91 69 23 -34 -65 -19 -61 31 55 -8 1 -131 -30 24 41 -13 68 -47 2 134 -112 89 84 -7 -124
6984 -124 10 -28 -80 -1 -30 -9 -113 -71 -5 1 17 -8 -13 26 -104 29 35 -8 -33 -10 -17 -41 -52 -101 -83 -80 -83 -79 -27 -22 -59 -72
7016 -72 -73 53 72 -4 58 33 -70 -32 67 -22 -99 -1 -91 -21 81 -64 62 -13 93 -27 -69 80 -28 -4 66 32
7042 32 62 36 -34 20 -35 63 45 -35 -22 -132 32 11 -41 -44 50 -107 -129 -30 -119 -7 170 62 -102 -3 114 65 -86
7069 -86 -75 83 -3 -21 37 47 -85 -6 -30 16 -1 -110 -54 62 -48 -70 -29 83 21 -25 -96 -13 80 -53 -43 -71 -43
7096 -43 -44 -24 111 99 10 57 20 15 -49 29 -5 -75 -187 68 -17 -55 119 -47 -4 -4 -68 -36 -44 5 -9 24 63 38 4 -57
7126 -57 -41 59 -14 23 -11 59 42 19 -127 8 -135 21 -9 77 85 -53 -15 60 -93 15 -28 -8 57 50 34 -45 -23
7153 -23 -43 -89 39 34 -41 -87 7 -57 -135 56 -14 -34 -94 -109 122 -39 -93 21 -134 -47 -98 34 -21 -5 62 -53 16
7180 16 -2 128 37 -43 -51 -138 -44 31 -57 75 -93 -88 -55 52 -89 -137 61 4 -15 55 -75 -20 -69 60 81 57 49 149
7208 149 28 45 89 76 -64 -88 1 25 -96 -66 28 62 -17 43 -158 -32 41 -47 84 102 -60 -91 10 65 -117
7233 -117 56 -8 23 50 -2 14 -24 16 -69 75 -78 -108 -22 -126 104 -87 2 10 -7 -99 69 -86 47 -85 54
7258 54 -17 -99 21 63 -11 -11 -118 45 145 -45 46 65 -53 9 -37 -61 -26 -4 -34 51 -68 -78 -33 96 -139 -80
7284 -80 -27 -1 -28 -15 -4 43 -33 -66 -80 70 -103 11 -38 -104 -3 79 -99 -42 32 -16 59 -31 24 46 -24 -26 -61 56
7312 56 -42 -61 92 -9 39 14 -4 -15 -54 -43 -78 -111 -30 97 1 -54 34 117 -139 -69 -92 6 -12 44 34 -55 -41 -22
7340 -22 0 63 51 62 -72 -123 -1 27 47 -81 -155 -11 -44 7 47 -7 71 -41 98 -57 53 -7 -76 75 1 -20
7366 -20 93 -17 -1 -70 7 89 -74 98 4 29 -83 16 3 -24 -51 -96 -8 -104 -15 70 1 -55 135 -80 -130 -6
7392 -6 68 -97 -38 -27 -26 42 -68 20 -61 -16 -31 22 -38 -37 -64 122 -62 54 60 -91 79 -72 -18 -48 -83 -67 -52 45
7420 45 19 -3 -30 -135 37 -48 -50 96 -69 84 -11 46 -46 -16 -2 13 -25 2 -141 -138 -19 56 -224 -9 -44 -85 94
7447 94 21 26 -39 46 -87 -79 111 -58 1 98 -55 -61 24 20 -3 -5 12 -167 -70 74 -83 -133 53 5 -47 -12 -115 101
7475 101 -106 -19 -53 83 85 -1 -78 -2 8 54 6 -45 -113 -33 -155 -103 -72 -115 -40 -12 3 -85 93 -80 -67 59 41
7502 41 -36 32 37 2 58 71 -57 -95 -149 5 20 18 78 -86 27 -28 14 44 -72 -58 -59 -12 -40 -93 -3 -62 34 56 -52
7531 -52 -238 -55 -18 -60 126 -130 135 -17 -65 -36 82 -171 -70 9 76 -70 -63 79 0 -51 -99 -80 -36 41 36 66
7557 66 -79 34 86 27 -66 57 -17 100 -54 -46 17 65 -42 68 -67 -69 -76 -88 23 -66 12 -83 -14 9 -3 34 -38
7584 -38 -25 61 -48 -67 -85 -14 55 -88 18 114 -19 180 -37 89 33 46 77 -72 6 126 -28 12 -66 41 -97
7609 -97 -39 24 -110 -85 -48 -33 26 33 -100 38 -64 6 -52 -7 -28 50 -130 -22 68 16 -58 -57 37 13 12 -75 16 -117
7637 -117 34 53 4 -49 133 -99 22 46 -2 31 -32 49 -40 -102 25 80 4 73 -45 27 -8 -3 21 104 -18 30 -94
7664 -94 1 -53 -60 -116 -61 -50 -177 109 -93 -35 42 -79 -51 -40 -34 -98 11 -101 -19 -24 69 -71 -119 -72 -70 -19 -20 -69 5
7693 5 111 -11 9 -28 164 83 28 -9 60 -44 87 -48 44 -32 78 -28 -12 3 -34 -12 54 23 -1 71 -91 64
7719 64 -31 -5 37 56 -12 10 34 -62 -65 -24 34 -48 37 -1 -29 -11 -3 11 -55 111 75 21 58 -105 41 49 -32 161 -132
7748 -132 -34 -73 13 -89 -9 34 49 -19 109 -90 0 -65 78 -56 -13 5 31 105 -26 -13 28 -126 -24 5 -46 54
7774 54 -6 -2 -44 142 -15 -97 -47 11 42 -70 43 7 12 -27 6 -33 -44 14 -30 -81 60 5 -79 -46 138 -61 -86 -28
7802 -28 52 14 -19 13 44 -25 2 -99 -13 13 -66 143 -52 -192 49 -48 18 2 55 -65 -2 -139 -31 84 -52
7827 -52 -72 -34 33 -69 -78 -31 29 65 -19 -83 -8 88 26 83 22 -110 42 -25 92 -67 -67 1 26 -64 38 2 80 119
7855 119 -22 -103 -136 -95 -16 62 -83 -99 48 -40 116 -57 58 35 -46 -185 34 -57 -19 5 -36 34 -6 25 95 -3
7881 -3 -50 88 -38 19 38 24 2 83 -14 -34 96 -30 -69 79 81 -30 67 15 -18 -2 -29 -56 -92 39 22 26 6 -68
7909 -68 -43 57 2 -11 88 -32 -117 84 -32 -116 -29 22 -42 -50 22 25 -74 -20 46 66 -19 -48 -2 -83 27 15 -59 -109 -39
7938 -39 92 98 48 64 -85 -15 33 -15 -10 57 104 -127 -16 39 -30 -89 -82 -84 -19 46 45 18 -83 -52 -154 -102 55 -56 -14
7967 -14 -115 -47 -20 -40 -46 34 69 -17 -29 42 -83 41 52 -56 25 -36 -27 -52 64 -35 72 36 -68 -87 107 -97 -49
7994 -49 55 -66 -28 -102 76 -40 -98 -31 5 -70 -77 47 48 -38 -64 -130 -111 -39 -59 67 59 79 -1 -133 20 -14 -32 -22
8022 -22 -28 -16 33 -70 84 116 -10 73 68 56 17 58 5 53 28 0 -59 -77 18 44 44 51 37 -25 -3 21 12 7 -83 -66 -62 4
8054 4 11 -140 28 92 -38 30 -57 -48 -40 29 44 -51 14 -46 -31 18 -41 113 -18 44 -5 -146 -8 -128 -17 31 -124
8081 -124 -84 -2 -9 84 52 -15 49 -11 -45 -121 12 87 108 62 -76 -157 77 -98 -23 -27 -68 -12 -104 80 0 98 43 2
8109 2 25 69 19 -38 1 98 -27 -17 24 117 -118 16 2 -58 -71 -175 14 34 -27 47 42 54 -22 36 -21 1 -17 145
8137 145 -21 -1 -9 -152 -78 6 -18 -193 6 37 -17 -49 -48 49 -16 3 121 8 74 -14 0 40 -152 20 -56 -87 19
8164 19 98 -16 -26 -5 -88 -15 -5 85 -11 -163 25 20 48 15 77 -35 -121 17 -76 75 59 -49 62 69 -59 0 -84
8191 -84 1 -12 -84 -8 -21 -36 -89 -19 52 -45 15 38 -48 -94 -28 7 -15 -86 -40 83 -162 -70 88 54 16 27 55 -57
8219 -57 -3 -29 33 43 -92 64 -51 68 -71 32 17 -2 -23 -48 -32 113 -1 -76 -31 -61 102 34 -85 18 -32
8244 -32 -4 62 133 -31 5 9 16 -88 -108 -72 -32 -12 -87 -69 -28 -20 29 26 87 -122 -42 -12 -27 37 -74 82 54 -50 62
8273 62 -21 -44 161 -2 52 38 122 -25 -92 27 8 -29 15 39 122 -97 65 -15 -21 -127 -65 -50 -32 104 -73 -9
8299 -9 -148 24 -22 -8 -82 43 39 -79 43 -40 118 17 19 -11 3 -20 113 -46 -61 -52 -12 54 -44 8 -77 -65 -58 -123
8327 -123 -128 13 63 46 50 -38 1 4 31 -106 -40 36 -21 -60 -11 -1 79 -55 -61 -5 -72 33 -26 115 -47 -35 34 7 -116
8356 -116 -52 21 74 72 -45 -4 -50 -71 26 35 -16 87 19 46 98 -60 -7 -61 29 -28 114 24 -23 -20 -57 -42 93 -21
8384 -21 4 35 12 -114 -95 -25 -29 38 -146 14 -10 6 88 -44 -67 -39 -13 43 -13 53 51 54 -24 60 54 -34 -93 4 -50 -53 -4
8415 -4 -8 23 -26 82 -27 -34 -36 62 76 -31 -11 0 -77 -150 54 7 -47 -25 -43 -34 -6 -73 -64 -74 45 -42 -32 -60 55 -64
8445 -64 137 153 -148 -118 -54 -68 17 11 -31 -110 3 44 -74 -94 55 -79 -101 14 -98 -6 94 8 3 -95 44 -43
8471 -43 79 14 25 -83 -54 -45 -5 9 -5 50 -43 93 -72 -85 -144 -162 -26 81 2 -84 -4 49 12 59 -78 -91 -42
8498 -42 82 87 -33 -21 -134 -42 75 -90 81 24 6 -6 73 14 83 -31 -3 109 -92 46 -43 88 -33 -41 69
8523 69 31 -12 -57 -57 21 -41 11 83 -8 -61 -15 -39 6 -36 -91 -11 -24 52 -5 -3 -60 49 -16 -39 -62 -87 20 -44 102 55
8553 55 -6 -63 79 40 -2 51 -13 113 76 27 17 -113 -112 -20 40 -37 -188 -17 42 25 -65 -125 68 -49 -9 -29 -48
8580 -48 56 -55 2 22 -105 -19 50 49 -5 10 -129 -127 -9 -22 67 42 38 20 7 75 -73 28 -10 -80 86 129 -68
8607 -68 -3 -67 3 -7 59 62 -25 35 96 -8 -17 -79 103 -48 -72 -61 -79 34 -78 -53 -46 -24 -50 -71 -29 -42 -143 -99 33
8636 33 71 22 24 109 -5 -95 58 10 133 27 83 45 -32 27 -14 -2 -56 -35 146 -47 49 69 -13 59 -55 -37 29
8663 29 -23 -54 -20 37 -3 -64 88 -43 -40 -121 -84 19 59 -129 0 -39 -74 -121 -45 45 78 9 -100 -19 -66 31 -206
8690 -206 -47 66 60 -18 -111 -43 27 19 -97 -3 50 -68 30 59 -56 7 58 92 7 -17 -1 -10 69 -8 -37 -1 -114 -123 -116
8719 -116 -83 -92 21 76 -93 -74 -100 18 -8 26 32 14 -131 73 -129 47 14 -31 49 -96 15 -81 69 -189 24
8744 24 -29 94 8 -2 -26 35 -41 -19 -19 31 54 -60 -75 152 39 48 -101 25 -3 -45 -64 -41 -86 58 -43 -26 -21 -6
8772 -6 62 100 -1 -18 6 -39 -79 32 -160 198 -70 44 -20 -21 -64 -178 29 -90 -50 -74 -24 143 -12 72 57 87
8798 87 68 -92 -172 -109 -13 3 29 -67 -3 60 -24 -129 46 21 -77 78 46 -70 38 -45 61 81 -34 1 -45 -18
8824 -18 -81 -81 60 -9 9 -32 -56 92 6 -123 -35 -24 -73 -40 -87 -26 66 44 116 106 108 -43 96 17 6 115 -8 0
8852 0 96 -68 -74 -39 75 44 -34 77 -23 133 131 -66 -93 29 -8 -191 -62 -32 -75 -111 -73 -39 56 45 -130 29
8878 29 -65 78 -62 6 64 -76 57 -53 37 -9 48 33 -34 -94 40 12 -82 -164 -92 65 -97 -45 24 -112 44
8903 44 7 63 -3 32 29 -48 4 -62 -91 73 -13 -44 -15 -118 -50 -187 -30 -114 -31 19 -26 -34 -78 -132 28 61 18 -63 -33
8932 -33 56 2 9 4 -9 -61 -22 91 25 -58 68 115 106 99 37 -32 -24 123 -25 -17 106 -49 98 41 -47 35 -35 91 14
8961 14 10 0 -46 -85 -31 8 -59 42 -104 -53 -42 -129 -11 -1 -104 60 51 48 -100 18 -50 32 -43 141 13 -117 10
8988 10 -78 75 -5 -56 97 -99 109 -25 -22 38 50 -103 11 20 -61 -84 88 -70 -30 -10 18 -55 -162 -105 -115 -3
9014 -3 24 -78 67 93 16 -139 -48 19 40 -76 -129 -2 24 75 41 28 82 23 -31 -72 61 -58 50 -30 -27 -11 -65
9041 -65 13 -108 66 39 -47 -2 -35 74 -33 -33 -7 -118 117 34 18 17 -18 38 -103 -104 34 70 -72 -78 -52 18 -142
9068 -142 25 28 24 56 59 -25 44 -74 10 42 -31 -17 21 -8 -44 -48 34 40 50 -26 -17 99 28 -13 -73 105 104 -58 -24 -34 -20
9099 -20 32 11 -79 -28 31 66 -34 113 -41 -45 169 -6 36 -23 27 -2 2 -43 -29 10 35 -44 24 -67 -33 46 107 44 16
9128 16 8 -31 10 3 37 -5 4 -7 68 28 94 4 14 -84 -10 -13 34 -53 -25 -72 -63 -130 -8 51 -31 30 -66 -91 -5 -105 -22 -119
9160 -119 -108 -60 -49 -46 -39 -83 5 8 15 23 47 108 -28 -21 -96 -46 111 -19 -22 -11 38 114 46 -13 -9 15 -97 15 74 88 45
9191 45 2 8 -27 50 21 30 83 59 9 -69 17 52 110 -3 -12 136 46 -15 38 128 -27 -60 22 -20 -56 -45 -48 16 -14 -3 -19
9222 -19 -22 -115 -18 -34 13 -38 27 46 -41 -56 -52 88 -58 120 -36 -52 12 -4 -40 37 -71 -47 28 -14 -38 72 -73 -68
9250 -68 66 103 -83 -13 141 -34 12 54 -69 -47 54 -70 -2 24 127 -66 -133 -94 -42 -15 75 -137 -48 48 -64
9275 -64 36 0 -38 8 81 3 16 93 -56 -17 -17 -59 -21 -42 13 -28 9 -30 -3 79 -42 -30 31 -38 41 -120 -70 26 -59
9304 -59 114 -114 -91 68 -88 150 20 -5 -33 -66 -9 -57 -40 -62 -32 123 -6 -70 -36 -37 15 -83 62 -30 -13 104
9330 104 -35 124 -79 -58 -71 -12 17 13 -13 -60 6 -44 -11 -122 20 23 -73 -63 -12 -30 -8 5 26 -13 -60 48 33 88
9358 88 150 -57 -48 -86 37 -42 -46 -75 -71 123 0 -46 44 0 -8 24 -64 -23 56 67 79 -56 -143 117 -30 -32 -39 1 -27 -35
9388 -35 35 -37 -52 -61 -13 -120 -65 -5 35 -116 -10 -12 -42 52 -44 70 1 -55 -73 35 -125 -76 -90 -42 9 -90 107 96
9416 96 139 -58 24 -10 81 -7 -50 -54 -24 61 -106 54 12 80 -2 0 75 42 71 -44 -86 -79 19 -84 -125 -17 42 -89
9444 -89 -39 -62 39 -91 -26 39 -10 -63 16 -63 -67 -17 -38 51 75 43 -122 79 28 -19 -59 -44 23 97 -19 -26 2 112
9472 112 63 -16 167 -44 22 -49 -73 -83 41 -118 -52 -70 -90 38 149 -91 -20 -3 -3 -89 11 33 34 -44 49 -109
9498 -109 -78 -113 34 15 -46 -66 35 102 38 82 57 185 -65 -81 -15 60 -98 143 14 51 -41 -68 -47 -27 -3 -43
9524 -43 -13 12 -48 -33 -199 -72 -54 -3 -74 104 -109 -80 -42 -143 -13 -62 87 -14 -98 -130 38 -85 95 50 42
9549 42 38 -58 1 -37 -160 -111 -7 -35 47 105 -4 -9 0 26 -55 22 -4 35 19 10 77 46 47 10 -79 16 31 -19 54 -125 31
9580 31 -5 -120 50 -20 -153 -14 16 -79 -25 -17 -15 -32 91 -1 38 -43 -12 11 -22 0 -18 6 -76 56 0 66 35 -52
9608 -52 50 -55 -16 36 110 98 -31 41 -12 36 -31 -109 169 -172 -28 81 28 6 16 -31 -23 -8 94 80 -42 57
9634 57 -72 -42 67 83 1 -54 95 -8 45 -35 15 -40 30 1 58 -92 -63 104 -34 -17 -26 17 75 -45 -49 14 -30
9661 -30 79 -47 28 22 44 164 -1 -60 42 -22 -40 -59 78 26 -1 -71 -61 66 -72 -34 -88 100 132 32 1 -13
9687 -13 -82 1 68 -83 60 30 15 38 65 -63 31 -12 99 -74 40 -32 146 -76 -32 -55 22 3 66 97 86 27
9713 27 -8 -58 -21 110 -55 -15 26 39 -38 -25 -76 -84 -34 -14 51 -26 -17 -65 -10 4 54 -19 -95 98 -19 -40 -90 34 74
9742 74 -47 -52 82 57 79 8 -80 -28 -59 -19 -14 101 -65 -46 -52 -137 82 -59 -78 27 80 56 -14 26 -74 89 -3
9769 -3 4 -94 57 -46 21 40 -7 20 84 -18 -31 -82 22 -16 -42 -63 -127 -25 -62 45 -76 56 -65 -129 41 -26
9795 -26 15 -41 117 30 81 71 -46 82 103 22 -73 -71 -29 156 24 34 16 -4 87 30 3 -59 5 36 -149 -1 -23
9822 -23 -34 -65 -7 -86 63 -46 -93 -45 -33 -94 -25 29 -24 56 43 -17 -106 11 1 -58 -62 -8 -40 -59 33 45 24 -25 36
9851 36 -17 17 20 27 27 -58 -30 -48 -54 -117 -39 -44 46 108 104 -51 12 -13 -4 -41 -142 19 53 37 -3 -62 6 41 94 -117 -75 -185
9883 -185 24 118 85 -20 -79 -52 -46 67 82 -27 -110 10 -8 -34 44 10 134 -7 39 -68 -30 83 32 -12 76 20
9909 20 72 65 3 -82 76 -2 -116 -97 34 142 -32 -9 -147 -44 -113 -27 151 -93 -15 -35 -76 19 -68 -100 24 88
9935 88 50 -61 88 10 17 -25 -49 13 -44 -108 -24 -87 17 -12 0 67 -43 -29 -3 20 -96 -30 43 -42 5 -20 -47 42
9963 42 54 -197 -41 75 -56 -28 -71 94 -9 -15 -80 74 37 -19 -65 -119 -25 32 -33 170 13 64 54 -59 -27 0
9989 0 17 64 2 77 -58 -87 -23 40 96 66 -34 -16 -28 -17 -58 27 13 69 -22 -61 23 8 -38 -175 54 13 30 13 -12
10018 -12 -20 -32 37 -106 19 -14 49 40 98 55 -83 -100 -34 -90 17 62 71 107 -8 -62 114 -26 -58 86 35 11 -46
10045 -46 216 0 35 -99 -25 -21 1 11 31 -64 -13 -43 13 41 -17 -130 -6 101 -84 -65 -61 -24 25 -16 -33 -170 35
10072 35 -53 -138 32 105 39 -28 90 -53 0 -50 -24 -39 19 36 5 107 22 17 68 12 23 30 -18 149 -27 77 17
10099 17 -58 -66 8 -9 -64 -85 -6 5 -38 -15 7 -113 -80 1 -45 106 -69 25 -62 39 15 -23 -80 -55 -39 16 -17 -77
10127 -77 6 37 30 87 -25 -27 -48 84 -47 -29 15 34 13 43 -21 53 -59 96 29 -1 -128 -71 65 -60 61 10
10153 10 -1 -3 39 52 18 -21 -44 20 -81 63 -56 -27 184 -86 69 -46 8 -13 -10 -4 -7 19 34 18 54 25 3 -2 36
10182 36 26 -5 122 111 79 -86 108 105 -8 -67 32 -50 20 24 19 111 -69 -131 -81 3 -72 65 42 -69 -90 -39 9 68
10210 68 30 1 -75 45 -18 -135 45 -39 17 83 -42 65 67 -17 -5 33 -138 -181 68 -34 117 137 0 -19 50
10235 50 76 -33 80 50 8 -25 49 -112 -77 22 12 28 -65 -4 5 134 -12 -3 -97 25 -51 -91 21 -6 138 -56
10261 -56 -16 -113 -54 1 -8 9 11 30 -60 -32 82 86 -117 -68 -24 68 -23 12 67 -31 26 -16 -24 -52 56 152 -21 36 -92
10290 -92 -97 12 77 -70 113 -124 -6 28 -28 -84 -121 -4 -20 -126 -93 3 89 -168 -104 -111 67 -60 -63 -112 -89 70
10316 70 38 20 80 5 53 98 22 111 42 -54 121 -37 32 -157 -152 0 -19 23 -49 87 53 73 48 -124 -10 -62 3
10343 3 -45 -32 75 -67 -16 16 -40 -9 -42 -131 -52 -52 -32 7 41 -25 151 9 -27 -71 1 -2 -98 -1 26 155 12 12 -38
10372 -38 -53 -54 -37 46 120 3 121 -68 -12 -30 22 -121 -138 58 16 -46 36 -3 -30 4 56 55 -15 -5 136 44 22 -79
10400 -79 39 -28 -26 -87 -127 5 -77 -100 9 -89 11 -22 43 -63 21 45 137 11 29 19 1 74 -29 -99 13 32
10426 32 103 92 -40 56 5 -186 124 -34 21 73 41 26 15 24 0 16 -60 -92 -92 -95 -47 -132 9 -118 5 28 -100
10453 -100 3 -71 -45 -136 -28 38 -82 19 96 64 26 49 -9 25 -47 -31 4 -130 -11 -8 66 63 -34 -44 -34 -10 60
10480 60 -41 18 47 -10 -83 48 18 -83 44 12 -8 -8 -17 -28 -69 -80 -26 -99 -41 18 -21 -59 -98 -23 -82 47 -10 -166
10508 -166 50 -16 9 27 17 -23 34 50 28 13 -4 -15 12 -22 -13 49 -46 36 -14 -56 57 -10 97 -30 -51 -24 -74 100
10536 100 12 68 -46 64 -24 -32 -55 116 107 -46 18 -64 -41 48 -26 31 58 -63 122 -102 24 -100 -20 -60 35 18
10562 18 -16 4 68 -45 -24 36 -29 121 -36 24 -1 29 1 44 28 102 -73 -26 -79 94 -44 -95 38 35 27 -74 -11
10589 -11 -90 -115 -36 -23 67 60 -117 31 89 -13 2 163 -22 -85 39 -78 -81 23 37 14 -49 6 -42 -64 3 29 -10
10616 -10 -109 43 106 72 -7 94 -11 17 61 36 5 2 114 0 -72 -83 89 -80 28 96 17 -16 -71 18 -96 35
10642 35 89 2 -93 -2 106 -13 91 60 128 -19 -87 -88 30 31 -8 -18 67 67 -52 8 -81 6 -123 -3 -38 -16 -86
10669 -86 55 -59 -28 -76 116 82 -21 -4 -28 49 96 -43 80 56 -40 79 -18 -49 5 -62 -36 43 20 -55 -23 -16 -150
10696 -150 96 35 -3 -76 -2 -14 -28 -28 -41 -33 47 34 -17 18 55 -97 -5 2 -16 -34 -88 67 28 -77 23 172 29
10723 29 22 -7 -15 -32 80 7 -61 54 17 -9 -59 -2 14 -26 7 29 20 -106 -24 -95 20 -117 133 15 91 22 -30 59
10751 59 -25 42 46 62 -145 -38 -23 24 6 14 -69 -29 88 -10 64 4 -127 4 -34 9 -20 -59 -109 55 -74 30 -53
10778 -53 -86 -46 -70 22 -117 46 37 -123 128 -80 -49 96 7 7 64 40 -61 50 20 -95 36 -14 45 15 -77 22
10804 22 29 -48 39 31 64 30 -10 112 -2 -16 -30 -31 50 -80 -115 48 96 22 131 -10 10 138 -62 85 -106 57
10830 57 9 -11 117 -8 -49 -68 -150 56 31 74 -23 156 26 -37 51 96 -38 -89 -76 94 -49 106 11 36 -14
10855 -14 22 1 43 38 73 -33 -52 -63 205 22 0 21 -58 -37 -13 -33 127 36 37 96 104 54 118 30 2 90 81 -79 -60
10884 -60 91 -57 42 112 -40 -77 -21 -66 -27 100 -18 36 -67 -60 10 11 107 14 52 111 57 -19 -7 -117 32 4 58
10911 58 18 -25 -3 23 -41 -6 -34 -59 18 23 -73 -171 -1 -12 48 82 -91 84 20 0 18 -56 31 -45 9 -116 -20 52
10939 52 3 23 113 -32 -22 8 -94 52 25 35 -32 -5 -48 33 -8 33 -52 -4 89 -32 114 -7 45 35 -47 19 5
10966 5 -23 -38 -4 28 -51 -26 -31 26 -120 -27 -28 -129 49 -106 113 -20 50 -22 92 -15 -19 -75 14 -33 134 57 27
10993 27 -100 -74 103 14 -11 29 25 -65 39 -46 -141 -52 42 -118 79 19 -19 106 -37 -64 -4 -35 -71 34 68 -31
11019 -31 -20 36 5 -121 73 -92 -58 -71 89 24 -25 7 -57 71 31 16 -12 -49 97 -30 14 52 71 -29 41 19
11045 19 -52 93 58 37 26 61 58 15 -41 -73 56 42 -32 -24 19 -77 119 -14 -58 43 63 -79 -11 -38 -93 43 -12
11072 -12 2 34 -14 -81 24 -34 -77 -70 -37 -52 -72 -20 -111 -6 -43 -50 16 177 -10 -47 -22 -2 -139 -16 54 44 26 10
11100 10 27 -47 20 24 -20 57 -28 -95 29 -121 64 60 -106 -45 -52 -47 -18 51 21 16 7 91 -94 -36 -128 57 -39 7 32 -23
11130 -23 -86 -32 43 -55 -12 -35 -23 73 -103 13 -45 104 54 -34 -35 -73 137 34 10 -8 54 69 29 46 -2 47 14 -159
11158 -159 -148 5 37 29 -52 29 95 -60 31 14 9 -9 -14 48 -56 29 -111 -46 22 9 -20 -35 102 35 -41 15 -62 -56 -68
11187 -68 -15 6 -20 -81 -17 21 -3 -10 108 56 -49 44 12 57 74 57 -18 70 0 -30 -115 -80 132 -49 65 -72 78
11214 78 57 -166 -24 -19 42 -3 -65 -47 11 45 -115 -35 29 24 -19 41 -93 -8 -93 33 64 37 31 -26 -28 37 24 50 -7
11243 -7 -6 -4 90 -17 -37 56 -22 -19 44 -71 -40 -16 -97 -15 -13 50 -25 -9 6 -87 24 11 -20 85 -67 52 -118 -31 -46
11272 -46 -80 -53 55 -36 28 -28 -18 -47 -64 61 14 52 16 64 -8 -43 51 33 4 -24 -33 -97 28 2 -47 15 -22 -25 -34 -21
11302 -21 82 -38 12 -96 58 71 -80 -91 -29 80 61 -63 -15 -79 -12 114 -15 49 -59 9 -102 83 -40
11325 -40 15 22 -92 12 117 -98 27 -72 49 46 -158 149 -5 -44 -116 -64 99 -14 45 -67 102 -131 -27
11348 -27 7 -5 0 17 122 -96 -71 62 -72 -61 49 -38 -97 -80 16 -97 -96 -99 164 -26 34 -20 100 -58 23 -5
11374 -5 -16 34 115 -23 64 45 -78 -25 -18 85 21 -9 72 55 -48 58 59 3 -13 74 -5 177 17 -82 18 62 105
11401 105 17 -9 -31 -95 -28 18 52 -13 7 -5 50 -183 -78 5 88 -28 80 -59 20 28 -62 85 -117 -77 21 19 37
11428 37 53 -39 -70 -50 58 39 -54 -82 106 27 -58 14 -138 18 -16 -39 14 80 161 -45 -14 77 77 62 -17 -20 -114 57
11456 57 -101 12 -96 2 -17 -89 24 -63 72 -131 -61 -34 -31 39 22 4 30 -97 -24 13 -41 82 89 -11 -78 106
11482 106 -89 -74 37 48 -1 -33 2 -56 -45 -25 39 53 35 -138 -25 -12 26 79 12 -59 -28 -8 49 15 86 -50 110
11509 110 -4 -93 -56 -26 -80 33 83 28 93 101 3 -153 -12 -9 84 68 -53 50 -12 -51 -60 9 -81 37 57 -100 60
11536 60 42 82 71 -19 0 80 30 -7 10 39 -58 24 -20 -34 1 -47 -7 -116 20 -1 -125 -35 24 -173 33 48 -70
11563 -70 0 26 -76 -126 -132 -151 24 103 31 -78 78 -29 -25 -49 -126 33 49 -68 118 -81 -23 50 -45 50 -60 -106
11589 -106 -61 -51 -52 18 28 -40 86 -7 24 -84 -14 4 44 -24 30 208 -17 -71 18 174 -87 21 13 43 41 54 -35
11616 -35 -2 -9 -69 11 -36 -27 6 65 -118 59 -42 -28 -2 -28 32 -64 36 -7 -6 4 -52 -8 -34 -39 2 20 -161 102 103
11645 103 -122 -20 102 -34 -37 22 -105 52 -20 -11 -12 -24 44 47 -20 -64 -78 31 -77 -13 36 89 -20 -47 26 1 109
11672 109 -12 -12 3 -19 57 -17 -4 38 77 -12 -45 35 51 -113 -36 20 0 35 10 -34 37 61 19 -88 -140 13 -31 -22
11700 -22 -70 54 15 -46 49 -42 39 54 74 52 -9 -48 67 -1 34 21 60 -115 -3 -24 37 -43 12 13 65 14 -72 -99
11728 -99 -74 17 126 39 36 -64 -6 118 -103 106 -3 46 -10 -74 54 -39 -64 -44 31 -6 36 42 31 -59 25 0 -36
11755 -36 37 13 -135 -60 -162 -60 42 59 -18 -14 -145 10 -22 -99 -72 -15 72 102 -31 28 87 -4 -125 4 -67 -14
11781 -14 -148 -89 107 -24 91 -10 0 -90 16 -146 -41 20 -43 -64 -159 25 -82 34 -16 6 21 -28 -92 32
11805 32 9 -63 30 65 13 67 24 -3 7 -3 -9 -39 75 11 11 -69 -95 49 -1 106 51 41 11 -41 129 -82 -101 97
11833 97 77 -6 0 -26 43 -20 77 23 -23 34 140 25 -86 -89 0 103 45 -38 106 -46 -99 86 76 -73 -39 -23 -47
11860 -47 92 -7 -39 55 47 1 15 146 -110 -76 90 86 -160 40 -59 -16 -35 79 5 -88 38 12 43 -22 -9 74 61
11887 61 -66 -60 -111 -78 68 28 -60 -71 -118 54 -17 5 -9 32 -67 -33 124 -82 0 -50 -5 46 -69 -1 -38 8 -17
11914 -17 178 -41 -9 45 17 70 52 58 -51 -24 -26 -2 -31 -37 -57 3 -12 -31 52 -137 -18 -50 39 -77 -82 47 17 -13
11942 -13 -32 -41 -56 59 -52 -98 -64 -90 -18 124 24 68 -23 -56 74 0 -63 104 -40 64 36 -43 -27 -137 77
11967 77 -5 -15 74 0 -21 83 -28 102 -93 -45 -128 -50 26 -100 63 -22 -35 58 20 15 59 -91 -90 7 -165 -65
11993 -65 -18 -43 -67 35 -25 34 -23 -52 -34 -41 101 33 -49 -89 23 29 -7 -46 -23 -23 13 29 -55 -32 -1 -145 -142 80 4
12022 4 37 -17 -34 -70 -107 -17 -40 85 19 81 -56 -28 -1 -17 84 9 -90 46 -44 -64 -79 1 4 54 -5 -79 -67 -6 -1
12051 -1 66 -25 -88 -9 -1 110 4 -84 -80 73 -70 -20 36 29 -11 -13 -65 9 -15 -66 -64 120 -90 51 -23 -35 71 -62
12079 -62 38 -68 -117 118 -61 -42 -58 -57 -29 34 -54 -54 113 -4 35 59 -49 35 -28 -15 71 28 -61 -64 62 60 80 -44
12107 -44 -59 -31 -17 -5 9 60 -12 -55 64 -10 36 57 -72 -101 26 -1 11 -97 -62 -5 -24 32 26 -8 75 67 -143 -55
12135 -55 -120 11 -78 57 -49 -63 13 -15 -12 32 43 100 -25 -56 -64 11 -55 35 46 113 -38 53 47 -54 70 -93 -2
12162 -2 24 13 30 58 -45 -44 -145 -32 -61 -167 36 -16 15 72 -1 -4 -153 56 -85 -8 -5 11 -128 69 -75 34
$$ [...]
16383c5
##END NTUPLES=NMR FID
##END=
