##TITLE=abcd
##JCAMPDX= 6.0         $$ Bruker NMR JCAMP-DX V2.0
##DATA TYPE= NMR SPECTRUM
##DATA CLASS= NTUPLES
##ORIGIN= UXNMR, Bruker Analytische Messtechnik GmbH
##OWNER= root
$$ XWIN-NMR		Version 3.5
$$ Sat Mar  1 12:52:14 2025 Russian Standard Time (UT+4h)  servis@DPX200
##.OBSERVE FREQUENCY= 200.131235884673
##.OBSERVE NUCLEUS= ^1H
##.ACQUISITION MODE= SIMULTANEOUS
##.ACQUISITION SCHEME= undefined
##.AVERAGES= 32
##.DIGITISER RES= 18
##SPECTROMETER/DATA SYSTEM= spect
##.PULSE SEQUENCE= zg
##.SOLVENT NAME= DMSO
##.SHIFT REFERENCE= (INTERNAL, DMSO, 0, 16.4885)
##AUDIT TRAIL= $$ (NUMBER, WHEN, WHO, WHERE, WHAT)
$$ ##TITLE= Audit trail, XWIN-NMR		Version 3.5
$$ ##JCAMPDX= 5.01
$$ ##ORIGIN= Bruker BioSpin GmbH
$$ ##OWNER= servis
$$ F:\spectra/data/av/nmr/H1/1/pdata/1/auditp.txt
$$ ##AUDIT TRAIL=  $$ (NUMBER, WHEN, WHO, WHERE, WHAT)
(   1,<2025-03-01 12:30:45.98 +0400>,<servis>,<DPX200>,
      <created by zg, POWCHK disabled, PULCHK disabled
       configuration hash MD5:
       00 E9 B6 7A A2 85 ED C7 34 08 36 98 17 FE 4E 26
       data hash MD5: 32K
       B2 C7 AA 6E 0B FB 72 71 4F 80 38 4D E6 B5 3B C7>)
(   2,<2025-03-01 12:51:22.57 +0400>,<servis>,<DPX200>,
      <Start of raw data processing
       efp BC_mod = 2 LB = 0.05 FT_mod = 6 PKNL = 1 PHC0 = -266.1254 PHC1 = 1.301534 SI = 16K 
       data hash MD5: 16K
       4D C4 80 A9 AF 00 63 CB 39 E2 31 66 AB A5 0F E7>)
(   3,<2025-03-01 12:51:34.56 +0400>,<servis>,<DPX200>,
      <pk PHC0 = 4.6 PHC1 = 0 
       data hash MD5: 16K
       B5 12 B5 21 22 62 D3 64 31 FA B1 95 3C 18 2C 29>)
$$ ##END=
$$ 
$$ hash MD5
$$ A0 23 92 16 06 3C ED 4A 85 69 57 AE C9 8E F3 FD
##$RELAX= 
##$RELAX= 
##$RELAX= 
##$RELAX= 
##$RELAX= 
##$RELAX= 
##$RELAX= 
##$RELAX= 
$$ Bruker specific parameters
$$ --------------------------
##$DU= <F:\spectra>
##$EXPNO= 1
##$NAME= <H1>
##$PROCNO= 1
##$TYPE= <nmr>
##$USER= <av>
##$AMP= (0..31)
100 100 100 100 100 100 100 100 100 100 100 100 100 100 100 100 100 100 
100 100 100 100 100 100 100 100 100 100 100 100 100 100 
##$AQSEQ= 0
##$AQ_mod= 1
##$AUNM= <au_zg>
##$AUTOPOS= <>
##$BF1= 200.13
##$BF2= 200.13
##$BF3= 200.13
##$BF4= 200.13
##$BF5= 500.13
##$BF6= 500.13
##$BF7= 500.13
##$BF8= 500.13
##$BYTORDA= 1
##$CFDGTYP= 0
##$CFRGTYP= 5
##$CHEMSTR= <none>
##$CNST= (0..31)
1 1 145 1 1 1 1 1 1 1 1 1 1 1 1 1 1 1 1 1 1 1 1 1 1 1 1 1 1 1 1 1 
##$CPDPRG= <>
##$CPDPRG1= <>
##$CPDPRG2= <>
##$CPDPRG3= <>
##$CPDPRG4= <mlev>
##$CPDPRG5= <mlev>
##$CPDPRG6= <mlev>
##$CPDPRG7= <mlev>
##$CPDPRG8= <mlev>
##$CPDPRGB= <>
##$CPDPRGT= <>
##$D= (0..31)
0 2 0 0 0 0 0 0 0 0.06 0 0 0 0 0 0 0.0002 0 0 0 0 0 0 0 0 0 0 0 0 0 0 
0 
##$DATE= 1740817845
##$DBL= (0..7)
120 120 120 120 120 120 120 120 
##$DBP= (0..7)
150 150 150 150 150 150 150 150 
##$DBP07= 0
##$DBPNAM0= <>
##$DBPNAM1= <>
##$DBPNAM2= <>
##$DBPNAM3= <>
##$DBPNAM4= <>
##$DBPNAM5= <>
##$DBPNAM6= <>
##$DBPNAM7= <>
##$DBPOAL= (0..7)
0.5 0.5 0.5 0.5 0.5 0.5 0.5 0.5 
##$DBPOFFS= (0..7)
0 0 0 0 0 0 0 0 
##$DE= 6
##$DECBNUC= <off>
##$DECIM= 32
$$ [...]
##$SUBNAM4= <"">
##$SUBNAM5= <"">
##$SUBNAM6= <"">
##$SUBNAM7= <"">
##$SUBNAM8= <"">
##$SUBNAM9= <"">
##$SW= 20.6817932712277
##$SWIBOX= (0..15)
0 0 3 0 0 0 0 0 0 0 0 0 0 0 0 0 
##$SW_h= 4139.07284768212
##$TD= 32768
##$TD0= 1
##$TE= 0
##$TE2= 300
##$TE3= 300
##$TEG= 300
##$TL= (0..7)
0 120 120 120 120 120 120 120 
##$TP= (0..7)
150 150 150 150 150 150 150 150 
##$TP07= 0
##$TPNAME0= <>
##$TPNAME1= <>
##$TPNAME2= <>
##$TPNAME3= <>
##$TPNAME4= <>
##$TPNAME5= <>
##$TPNAME6= <>
##$TPNAME7= <>
##$TPOAL= (0..7)
0.5 0.5 0.5 0.5 0.5 0.5 0.5 0.5 
##$TPOFFS= (0..7)
0 0 0 0 0 0 0 0 
##$TUNHIN= 0
##$TUNHOUT= 0
##$TUNXOUT= 0
##$USERA1= <user>
##$USERA2= <user>
##$USERA3= <user>
##$USERA4= <user>
##$USERA5= <user>
##$V9= 5
##$VALIST= <valist>
##$VCLIST= <CCCCCCCCCCCCCCC>
##$VD= 0
##$VDLIST= <DDDDDDDDDDDDDDD>
##$VPLIST= <PPPPPPPPPPPPPPP>
##$VTLIST= <TTTTTTTTTTTTTTT>
##$WBST= 1024
##$WBSW= 30
##$XGAIN= (0..3)
0 0 0 0 
##$XL= 0
##$YL= 0
##$YMAX_a= 1053816
##$YMIN_a= -881634
##$ZGOPTNS= <>
##$ZL1= 120
##$ZL2= 120
##$ZL3= 120
##$ZL4= 120
##$ABSF1= 0
##$ABSF2= 0
##$ABSG= 0
##$ABSL= 0
##$ALPHA= 0
##$AQORDER= 0
##$ASSFAC= 0
##$ASSFACI= 0
##$ASSFACX= 0
##$ASSWID= 0
##$AUNMP= <proc_1d>
##$AZFE= 0.1
##$AZFW= 0.1
##$BCFW= 0
##$BC_mod= 2
##$BYTORDP= 0
##$COROFFS= 0
##$CY= 18.4799938201904
##$DATMOD= 1
##$DC= 0
##$DFILT= <>
##$DTYPP= 0
##$F1P= 9.9274215381318
##$F2P= -0.165520771350173
##$FCOR= 1
##$FTSIZE= 16384
##$FT_mod= 6
##$GAMMA= 0
##$GB= 0
##$INTBC= 1
##$INTSCL= 4.127829e-11
##$ISEN= 128
##$LB= 0.05
##$LEV0= 0
##$LPBIN= 0
##$MAXI= 10000
##$MC2= 0
##$MEAN= 0
##$ME_mod= 0
##$MI= 50
##$NCOEF= 0
##$NC_proc= -4
##$NLEV= 6
##$NOISF1= 3.799351
##$NOISF2= 2.8
##$NSP= 0
##$NTH_PI= 0
##$NZP= 0
##$OFFSET= 16.48848
##$PC= 4
##$PHC0= -261.5254
##$PHC1= 1.301534
##$PH_mod= 1
##$PKNL= yes
##$PPARMOD= 0
##$PSCAL= 4
##$PSIGN= 0
##$REVERSE= no
##$SF= 200.130005582386
##$SI= 16384
##$SIGF1= 3
##$SIGF2= 2
##$SINO= 400
##$SIOLD= 16384
##$SREGLST= <1H.CDCl3>
##$SSB= 0
##$STSI= 16384
##$STSR= 0
##$SW_p= 4139.07284768211
##$SYMM= 0
##$S_DEV= 0
##$TDeff= 32768
##$TDoff= 0
##$TI= <>
##$TILT= no
##$TM1= 0
##$TM2= 0
##$TOPLEV= 0
##$USERP1= <user>
##$USERP2= <user>
##$USERP3= <user>
##$USERP4= <user>
##$USERP5= <user>
##$WDW= 1
##$XDIM= 16384
##$YMAX_p= 470717932
##$YMIN_p= -405894
$$ End of Bruker specific parameters
$$ ---------------------------------
##NTUPLES= NMR SPECTRUM
##VAR_NAME=  FREQUENCY,     SPECTRUM/REAL,   SPECTRUM/IMAG
##SYMBOL=    X,             R,               I
##VAR_TYPE=  INDEPENDENT,   DEPENDENT,       DEPENDENT
##VAR_FORM=  AFFN,          ASDF,            ASDF
##VAR_DIM=   16384,         16384,           16384
##UNITS=     HZ,            ARBITRARY UNITS, ARBITRARY UNITS
##FACTOR=    0.252644378177508, 1,           1
##FIRST=     3299.83951724647, 0,            0
##LAST=      -839.233330435636, 0,           0
##MIN=       -839.233330435636, -405894,     0
##MAX=       3299.83951724647, 470717932,    0
$$ Real data points
##PAGE= N=1
##DATA TABLE= (X++(R..R)), XYDATA
$$ [...]
8471h0305j9811Q0991q5222M3132p2r114K3933j8848p8700P3828j0933m315j5382
8458a00818J7051k1506M1526K522r525o663L2371l9431J5919k4337N2811o980
8446d7060O417j8032j516J303j582k7106N0284M476k4456m174L5443m6287r756
8433h2046O7569k5952K2326m9720N8139k0719k6819M9221j0824p150o915m9388
8421h2278N7741k9871o344j8183P0074J4655j0074l6901K9068k5569K1067j5182
8409c1797P1387P294k809l3705N649M5040k45L5865l6410m57K9889J0258J5817
8396A15776J3121O0986K0600j6477k0819M9049l2749K1552M7512j08619O8237
8385B18169j5223j0593j8753l0849P9906m6900l0818Q622j207k1222P309k8686
$$ y = [-80305, -100116, -19125, -104347, -61215, -61287, -70401, -46468, -65316, -144016, -70188, -81121, -85436, -100818, -83767, -105273, -63747, -61225, -70750, -77413, -45042, -84473, -68554, -92891, -40080, -47060, -40643, -58675, -60191, -58888, -60470, -87576, -37292, -32816, -57272, -61446, -26003, -72290, -82046, -14477, -40429, -18103, -67823, -9684, -30403, -57222, -8001, -18825, -25975, -32890, -82278, -24537, -54408, -60752, -78935, -8861, 5794, -4280, -41181, -12113, -37682, -16615, -31797, 39590, 46884, 44075, 10370, 16019, 61059, 60814, 96679, 60269, 59812, 89701, 99959, 115776, 128897, 189883, 210483, 194006, 173187, 222236, 189487, 211039, 258551, 149932, 218169, 202946, 192353, 173600, 142751, 222657, 175757, 144939, 153561, 152354, 131132, 138441, 109755]
8373A09755K1712O957l6689J1039K337L6434k3928j8388Q712K5476M1930J2214
8361A97561o0689N2811o0613L3309l3842P428K3683l0908J043J9936j945r1235
8349E6539K4867J0247j660l1341J9636k3044P762j9026J3623m9246M3617j7628
8337C4346k0278n72M2837r559l3278m9144o233L0373j8704j122L2955l0107N163
8324b3323k1880j0239L4219n6311K6990j3460J6049R066j6143l4186n540M1325
8312e3433q074m366M5124k4601j1691m3662J6024J9529n746K2606J7276L845K5161
8299b008l9323N177j3080j4393K0146m5441P1696L895K397n0688J6220J5244J6475
8286a3683o468j063L163k1155J9552j1968Q066K0652n280L3607j3282l7851J6516
$$ y = [109755, 131467, 138424, 101735, 112774, 115111, 151545, 127617, 109229, 117941, 143417, 185347, 197561, 136872, 189683, 129070, 162379, 128537, 135965, 159648, 128740, 129783, 149719, 147774, 56539, 81406, 91653, 89993, 58652, 78288, 55244, 63006, 43980, 57603, 8357, 51974, 34346, 14068, 13496, 56333, 46774, 13496, -35648, -41881, -11508, -30212, -31334, 1621, -28486, -23323, -45203, -55442, -21223, -77534, -50544, -64004, -47955, -38889, -55032, -89218, -94758, -53433, -61507, -65873, -20749, -45350, -57041, -100703, -84679, -65150, -70896, -48290, -31014, -27169, -2008, -41331, -36154, -49234, -63627, -43481, -88922, -17226, -13331, -10934, -61622, -45402, -30158, -13683, -20151, -21214, -18051, -39206, -19654, -31622, -23556, -2904, -8184, 25423, 12141, -25710, -9194]
8273i194J6164l5897N428K3124k5770N7524K2948n0394L075J0383m736L7324m3483
8260F496k9517P0850m6532P0294j8124N700k1841o7250M5075o6926O9230p2703
8248e5248M936n107O1208k5629j1609K1226k5532J1871l249J7687k3409P36j5868
8235d7987j4147j0731K2472j4318K6072J1836j932j7174j7809J7956k709p399
8223e5870J0716J4601p0596M0967o549l7815P6908j7377K2817k4300P944k7456
8211f6010j2634J1368l1019J7300N5817n7058m889J8964K9680N2131p8340l1713
8199i6403N4438m0591M4966p5986J8768K3943J00090j12526L455l814k1076M6590
8187e8146r3271P8409P8576k1905n1913J8457j1483k9355P5416k4985l2623O1782
$$ y = [-9194, 6970, -28927, -23499, -375, -26145, 31379, 54327, 3933, 7008, 17391, 12655, 49979, 6496, -23021, 47829, 1297, 71591, 53467, 59167, 37326, -29924, 15151, -51775, 17455, -55248, -50312, -55419, 5789, -19840, -31449, -10223, -35755, -23884, -27133, -9446, -32855, -32119, -47987, -62134, -72865, -50393, -64711, -38639, -26803, -28735, -45909, -63718, -45762, -48471, -55870, -45154, -30553, -101149, -60182, -66731, -104546, -27638, -45015, -22198, -46498, -38554, -66010, -78644, -67276, -98295, -80995, -25178, -82236, -87125, -68161, -38481, 13650, -64690, -96403, -41965, -82556, -37590, -113576, -94808, -70865, 29225, -83301, -79846, -83660, -104736, -58146, -151417, -73008, 5568, -16337, -68250, -49793, -61276, -90631, -15215, -40200, -72823, -11041]
8175a1041q3788K4526M6178k6448j3270M3229j9375J4927o484q928m9468K9265
8163f0677L3903L3172o7386Q872N9292m7341K4628l5794n209N8184m9481K0888
8151b6949k87K6045o8201L955O5047l8327M9079l4517r043J4210j3483n629L6730
8138a370l8257L2181k1856k7635M4781M4654m3220n2171R433K6286Q937m0146
8126e8383L6065m6729N0954j2047j4898k9823L9670k294j4900o153J8703l8400
8114g8235m653N611L2411j5080k0335L6501M8443o7497k0715R339k2573K7232
8102f9551J9440l6534M601j647K1637K1641l3321j3025k410J4402K2015l3948
8090h6700m793L9348l7736R936k5423o66K006K3643m4391O2642l1221Q602j5601
$$ y = [-11041, -94829, -70303, -24125, -50573, -63843, -20614, -39989, -25062, -31546, -40474, -89942, -60677, -26774, 6398, -60988, -52116, 7176, -40165, -15537, -51331, -56540, 1644, -47837, -26949, -27236, -1191, -69392, -65437, -390, -38717, 10362, -24155, -33198, -18988, -32471, -38100, -1370, -39627, -7446, -29302, -56937, -12156, 32498, -10722, -62893, -53460, -27174, -18237, -58383, -22318, -69047, -18093, -30140, -45038, -74861, -35191, -37485, -52385, -58538, -39835, -78235, -82888, -77277, -44866, -59946, -80281, -43780, 4663, -62834, -83549, -74210, -96783, -69551, -50111, -86645, -82044, -83691, -62054, -40413, -73734, -86759, -89169, -74767, -52752, -86700, -91493, -52145, -89881, -79945, -105368, -106034, -104028, -80385, -124776, -62134, -93355, -84753, -100354]
8077a00354j1014k2793N7680p803n947k324K6180K1313j3025l3204k2038N1153
8065f2176l5907J0939m1301M464L2057K1284l2177J2130j0627J4753K0671m1123
8053a07013M5156o8682L3252K8614k3876N0599p4491R219J7098K8848L4114p2758
8041i9920j957J7182j2793J5702K0079l3412N657J8021K933k8710J6151k4190
8029a05257O7920r0100J4255P6387l3479m6226J2501K2379J0264J8911l7315j1153
8017a00913K1253K4470j4784k1937j7406J2673Q691J3261N122k4837K5383j9948
8005h8972O677k6106K791L4072l778K2800l5486J6547K3338M906p894l6616m5667
7992a33388J00693n3790n836j4802K4653l973J2259N116k0544J4616l9801J7443
$$ y = [-100354, -111368, -134161, -76481, -84284, -90231, -92555, -66375, -45062, -58087, -91291, -113329, -62176, -98083, -87144, -128445, -123981, -91924, -70640, -102817, -90687, -101314, -86561, -65890, -107013, -61857, -130539, -97287, -68673, -92549, -41950, -116441, -107222, -90124, -61276, -27162, -99920, -101877, -84695, -97488, -81786, -61707, -95119, -89462, -71441, -68508, -97218, -81067, -105257, -37337, -127437, -113182, -36795, -70274, -116500, -103999, -81620, -71356, -52445, -89760, -100913, -79660, -55190, -69974, -91911, -109317, -96644, -87953, -74692, -69570, -94407, -69024, -88972, -82295, -108401, -105610, -71538, -75316, -52516, -88002, -71455, -48117, -43211, -51105, -87721, -133388, -32695, -86485, -92321, -107123, -82470, -86443, -74184, -69068, -89612, -74996, -114797, -97354]
7980i7354K4840j436o7119K2454P6444m2280J0180j7615O096J1192J326L0376
7968d2896j9088m6367k6271P9340j3646r457l1113m4856O6722J6510m0206M1820
7956f9508J6108l9476J1375l0073M8915q1463p916O4077n2260P5228l5438J0137
7944i0294K4167n0885N7575k0160r85q337k5872j8137J6522K9335l4560K4758
7932i6873J0455j391K0735k9454j2943q01L563K1696K5389j0083o1681J2955J6931
7919a01502K8739l9981M9247k5424Q029m2647L1273L7643N546j7045o7647J9975
7907a13794L3543m2746J4639J5884Q803N718m4018M7839k108j5559J7642k5317
7895i9474n2265P3779m8686J8866j755N9904j7809n81n2844O1880k9309o767K7427
$$ y = [-97354, -72514, -73950, -141069, -118615, -42171, -84451, -74271, -91886, -85790, -74598, -73272, -42896, -61984, -108351, -134622, -55282, -68928, -78385, -109498, -154354, -87632, -71122, -111328, -69508, -53400, -92876, -81501, -111574, -62659, -144122, -152038, -87961, -140221, -64993, -100431, -90294, -66127, -117012, -59437, -79597, -80582, -88919, -114791, -132928, -116406, -87071, -121631, -96873, -86418, -87809, -67074, -96528, -109471, -110272, -106709, -85013, -59624, -69707, -131388, -118433, -101502, -72763, -112744, -63497, -88921, -80892, -123539, -92266, -54623, -49077, -66122, -133769, -113794, -80251, -122997, -108358, -92474, -83671, -77953, -121971, -74132, -76240, -91799, -74157, -99474, -151739, -77960, -126646, -107780, -109535, -49631, -67440, -68021, -120865, -58985, -88294, -95061, -67634]
7882f7634k4109P617p635j4346l430l0144L7976J5597k0000j7978K8116l066K5553
7869g3483r648n1674Q2766k6277l3969r612J3874R633N9064l0741l8296K5306
7857h3057P315l6141J0079q3235L05789j84655J0845o9885M7568m7799M5223j5928
7845i3881L7957j7955q330j1240j6657K8748j7848K7353m4114J4725N485N4094
7833d1663o2712K9637m199K2856j8624K338K2173k3962J9198o0032l4043J07292
7821d1741l2549j5016L5201k4673L888N348o5021q663P4619J5965k7819r229m503
7808i4193K9066j8312K0302l2353J9979J9712J5020k1414q853k1284P3653p6592
7796i5269R6689l8447l1527J4541l0894J4853j800q213m560J2221j363M072o69
$$ y = [-67634, -91743, -84126, -91761, -106107, -109537, -139681, -101705, -86108, -106108, -124086, -95970, -99036, -73483, -83131, -134805, -52039, -78316, -112285, -121897, -108023, -98390, -39326, -70067, -108363, -83057, -75742, -111883, -101804, -185039, 120750, -63905, -53060, -122945, -75377, -123176, -77953, -93881, -55924, -73879, -82209, -93449, -110106, -81358, -99206, -71853, -115967, -101242, -95757, -41663, -104375, -74738, -78937, -56081, -74705, -72367, -50194, -74156, -54958, -114990, -149033, -41741, -74290, -89306, -54105, -78778, -74890, -69542, -134563, -143226, -68607, -52642, -80461, -89690, -94193, -65127, -83439, -63137, -95490, -75511, -55799, -40779, -62193, -71046, -92330, -18677, -95269, 1420, -37027, -68554, -54013, -84907, -70054, -71854, -80067, -84627, -72406, -73769, -69697, -70366]
7783g0366J4071J0737p8880N3905J1728K9584l4792l2478N1821j2053j4425O585
7771f4563j7993J0135N3801o4529L6125j8518j5104K3442j9195K1688Q472l1931
7759g8170j8184K9665N587k1667N9099j0497l5800K8600K4410n2667K1251k3198
7747g1571Q861K5331l6129K4533k0127J8626K281k082l5351R385m547K2456K370
7734e5964O637m0569Q33P8393n0451J1330J2308l5905R920O060q581k1099L3776
7721e3312K9241r863k8580J9583l9677J6406M950o668J2109m881j403L534J3908
7708d4653J4965l697L1348m4124J0305M875l8838M365RP224J1122J082k0813j2268
7694g9098L6216j1253R444m5289L7043R805l47K5617m8565n450K8406K2306m7000
$$ y = [-70366, -56295, -45558, -124438, -70533, -58805, -29221, -64013, -96491, -44670, -56723, -71148, -64563, -82556, -72421, -18620, -83149, -47024, -65542, -80646, -57204, -76399, -54711, -46239, -78170, -96354, -66689, -61102, -82769, -23670, -34167, -69967, -41367, -16957, -69624, -48373, -71571, -62710, -37379, -73508, -48975, -69102, -50476, -48195, -50277, -85628, -76243, -80790, -58334, -55964, -49327, -89896, -89063, -10670, -61121, -49791, -37483, -73388, -63468, -57408, -65989, -87088, -53312, -24071, -33934, -62514, -42931, -82608, -66202, -61252, -67920, -55811, -60692, -62095, -58561, -44653, -29688, -33385, -2037, -46161, -35856, -30981, -69819, -65454, -65445, -58221, -47099, -46017, -66830, -79098, -42882, -54135, -44691, -89980, -52937, -43132, -43479, -17862, -66427, -71877, -43471, -21165, -68165]
7681f8165K0908M0877L312l5709Q199J5912n2440L9407k8075J3878j2837P975
7669d6758o341k9888L7707K7300o4257l545L0324K8950l923l49Q252l9000j1416
7656g2944j0435K3383M8267j5568l6051M1509R42l1067N2736l2106l8798O0341
7644i791j9412l2635p146O3593K2416j0938k3902k895j1750m6287K5479P0023
7632A6755j6506m6161l454J1742J2472j0957q667K7092j00533P3324M7715j3698
7620a0876o9656N1237J2738K9216k471r431k5487M3308l875o4904j915K7292k2249
7607d7073N093M312l2768j2065N0844m381R36k1688j4238R9941o753n3797j7229
7594d8866K2831j6689K21L4749Q824J7760m6337K092o511P442M6756n2467k0691
$$ y = [-68165, -47257, -6380, -3068, -38777, -30578, -14666, -67106, -27699, -55774, -41896, -54733, -46758, -53099, -82987, -45280, -17980, -82237, -85782, -55458, -26508, -30431, -30780, -22528, -61528, -72944, -83379, -59996, -11729, -27297, -63348, -21839, -20897, -51964, 772, -31334, -70132, -9791, -29203, -61838, -68984, -5391, 17025, 6087, -17815, -20710, -32460, -78747, -53268, 16755, 249, -45912, -49366, -37624, -25152, -36109, -44776, -17684, -118217, -44893, 2822, -10876, -80532, -29295, -16557, 12659, 10188, 757, -24730, 18578, 14703, -50201, -52116, -24824, -47073, -41980, -37668, -70436, -82501, -31657, -36038, -35102, -56790, -71028, 28913, 22160, -31637, -48866, -26035, -42724, -42503, -7754, 1070, 18830, -27507, -25415, -31926, -24484, 22272, -30195, -50886]
7581e0886j0931J1844n2342J10918j0695k885k0550R3472p2964l2609L2911J7748
7569A3031p2514O6421k3528N5842k6256j6971l730k1711q008R4838m9297j169
7557F948m079l7671K9162K2758k3338M0711j1689l8674M9598n8276L4694j4114
7545c970N523m8000N8331k6621N3652k2346m2183N0460l6414J3092M3385n8698
7533a3789K9118l8901J5906K30L7186o622n4869L6079j100o179j4895M8786l7442
7520f492O512O2466n6894K2259j1615J7946j083k7278j3304K9242k8634K2949
7508A6074M3757k8466p2748O2972j2810J2704K229J0804J2083p7842P6018k5940
7496A8835J8514l0949m1651Q3198j6272m781n2216L8812M0042n2019P2923j00461
$$ y = [-50886, -61817, -49973, -102315, 8603, -2092, -4977, -25527, 67945, -5019, -37628, -4717, 13031, -59483, 6938, -16590, 39252, 12996, -3975, -7705, -29416, -37424, 57414, 8117, 6948, 2869, -34802, -5640, 17118, -6220, 34491, 22802, -15872, 33726, -24550, 10144, -3970, 1553, -46447, 11884, -14737, 38915, 16569, -25614, 24846, -11568, 1524, 44909, -13789, 15329, -23572, -7666, -7436, 29750, 23128, -31741, 4338, 3238, -2941, -17836, 30950, -6492, 20, 62486, 5592, 27851, 16236, 34182, 33099, 5821, -7483, 21759, -6875, 16074, 59831, 31365, -41383, 21589, 8779, 21483, 23712, 34516, 46599, -31243, 44775, 18835, 37349, 6400, -35251, 47947, 31675, 26894, -25322, 13490, 53532, 1513, 74436, -26025]
7484b6025J0189j2124M9227j9019Q479M0557K0407k9144K8248j4261j6118k3262
7472A7154K1891K699l1768L4254J6395l2589N9021k8091J2632k6317l9927K8587
7460C3941M8125J3745k1770O580p8458L3547M202K6186p747j5780m984M5484J5228
7447I8299n4276J2805K7350J0348m8433l9004O4465J989j6441K4239M2414j07553
7435A6202N7202l0534K4029Q703k3600k2387M2004q797K8285J6115n3636N2735
7423A06321R721j0781m958j9507M48K4193j4920L4664m4844j2689J9111P57K8030
7410A15546j7397L8101J8169o8469P2874n5500O0621K7051m9651k488L1340l9764
7398A30433m9180Q9187r010k8502P791l0358M9689j3230l0885P0893m3118k893
$$ y = [-26025, -15836, -27960, 21267, 2248, 10727, 51284, 71691, 42547, 70795, 56534, 40416, 17154, 39045, 41744, 9976, 44230, 60625, 28036, 87057, 58966, 71598, 45281, 5354, 33941, 82066, 95811, 74041, 80621, 2163, 35710, 39912, 66098, 58351, 42571, 37587, 83071, 98299, 44023, 56828, 84178, 94526, 46093, 7089, 71554, 73543, 57102, 81341, 123755, 16202, 73404, 42870, 66899, 75602, 52002, 29615, 71619, 62822, 91107, 107222, 53586, 106321, 116042, 105261, 100303, 80796, 81244, 105437, 90517, 125181, 80337, 67648, 86759, 87516, 115546, 98149, 136250, 154419, 85950, 158824, 103324, 163945, 190996, 141345, 138857, 170197, 130433, 81253, 170440, 161430, 132928, 140719, 110361, 160050, 146820, 115935, 186828, 143710, 140817]
7386A40817L9740j1672J1466p2613L3186O0406n3671k3301J02370j8731k735L7076
7374B42338o3693m165K2348M0930o5974M9229j7275j2206J7573R184L4387j9840
7362B32836k5252Q362J0928J6891l5095j7453M5334N6083l8979L153R471j9038
7350B47241R663J4641j30M68L5681o8925L2904L1845n0824N2369k7490q193k9399
7337B39851L9016K5846M305k8364o221K5452L2820k5333N4007l6822k9716L6335
7325C31176m9207J8018O1074p1568L9667j0704M238l2087j0864N0025n1763J0741
7313B88746J5978K5815N1318n3690K2124q666K05k2442M1177n6301J9543K9535
7301C53342m079J9973j0105j5043N1419k6540k4966l785N9481M1878q1688M9886
$$ y = [140817, 180557, 168885, 180351, 107738, 140924, 201330, 147659, 124358, 226728, 207997, 205262, 242338, 178645, 174480, 196828, 237758, 171784, 221013, 203738, 191532, 209105, 218289, 252676, 232836, 207584, 215946, 226874, 243765, 208670, 191217, 236551, 292634, 253655, 256808, 266279, 247241, 256904, 271545, 271415, 271883, 307564, 238639, 271543, 303388, 252564, 304933, 277443, 269250, 239851, 278867, 304713, 309018, 280654, 274433, 299885, 332705, 307372, 361379, 324557, 294841, 331176, 281969, 299987, 361061, 289493, 329160, 318456, 322694, 290607, 279743, 329768, 278005, 288746, 304724, 330539, 381857, 328167, 350291, 341625, 341830, 319388, 360565, 304264, 323807, 353342, 349263, 369236, 359131, 344088, 395507, 368967, 344001, 340216, 399697, 441575, 359887, 409773]
7289D09773m6218J7370m3750J1622K0044L1736R191Q714J0699m3731M8941K0458
7277D54849l6661l850K8269k3916n214N1837n33K0947m8483L7181j0574j4101
7265D49751N4315k8527M4483j19765R2029k2598J7971M508J1513j3188j7788O0988
7253E33692J4161l9952K6344j9522M2940L700k5420J8052K426K0941J5753J9676
7241F12791l6400o170O2837k9152l704P4257m5581K8543K8698p623k8656J8240
7229F68080Q739j5693M6557j2346o21P820K9271k3748K7041J8216L2387n2588
7217G33115j0651M5843M5833k1150Q647L3903p588j0868l089k0982P1030l0131
7205H33912L5912L725L0327n438n528N5057k5552J4207J128K7184J3614M2032
$$ y = [409773, 363555, 380925, 337175, 348797, 368841, 400577, 409768, 418482, 429181, 385450, 434391, 454849, 418188, 414338, 442607, 418691, 413477, 465314, 464781, 485728, 437245, 474426, 463852, 449751, 504066, 475539, 520022, 400257, 492286, 469688, 487659, 492167, 503680, 490492, 472704, 533692, 547853, 507901, 534245, 514723, 557663, 561363, 535943, 553995, 556421, 577362, 593115, 612791, 576391, 570221, 633058, 603906, 600202, 674459, 628878, 657421, 686119, 678496, 649840, 668080, 676819, 661126, 707683, 695337, 694716, 702536, 731807, 708059, 735100, 753316, 785703, 733115, 722464, 768307, 814140, 792990, 801637, 835540, 827952, 817084, 813995, 793013, 864043, 833912, 869824, 873549, 903876, 898438, 892910, 947967, 922415, 936622, 937750, 964934, 978548, 1020580]
7193A020580M1172K6687m4659J5544K3789R95N5759k8448k88O4114K14J2111K3227
7180A210797K2132L1570j8973P1414n081R4046k8152O2030J2357j8750M1961L1930
7168A507281P741L1016N7806k405L7851L7918M5580J23M7864M4336M4820P0076
7156A930007L93M6618L7868P9098L1255J09117k0017J05949K9250R5299M4932
7145B489769Q6454N8397N5459R3964O3112N2568J04391R8119Q7245O651J48855
7134C344984O5154Q8468J77522R5639J20267J43446J16877J80003J47475J93918
7124D673753J16392K71616J28164K19575J96735K05542J88429K76651K50246K51929
7114F779032K54460K03810K92565K15875J99743J98056K24601J44624K21578J80763
$$ y = [1020580, 1061752, 1088439, 1043780, 1059324, 1083113, 1084108, 1139867, 1111419, 1111131, 1175245, 1175459, 1187570, 1210797, 1232929, 1264499, 1245526, 1316940, 1311859, 1405905, 1377753, 1439783, 1452140, 1433390, 1475351, 1507281, 1515022, 1546038, 1603844, 1601439, 1639290, 1677208, 1722788, 1722911, 1770775, 1815111, 1859931, 1930007, 1930400, 1977018, 2014886, 2093984, 2125239, 2234356, 2214339, 2320288, 2349538, 2444837, 2489769, 2576223, 2634620, 2690079, 2784043, 2847155, 2899723, 3004114, 3102233, 3189478, 3196129, 3344984, 3410138, 3498606, 3676128, 3771767, 3892034, 4035480, 4152357, 4332360, 4479835, 4673753, 4790145, 5061761, 5189925, 5409500, 5606235, 5811777, 6000206, 6276857, 6527103, 6779032, 7033492, 7237302, 7529867, 7745742, 7945485, 8143541, 8368142, 8512766, 8734344, 8915107]
7104H915107J82881J74185J67571O8346J68259J73462J78174K01019K32307J94179
7094A0655490K99590L16552K42648L62183L93440M03884M57103M04447M40874
7085A3976211N19746L82110L68147L70429L08787K34615Q2905L0003j01732j19428
7075A6051793q6780k36980j91763k72020k42577j99200j59500j09107j71046m8036
7065A4334784o0452K6910M6542J03655J71835J29015J66356J90029K60805K94624
7055A5664103J96590J94164J42071O7797l3200j23526j61648k84506l80176m08327
7045A4873342l98124m45111m71439m31246m33335l67930l99783m08727l07044
7036A1210603k38486l43386j74486k50373j96513j49159j42980q7151j54757o6898
$$ y = [8915107, 9097988, 9272173, 9439744, 9508090, 9676349, 9849811, 10027985, 10229004, 10461311, 10655490, 10955080, 11271632, 11514280, 11876463, 12269903, 12673787, 13130890, 13535337, 13976211, 14495957, 14878067, 15246214, 15616643, 15925430, 16160045, 16242950, 16272953, 16171221, 16051793, 15965013, 15728033, 15536270, 15264250, 15021673, 14822473, 14662973, 14553866, 14382820, 14334784, 14274332, 14301242, 14347784, 14451439, 14623274, 14752289, 14918645, 15108674, 15369479, 15664103, 15860693, 16054857, 16196928, 16264725, 16231525, 16107999, 15946351, 15661845, 15281669, 14873342, 14475218, 14030107, 13558668, 13127422, 12694087, 12326157, 11926374, 11517647, 11210603, 10972117, 10628731, 10454245, 10203872, 10007359, 9858200, 9715220, 9628069, 9473312, 9406414]
7026I406414j44057q2647j35751j48211j66521j60028j68013k00666k09945j93928
7016G796647k39699j23911k78871k39352j60590j75968k29544j73110j56927j22665
7006E896010j46117j49778j22471j15161j15248r5460j21007n1144q5944r0133
6996D803547o5322o8369p1584l4510m0132k223k5996p5934N537n7860j3301r956
6984D343897m9499P859p7535J6448n8096m1970n7353l0246m2932k7062K0447l3297
6972C970661m1089K052j7625q4728n096L8259l9598k7029p207l5329M6315o612
6960C792974K3693K627l0135O7578o0848N890P919J6769n1027Q963l6674k0046
6948C727683J3010l4887o7122J0134k5084l4629k7294K3767l745o071k5401J3496
$$ y = [9406414, 9262357, 9179710, 9043959, 8895748, 8729227, 8569199, 8401186, 8200520, 7990575, 7796647, 7556948, 7433037, 7154166, 6914814, 6754224, 6578256, 6348712, 6175602, 6018675, 5896010, 5749893, 5600115, 5477644, 5362483, 5247235, 5151775, 5030768, 4979624, 4893680, 4803547, 4738225, 4669856, 4598272, 4563762, 4523630, 4521407, 4495411, 4419477, 4425014, 4367154, 4353853, 4343897, 4294398, 4302257, 4224722, 4241170, 4183074, 4141104, 4083751, 4053505, 4010573, 3983511, 4003958, 3970661, 3929572, 3931624, 3913999, 3829271, 3824175, 3862434, 3822836, 3795807, 3788600, 3753271, 3799586, 3792974, 3816667, 3819294, 3789159, 3856737, 3795889, 3801779, 3809698, 3826467, 3775440, 3784403, 3747729, 3727683, 3740693, 3705806, 3638684, 3648818, 3623734, 3589105, 3561811, 3585578, 3581833, 3575762, 3550361, 3563857]
6936C563857M560j5025j791R1848q901j1259n1111P1347o772N297K3071L4125
6924C699246n9053O3294M4920n286M0972j24772O7018K1509j1468J4368N096M3495
6912C799339J0614J6604j5614N5470o068K9713O6577n3084J21224r602K4289R450
6900D048912P6073P9276M4297m925O6302N1503L6167L6205N8300P5111J8409N5768
6888D641398R9151N7162L5957O6662O7343P8865L3939J68811R682P8712R0014
6877E427696Q8547M4100J01872Q9552J30492Q6291J10320Q8152J65031N4026J82679
6866F568758J50090R2997K13642J77537J77415J37438K33974K08609K19928K03563
6856H383951K66157K55462L02370K49471L10960L65549K67153L71137M13565K97135
$$ y = [3563857, 3568417, 3553392, 3551601, 3643449, 3634548, 3623289, 3572178, 3643525, 3636753, 3642050, 3665121, 3699246, 3640193, 3703487, 3748407, 3743121, 3784093, 3659321, 3726339, 3747848, 3736380, 3750748, 3755844, 3799339, 3809953, 3826557, 3810943, 3866413, 3860345, 3890058, 3956635, 3903551, 4024775, 4015173, 4039462, 4048912, 4124985, 4204261, 4248558, 4243633, 4309935, 4361438, 4397605, 4433810, 4492110, 4567221, 4585630, 4641398, 4740549, 4797711, 4833668, 4900330, 4967673, 5046538, 5080477, 5249288, 5258970, 5337682, 5427696, 5516243, 5560343, 5662215, 5751767, 5882259, 5968550, 6078870, 6167022, 6332053, 6386079, 6568758, 6718848, 6811845, 7025487, 7203024, 7380439, 7517877, 7751851, 7960460, 8180388, 8383951, 8650108, 8905570, 9207940, 9457411, 9768371, 10133920, 10401073, 10772210, 11185775, 11482910]
6846A1482910M44005M44745M65940M03623N00780N99644N45583O09909P14412
6837A6211551O63098O86998P96354Q07930Q99574R40342R94999J033246J102347
6828B4136439J161519J126990J254406J278562J351107J271010J439029J508412
6820C4527474J583605J662703J884035J936903K186571K424181K621448K868022
6812E1694942L134015L397853L731786M060332M425221M746227N212699N627568
6804H6030643O114556O618050P264562P691175Q133185Q408516Q571054Q299025
6796A47130766P637992O345108M489595K146520m15968k945632n058312o862739
6788A52467330p909834q627065q789833q794011q514870q066808p648599o928725
$$ y = [11482910, 11926915, 12371660, 12837600, 13241223, 13742003, 14341647, 14887230, 15497139, 16211551, 16874649, 17561647, 18358001, 19165931, 20065505, 21005847, 22000846, 23034092, 24136439, 25297958, 26424948, 27679354, 28957916, 30309023, 31580033, 33019062, 34527474, 36111079, 37773782, 39657817, 41594720, 43781291, 46205472, 48826920, 51694942, 54828957, 58226810, 61958596, 66018928, 70444149, 75190376, 80403075, 86030643, 92145199, 98763249, 106027811, 113718986, 121852171, 130260687, 138831741, 147130766, 154768758, 161113866, 165603461, 167749981, 167334013, 164388381, 159330069, 152467330, 144557496, 135930431, 127140598, 118346587, 109831717, 101764909, 94116310, 87187585]
6780H7187585o440322n792310n293735m744769m223516l888589l484427l161905
6772E0158012k898462k572621k384598k256362k026523j980138j883684j688332
6764C2467292j596844j534614j440741j301700j213521j184419j137555r90915
6756B2066983r50115r37736r08906q08389p42124p25053o58871o35982o35166
6747A5064641m98617n87751m70506n25537l99578m67820m23404m14052l51571
6738A0925805l35465l30447l59970k35725l36237k86468k50515k66255j92414
6729H332309k73979k00610j94049j97209j94052k09373j98588j17229j39096k22340
6719F385784j68746j71240n3304j61896k11962r9268j73582o9715j67716j38699
$$ y = [87187585, 80747263, 74954953, 69661218, 64916449, 60692933, 56804344, 53319917, 50158012, 47259550, 44686929, 42302331, 40045969, 38019446, 36039308, 34155624, 32467292, 30870448, 29335834, 27895093, 26593393, 25379872, 24195453, 23057898, 22066983, 21116868, 20179132, 19270226, 18461837, 17719713, 16994660, 16335789, 15699807, 15064641, 14566024, 13978273, 13507767, 12982230, 12582652, 12114832, 11691428, 11277376, 10925805, 10590340, 10259893, 9899923, 9664198, 9327961, 9041493, 8790978, 8524723, 8332309, 8058330, 7857720, 7663671, 7466462, 7272410, 7063037, 6864449, 6747220, 6608124, 6385784, 6217038, 6045798, 5992494, 5830598, 5618636, 5519368, 5345786, 5276071, 5108355, 4969656]
6709D969656j22216q2668j26113o6802j04642j21140j13182j02980o4496r9540
6699C965877p1117j21207o4250p1543r2588n7907q3208l3755r9257p7646k6833
6688C166566q0519p7480p1698m7524k7093r3385k3894j15751m2963k5948q2969
6677B477342m7222J7930p8612o4297k8696o1048k9145m1586l1148l3147k4096
6666B056275m7143p1636K0808p5542o2262k8491L1609l4521l5318j6995k6182
6655A710602j3734k9138l7591l0631m1288n7857M5438j5725k5062o9654J3119
6644A448479n3490K1188q5299J7769l1365p194p1207n32L295L133m0184j422n2925
6631A150246K1987q5299K9158l9303q819l1323J4716m2493k3165k3897K2443n4780
$$ y = [4969656, 4847440, 4764772, 4638659, 4571857, 4467215, 4346075, 4232893, 4129913, 4065417, 3965877, 3894760, 3773553, 3709303, 3637760, 3545172, 3487265, 3404057, 3370302, 3271045, 3193399, 3166566, 3086047, 3008567, 2936869, 2889345, 2862252, 2768867, 2744973, 2629222, 2586259, 2560311, 2477342, 2430120, 2448050, 2369438, 2305141, 2276445, 2215397, 2186252, 2144666, 2113518, 2080371, 2056275, 2009132, 1937496, 1958304, 1882762, 1820500, 1792009, 1823618, 1789097, 1753779, 1736784, 1710602, 1696868, 1667730, 1630139, 1599508, 1558220, 1500363, 1545801, 1530076, 1505014, 1435360, 1448479, 1394989, 1416177, 1330878, 1348647, 1317282, 1310088, 1238881, 1238349, 1241644, 1244777, 1204593, 1203171, 1150246, 1172233, 1086934, 1116092, 1076789, 1067970, 1036647, 1051363, 1008870, 985705, 961808, 984251, 929471]
6619I29471K6018m2930r675J2682l6147k5589R178M9895l0086o1317k3791O2198
6607H59907n4627o58j4382J1751o586n0695J6423k5551l571J0613j5188K8863
6595G56299l8232l7520N3396m513n4151O326J5057L926o1560J7583j2488j0465
6583F33658P2n4356L7966l160J1612K9356q1656K0380J43k550o8595N6493l786
6570E75577o282k8106J5370J301l4647J4391n4183K3518m2244J3976K8805l7756
6558D69720J7671J2341o9157J2565K4072J8920m5233o597J7193K298l303l9413
6546D11077O514L427n047M6189p2182K4821k0288k83k5364K233K4659j351n402
6533C89003J9247p2856L5975J781P826o864k8269Q698j566K8462n5774N9319n0046
$$ y = [929471, 955489, 912559, 902884, 915566, 879419, 853830, 863008, 912903, 882817, 821500, 797709, 859907, 805280, 804622, 790240, 801991, 795405, 744710, 761133, 735582, 732011, 742624, 727436, 756299, 718067, 680547, 733943, 729430, 675279, 681605, 696662, 700588, 639028, 656611, 644123, 633658, 633730, 579374, 617340, 614180, 625792, 655148, 573492, 593872, 594015, 591465, 522870, 579363, 575577, 569295, 541189, 556559, 557860, 523213, 537604, 483421, 506939, 464695, 478671, 507476, 469720, 487391, 499732, 430575, 443140, 467212, 486132, 440899, 434302, 451495, 453793, 450490, 411077, 417591, 421018, 415971, 462160, 389978, 414799, 394511, 394228, 368864, 371097, 395756, 394405, 389003, 408250, 335394, 371369, 373150, 380976, 374112, 345843, 354541, 352975, 381437, 325663, 384982, 334936]
6520C34936J3252J860m8428O6910m6456m8957M0059o723J0626J2886k0990J1528
6508C20503K013M4076o2676k8727K8612J1496o3936K0672L3864J4753r537l0146
6496B80967M2656l3849J7044k3497J4484L377j3081l2925M333L3608m1110M9591
6484C01598Q258n9399j4324M8284j3899k3602K7614k9978M3631m332R039j6310
6472B76580p5392K1703k06M3657l1239R357k4832m1374O7703R493l7664k0263
6460A97523K7421k3793J6546m8823O1638k5170J7215k513J6486l3858l0362L6262
6448B08572K068P2814j07972K6354L6263p8072J17726n4000Q079l5659K0463j8800
6436A97836K2387l3544L4767o840l3167Q6673k0021m1719k0404L915J672j4806
$$ y = [334936, 348188, 350048, 301620, 368530, 322074, 273117, 313176, 306453, 317079, 329965, 308975, 320503, 322516, 366592, 303916, 275189, 303801, 315297, 251361, 272033, 305897, 320650, 311113, 280967, 323623, 289774, 306818, 283321, 297805, 301182, 288101, 255176, 259509, 293117, 252007, 301598, 309856, 250457, 236133, 284417, 270518, 246916, 274530, 244552, 288183, 283851, 292890, 276580, 201188, 222891, 222685, 266342, 235103, 244460, 219628, 178254, 245957, 255450, 217786, 197523, 224944, 201151, 217697, 168874, 230512, 205342, 222557, 220044, 236530, 202672, 172310, 208572, 210640, 283454, 175482, 201836, 238099, 160027, 277753, 223753, 231832, 196173, 216636, 197836, 220223, 186679, 221446, 214606, 181439, 268112, 248091, 206372, 185968, 189883, 191555, 176749]
6424A76749p405K2677j9396K8420j4146R645J7575n2646L6902O030J2961j7635
6412A99731P1626j335J2004m5308L5016k336n565M7703p2233L5413o0957L7346
6400B51105n1522P3568n9086o61j0789j2131o1180N7505j8805L8902j6398Q79
6388A91387M5904m2447o288Q2677n5616K8302K7854k2260o771M9746l9714J3557
6376B66331k0102j742K4555q0498L9259m5320l064m0591K4740K9727k7118k2444
6364A43733N5436n6789M150M7942m0446J1222j1693L5401o7812K1405M5307l4679
6352A53177J3417K6217k1718R98j3678N1811n7869l492L0057l7463J6733j2382
6340A45808L6376n7482r227L3951k1797K2085m3444K5199j5359K6125J3612j6087
$$ y = [176749, 169344, 192021, 172625, 201045, 186899, 196544, 214119, 161473, 198375, 204405, 217366, 199731, 271357, 270022, 282026, 236718, 271734, 269398, 263833, 311536, 239303, 274716, 213759, 251105, 199583, 273151, 214065, 213404, 202615, 190484, 129304, 186809, 168004, 206906, 190508, 191387, 237291, 194844, 188556, 271233, 215617, 243919, 271773, 249513, 242742, 292488, 252774, 266331, 246229, 244487, 269042, 188544, 227803, 182483, 179419, 138828, 163568, 193295, 166177, 143733, 199169, 142380, 146530, 194472, 154026, 165248, 153555, 188956, 121144, 142549, 187856, 153177, 166594, 192811, 171093, 172091, 158413, 210224, 152355, 148863, 178920, 141457, 158190, 145808, 182184, 124702, 115475, 149426, 127629, 149714, 106270, 131469, 116110, 142235, 155847, 139760]
6328A39760K794j7249K5930q304L186k5123K4400j6583N8113m455K723m2982n041
6315A37169J4648m5451O7631k3228J1879J2784M7123q0559j383r339J6915J4246
6303A62435J4667l6018P224M9758p00l3587m159K0610M1853n2383L6294l2780
6291A73214O5444m2367k1153J1172o634k6331Q314J6383k0242j5671M9107k5186
6279A66050j8243J7016Q837j0376J5202L5781r1210Q8806n4797J5042J8639J1733
6267B02480k2934L5067n100k2940q25k1738J4646L754q0823O3491O465k3525o4518
6254H3500O9992l9350j518j4154L1976l1536L6855L563K5830q4153L7103j6313
6242A01795M292N2381J1370l8737J4936K5718k3689l7253m583O5601m2496m7338
$$ y = [139760, 142554, 125305, 151235, 142931, 146117, 120994, 145394, 128811, 186924, 182469, 185192, 142210, 137169, 151817, 106366, 173997, 150769, 162648, 175432, 222555, 141996, 140613, 131274, 148189, 162435, 177102, 141084, 148308, 198066, 197366, 163779, 159620, 180230, 222083, 169700, 205994, 173214, 238658, 196291, 175138, 186310, 179676, 153345, 161659, 178042, 157800, 142129, 191236, 166050, 147807, 164823, 173660, 163284, 178486, 214267, 123057, 211863, 157066, 172108, 190747, 202480, 179546, 214613, 209513, 186573, 185748, 164010, 178656, 182410, 101587, 165078, 171543, 148018, 83500, 153492, 114142, 112624, 98470, 130446, 98910, 135765, 139328, 165158, 81005, 118108, 101795, 106087, 158468, 169838, 131101, 146037, 171755, 148066, 110813, 106230, 171831, 129335, 81997]
6230H1997J9985j071L4397l9443R412N801m3199N7227k9638L0101m1047K6985
6218A11507l0731J6687N541k730J6106k4646P648l4433O4655l1745J1862J842
6206A11563l5533N0393n1280K2526j9406K0746m9365L4194K2207j7239k2660M0789
6194A06935P815l7860J9771j774K2431n0067o760N5826m5373J1002J969L5940
6182A19855j6687l9783K7032O196j0606R420N5170j2410j1926j9773n0187J9828
6170G6129L4695k3856j3558L1129j0144q847M275K1300n5515J8044L9563K8681
6158A41896n5089J924j8255J7451j3285J3057j0343j0642O4999q155J4780l2077
6146A06261N350P210r493k097K8287l6624J3784j4230L1781j0077r340K5994k9963
$$ y = [81997, 101982, 100911, 135308, 95865, 105277, 111078, 67879, 125106, 95468, 125569, 84522, 111507, 80776, 97463, 103004, 100274, 116380, 91734, 99382, 64949, 129604, 97859, 109721, 111563, 76030, 126423, 75143, 97669, 78263, 99009, 49644, 83838, 106045, 88806, 66146, 106935, 114750, 76890, 96661, 94887, 117318, 67251, 60491, 116317, 70944, 81946, 83915, 119855, 103168, 63385, 90417, 96613, 86007, 95427, 150597, 138187, 126261, 106488, 56301, 76129, 110824, 86968, 73410, 104539, 94395, 85548, 89823, 111123, 55608, 73652, 113215, 141896, 86807, 88731, 70476, 87927, 74642, 87699, 77356, 66714, 131713, 123558, 138338, 106261, 111611, 118821, 109328, 107231, 135518, 98894, 112678, 98448, 130229, 120152, 110812, 136806, 106843]
6133A06843J8148l2887K1523k2357J5082K2998k0164j5477j0963M1886l6984L8142
6121A25790m2888J3105N338m336M8038m386k0942J9361l7534K0169m759K2517
6109A39473q033k4915J0650J6598J079N039l6817J7878k1144P3421k0915o9108
6097H3206Q4659j7208j8532p091K0635q101M6297l2688k9777j8552O1219m1798
6085A22269M2587k5064p230K8753l3042L4522j8783J5007k3381K2036n1169K4072
6073A30577J8317l3138N0755n5651R1881J262j4292m4841l4505R4250J4942n5281
6061A64276k2464K1614M0027o1559J0342L2145k7968M884m605J7484O2590m4550
6049A92216k3534J4660j9531N3703L9268o1861K4146l4556L0545L1262m2137M0718
$$ y = [106843, 124991, 92104, 113627, 91270, 106352, 129350, 109186, 93709, 82746, 124632, 87648, 125790, 82902, 96007, 101345, 97009, 145047, 140661, 119719, 139080, 101546, 121715, 116956, 139473, 131440, 106525, 117175, 133773, 134852, 139891, 103074, 120952, 99808, 173229, 152314, 83206, 167865, 150657, 132125, 125034, 145669, 137568, 183865, 151177, 121400, 102848, 164067, 122269, 164856, 139792, 132562, 161315, 128273, 162795, 144012, 159019, 135638, 157674, 106505, 130577, 148894, 115756, 166511, 110860, 202741, 204003, 189711, 144870, 110365, 204615, 219557, 164276, 141812, 163426, 203453, 141894, 152236, 184381, 156413, 161297, 156692, 174176, 236766, 192216, 168682, 183342, 163811, 217514, 256782, 194921, 219067, 184511, 215056, 246318, 204181, 244899]
6037B44899k2075N628k8461q287L1483m4848J8791N236L8877l4985R87J6123j7630
6024B05738O0035m3387J4018j6542j5592J2019N191M878l7227M3115K498J2730
6012B47474P183m2617k671j6174j7947N1058n1548K2568r953K5415j3583K7936
6000B27141J9103k7714j8294Q493K4450L1585q423j7140k7878J0634K196p514
5988B16639l361K7790l3579N099l812J9792K1692m0665N9105m3041K4703N891
5976B56253j625j9547p237r051L5270n3139P9658k6363m5134L3414J7703l3001
5964B27201K251J0174L8378j2093M608k5007K1766j7929J018P02J3810J167L638
5951B69684k0925J3788N6570m1786m4733N3967k3698M0814n8763N2353O822k1911
$$ y = [244899, 222824, 228452, 199991, 191704, 223187, 178339, 197130, 202366, 241243, 206258, 207245, 223368, 205738, 265773, 222386, 236404, 219862, 204270, 216289, 221480, 226358, 189131, 232246, 234744, 247474, 254657, 212040, 209369, 193195, 175248, 226306, 174758, 197326, 187373, 212788, 199205, 227141, 246244, 218530, 200236, 208729, 233179, 264764, 256341, 239201, 211323, 221957, 224153, 216639, 213278, 241068, 207489, 212588, 208776, 228568, 250260, 209595, 268700, 225659, 250362, 256253, 254628, 235081, 227844, 218793, 254063, 200924, 280582, 254219, 209085, 242499, 260202, 227201, 229452, 239626, 278004, 265911, 270519, 245512, 267278, 249349, 250367, 251069, 264879, 266046, 269684, 248759, 262547, 319117, 277331, 232598, 286565, 262867, 303681, 244918, 297271, 304093, 282182]
5939B82182M1652l3775J6629n1709O3077k4881n739J2005j8953k235L5097R275
5927C22625l8631K5157M6777m5006R431j4335K0694r906J3274J7946l1675k6457
5915B89894J3147K0371K4398M8971o3889L5317j567K2183p4602K3692R828r330
5903C38413M253P8621n4234n7694M2727O9922j9752p708j1651j6042J1711j2251
5891C66315j9647M4897M4574k7024M3916j9207n3065P2054m7638K0522k7664Q384
5879D06417O4849j1740k1942K5406l473Q361m5466O4374L2118n0524N117Q698
5867D82195K4262j6778k3616K6667P393K3212j8061J7669Q001j8913L6019j7705
5855E30345M9501J7608n1102P0469n4693O7781m7062J3243j8272N3118K1809Q442
$$ y = [282182, 323834, 290059, 306688, 254979, 318056, 293175, 287436, 299441, 280488, 278253, 313350, 322625, 283994, 309151, 355928, 310922, 320353, 306018, 326712, 316806, 330080, 348026, 316351, 289894, 303041, 323412, 347810, 396781, 332892, 368209, 366642, 388825, 314223, 337915, 347743, 338413, 342666, 421287, 367053, 309359, 352086, 422008, 402256, 394548, 382897, 366855, 378566, 366315, 346668, 391565, 436139, 409115, 453031, 433824, 380759, 452813, 405175, 425697, 398033, 406417, 471266, 459526, 437584, 462990, 459517, 467878, 422412, 486786, 518904, 468380, 473497, 482195, 506457, 489679, 466063, 492730, 500123, 523335, 505274, 522943, 530944, 512031, 548050, 530345, 579846, 597454, 546352, 616821, 562128, 629909, 582847, 596090, 577818, 630936, 652745, 661187]
5843F61187j003m2958P6554j5089J9650j5397K6361r458Q7811m1723k9004K8181
5831G45112Q3514j0414M9991J9099m98K239N470J9604L4481K8092M2097N5550
5819A074337n850K8081J5116L8562L8021L4430O0715N46P5085J7943P7798K8092
5807A482876O2831L0478Q4439J08814J18023O9582R8262J08797J51994L7682J98434
5796B552212J33889J58394J53644J32677Q2774J15960N5379Q8626k8815l3913
5786C410827l7592k342j8395P289M949M0287K4668R5235L4847J38017J16543J19894
5774C934227J67493J72562K76736J62175K60556L08095L63209L22854M49631K79241
5764F696779L49235K38738J75584M2188o5637j93935j93956l23891j90634l22691
$$ y = [661187, 660184, 617226, 693780, 678691, 698341, 682944, 709305, 699847, 787658, 745935, 716931, 745112, 828626, 818212, 868203, 887302, 886804, 889043, 894513, 914117, 948598, 976690, 1018787, 1074337, 1068487, 1096568, 1111684, 1150246, 1188267, 1222697, 1283412, 1283958, 1359043, 1376986, 1454784, 1482876, 1545707, 1576185, 1660624, 1769438, 1887461, 1957043, 2055305, 2164102, 2316096, 2353778, 2552212, 2686101, 2844495, 2998139, 3130816, 3213590, 3329550, 3384929, 3473555, 3444740, 3410827, 3373235, 3370893, 3352498, 3359787, 3364736, 3405023, 3429691, 3524926, 3559773, 3697790, 3814333, 3934227, 4101720, 4274282, 4551018, 4713193, 4973749, 5281844, 5645053, 5967907, 6417538, 6696779, 7046014, 7284752, 7460336, 7502524, 7436887, 7242952, 7048996, 6725105, 6534471, 6211780]
5754F211780j46306j98278j51262j15831r6385m3570p3610L9352L5582M5387R8304
5743E605163J20398R7453J73457K26354L09926K17098L00507K75558L08538R8299
5733G732751J38463l4963j48996k79744k56390l94894l44266l04744l21027l20819
5723E465371k19482k28352k06413r3796j53114j01531j31686j13267r8810l4534
5713D084386l6613j7414l6366P624K0381M8360K0279J0616K6973n2820k9854j40639
5701C904913j27376j45235j40919j58471j20975j19320j46926r6424j19169o4198
5691B665900o5240j19773l8880l6281p0847r0532n3165k5014n5041l7251k5877
5680B047999q4555j0074p7456o703n331Q650K4541j3114m2242m8574J5608m9981
$$ y = [6211780, 6065474, 5867196, 5715934, 5600103, 5503718, 5460148, 5386538, 5425890, 5461472, 5506859, 5605163, 5725561, 5823014, 5996471, 6222825, 6532751, 6749849, 7050356, 7325914, 7634452, 7732751, 7871214, 7836251, 7687255, 7407511, 7151121, 6756227, 6411961, 6107217, 5786190, 5465371, 5245889, 5017537, 4811124, 4717328, 4564214, 4462683, 4330997, 4217730, 4118920, 4084386, 4047773, 4030359, 3993993, 4001617, 4021998, 4070358, 4090637, 4101253, 4128226, 4075406, 4045552, 3904913, 3777537, 3632302, 3491383, 3332912, 3211937, 3092617, 2945691, 2849267, 2730098, 2665900, 2600660, 2480887, 2442007, 2405726, 2334879, 2244347, 2191182, 2166168, 2111127, 2073876, 2047999, 1963444, 1953370, 1875914, 1869211, 1863880, 1872530, 1897071, 1883957, 1841715, 1793141, 1808749, 1758768]
5668A758768j1665O954j7836J5567j5581M1746l8243m675K0263n2850L7393J8368
5656A758209k6625k9723N3712m4890K0614j2952P0107q4195M0302Q789J9151o120
5644A766379O747j4062k9878O9339j6385k2349K2653M0819l5961K5698K5597J7143
5632A855740j7571J5943L7204Q848O661j042K5582R4002J7366n2717M7152m276
5620B032892O3400J0637P1861K1993L3585m5617O0171N8272k5887P7027J6935
5609B375269J6771R5898l522N6821N8379P326L4206L6380O7745J31072L079L2076
5597B911500J17212O9710J24087O4321P7120M4171J38291P4278J58379P1811J49286
5586D000166J39982Q8154J46508J58634R3588J14372J72105J19566J07230J16342
$$ y = [1758768, 1747103, 1754057, 1736221, 1751788, 1736207, 1777953, 1739710, 1735035, 1755298, 1702448, 1739841, 1758209, 1731584, 1701861, 1755573, 1710683, 1731297, 1718345, 1788452, 1704257, 1744559, 1753348, 1772499, 1766379, 1773126, 1759064, 1729186, 1798525, 1782140, 1759791, 1782444, 1823263, 1787302, 1813000, 1838597, 1855740, 1838169, 1854112, 1891316, 1900164, 1906825, 1905783, 1931365, 2025367, 2042733, 1990016, 2037168, 2032892, 2096292, 2106929, 2178790, 2200783, 2234368, 2188751, 2248922, 2307194, 2281307, 2358334, 2375269, 2392040, 2487938, 2484416, 2541237, 2599616, 2606942, 2641148, 2677528, 2745273, 2876345, 2879424, 2911500, 3028712, 3098422, 3222509, 3286830, 3363950, 3408121, 3546412, 3620690, 3779069, 3850880, 4000166, 4140148, 4228302, 4374810, 4533444, 4627032, 4741404, 4913509, 5033075, 5140305, 5256647]
5576E256647J53058J61960L3861O4552O9532P5268Q1878K2649L7780P6029o6986
5565E966228k6130K8249q3714j16664k0296p0810p1163r1184n5991j31065n2519
5554E274941j23369o2554j85067m3535n8260p7076n9232j36631j4681r3333k5558
5543D395645N895p8546l5361L3761j7162n1083l701k3701J3430N2922M102n5958
5531D240243L8007J0247K1030K2554P3677J307L6935O4344k2558j034O4954M0652
5519D590358J2567M2771j7921P6189N4187N0617j0812O1573O6041O2862L5130
5508E023562N0891P9576M003O5047M187K7567M4391N4369J06080M9061P4017J6102
5496E598853J1868J16727N2919K8028M0204L379J22439N7491K768O5295P3901
$$ y = [5256647, 5409705, 5571665, 5605526, 5670078, 5739610, 5814878, 5896756, 5919405, 5957185, 6033214, 5966228, 5940098, 5968347, 5884633, 5767969, 5747673, 5676863, 5605700, 5514516, 5458525, 5327460, 5274941, 5151572, 5089018, 4903951, 4860416, 4802156, 4725080, 4665848, 4529217, 4514536, 4421203, 4395645, 4401540, 4322994, 4287633, 4321394, 4304232, 4253149, 4249448, 4225747, 4239177, 4292099, 4296201, 4240243, 4278250, 4288497, 4309527, 4332081, 4405758, 4407065, 4444000, 4508344, 4485786, 4484752, 4549706, 4590358, 4602925, 4645696, 4627775, 4703964, 4758151, 4808768, 4797956, 4859529, 4925570, 4988432, 5023562, 5074453, 5154029, 5158032, 5223079, 5227266, 5254833, 5299224, 5353593, 5459673, 5508734, 5582751, 5598853, 5610721, 5727448, 5780367, 5808395, 5848599, 5851978, 5974417, 6031908, 6034676, 6099971, 6173872]
5485F173872M7684J1870R5749N0998Q9983L0124N1105N1244N7663O1398J6879
5474F738569R9363L9435J1651J7517J08887m587R2548N8130K593N0675J20636
5463G335417L9450l961L0308N7512N5041J19411L7071M0145j5744J15780M4869
5452G855299L9068J05550N3066L9516R2026L4638J07406N2143J07444N6593L3285
5441H576034P7061J03256M9166N7261J11644L9690J02684Q9938M8029J01975P0939
5430I427677J19475M3634P8502J18691N5127J01037J18776R9076J57124Q0556
5420A0399675N3651J22486J37046Q2777R0200J32814J00542Q8871J30503J54768
5410A1493333R7030J31855J47119J20852J64355J48286J38021J30668J73420K14586
$$ y = [6173872, 6221556, 6233426, 6329175, 6380173, 6470156, 6500280, 6551385, 6602629, 6660292, 6721690, 6738569, 6837932, 6877367, 6889018, 6906535, 7015422, 7010835, 7103383, 7161513, 7164106, 7214781, 7335417, 7374867, 7370906, 7401214, 7458726, 7513767, 7633178, 7670249, 7710394, 7694650, 7810430, 7855299, 7894367, 7999917, 8052983, 8092499, 8184525, 8219163, 8326569, 8378712, 8486156, 8542749, 8576034, 8653095, 8756351, 8805517, 8862778, 8974422, 9014112, 9116796, 9206734, 9254763, 9356738, 9427677, 9547152, 9590786, 9669288, 9787979, 9843106, 9944143, 10062919, 10161995, 10319119, 10399675, 10453326, 10575812, 10712858, 10795635, 10885835, 11018649, 11119191, 11208062, 11338565, 11493333, 11590363, 11722218, 11869337, 11990189, 12154544, 12302830, 12440851, 12571519, 12744939, 12959525]
5400A2959525J17123J81227J70980J47654K01598J82285J70857K25698J94871
5391A4551818J35382K62804K32842K25867J95150K99024K59325K54503K71229
5382A6687944L24141L01114L18626L32387L10878M17770L88771M40625M28030
5373A9950286M69746M41949N30547N51702N25778O22466O41566P15619P62004
5364B5211663P69803P91716Q26787R30094R98206J025896J091517J194896J215277
5355C4055855J337443J365585J519329J560098J670158J817893J823849K003512
5347D7153722K008595K207564K319151K500076K620241K721611K955109L101228
5339F7587297L203060L479508L736245L979873M231047M532401M851438N233227
$$ y = [12959525, 13076648, 13257875, 13428855, 13576509, 13778107, 13960392, 14131249, 14356947, 14551818, 14687200, 14950004, 15182846, 15408713, 15603863, 15902887, 16162212, 16416715, 16687944, 17012085, 17313199, 17631825, 17964212, 18275090, 18692860, 19081631, 19522256, 19950286, 20420032, 20861981, 21392528, 21944230, 22470008, 23092474, 23734040, 24449659, 25211663, 25981466, 26773182, 27599969, 28530063, 29528269, 30554165, 31645682, 32840578, 34055855, 35393298, 36758883, 38278212, 39838310, 41508468, 43326361, 45150210, 47153722, 49162317, 51369881, 53689032, 56189108, 58809349, 61530960, 64486069, 67587297, 70790357, 74269865, 78006110, 81985983, 86217030, 90749431, 95600869, 100834096]
5331A00834096N594381O150097O670498P368207P834469Q439087R017809R776361
5323A61685005J0714323J1718936J2604974J3329236J3738794J3998065J4441465
5316B52230798J5141087J6144538J6865647J7096529J6652157J5807275J5054243
5309C64992274J4831794J4772699J4907889J4250266J2620812J0243650P771703
5302D54391087N838631M516762L531042K218618K21792k666168n730196q284974
5294D54036594j0113986j1045792j1817369j2774723j4150027j5814839j7157124
5287C61162734j8046153j8355608j8148227j7622122j7375482j7173977j6993104
5280B37448061j6675057j6072273j5217388j4103172j2923444j1737209j0616238
$$ y = [100834096, 106428477, 112578574, 119249072, 126617279, 134451748, 142890835, 151908644, 161685005, 172399328, 184118264, 196723238, 210052474, 223791268, 237789333, 252230798, 267371885, 283516423, 300382070, 317478599, 334130756, 349938031, 364992274, 379824068, 394596767, 409504656, 423754922, 436375734, 446619384, 454391087, 460229718, 464746480, 468277522, 470496140, 470717932, 468051764, 462321568, 454036594, 443922608, 432876816, 421059447, 408284724, 394134697, 378319858, 361162734, 343116581, 324760973, 306612746, 288990624, 271615142, 254441165, 237448061, 220773004, 204700731, 189483343, 175380171, 162456727, 150719518, 140103280]
5273A40103280r562905q632973p853628p147194o477167n850468n362399m903872
5265H4312674m444135m106647l785500l626561l332787l107840k888274k742878
5257E6278052k553039k403799k267758k136305k021120j865512j785205j686914
5249C9558400j493148j466641j360370j385399j201631j145344j139786r90657
5241B9375424j006189r37654q79289q24188p66985p69134p30909o34390o91055
5232B2135631n88347n74203n72112n56761n63352m64906m74239n06904m49406
5223A7385401m19955m17971l96823m00252l89027l98447m03469l34811k90223
5214A3934423l25182l68172l06993l23224k87791k66819l44567k75940k52823
$$ y = [140103280, 130540375, 121907402, 114053774, 106906580, 100429413, 94578945, 89216546, 84312674, 79868539, 75761892, 71976392, 68349831, 65017044, 61909204, 59020930, 56278052, 53725013, 51321214, 49053456, 46917151, 44896031, 43030519, 41245314, 39558400, 38065252, 36598611, 35238241, 33852842, 32651211, 31505867, 30366081, 29375424, 28369235, 27431581, 26552292, 25728104, 24961119, 24191985, 23461076, 22826686, 22135631, 21547284, 20973081, 20400969, 19844208, 19280856, 18815950, 18341711, 17834807, 17385401, 16965446, 16547475, 16150652, 15750400, 15361373, 14962926, 14559457, 14224646, 13934423, 13609241, 13241069, 12934076, 12610852, 12323061, 12056242, 11711675, 11435735, 11182912]
5205A1182912k73784k22189k59634k42257k57644k17857k41409k19721j39988
5196I108429k53921j78336k10890j89369j56260j49318j74909k03755j37642j83440
5186G270589j86463j33487j75556j84095n4132j65980j60511q0627j59545r7061
5176E873132j00996j11918j14370j25826q8521j66353r7710m3577j11872j13537
5166D798452n0123r5395r0813r2205k4915r2405o2203r5812o1722n4488o1189
5155D017182q0904o8490o4661o6833q4899k4794j12878n4833q7424m468j10838
5144C256160n7772n1244p6029p5757p9633K3870j37431j6185q2929K2571j00340
5133B625281k9492o6297p1291l6972k8873q4153J820M4407j35337n3578L4050
$$ y = [11182912, 10909128, 10686939, 10427305, 10185048, 9927404, 9709547, 9468138, 9248417, 9108429, 8854508, 8676172, 8465282, 8275913, 8119653, 7970335, 7795426, 7591671, 7454029, 7270589, 7084126, 6950639, 6775083, 6590988, 6536856, 6370876, 6210365, 6129738, 5970193, 5873132, 5772136, 5660218, 5545848, 5420022, 5331501, 5165148, 5067438, 5023861, 4911989, 4798452, 4748329, 4652934, 4562121, 4469916, 4445001, 4352596, 4290393, 4194581, 4132859, 4078371, 4017182, 3936278, 3867788, 3803127, 3736294, 3651395, 3626601, 3513723, 3458890, 3371466, 3366998, 3256160, 3198388, 3147144, 3071115, 2995358, 2915725, 2939595, 2802164, 2785979, 2703050, 2725621, 2625281, 2595789, 2529492, 2458201, 2421229, 2392356, 2308203, 2310023, 2354430, 2219093, 2165515, 2199565]
5122B199565r5587l1003L2166j17471K0340N468q2187l5996m8564q798J0428m9716
5110A798645r791n5831O0003p8084R010l8289j4880l764j8801o3361l2207O3795
5098A616445m5807k0498k6386l4369R538n4459J0750L8010K359r3556M8899m4169
5086A406757J3051Q510k5873l3114J3089j9196l8770K5990K3972m7808J4623j4908
5074A326323l3441L4971J5482L165k9756J0084L6646J4110l9628L7755p343M0884
5062A409252n1668J8530P3863O319M60N9685O56K3075J07314j4699O6677L9516
5050A738980N2843N5645O6349J16969P2295M1738J04793P6145J28316Q6871J26752
5039B667696Q3186J59345J01228N2850O1155J17539J51126J7316N1890N6695M9221
$$ y = [2199565, 2103978, 2072975, 2105141, 1987670, 2008010, 2013478, 1931291, 1895295, 1846731, 1837933, 1848361, 1798645, 1788854, 1733023, 1793026, 1714942, 1723952, 1685663, 1670783, 1667019, 1648218, 1584857, 1552650, 1616445, 1570638, 1550140, 1523754, 1489385, 1498923, 1444464, 1455214, 1493224, 1495583, 1402027, 1450926, 1406757, 1419808, 1428318, 1402445, 1369331, 1382420, 1363224, 1324454, 1350444, 1374416, 1326608, 1341231, 1326323, 1292882, 1327853, 1343335, 1346500, 1316744, 1326828, 1363474, 1377584, 1337956, 1375711, 1368368, 1409252, 1357584, 1376114, 1449977, 1456296, 1456756, 1516441, 1517097, 1540172, 1647486, 1632787, 1699464, 1738980, 1791823, 1847468, 1913817, 2030786, 2103081, 2144819, 2249612, 2325757, 2454073, 2540944, 2667696, 2750882, 2910227, 3011455, 3064305, 3125460, 3242999, 3394125, 3411441, 3463331, 3520026, 3569247]
5028C569247N7171K6634J4721k73p0941L8434j40841l2596n9282j20421r0683
5017C191170r7672j50814j22534j24310j01288j23905j29966j74335p0707r1006
5007B004633j58292j18645o6744r5129j37445j8579j30141k8476j05700j3052
4997A132430r3841l2200l8270q2640r849k5624m0449j2994k8683k7727l140r5903
4985F41110j2873j982l1320K2661l2448j8798q714m6081n7322L5871n114l3259
4973D51731k377L4662k4302m0655q209K6675l9765J0830L382q2135N9612J9244
4961D08693j01288R215J7379o563j3463l7781J2670K8635p5721L2101k1085j8697
4949B34095m641q507J579N797K7297l0692o9539K2853j2011m0007M1662K6325
$$ y = [3569247, 3626418, 3653052, 3667773, 3667500, 3596559, 3634993, 3494152, 3461556, 3402274, 3281853, 3191170, 3093498, 2942684, 2820150, 2695840, 2594552, 2470647, 2340681, 2166346, 2095639, 2004633, 1846341, 1727696, 1660952, 1565823, 1428378, 1409799, 1279658, 1251182, 1145482, 1132430, 1038589, 1006389, 968119, 885479, 875630, 850006, 809557, 796563, 767880, 740153, 737013, 641110, 628237, 626255, 594935, 617596, 585148, 566350, 557636, 511555, 454233, 490104, 484990, 451731, 449354, 484016, 459714, 419059, 410850, 437525, 397760, 408590, 411972, 329837, 389449, 408693, 307405, 316620, 333999, 327436, 313973, 276192, 288862, 317497, 241776, 273877, 252792, 234095, 229454, 220947, 222526, 228323, 255620, 224928, 155389, 178242, 166231, 126224, 167886, 194211]
4937A94211l7488k9347k1217M6240m5737j1933P5675o4920J4490j4577j8305k3983
4925F3109J5092J96L0953j0183o9557L8017L0202l6414J2661l7862K6285L4426
4913I6925j3537q873l8683L3292J5062k5938L713o8553O0255Q372M1164m776k1009
4900G7414N1447K4705m2203O990k4185l1946P5262k9434l005o5531O6348j6396
4888H9466R977q972R888N7804n1222p474M0411p0619L6504k62r069J2822k4785
4875H4469N1673n4324m416m8471J3371q991j8251Q462l7865j4379R953k2128M1137
4862B40j0004j3430l70K7596l3500j9337m0128L6603o886L2129o3562P4910q909
4849b4648m4369p785J7920p822M3276K3503m6105o761K014J7416r707J380k3227
$$ y = [194211, 156723, 127376, 106159, 152399, 106662, 94729, 170404, 105484, 119974, 105397, 87092, 63109, 78201, 78397, 109350, 99167, 29610, 67627, 97829, 61415, 74076, 36214, 62499, 96925, 83388, 74515, 35832, 69124, 84186, 58248, 61961, -6592, 53663, 62035, 103199, 98423, 77414, 128861, 153566, 111363, 118353, 94168, 62222, 137484, 108050, 105045, 39514, 105862, 89466, 99443, 90471, 100359, 158163, 106941, 99467, 139878, 69259, 105763, 105501, 96432, 109254, 84469, 136142, 81818, 77402, 28931, 42302, 33311, 15060, 23522, -14343, -28722, -18769, -40897, 240, -9764, -23194, -23564, 4032, -29468, -48805, -88933, -52330, -59216, -27087, -90649, -15739, -24648, -69017, -76802, -58882, -66704, -23428, 75, -46030, -52791, -50777, -33361, -43068, -41688, -64915]
4836f4915K2714q131j1952N3567q7944J03748k481m6476J6830k3484J1310R781
4824b7433m8772M6360o1568P9808n1097N99k0802p638J3122o1001N7742K7328
4812e3352K6650m1903p2177R1399m6991J5264j9248J4609Q527p217J0402J573
4800g2464l6516K0187M6783l4824n3161M1786l864o6002J00696l6793J8049m420
4788h0543J7145j9783K7853J5026j1974M3210j0049k689m5074N7021j1374j7310
4776c8541j2576O630Q5084p7211J5213p641L4118m5454N9635k3811l7126N2050
4764A0370q263J5963n6038K7854O6913l2907R740m882j8729m891K1157L0439j7471
4751C9255r895P0839o5146K0088l0304k5431O0532L7815L2255m5732L0517k1128
$$ y = [-64915, -42201, -50332, -62284, -8717, -96661, 7087, 4606, -41870, -25040, -48524, -37214, -27433, -76205, -29845, -91413, -11605, -62702, -62103, -82905, -90543, -77421, -138422, -80680, -53352, -26702, -68605, -140782, -49383, -96374, -81110, -100358, -85749, -77222, -84439, -74037, -72464, -108980, -88793, -42010, -76834, -129995, -88209, -92073, -158075, -57379, -94172, -76123, -80543, -63398, -83181, -55328, -40302, -52276, -9066, -19115, -21804, -66878, -9857, -21231, -38541, -51117, -44487, 40597, -36614, -21401, -29042, 5076, -40378, 19257, -4554, -41680, 10370, 2107, 18070, -37968, -10114, 56799, 23892, 33632, 28750, 10021, 5130, 26287, 56726, 39255, 29360, 100199, 35053, 55141, 24837, -594, 59938, 97753, 130008, 84276, 114793, 93665]
4739I3665J6339K7501K3387l4114L3369j0478j9407m732L7144l2197p147L0045
4727A53375K759J0214m8769L8017n324l1705M3075P3151n5221m401N5782k7429
4715B03524K4102N616j3128L2046k1132k49j4689K8512J7275n2110j2234L1304
4703B28837p405j0467L2074n4305M3719M3560n3290Q758K7960p6524Q1768k0091
4691B44594l1161k1091K3926L9845k0492k8660l919L9401K0262k9831L7540n748
4679B64666l9838J1797J3619J4902J0084J6750p180r388J6234L0528k1697j1850
4667B88627K0505L4650p9585N0958L0013n2131K8417L1595o1010J0985M0553N787
4655C49364l1423L43M4131L3693n1679M0501l9960M6557N37K0577K6459l589n5214
$$ y = [93665, 110004, 137505, 160892, 126778, 160147, 149669, 130262, 125530, 162674, 130477, 123330, 153375, 156134, 166348, 117579, 155596, 150272, 118567, 161642, 234793, 179572, 175171, 230953, 203524, 227626, 233242, 220114, 252160, 231028, 230779, 216090, 244602, 261877, 209767, 197533, 228837, 221432, 210965, 243039, 188734, 232453, 276013, 222723, 231481, 259441, 182917, 264685, 244594, 213433, 192342, 216268, 256113, 235621, 206961, 203042, 242443, 262705, 232874, 270414, 264666, 224828, 236625, 250244, 265146, 275230, 291980, 284800, 275412, 291646, 322174, 300477, 288627, 309132, 343782, 264197, 315155, 345168, 293037, 321454, 353049, 292039, 303024, 343577, 349364, 317941, 318284, 362415, 396108, 344429, 384930, 344970, 391527, 392064, 412641, 439100, 435511, 380297]
4642C80297L1079J152J7081r717J1489l51O4733Q734L7468m1631Q722N736k8989
4629D85803n541N4931r981P2438r785j4651J8849L132O751M6874K9193r292K6618
4616F95339K946M3322k6929K4597K9145n7310J9253k1636J25489n233N2718l9347
4604H42354O3287L4590j2695M5801K8398l5061M3013j3683r005K0707O3121J7852
4592A088679K7852n0014R8368J4617j1348K5995M5609J2767L8251J9950N9240
4581A369966M3680K8778M8002O4382L9140R115K2087N2780Q106L6033L2903M1942
4569A796914M735M1386o894O6223M8389M8713N0473L1713O5020Q4015J00194J4041
4557B344922P1932O9497j182P7704N3610M9264M3872N7743M4653P6861L4117N9569
$$ y = [380297, 411376, 412528, 429609, 419892, 431381, 431030, 495763, 504497, 541965, 500334, 509056, 514792, 485803, 480262, 535193, 525212, 597650, 587865, 573214, 592063, 595195, 601946, 648820, 678013, 668721, 695339, 698285, 741607, 714678, 739275, 768420, 711110, 730363, 708727, 834216, 828983, 881701, 842354, 905641, 940231, 927536, 973337, 1001735, 966674, 1009687, 996004, 986999, 1007706, 1070827, 1088679, 1116531, 1066517, 1164885, 1179502, 1168154, 1194149, 1239758, 1252525, 1290776, 1310726, 1369966, 1413646, 1442424, 1490426, 1554808, 1593948, 1603063, 1625150, 1677930, 1686036, 1722069, 1754972, 1796914, 1801649, 1843035, 1836141, 1902364, 1950753, 1999466, 2049939, 2081652, 2146672, 2230687, 2330881, 2344922, 2416854, 2486351, 2485169, 2562873, 2616483, 2665747, 2709619, 2767362, 2812015, 2888876, 2922993, 2982562]
4545B982562J03880J02374J38352K2222J49307P8416J48031R8294J85983J08959
4535D118380K38760K05711J93789K47234J63600K42308J67280K24386J84879J67820
4525F154147J15851R5528J14674J15261N5253Q3041Q3573J28599N9954J41329
4515G147210J00133J00613K30902J29421K53031K08682K79038K88458K90407M10320
4505I438215M00285M40421M84549N05545N26842N65838N08005N41018N74645M90816
4495A4476179N40028M66439N48523N41910N76391O32909O21740N41400O47755
4486A9593274N11688N00070M52968K71937J26368P4194J1027j19339m7145j09516
4476B1265526q4429l5521k0418M9976J17588K06770K88339L57584M17298M71014
$$ y = [2982562, 3086442, 3188816, 3327168, 3349390, 3498697, 3577113, 3725144, 3823438, 4009421, 4118380, 4357140, 4562851, 4756640, 5003874, 5167474, 5409782, 5577062, 5801448, 5986327, 6154147, 6269998, 6365526, 6480200, 6595461, 6650714, 6733755, 6817328, 6945927, 7005881, 7147210, 7247343, 7347956, 7578858, 7708279, 7961310, 8169992, 8449030, 8737488, 9027895, 9438215, 9838500, 10278921, 10763470, 11269015, 11795857, 12361695, 12869700, 13410718, 13985363, 14476179, 15016207, 15482646, 16031169, 16573079, 17149470, 17782379, 18404119, 18945519, 19593274, 20104962, 20605032, 21058000, 21329937, 21456305, 21530499, 21541526, 21422187, 21375042, 21265526, 21181097, 21145576, 21125158, 21175134, 21292722, 21499492, 21787831, 22145415, 22562713, 23033727]
4466B3033727O04727O79706Q35413Q79938R84250J107143J000257J201000R92458
4457C1318619Q75638N80402J49283j69758n85383r18217j183172j278885j260663
4448B7527864j267161j276184j141500j080938r46743q29185p21533n80203n06112
4439A9178305l96175l31874k04362p9123j19338l021l8199J36035L771M2375j2835
4428A8175559q6005k34099k66332m55307o14902o51906p55224p21743q06924q10263
4418A2772854p29444o82297p36721o17839n69894n68007m85493m48107m16272
4409G518780l56129l59980l13609k88130k65081j84722k42226k80200k29409j43058
4399D856236j94166j67125j36939j84108j77946j13676j80373J9002j45205j82509
$$ y = [23033727, 23638454, 24318160, 25153573, 26033511, 27017761, 28124904, 29125161, 30326161, 31318619, 32194257, 32774659, 32923942, 32754184, 32168801, 31250584, 30067412, 28788527, 27527864, 26260703, 24984519, 23843019, 22762081, 21815338, 20986153, 20264620, 19684417, 19178305, 18782130, 18450256, 18245894, 18166771, 18047433, 18044412, 18006213, 18142248, 18146019, 18188394, 18175559, 18089554, 17855455, 17589123, 17133816, 16518914, 15867008, 15111784, 14390041, 13583117, 12772854, 12043410, 11361113, 10624392, 10006553, 9436659, 8868652, 8383159, 7935052, 7518780, 7162651, 6802671, 6489062, 6200932, 5935851, 5751129, 5508903, 5228703, 4999294, 4856236, 4662070, 4494945, 4358006, 4173898, 3995952, 3882276, 3701903, 3720905, 3575700, 3393191]
4389C393191q2265j10434j56516k3712j01168q7342m8341q6624r9458n1683o2897
4378B482751m2795p1978q2046k0868n9766o2418j8948j8682r2524l7648k107m3573
4366A929398n7904n720j4472j9924r151j3079n9105R93p3425k0448m2990k1614
4354A592559j1114k5051p585l5375l4207k3532n2186q680J7824n7675m8072O4305
4342A371211l0320p1590M0145l6705K83J7061j337l4128N6472l0345P9233j19460
4330A240520N0640L4930n2422l2857P2109o735j1049K1261j5079j965L5756J8492
4318A353601Q926J6453L7353R6613k1124k9481P0888L4728O1891L5819Q9304J0804
4306A765775P852N7696J8263Q6194J10983Q5811O4929M9676J73950O8614J36957
$$ y = [3393191, 3310926, 3200492, 3043976, 3020264, 2919096, 2831754, 2783413, 2696789, 2597331, 2545648, 2482751, 2439956, 2367978, 2285932, 2265064, 2205298, 2142880, 2123932, 2105250, 2012726, 1975078, 1972971, 1929398, 1871494, 1865774, 1851302, 1831378, 1822227, 1809148, 1750043, 1751036, 1677611, 1657163, 1614173, 1592559, 1581445, 1556394, 1548809, 1513434, 1479227, 1455695, 1403509, 1394829, 1412653, 1354978, 1306906, 1371211, 1340891, 1269301, 1309446, 1272741, 1273024, 1290085, 1288748, 1254620, 1311092, 1280747, 1359980, 1240520, 1291160, 1326090, 1273668, 1240811, 1312920, 1306185, 1295136, 1316397, 1301318, 1299353, 1335109, 1353601, 1362527, 1378980, 1416333, 1512946, 1491822, 1462341, 1533229, 1567957, 1629848, 1665667, 1754971, 1765775, 1773627, 1831323, 1849586, 1935780, 2046763, 2132574, 2197503, 2247179, 2421129, 2489743, 2626700]
4295B626700Q2700J67550J37842J83256K33369K10848K09982K60516L03035L18239
4285D734037L48295M58844M09450M98764O04350N03163N59946M63748L66924J30833
4275I078354l2252j45448l02191l32222k73008k91805k92223j73073j46380j39744
4265F950008o1204J4614O4916R9741J76513K66380K66125L53966N12515M52024
4255I095598O76580P22115P59071Q95677R32251Q73709P31507M04312J1392k84458
4245A4817754o23613q46665r07446q60233q17690p72858o93738o26800n23611
4236H145100m67691l52346l06147k43804k08791j03594l232o686O0617J24109
4226F637535J81470J80181K21296K75609L19257K53586K07194M6872q5954k82823
$$ y = [2626700, 2709400, 2876950, 3014792, 3198048, 3431417, 3642265, 3852247, 4112763, 4415798, 4734037, 5082332, 5541176, 5950626, 6449390, 7053740, 7556903, 8116849, 8580597, 8947521, 9078354, 9046102, 8900654, 8598463, 8266241, 7993233, 7701428, 7409205, 7236132, 7089752, 6950008, 6888804, 6903418, 6968334, 7068075, 7244588, 7510968, 7777093, 8131059, 8643574, 9095598, 9772178, 10494293, 11253364, 12149041, 13081292, 13955001, 14686508, 15090820, 15102212, 14817754, 14194141, 13347476, 12440030, 11579797, 10762107, 9989249, 9295511, 8668711, 8145100, 7677409, 7325063, 7018916, 6775112, 6566321, 6462727, 6459495, 6452809, 6513426, 6637535, 6819005, 6999186, 7220482, 7496091, 7815348, 8068934, 8276128, 8323000, 8237046, 7954223]
4216G954223l98326m53540m40768n19507m20737n00026l60898m00771l31198l42182
4206C786270k09968k89721k39831j24564k18536r8593j97224n9421j87251p4688
4196B086473j18934r1451n5296j02130q2494r619j04301r3602r4479k6348k6674
4185A281145n6995n3843k8284q2810l0663J5053q3960k052k6202o3255l9875k3163
4173H05096n2381k031J0796m9427K393k1013J0446q7433m5K4989k1769k1038k4995
4160E73588l7403k5163n8530Q1157o7765m0970J421R774O9988n2592K123P400
4148D63028m2370M7608o5727M6422M5865m4918J8961j5590R231Q4530n4792O1013
4136E53261j050k4799P043n3090j2744l7273n1616M185J3518n1537M86L7347o6279
$$ y = [7954223, 7555897, 7102357, 6661589, 6142082, 5721345, 5221319, 4860421, 4459650, 4128452, 3786270, 3576302, 3286581, 3046750, 2922186, 2703650, 2605057, 2407833, 2348412, 2161161, 2086473, 1967539, 1876088, 1820792, 1718662, 1636168, 1626549, 1522248, 1428646, 1334167, 1307819, 1281145, 1224150, 1170307, 1142023, 1059213, 1028550, 1043603, 959643, 957591, 931389, 868134, 828259, 805096, 752715, 750684, 761480, 712053, 714446, 693433, 703879, 616446, 616401, 641390, 619621, 598583, 573588, 536185, 511022, 452492, 533649, 465884, 424914, 426335, 436109, 506097, 453505, 455628, 463028, 420658, 468266, 402539, 448961, 494826, 449908, 468869, 453279, 462510, 547040, 492248, 553261, 552211, 527412, 534455, 481365, 468621, 431348, 379732, 383917, 397435, 345898, 346384, 383731, 317452]
4123C17452j5836K1512j0810q42j8748N0549l6331M4745k2333K6144K6047k1350
4111C60199J3238k2019L1589q1331N465k3765p7730J2242l0534K8618o9338N8980
4099B05614m1746l0541k3119L0886n2734J6615K0786k5203n5270J20K9385k9707
4087D5086N7488n4440n651j2383L4264l7935J9237P681k6218m8657M6784j1887
4075A3369p903K4867k8704k310n3360p668N8334K3026J4801j4595K1640l4631
4063F866j7939m0662J0684M9985k5452j232k5334L3673L5485o0621J0293L979
4051b0275M0405p3430K2356L1113k5989j9495m9796J04611n4691M897j5657J3120
4039d2831M040q317N503K6683l0598l2993Q2917n826j1834J2770j5392j4580l7711
$$ y = [317452, 301616, 323128, 312318, 311476, 292728, 343277, 306946, 351691, 329358, 355502, 381549, 360199, 373437, 351418, 383007, 301676, 307141, 283376, 205646, 217888, 187354, 215972, 146634, 205614, 163868, 133327, 110208, 141094, 88360, 104975, 125761, 100558, 45288, 45408, 74793, 45086, 102574, 48134, 42483, 30100, 64364, 26429, 45666, 53347, 27129, -21528, 25256, 13369, 5466, 30333, 1629, -681, -54041, -61709, -3375, 19651, 34452, 19857, 41497, 6866, -11073, -51735, -41051, 8934, -16518, -17750, -43084, -9411, 26074, -34547, -24254, -20275, 20130, -53300, -30944, 169, -25820, -45315, -95111, 9500, -45191, -40294, -55951, -42831, -38791, -47108, -41605, -14922, -45520, -78513, 4404, -1422, -13256, -486, -15878, -30458, -68169]
4026f8169R8974j1201n971q5095O3380n113Q259J6407o7367L5217J4941j2348
4014a8086l5517N5384k5456l6094J4945J4371l3127K4523J7262k8149j5626O8568
4002B998o624j6840l3480L3451J2563M781l3617j6522N2743q856K0834j8058o5388
3989g2015M977K2330k9778K3423l1517n1237N3849N3691k4501k2671j1046r617
3977i4112l205J7314k577J960N926j9785K0934m6594J7313p50K1542k423J8182
3964f6275m6628l0386J9758K7497L160J7567o6994K9229O5460o5769j9295L2473
3952a00203j8455k0324Q538j2975L3522k2292N428k4265J7103j5217K525j2806
3940a59421k404K0906K8485l9339m4069L3167n545K4611k1553J1105J4566l1031
$$ y = [-68169, 30805, 19604, 13633, -71462, -8082, -13195, -4936, 11471, -55896, -20679, -5738, -18086, -53603, 1781, -23675, -59769, -44824, -30453, -63580, -39057, -21795, -49944, -65570, 2998, -3626, -20466, -53946, -20495, -7932, -3151, -36768, -53290, -547, -9403, 11431, -6627, -72015, -67038, -44708, -74486, -51063, -82580, -133817, -79968, -26277, -50778, -73449, -84495, -94112, -97317, -80003, -82580, -80620, -74694, -94479, -73545, -120139, -102826, -103576, -82034, -84457, -66275, -112903, -143289, -123531, -96034, -92874, -75307, -142301, -113072, -47612, -113381, -132676, -100203, -118658, -138982, -130444, -143419, -109897, -132189, -126761, -151026, -133923, -149140, -146615, -159421, -161825, -140919, -112434, -151773, -195842, -162675, -168220, -143609, -165162, -154057, -139491, -170522]
3928a70522l820k2330O4363o7358K2848k7060L2050p866J6994K7627p2745L112
3916b04707J5506O4744o6393l136L4710n3499K7934j2127q071Q302M6603k1962
3904a72096k5545l458k0030J10546r1317j3750O4265l6126k134k6950J504M7581
3892a67510l311k5301R790j8984N785L3078j1209k2593k0701J337L0401p316Q511
3879a88023J5167o3149N8244L7749o8600l6351O5144j6234J7677J9984n4210L6690
3867a75912K3920j7489n654N8233k6545j5517J8130R190j504L7165m3539J2049
3855a27473J6349K9182o5240k6655N3936K6340m681L4740m2559K6971m7714q30
3843a27634K1387J1178o8698N2901R85J1566K7818l4463p991J4281Q481n1547
$$ y = [-170522, -174342, -196672, -132309, -199667, -176819, -203879, -171829, -179695, -162701, -135074, -207819, -204707, -189201, -124457, -190850, -193986, -159276, -212775, -184841, -196968, -205039, -196737, -150134, -172096, -197641, -201099, -221129, -110583, -201900, -215650, -151385, -187511, -189645, -216595, -215091, -167510, -170821, -196122, -186332, -205316, -199531, -166453, -177662, -200255, -220956, -219619, -189218, -196534, -188023, -172856, -236005, -177761, -140012, -208612, -244963, -179819, -196053, -178376, -158392, -212602, -175912, -151992, -169481, -175135, -116902, -143447, -158964, -140834, -131644, -133148, -95983, -139522, -127473, -111124, -81942, -147182, -173837, -119901, -93561, -98242, -63502, -106061, -79090, -126804, -127634, -106247, -95069, -163767, -110866, -109881, -98315, -70497, -104960, -112951, -98670, -90189, -141736]
3831a41736J28241n9498N068k5864K0057l775J0487o850J3820L7221q2997L5677
3819g0149r580J5884m3330O6078n7036J9974j281L6054m6024J8952q710J6563
3807f2605M218n8499J8617K2332k0415K2491l506n3840l4659O569O8068k2140
3795a13369L522k4500l5316L2142k5357K4872p814l017k0589j0749q739R545n3496
3782b32865L3079L314k5043m0577J5723m3072O3769k772q664J5426J3538n1769
3770b59913p17J4358L5761R103k6348k4664M7148l0757j9804j0163Q7542j9248
3758a97702m5999K9392N974l286m011q4978L2108K8524k1912J7690N6691o8465
3746b55974Q327R700R414k0864j9757K3956P774m0788M212J6491M3099n9021j4718
$$ y = [-141736, -13495, -72993, -67925, -93789, -73732, -77507, -67020, -73870, -60050, -22829, -105826, -70149, -79729, -63845, -107175, -41097, -98133, -78159, -79440, -43386, -89410, -70458, -79168, -62605, -58387, -116886, -98269, -75937, -96352, -73861, -77367, -131207, -165866, -159297, -91229, -113369, -109847, -134347, -169663, -137521, -162878, -138006, -145820, -148837, -169426, -180175, -188914, -179369, -232865, -199786, -196472, -221515, -262092, -246369, -289441, -225672, -228444, -237108, -221682, -208144, -259913, -260630, -246272, -210511, -201408, -227756, -252420, -205272, -236029, -255833, -265996, -178454, -197702, -243701, -214309, -208335, -211621, -215632, -300610, -268502, -239978, -261890, -244200, -187509, -255974, -247647, -237947, -228533, -249397, -269154, -245198, -237424, -278212, -274000, -257509, -214410, -273431, -288149]
3733b88149N2987k8514M0637J3963n3507M7991n6315l1515N2383l6732N1649o5478
3721c00600P2365k5796k3484M5985k0367o1547N5676L4410j00585O0462M8441
3710b15040J2022o0085M1791o8307N2739n1286k4393K1097Q949L836M7166n9828
3698b91339J2056J4849J1627R931r1197J02975k4457m9065J8716M784l2141R6626
3686b16635n6965M58k2242L4510M3273o0759L3666k5905k4549j3393N2906o4470
3674c20105L7097M7956l2147j4424j3153m8971M7088M4949K2091k2534k8360N737
3662b74776j7336L9175k8795l2109q124Q1181n0925p798L6105P034k9472j057
3650b86897m8135K5119K3856R821r608L9385j6376p222k8861L2647k2859R443
$$ y = [-288149, -235162, -263676, -223039, -209076, -262583, -214592, -270907, -302422, -250039, -286771, -235122, -300600, -228235, -254031, -277515, -231530, -251897, -313444, -257768, -223358, -323943, -263481, -215040, -203018, -263103, -221312, -289619, -236880, -288166, -312559, -291462, -282513, -278677, -231511, -291339, -279283, -264434, -252807, -242876, -334073, -231098, -255555, -304620, -285904, -281120, -313261, -216635, -273600, -273142, -295384, -260874, -217601, -278360, -244694, -270599, -295148, -308541, -255635, -320105, -283008, -235052, -267199, -281623, -294776, -343747, -296659, -251710, -229619, -252153, -280513, -274776, -292112, -252937, -281732, -313841, -321965, -240784, -291709, -299507, -263402, -256368, -285840, -286897, -335032, -309913, -286057, -276236, -285844, -246459, -262835, -270057, -298918, -266271, -289130, -279687]
3638b79687K6030k107k5406k6295P932P616K662q313M8804k4408j6762J4890J7277
3625b57767j0837L4988m1979M2425o9114M9613o2778M1120K1591o0280L5543l2267
3613c09742k5802M5954K7873q6117O4377l3980j2378L5112k8419J5084N108J8748
3601b84182r703j6230L9602k7136k1259j4596Q2445j6251K5488n1472K0044K6679
3589b46571k1586k040n6535L034P2390J5436q939n9308L1918l102k3425K9334
3577b69394k6311K935O06l3879P0232m5312P791J7352J8114L8148o8354k3614
3565c11686L5598J6153n606l0423L4854j5490J1044o5455L5069K6038k0454K5458
3553b64900n008l5506L5515n1526J7680J0940K1033l84k9921K6243l9017P3344
$$ y = [-279687, -253657, -255764, -281170, -307465, -299533, -291917, -289255, -297568, -248764, -273172, -289934, -275044, -257767, -268604, -233616, -275595, -233170, -302284, -252671, -315449, -274329, -252738, -313018, -277475, -309742, -335544, -289590, -261717, -347834, -283457, -317437, -329815, -294703, -323122, -308038, -302930, -284182, -293885, -310115, -270513, -297649, -318908, -333504, -251059, -267310, -241822, -293294, -273250, -246571, -268157, -270197, -326732, -323698, -251308, -235872, -244811, -304119, -272201, -275303, -298728, -269394, -295705, -292770, -292164, -326043, -255811, -301123, -293332, -275980, -257866, -219718, -288072, -311686, -276088, -259935, -265541, -295964, -261110, -276600, -265556, -331011, -295942, -269904, -290358, -264900, -269908, -305414, -269899, -321425, -303745, -292805, -271772, -272156, -302077, -275834, -314851, -241507]
3541b41507J4799p2248N4394o8244P0192m8924k12M7012n9532j3993L9546K91
3529b78426j5394L2460j1859n0329k1823L4573K2182K1135k74m150m75o6559K5054
3516c13885M8898k6277J2146R496K5985n551k8267J3338l3943j497L1995o1531
3504c29093M8501J2502n339J1314j1439p2230Q7401n1314N2879p9003N3350n638
3492b88109n7931M9144J3126j347m6421J5195O0095m3420l5324J7725N941K9658
3480b81668k8920k3119P5153k6606k3574K9143k8696J6777R978J4902Q613o9902
3468c27919M2927k7107M0975j6627m1391N3393l2534K0139m6141K4164K9384j065
3456b81802L7820n2067j5976K9351J1438M963j7699k627N48j5271k1243N9522
$$ y = [-241507, -226708, -298956, -244562, -312806, -242614, -291538, -291750, -244738, -304270, -318263, -278717, -278426, -293820, -261360, -273219, -323548, -345371, -310798, -288616, -267481, -267755, -271905, -272380, -338939, -313885, -264987, -291264, -279118, -269622, -243637, -249188, -277455, -264117, -298060, -299557, -267562, -329093, -280592, -268090, -273429, -262115, -273554, -345784, -258383, -309697, -256818, -335821, -282471, -288109, -346040, -296896, -283770, -285117, -331538, -316343, -256248, -299668, -334992, -317267, -311326, -281668, -310588, -333707, -258554, -285160, -308734, -279591, -308287, -291510, -281532, -266630, -258017, -327919, -284992, -312099, -271124, -287751, -329142, -275749, -308283, -288144, -334285, -310121, -280737, -281802, -243982, -296049, -312025, -282674, -271236, -266273, -283972, -286599, -286051, -301322, -322565, -263043]
3444b63043m396p7198n130O3149p338L8528p3754N0506m8920K4625j0448k00K0007
3431b93612J294J1823j4782k6880N5616n2268J0118l329K3926m7166Q1762k6532
3419b80030k2192L9550o646l7313J0370Q442K7386j6763j0850P109l0440R419
3407c01958K4939K5631k4743J2162N388j2211k3458K2101r786j7791P069K1623
3395b71034k6586K4237l2630M1975l6742L0947m4099J1515N274q443N6758j5638
3383b64466L146r458j6893o381l0160M5303r951L0242m3552k095J969m99k518
3370c05313L5081k0403K6217o1191K829K8655K6547o639l0869j1430K859K8613
3358b85044K0170k567k450k7210M5537m5731l59l638K5436J992p567n940k3532
$$ y = [-263043, -267439, -344637, -349767, -286618, -293956, -255428, -329182, -278676, -327596, -302971, -313419, -313619, -293612, -292318, -280495, -295277, -322157, -266541, -318809, -308691, -312020, -288094, -335260, -253498, -280030, -302222, -262672, -269318, -306631, -296261, -287819, -260433, -277196, -288046, -280937, -311377, -301958, -277019, -251388, -276131, -263969, -258581, -270792, -294250, -272149, -281935, -299726, -292657, -271034, -297620, -273383, -306013, -264038, -300780, -269833, -313932, -302417, -297143, -305586, -248828, -264466, -261320, -270778, -287671, -294052, -324212, -278909, -288860, -258618, -302170, -304265, -302296, -302795, -305313, -270232, -290635, -264418, -325609, -322780, -294125, -267578, -274217, -305086, -316516, -313657, -285044, -264874, -267441, -269891, -297101, -251564, -297295, -297654, -301292, -275856, -273864, -281431, -287371, -310903]
3345c10903M3937K798K9204p4397J1206N8479m2185J8211o759l5690l2635O0078
3333b78656l5592j9493L4702P939J6788k2667j3108K4230o961J2524p810L3601
3321b54503m1354L73K2657k4250R957K0783l491O142J8508n2146k0668P5902m8269
3308b90359r650j2771L8323j2109j4044k1924M9042k0972K0459k6832K4956j3306
3296b89187r226K6246m7734k490j313J3864Q0889k6755m5080l1321M8447J3931
3284b69729l1772j5239k850P675M5933k9624k3664O4472J0400o8022L809O6677
3272b41934j9762j2070j2177k1822j4605L0302K2290N1212p9379k423M1377k9414
3260b88405l1062P9113l5212K788K7950k8124l739J6150n3502M5138l2973L9493
$$ y = [-310903, -266966, -264168, -234964, -309361, -298155, -239676, -281861, -263650, -270409, -306099, -338734, -278656, -314248, -333741, -299039, -291100, -274312, -296979, -310087, -285857, -292818, -280294, -288104, -254503, -295857, -295484, -272827, -297077, -287120, -266337, -269828, -263686, -245178, -297324, -317992, -242090, -290359, -300009, -312780, -274457, -286566, -300610, -322534, -273492, -294464, -274005, -300837, -275881, -289187, -298413, -272167, -319901, -322391, -323704, -309840, -228951, -255706, -300786, -332107, -283660, -269729, -301501, -316740, -319590, -311915, -265982, -295606, -319270, -254798, -244398, -312420, -308611, -241934, -261696, -273766, -285943, -307765, -322370, -292068, -269778, -218566, -297945, -300368, -258991, -288405, -319467, -240354, -275566, -272778, -244828, -272952, -276691, -260541, -314043, -268905, -301878, -262385]
3248b62385k2215n79j0771L3786n333m2227k1485Q3861l4615K4699k7702J556
3236b83410J991j2483j7538J9556k2302L0389N081M544j2280M8131n2749l0344
3224c21414J8332N0418o268r81k7026O731j2240M0561n1640r59J8033m3113P5449
3211b54117K4109r2834N5193j0123M4679l1704m2927J2921j0657j4197O7510m3917
3199b96064O7865l6554l5523k2950J04065n7884j1436k1756O3188k6413o5780
3188c39242M8094J79J9106k6394K2904j1573J1037l2261K3572k6723O1138m7717
3176b97880p628L124K9653n2982M8271k500L3659m5455L069k5273j877K8150M564
3163b83105K406m9416R0937l8277k5177k5187J4485j945J5459J2086k9784J0251
$$ y = [-262385, -284600, -285179, -295950, -262164, -267497, -309724, -331209, -247348, -281963, -257264, -284966, -283410, -281419, -293902, -311440, -291884, -314186, -283797, -278716, -274172, -286452, -238321, -291070, -321414, -303082, -252664, -258932, -259913, -286939, -280208, -292448, -251887, -303527, -304486, -286453, -329566, -254117, -230008, -322842, -267649, -277772, -233093, -264797, -307724, -294803, -305460, -319657, -252147, -296064, -228199, -264753, -300276, -323226, -219161, -277045, -288481, -310237, -247049, -273462, -339242, -291148, -290969, -271863, -298257, -275353, -286926, -275889, -308150, -284578, -311301, -250163, -297880, -305508, -302384, -272731, -325713, -277442, -279942, -246283, -291738, -288669, -313942, -315819, -287669, -283105, -280699, -330115, -239178, -277455, -302632, -327819, -313334, -315279, -299820, -287734, -317518, -307267]
3151c07267K1553J9417j4213q720K2490l9081M4664l9888K2502M6120l4605J4775
3139b52253o4009J169N05R489L2554R48J2248l9606L1132J2044j4454P694k2139
3126b84678k1603J7174J6757J7059o5604L3763K3179k169J0532o7747P6165l5649
3114b82821J2603m0387K4356l4117M2005k9492L0751l1656O0004n3020m165M7615
3102b58324k5899J902o169l397J1587l558l6669K0946J095k3927N7308k9207q210
3089c02522O958L3547j9290q803r15j4887L92J2086J0792j4648L4067m2488K2263
3076b83448J238K7129k4586k8728Q675J3435K4735l5328M8924p1259P403J8060
3064b93750J050j3920M7241K2145o2570K0557K7236k3954k6657j3274K0528J0463
$$ y = [-307267, -285714, -266297, -280510, -289230, -266740, -305821, -261157, -301045, -278543, -232423, -267028, -252253, -316262, -315093, -314588, -305099, -272545, -271597, -259349, -298955, -267823, -255779, -270233, -262539, -284678, -306281, -289107, -272350, -255291, -320895, -287132, -263953, -266122, -255590, -323337, -247172, -282821, -270218, -310605, -286249, -320366, -278361, -307853, -277102, -308758, -248754, -301774, -305939, -258324, -284223, -282321, -288490, -291887, -280300, -283858, -320527, -299581, -298486, -322413, -265105, -294312, -302522, -295564, -262017, -281307, -290110, -291025, -305912, -305520, -293434, -282642, -297290, -263223, -305711, -283448, -282210, -255081, -279667, -308395, -299720, -286285, -261550, -296878, -247954, -319213, -311810, -293750, -292700, -306620, -259379, -237234, -299804, -279247, -252011, -275965, -302622, -315896, -295368, -284905]
3052b84905K2374l4491j395L0937K2789o0232J6306m8624M4713l511M5170m0252
3040b91121K4417k9774M642Q332j078J33K3207K0826r770m9918J7699j1176j631
3027b95212M4444n6233N3046l4271m9346O6444J3445K0367j0132m8537K9363p24
3015b67346j6670p0474K9883M6184o5524K5639N4947J423j0684n945n584K1645
3003b62506l2698K0915n0060P7022p926k6246j710L2208m4525k534K3747K9213
2991b45100m5097l027M0052p1714M2096K9827p7213N8993m2742N0350R591Q329
2979b45655k7397L4237n4775N7895m7335L1206k4389o4335O9503j8227J2479J9888
2967b56905o2861l156P1596p5289J1052L2193k9067q115M0102K634L9892l4047
$$ y = [-284905, -262531, -297022, -298417, -267480, -244691, -304923, -288617, -337241, -292528, -296039, -250869, -291121, -266704, -296478, -291836, -283504, -284582, -284449, -261242, -240416, -250186, -300104, -282405, -293581, -295212, -250768, -307001, -253955, -288226, -337572, -271128, -257683, -237316, -247448, -295985, -266622, -267346, -284016, -354490, -324607, -278423, -343947, -318308, -263361, -261938, -272622, -278567, -284151, -262506, -295204, -274289, -324349, -247327, -255253, -281499, -283209, -251001, -295526, -298060, -274313, -245100, -290197, -293224, -253172, -324886, -282790, -252963, -330176, -271183, -313925, -263575, -253984, -245655, -273052, -238815, -293590, -235695, -283030, -251824, -276213, -340548, -271045, -289272, -276793, -256905, -319766, -322922, -251326, -326615, -315563, -283370, -312437, -320552, -280450, -277816, -237924, -271971]
2955b71971O1504n5782j7555k3097L4099j5456M4959J2367l7527J330p7008N4490
2943b89647k572K4617K7333p1330J2581j1388N2448r769l7402Q324k3763M4082
2931b76486K007m894M3329k0310j6966J5958k6701K80L9257j1596k7339k9255
2919c12716N4010l6732L1927j7406K2560J3578j6631K612m342j2986J2339M945
2907b58842K0220l9518j7112M4386q3844O2683M9633n5684j2816l625K3105j978
2895b73392L186L365o835K929j248j5526J6163J0237k4377K8258k6217J3319m418
2882b74556J7101l0902M4236k4281m7050P7208p668k2200N900j7595L3012o6983
2870c13778O4619j9192m1454K9103J0092L8096k93o1216l557L5161M0295o0677
$$ y = [-271971, -210467, -266249, -283804, -306901, -272802, -288258, -243299, -230932, -268459, -267129, -344137, -289647, -292219, -267602, -240269, -311599, -299018, -310406, -257958, -267727, -305129, -296805, -320568, -276486, -274479, -279373, -236044, -256354, -273320, -257362, -284063, -283783, -244526, -256122, -283461, -312716, -258706, -295438, -263511, -280917, -258357, -244779, -261410, -258798, -263140, -276126, -263787, -258842, -238622, -278140, -295252, -250866, -334710, -272027, -222394, -278078, -290894, -294519, -271414, -273392, -270206, -266841, -273676, -270747, -271995, -287521, -271358, -261121, -285498, -257240, -283457, -270138, -274556, -257455, -288357, -244121, -268402, -315452, -238244, -245912, -268112, -262212, -279807, -246795, -313778, -249159, -268351, -309805, -280702, -270610, -232514, -232807, -294023, -297580, -262419, -222124, -282801]
2858b82801M5970l3928n2700P4128o4615N4023m1931J8762k4408M4575j9452J5624
2846b66753J6206k6349J625K7079l242m1431j6051J9125J2391K4009o6920P0802
2834b49509m8260L5531j5708j0333K4965l6433l8594N6202k175m0773N2821m9706
2822c21972N3721j0419j927P277p019Q9J7361l009n7709N0826K438k6547K4145
2809b72745J5309l1123K376M3958m1853q264P182K8657K3006l4017m138R292n7905
2796c20265M7577j1343N083N8475p0759o31J1509k8821M0906r180J4728m6571
2784c09292J6350M6987j5575P911j2776K2350k0535j528L3016k7138R604n817
2772b56443m4716J7357k913J3074R047m0312Q961l770L8019j5246k4558R3680
$$ y = [-282801, -236831, -270759, -323459, -249331, -313946, -259923, -301854, -283092, -307500, -262925, -282377, -266753, -250547, -276896, -275271, -248192, -251434, -292865, -308916, -289791, -277400, -253391, -320311, -249509, -297769, -262238, -277946, -288279, -263314, -299747, -338341, -282139, -284314, -325087, -272266, -321972, -268251, -278670, -280597, -273320, -280339, -280250, -262889, -265898, -323607, -272781, -270343, -296890, -272745, -257436, -288559, -286183, -242225, -284078, -292342, -285160, -256503, -233497, -267514, -271652, -262360, -320265, -272688, -284031, -278948, -220473, -291232, -291863, -280354, -309175, -268269, -277449, -262721, -309292, -292942, -245955, -261530, -253619, -266395, -244045, -264580, -266108, -233092, -260230, -250626, -256443, -301159, -283802, -286715, -273641, -264594, -304906, -295945, -299715, -261696, -276942, -301500, -207820]
2760b07820o9045L3120m5097P861J0735L197k2977M2239o0543M2850J6663k6012
2748b74829n838L8707m1654Q952J3723J5739m7025M0777k8336k6537K7351Q1116
2736a97854r5552K5885K579j5799K1017k9776J3433Q033m90j3227M4631l7168
2724b74288m0293K5581o121L9504m8675M6535l3649N0636l7475O618N8128l0220
2712b43719K3696q711m5356J6889Q082l6051K6224K694j5599J9823l4723l9923
2700c26674P9044k3601k2089o83K5386k7744j4061K4570n290N141K6471k1234
2688b80764q939Q055j235p475J1687O2592q1843j5546L5413J5808j0446K0636
2676b52057o8383N8494K4106p071L5551l2880j9353j4692k5726M3938M883p0029
$$ y = [-207820, -276865, -243745, -288842, -280981, -270246, -267049, -290026, -247787, -308330, -265480, -248817, -274829, -280667, -241960, -283614, -274662, -260939, -245200, -292225, -251448, -279784, -306321, -278970, -197854, -293406, -267521, -264942, -280741, -259724, -289500, -276067, -268034, -268524, -281751, -237120, -274288, -314581, -289000, -295121, -255617, -304292, -257757, -291406, -240770, -278245, -271627, -213499, -243719, -220023, -228734, -274090, -257201, -249119, -285170, -258946, -256252, -271851, -252028, -286751, -326674, -247630, -271231, -293320, -294003, -268617, -296361, -310422, -285852, -291142, -286001, -259530, -280764, -289703, -281648, -282883, -290358, -278671, -216079, -297922, -313468, -278055, -262247, -272693, -252057, -320440, -261946, -237840, -244911, -209360, -242240, -261593, -276285, -302011, -258073, -253190, -323219]
2664c23219K7759j0253J3529n745j247j8400O9464J5822o4733N888M887j996M3358
2651b44886j6880O149r170L3505p9596M8959J1467k5417L2964m5002K9640k9519
2639b87786j6405L3310l6709O6430l3592l2468L6978m379L4214l7784O226Q80
2627b71085L5017j8774Q580k9083J5070J0899k469N405j6347p2764N4439J0328
2615b70784M1074o8857M1332m085n3625L6015m8123P8284l4459k6756K7784m223
2603b86423J2826J7020o553k8389o716k9072L9095M3476m2850q629M1639Q751
2591b45825n7210L0403J084q637k7620K2543O3712q113p0354K0483m02L1549l334
2578b51721l3377l3415J3707N2657k4218N787K2896j9891j0602L0124l8794L0781
$$ y = [-323219, -295460, -305713, -292184, -297929, -299176, -317576, -248112, -232290, -297023, -291135, -286248, -288244, -244886, -261766, -255617, -264787, -231282, -310878, -261919, -250452, -275869, -242905, -287907, -258267, -287786, -304191, -270881, -307590, -241160, -274752, -307220, -270242, -274621, -240407, -278191, -271965, -271085, -236068, -254842, -246262, -275345, -260275, -249376, -251845, -246440, -262787, -335551, -281112, -270784, -229710, -298567, -257235, -261320, -314945, -278930, -327053, -248769, -283228, -309984, -282200, -286423, -273597, -256577, -263130, -291519, -298235, -327307, -288212, -244736, -287586, -296215, -254576, -245825, -303035, -272632, -271548, -280185, -307805, -285262, -221550, -229663, -300017, -279534, -279936, -248387, -251721, -285098, -318513, -304806, -252149, -276367, -270580, -247684, -267575, -278177, -248053, -286847, -256066]
2566b56066k1342m743K4693m5056J557J3929J7200k0614L1024n5010N4328K8438
2554b31662m8237Q604L3295k7111L8090l2286p6019Q1956k7418m5405O0726K1414
2542b44053p2355P4537m4274l960k523K923q741L6732Q984k3312m738O865L3410
2529b40505m1527P3000q4544j1709K1583N424Q356j911J32j966j270l74q102K2897
2515b60516J6212l9852R18J9962j1992k3095M0052l7270R439l6142M2901Q712
2503b70671r069L4965K326k7016j9420O8905n7003m3229K2036L792J777N4341
2491b38266K0411l0296j063j8266k0722K1168K6516j7813O384j6558N4501o5341
2479b79345L2175j9726K4929k6518K8938k7304L0066o3200L8585J6212l8397K4311
$$ y = [-256066, -277408, -282151, -257458, -302514, -300957, -287028, -269828, -290442, -259418, -314428, -260100, -231662, -279899, -271295, -238000, -265111, -227021, -259307, -335326, -253370, -280788, -326193, -265467, -244053, -316408, -241871, -286145, -290105, -292628, -289705, -298446, -261714, -252730, -276042, -280780, -273915, -240505, -282032, -209032, -293576, -305285, -283702, -278278, -269922, -271833, -271701, -273667, -274937, -275311, -283413, -260516, -244304, -284156, -283238, -263276, -275268, -298363, -258311, -295581, -286142, -322284, -279383, -270671, -279740, -244775, -242449, -269465, -288885, -219980, -276983, -320212, -298176, -294384, -292607, -238266, -217855, -248151, -249214, -267480, -288202, -267034, -240518, -258331, -251947, -268505, -214004, -279345, -247170, -266896, -241967, -268485, -239547, -266851, -236785, -299985, -261400, -245188, -283585, -259274]
2467b59274Q373k9352p284L2069L656l5819P8227m0227l5989j245K3835j2701
2455b75731J7723m3901M1961N9662o0874j4256L1074k4149L6807o1131M3750l3461
2443b82526j1630O7967m5260j1380O0551k7102n825Q909l270J1929o876o0918
2431c05431L5755j0874M0969m506k8450J4904j1856K1084k1501m8369K8561J9260
2419b70454m6876Q6562k5599j8663J4410l7868L3642n613m747K7408J6937p218
2407b38079K0260m7137K6211j3973j7166q755k0013J008L3265j9471M5178m2813
2395b81485j2366J1930J3802J7311n5057j8400M7296j2317J6492j4398L4056k1124
2383b74260K050J6510k74K4651j4396L9989r8090L4955m089K6795P004j1376J5795
$$ y = [-259274, -250901, -280253, -287537, -255468, -251812, -287631, -209404, -249631, -285620, -286865, -263030, -275731, -258008, -301909, -259948, -200286, -261160, -275416, -244342, -268491, -231684, -292815, -249065, -282526, -294156, -226189, -271449, -282829, -222278, -249380, -255205, -246296, -249566, -237637, -244513, -305431, -269676, -280550, -239581, -244087, -272537, -257633, -269489, -248405, -269906, -318275, -289714, -270454, -317330, -230768, -256367, -275030, -260620, -298488, -264846, -270459, -275206, -247798, -230861, -238079, -217819, -264956, -238745, -252718, -269884, -278639, -298652, -297644, -264379, -283850, -238672, -281485, -293851, -281921, -268119, -250808, -305865, -324265, -276969, -289286, -272794, -287192, -253136, -274260, -272210, -255700, -255974, -231323, -245719, -205730, -303820, -268865, -272954, -246159, -239155, -250531, -234736]
2370b34736l6921j6179p589q985M1811m98J0210j5424n435l9201P296L4461m6126
2357c17316N9543k1679P907m3662Q0654k7357K2039J2653l8034K4453m6071J6537
2345b70333K0286k437m3544L6434l3431K7475j8790k0114K0041J1305k9673M1098
2333b61683J885l1438L0851l0388l0099J3331K2167J8864k8694N453K7731J6585
2321b45435p872O648M0399o0863l2346K6966L6888m6404l00L9572n2717J815R6995
2308a96654r3565J5715K7172j5277l4767k9212M5333j9732N3203p428k2402k8791
2296c06405q400K2504M7860n5309N9486n3573N7372o3265j3519L6751L4770p311
2284b49039k7480M301M955L6582l7988j2950J0802j6397N0345r306j9704K719
$$ y = [-234736, -271657, -287836, -295425, -304410, -262599, -263097, -252887, -268311, -273746, -312947, -305651, -271190, -317316, -257773, -279452, -271545, -315207, -234553, -261910, -239871, -227218, -265252, -240799, -286870, -270333, -250047, -252484, -296028, -259594, -293025, -265550, -284340, -304454, -284413, -273108, -302781, -261683, -259798, -291236, -260385, -290773, -320872, -307541, -285374, -266510, -295204, -289751, -262020, -245435, -253307, -246659, -206260, -267123, -299469, -272503, -235615, -282019, -282319, -242747, -295464, -293649, -196654, -290219, -274504, -247332, -262609, -297376, -326588, -281255, -300987, -247784, -255212, -277614, -306405, -314805, -292301, -244441, -299750, -240264, -293837, -236465, -299730, -313249, -276498, -241728, -249039, -276519, -272218, -267263, -230681, -268669, -281619, -270817, -287214, -236869, -246175, -265879, -263160]
2272b63160M365l755l1360R35L7266J3180R531j8037k9245j681Q047M7954o7413
2259b93373J3660M6828p1477M8757o9516O2540j7060L3010q410j9715n0483M6368
2247b78871L6155n0436O356M3938l0996O3363m6263l4939M2341j0906j8393K4178
2235b54473k2083j5153K5616K1843P621M2157j06687N3466k5538K2245k7410l0861
2223c09257J01870p395O924o1604Q157K2814k4044l5161O2670m1882M0294n4303
2211b90917J5270j9623N1714K9082n4649K9476r764L4206p757m4978J5645O023
2199b46272K5748r218q6407N3008L99k3453K2767j6274M5838q656k9998K0020
2187b52498k8420j6987J1563L6674R568J7485k6310l6941L9918r320q875L2558
$$ y = [-263160, -258795, -262550, -293910, -292975, -255709, -242529, -232998, -251035, -280280, -281961, -273914, -225960, -293373, -279713, -232885, -304362, -255605, -325121, -262581, -279641, -246631, -255041, -274756, -325239, -278871, -242716, -293152, -286796, -242858, -273854, -210491, -256754, -291693, -249352, -260258, -278651, -254473, -276556, -291709, -266093, -244250, -236629, -194472, -301159, -247693, -273231, -250986, -278396, -309257, -207387, -214782, -207858, -269462, -261305, -238491, -262535, -297696, -235026, -276908, -236614, -290917, -275647, -295270, -243556, -214474, -269123, -239647, -249411, -215205, -222962, -267940, -252295, -246272, -220524, -229742, -316149, -263141, -262742, -286195, -263428, -279702, -233864, -242520, -272518, -252498, -280918, -297905, -286342, -249668, -240100, -222615, -248925, -285866, -245948, -255268, -264143, -231585]
2175b31585l7338j383k5115J4850j6195M3421j7035L4512k5669K1260n8521N1331
2163b47467l7184L8141l6978l221M2564p479q8175N1968l2760J02675l5271J9258
2151b33929p2370O2377n9455O7072n2004j6720L9357J3501n9296K6259j5991Q0
2139c01119o797M0236l4394K8824j529j330j4312J859M6842r745l1055K9920n317
2126b57917j4652k7629N9865K2781m2683j4505j0192k076k4383P7576J7143m1929
2114b58601j8699J5817j5192O804N7974m5616j3700Q064L9053k1602R220K8712
2102b07766n7921j9761l657J8452K9318k1434k2792M2261l2396j6486N0272j931
2090b43841l5402q1k8423J221j6201P3053J0784n7614K5946K3693K4414n3733
$$ y = [-231585, -268923, -270306, -295421, -280571, -296766, -253345, -270380, -235868, -261537, -240277, -298798, -247467, -284651, -246510, -283488, -286709, -244145, -251624, -339799, -287831, -320591, -217916, -253187, -233929, -306299, -243922, -303377, -236305, -288309, -305029, -265672, -252171, -311467, -285208, -301199, -301119, -307916, -267680, -302074, -273250, -274779, -276109, -290421, -288562, -241720, -251465, -282520, -252600, -257917, -272569, -300198, -240333, -217552, -260235, -274740, -284932, -287008, -311391, -233815, -216672, -258601, -277300, -261483, -276675, -269871, -211897, -257513, -271213, -263149, -224096, -245698, -236478, -207766, -265687, -285448, -289105, -270653, -241335, -262769, -285561, -243300, -275696, -292182, -241910, -243841, -279243, -279324, -307747, -306526, -322727, -249674, -238890, -296504, -270558, -246865, -222451, -276184]
2078b76184J8732K91K8342Q765n4944J6885l3853m953J00148j26915O2902o337
2066b67121J6018J6148o1673M5275p419L9276o2697q744K0207J249J7663J9361
$$ y = [-276184, -257452, -257161, -228819, -220054, -274998, -258113, -291966, -296919, -196771, -323686, -260784, -267121, -251103, -234955, -296628, -251353, -258772, -219496, -282193, -290937, -270730, -269481, -251818, -232457]
$$ [...]
##END NTUPLES=NMR SPECTRUM
##END=
