##TITLE=abcd
##JCAMPDX= 6.0         $$ Bruker NMR JCAMP-DX V2.0
##DATA TYPE= NMR SPECTRUM
##DATA CLASS= NTUPLES
##ORIGIN= UXNMR, Bruker Analytische Messtechnik GmbH
##OWNER= root
$$ XWIN-NMR		Version 3.5
$$ Sat Feb 15 11:35:32 2025 Russian Standard Time (UT+4h)  servis@DPX200
##.OBSERVE FREQUENCY= 200.131235884673
##.OBSERVE NUCLEUS= ^1H
##.ACQUISITION MODE= SIMULTANEOUS
##.ACQUISITION SCHEME= undefined
##.AVERAGES= 32
##.DIGITISER RES= 18
##SPECTROMETER/DATA SYSTEM= spect
##.PULSE SEQUENCE= zg
##.SOLVENT NAME= D2O
##.SHIFT REFERENCE= (INTERNAL, D2O, 0, 16.4885)
##AUDIT TRAIL= $$ (NUMBER, WHEN, WHO, WHERE, WHAT)
$$ ##TITLE= Audit trail, XWIN-NMR		Version 3.5
$$ ##JCAMPDX= 5.01
$$ ##ORIGIN= Bruker BioSpin GmbH
$$ ##OWNER= servis
$$ F:\spectra/data/av/nmr/H1/1/pdata/1/auditp.txt
$$ ##AUDIT TRAIL=  $$ (NUMBER, WHEN, WHO, WHERE, WHAT)
(   1,<2025-02-15 11:30:49.57 +0400>,<servis>,<DPX200>,
      <created by zg, POWCHK disabled, PULCHK disabled
       configuration hash MD5:
       00 E9 B6 7A A2 85 ED C7 34 08 36 98 17 FE 4E 26
       data hash MD5: 32K
       9F 03 2D E1 28 66 18 AF A0 2B AA A5 EF 57 B9 ED>)
(   2,<2025-02-15 11:34:28.32 +0400>,<servis>,<DPX200>,
      <Start of raw data processing
       efp BC_mod = 2 LB = 0.05 FT_mod = 6 PKNL = 1 PHC0 = -263.3254 PHC1 = 1.301534 SI = 16K 
       data hash MD5: 16K
       32 41 B3 77 84 7B E1 13 7B 14 9C 40 C9 7D A8 1F>)
(   3,<2025-02-15 11:34:41.28 +0400>,<servis>,<DPX200>,
      <pk PHC0 = -2.8 PHC1 = 0 
       data hash MD5: 16K
       6E 51 6C 40 E7 E3 7F 5C 7B 56 A5 F6 66 81 02 74>)
$$ ##END=
$$ 
$$ hash MD5
$$ 88 49 BF 55 B9 6A 22 81 32 26 9F C0 A8 82 50 41
##$RELAX= 
##$RELAX= 
##$RELAX= 
##$RELAX= 
##$RELAX= 
##$RELAX= 
##$RELAX= 
##$RELAX= 
$$ Bruker specific parameters
$$ --------------------------
##$DU= <F:\spectra>
##$EXPNO= 1
##$NAME= <H1>
##$PROCNO= 1
##$TYPE= <nmr>
##$USER= <av>
##$AMP= (0..31)
100 100 100 100 100 100 100 100 100 100 100 100 100 100 100 100 100 100 
100 100 100 100 100 100 100 100 100 100 100 100 100 100 
##$AQSEQ= 0
##$AQ_mod= 1
##$AUNM= <au_zg>
##$AUTOPOS= <>
##$BF1= 200.13
##$BF2= 200.13
##$BF3= 200.13
##$BF4= 200.13
##$BF5= 500.13
##$BF6= 500.13
##$BF7= 500.13
##$BF8= 500.13
##$BYTORDA= 1
##$CFDGTYP= 0
##$CFRGTYP= 5
##$CHEMSTR= <none>
##$CNST= (0..31)
1 1 145 1 1 1 1 1 1 1 1 1 1 1 1 1 1 1 1 1 1 1 1 1 1 1 1 1 1 1 1 1 
##$CPDPRG= <>
##$CPDPRG1= <>
##$CPDPRG2= <>
##$CPDPRG3= <>
##$CPDPRG4= <mlev>
##$CPDPRG5= <mlev>
##$CPDPRG6= <mlev>
##$CPDPRG7= <mlev>
##$CPDPRG8= <mlev>
##$CPDPRGB= <>
##$CPDPRGT= <>
##$D= (0..31)
0 2 0 0 0 0 0 0 0 0.06 0 0 0 0 0 0 0.0002 0 0 0 0 0 0 0 0 0 0 0 0 0 0 
0 
##$DATE= 1739604649
##$DBL= (0..7)
120 120 120 120 120 120 120 120 
##$DBP= (0..7)
150 150 150 150 150 150 150 150 
##$DBP07= 0
##$DBPNAM0= <>
##$DBPNAM1= <>
##$DBPNAM2= <>
##$DBPNAM3= <>
##$DBPNAM4= <>
##$DBPNAM5= <>
##$DBPNAM6= <>
##$DBPNAM7= <>
##$DBPOAL= (0..7)
0.5 0.5 0.5 0.5 0.5 0.5 0.5 0.5 
##$DBPOFFS= (0..7)
0 0 0 0 0 0 0 0 
##$DE= 6
##$DECBNUC= <off>
##$DECIM= 32
$$ [...]
##$SUBNAM4= <"">
##$SUBNAM5= <"">
##$SUBNAM6= <"">
##$SUBNAM7= <"">
##$SUBNAM8= <"">
##$SUBNAM9= <"">
##$SW= 20.6817932712277
##$SWIBOX= (0..15)
0 0 3 0 0 0 0 0 0 0 0 0 0 0 0 0 
##$SW_h= 4139.07284768212
##$TD= 32768
##$TD0= 1
##$TE= 0
##$TE2= 300
##$TE3= 300
##$TEG= 300
##$TL= (0..7)
0 120 120 120 120 120 120 120 
##$TP= (0..7)
150 150 150 150 150 150 150 150 
##$TP07= 0
##$TPNAME0= <>
##$TPNAME1= <>
##$TPNAME2= <>
##$TPNAME3= <>
##$TPNAME4= <>
##$TPNAME5= <>
##$TPNAME6= <>
##$TPNAME7= <>
##$TPOAL= (0..7)
0.5 0.5 0.5 0.5 0.5 0.5 0.5 0.5 
##$TPOFFS= (0..7)
0 0 0 0 0 0 0 0 
##$TUNHIN= 0
##$TUNHOUT= 0
##$TUNXOUT= 0
##$USERA1= <user>
##$USERA2= <user>
##$USERA3= <user>
##$USERA4= <user>
##$USERA5= <user>
##$V9= 5
##$VALIST= <valist>
##$VCLIST= <CCCCCCCCCCCCCCC>
##$VD= 0
##$VDLIST= <DDDDDDDDDDDDDDD>
##$VPLIST= <PPPPPPPPPPPPPPP>
##$VTLIST= <TTTTTTTTTTTTTTT>
##$WBST= 1024
##$WBSW= 30
##$XGAIN= (0..3)
0 0 0 0 
##$XL= 0
##$YL= 0
##$YMAX_a= 319307
##$YMIN_a= -315962
##$ZGOPTNS= <>
##$ZL1= 120
##$ZL2= 120
##$ZL3= 120
##$ZL4= 120
##$ABSF1= 0
##$ABSF2= 0
##$ABSG= 0
##$ABSL= 0
##$ALPHA= 0
##$AQORDER= 0
##$ASSFAC= 0
##$ASSFACI= 0
##$ASSFACX= 0
##$ASSWID= 0
##$AUNMP= <proc_1d>
##$AZFE= 0.1
##$AZFW= 0.1
##$BCFW= 0
##$BC_mod= 2
##$BYTORDP= 0
##$COROFFS= 0
##$CY= 18.4799938201904
##$DATMOD= 1
##$DC= 0
##$DFILT= <>
##$DTYPP= 0
##$F1P= 9.9274215381318
##$F2P= -0.165520771350173
##$FCOR= 1
##$FTSIZE= 16384
##$FT_mod= 6
##$GAMMA= 0
##$GB= 0
##$INTBC= 1
##$INTSCL= 4.127829e-11
##$ISEN= 128
##$LB= 0.05
##$LEV0= 0
##$LPBIN= 0
##$MAXI= 10000
##$MC2= 0
##$MEAN= 0
##$ME_mod= 0
##$MI= 50
##$NCOEF= 0
##$NC_proc= -6
##$NLEV= 6
##$NOISF1= 3.799351
##$NOISF2= 2.8
##$NSP= 0
##$NTH_PI= 0
##$NZP= 0
##$OFFSET= 16.48848
##$PC= 4
##$PHC0= -266.1254
##$PHC1= 1.301534
##$PH_mod= 1
##$PKNL= yes
##$PPARMOD= 0
##$PSCAL= 4
##$PSIGN= 0
##$REVERSE= no
##$SF= 200.130005582386
##$SI= 16384
##$SIGF1= 3
##$SIGF2= 2
##$SINO= 400
##$SIOLD= 16384
##$SREGLST= <1H.CDCl3>
##$SSB= 0
##$STSI= 16384
##$STSR= 0
##$SW_p= 4139.07284768211
##$SYMM= 0
##$S_DEV= 0
##$TDeff= 32768
##$TDoff= 0
##$TI= <>
##$TILT= no
##$TM1= 0
##$TM2= 0
##$TOPLEV= 0
##$USERP1= <user>
##$USERP2= <user>
##$USERP3= <user>
##$USERP4= <user>
##$USERP5= <user>
##$WDW= 1
##$XDIM= 16384
##$YMAX_p= 279959932
##$YMIN_p= -998246
$$ End of Bruker specific parameters
$$ ---------------------------------
##NTUPLES= NMR SPECTRUM
##VAR_NAME=  FREQUENCY,     SPECTRUM/REAL,   SPECTRUM/IMAG
##SYMBOL=    X,             R,               I
##VAR_TYPE=  INDEPENDENT,   DEPENDENT,       DEPENDENT
##VAR_FORM=  AFFN,          ASDF,            ASDF
##VAR_DIM=   16384,         16384,           16384
##UNITS=     HZ,            ARBITRARY UNITS, ARBITRARY UNITS
##FACTOR=    0.252644378177508, 1,           1
##FIRST=     3299.83951724647, 0,            0
##LAST=      -839.233330435636, 0,           0
##MIN=       -839.233330435636, -998246,     0
##MAX=       3299.83951724647, 279959932,    0
$$ Real data points
##PAGE= N=1
##DATA TABLE= (X++(R..R)), XYDATA
$$ [...]
10078D937070n8037K1625k2761o0998j71924k06291j05354j80332l05268r9108
10068C748622j54619j68881k96221q1929j8605J2906r7979J33828j77534j19441
10058B780147m4988r6913l0738J92939k06583o5314m1934J69816j09700J05866
10048B652598M9028j55795q317j9243J49575O9665n0593m6528N43K34341j85135
10037B690139o2863J34246M6988m8585J50395J48239l7393P0181j47216K20372
10027C164503J16916j58383K5739K77347K0405m3263P0752L3510R7742O0939M6845
10016C713052L1784L02291M1266Q4111K92165j40202J26235J03509J57656L48348
10006E060215Q7056J66837K40748K35947L55863L7014M25263Q3855M13738L95839
$$ y = [4937070, 4879033, 4900658, 4877897, 4816899, 4644975, 4438684, 4333330, 4152998, 3847730, 3748622, 3594003, 3425122, 3128901, 3046972, 3028367, 3041273, 2943294, 3077122, 2899588, 2780147, 2735159, 2638246, 2607508, 2800447, 2593864, 2528550, 2486616, 2656432, 2546732, 2652598, 2701626, 2545831, 2537514, 2518271, 2667846, 2737511, 2686918, 2640390, 2640933, 2875274, 2690139, 2627276, 2761522, 2808510, 2759925, 2910320, 3058559, 3021166, 3091347, 2944131, 3164503, 3281419, 3123036, 3148775, 3426122, 3446527, 3403264, 3474016, 3507526, 3605268, 3666207, 3713052, 3744836, 4047127, 4088393, 4172504, 4464669, 4324467, 4450702, 4554211, 4711867, 5060215, 5147271, 5314108, 5554856, 5790803, 6146666, 6183680, 6608943, 6692798, 7106536, 7502375]
9996G502375K38402K44263P39289M35321N49137N55546N76072Q21137P49970R74239
9986A3385751P66273J096109J190158J142153J265281J463569J520507J783807
9978B3613608J833077J921533K369039K417751K815177K979303L043317L439803
9970D4432608L285809K792463K467787J737358J693557Q66979M37306o33758j140161
9961E5939948j396075j719990k183119j861620j518838j520908r58053n21750
9953D4259595m57134L55992M40109Q83629J246801J816782K130724K243287K318333
9944E5238118K121543J508459J287754M05409q9376j015980j438834k304149k666890
9935E3046054l225667l492629l492068l356645l010118k915694k642551k025993
$$ y = [7502375, 7740777, 7985040, 8724329, 9159650, 9708787, 10264333, 10840405, 11661542, 12411512, 13385751, 14152024, 15248133, 16438291, 17580444, 18845725, 20309294, 21829801, 23613608, 25446685, 27368218, 29737257, 32155008, 34970185, 37949488, 40992805, 44432608, 47718417, 50510880, 52978667, 54716025, 56409582, 57276561, 57713867, 57080109, 55939948, 54543873, 52823883, 50640764, 48779144, 47260306, 45739398, 44781345, 44259595, 43802461, 44158453, 44598562, 45482191, 46728992, 48545774, 50676498, 52919785, 55238118, 57359661, 58868120, 60155874, 60561283, 60471907, 59455927, 58017093, 55712944, 53046054, 49820387, 46327758, 42835690, 39479045, 36468927, 33553233, 30910682, 28884689]
9927B8884689k148675j859758j569742j383523j348021j121515j027492q98347
9919A7527616m75719q89829k45199p58974l77569m16498k68914l83919n76427
9910A3134568l05538l72628k12610m24616m82631m53992l55008o19894j18930
9901I788721m72324j28315l12816k76777j01595k85885j6372K700R4438n3856
9891H237919L4464o4402J43497K1062j41243o8697r7817p5779k26741j798l78601
9880G381864r5886l39513k87688l96273k44667j49359k69412q5466k33320p8756
9870E201524j29959j46642k04797O7329l5007j24973n6726k15949N5887j05223
9860D305464k51029j2611K45688k07457j45205J62680j8954j56383L24018l08959
$$ y = [28884689, 26736014, 24876256, 23306514, 21922991, 20574970, 19453455, 18425963, 17527616, 17051897, 16162068, 15916869, 15157895, 14780326, 14363828, 14094914, 13710995, 13134568, 12829030, 12456402, 12243792, 11819176, 11336545, 10882553, 10527545, 9907651, 9788721, 9316397, 9188082, 8875266, 8598489, 8496894, 8211009, 8194637, 8197337, 8291775, 8237919, 8272383, 8207981, 8351478, 8372540, 8231297, 8162600, 8064783, 7989004, 7762263, 7760465, 7381864, 7285978, 6946465, 6658777, 6262504, 6017837, 5868478, 5599066, 5513600, 5280280, 5201524, 5071565, 4924923, 4720126, 4787455, 4752448, 4627475, 4570749, 4354800, 4410687, 4305464, 4054435, 4041824, 4287512, 4080055, 3934850, 4097530, 4078576, 3922193, 4246211, 3937252]
9850C937252K56603k5769p4455K57q5890J131J08090j30939K38504k07037J54566
9839D172313j23270J3337N407J04017L63342j91355Q1566K5678J75237j27981
9829D498291J92750p8528K67397J61591N0351j0500K42837j29099L13683K22950
9819E731723l4901M09469K84628J64277K39250L25550L66918L90029K97536L53287
9809H527766K54096N41020O66528K77585O51137P45035N06267O73039R20894Q20234
9799A4583601J152823J297256J191802J323821J160211J227104R65066O73310
9791B3574994N40861M92861L6138O1368k46603m37992m09216n33842l57542k23497
9781B2497530J13514j13075N35789O42880L00529Q52310P28662R03573J227651
$$ y = [3937252, 4193855, 4168086, 4093631, 4093888, 4007998, 4009129, 4117219, 3986280, 4224784, 4017747, 4172313, 4049043, 4062380, 4067787, 4171804, 4535146, 4343791, 4425357, 4451035, 4626272, 4498291, 4691041, 4612513, 4879910, 5041501, 5091852, 5081352, 5324189, 5195090, 5508773, 5731723, 5696822, 6106291, 6390919, 6555196, 6794446, 7119996, 7486914, 7876943, 8174479, 8527766, 8781862, 9322882, 9989410, 10266995, 10918132, 11663167, 12169434, 12842473, 13763367, 14583601, 15736424, 17033680, 18225482, 19549303, 20709514, 21936618, 22901684, 23574994, 24115855, 24608716, 24644854, 24706222, 24459619, 24021627, 23612411, 23078569, 22721027, 22497530, 22611044, 22497969, 23033758, 23676638, 23977167, 24829477, 25558139, 26461712, 27689363]
9772B7689363J417363J649704J866105K023423K411364K574281K957962K885213
9764D5474778K433196K721366K098338J826653J141957N02195J69493p02874j071206
9755E4593896j410248k248562k246831k383595k635398j958733j829486j296610
9747C8584433j098015q29654o31718n50315J55215O8721N73603P11422Q83688
9738C7867380J361404J646272K138618K280780K339332K564252J839812J402697
9730E3440547Q65660K46319j39792n75594j449926j670798k195139k384495k599229
9721D3537553k327967j805861j793299j273830r27752p81842o85216K1074o6558
9712C3896302J81772N11094N68511Q25788Q97082J664310J403739J869126K154588
$$ y = [27689363, 29106726, 30756430, 32622535, 34645958, 37057322, 39631603, 42589565, 45474778, 47907974, 50629340, 52727678, 54554331, 55696288, 56198483, 56367976, 55665102, 54593896, 53183648, 50935086, 48688255, 46304660, 43669262, 41710529, 39881043, 38584433, 37486418, 36656764, 36025046, 35474731, 35629946, 35698667, 36272270, 36983692, 37867380, 39228784, 40875056, 43013674, 45294454, 47633786, 50198038, 52037850, 53440547, 54306207, 54552526, 54412734, 53837140, 52387214, 50716416, 48521277, 46136782, 43537553, 41209586, 39403725, 37610426, 36336596, 35408844, 34627002, 33941786, 33962860, 33896302, 34078074, 34589168, 35157679, 35983467, 36880549, 38544859, 39948598, 41817724, 43972312]
9703D3972312K392522K871364K985116L393945M100344L776450M048740L388526
9695G0929319L102010K307024J380803Q07789O55008j95636r15907j489463k712975
9686G3867972l461307l981301m041889l992592l683035l046766l018279k379285
9678D6263518j962189j716918j617780j145933j192570n85435m78215l0447J39533
9669C7673564N49938R00155Q93687J479160J592682J797815J336183J208116Q05867
9660D8237167M08561j88647k80002r13176p43422j028503j648347j851567k008997
9651C9983067k335863j920276k364079k124499j801841j545252j673560j408147
9643B4809550j311067q17554j287474r45324r70762n88020q22618p67526q14773
$$ y = [43972312, 46364834, 49236198, 52221314, 55615259, 59715603, 63492053, 67540793, 70929319, 74031329, 76338353, 77719156, 78526945, 79181953, 78986317, 78070410, 76580947, 73867972, 70406665, 66425364, 62383475, 58390883, 54707848, 51661082, 48642803, 46263518, 44301329, 42584411, 40966631, 39820698, 38628128, 38042693, 37564478, 37534031, 37673564, 38223502, 39123657, 40017344, 41496504, 43089186, 44887001, 46223184, 47431300, 48237167, 48645728, 48457081, 48177079, 47263903, 46520481, 45491978, 43843631, 41992064, 39983067, 37647204, 35726928, 33362849, 31238350, 29436509, 27891257, 26217697, 24809550, 23498483, 22680929, 21393455, 20448131, 19477369, 18889349, 18066731, 17299205, 16484432]
9634A6484432p13921o11002q11719o57666n06963n63108o05626k03646n68448
9625A1242333n22311p3002n89478k04347k63346k09889m28090K8618m05454n8538
9615H516496J844N2411k54964p4118R9312j72859j43260j4113k50328r4718l11845
9604G353858k09046p3654k42691j94734k45180l37202L2785j48420l34631j00877
9594E500208o0287k66018r4271l5868q3346j41448j2973k32357N4484K0884k94456
9583D354552J21293k37416R0769l81716K36009j2703l6975k1026M2148k02102
9573C952833K22089l09881p6674J32824j683N2765N531J33910o8567k9233j07485
9562C906429R3675l48971K68027k4911k57129K26937o4854P2429O9070j84898
$$ y = [16484432, 15770511, 15159509, 14347790, 13690124, 13183161, 12620053, 12014427, 11810781, 11242333, 10720022, 10647020, 10057542, 9853195, 9589849, 9379960, 8951870, 8980488, 8575034, 8516496, 8518340, 8570751, 8315787, 8241669, 8340981, 8168122, 8024862, 8010749, 7760421, 7665703, 7353858, 7144812, 7071158, 6828467, 6633733, 6388553, 6051351, 6084136, 5935716, 5601085, 5500208, 5439921, 5173903, 5079632, 5043764, 4960418, 4818970, 4805997, 4573640, 4628124, 4649008, 4354552, 4475845, 4238429, 4329198, 3947482, 4183491, 4170788, 4133813, 4112787, 4154935, 3952833, 4174922, 3865041, 3788367, 3921191, 3919508, 3972273, 3977804, 4111714, 4043147, 4013914, 3906429, 4000104, 3651133, 3919160, 3894249, 3637120, 3864057, 3799203, 3871632, 3940702, 3755804]
9552C755804K3624q6710j12337L16810k57768P1158j88922L46181j78791K01792
9542C890841j15569n7671J40365k0503q4894J41378J8641j90432K38267j6108
9532C944315j25332J49311J2091j33287K30533m9687K09186p5186k01687N15318
9522D475575j51049K8702j39897K50508R2161J98228j10329J28693K65464j351
9512E036705J15223q3833J48008L13960J30294L08859J95687j13714R7394K56443
9502F405026M64310L054L32610J03606N78239J68135L33747N62399M61310L21348
9492I733784N77044P28479N34517P80478M51202R04984N92727M52138Q21129O81290
9482A6257772O31621O23247Q39617P03957N88835P53260Q46815J018105R25564
$$ y = [3755804, 3779428, 3692718, 3580381, 3897191, 3639423, 3710581, 3521659, 3867840, 3689049, 3890841, 3775272, 3717601, 3857966, 3837463, 3752569, 3893947, 3912588, 3722156, 3960423, 3944315, 3818983, 3968294, 3980385, 3847098, 4077631, 4027944, 4237130, 4161944, 3960257, 4475575, 4324526, 4353228, 4213331, 4463839, 4556000, 4754228, 4643899, 4772592, 5038056, 5036705, 5151928, 5068095, 5216103, 5530063, 5660357, 5969216, 6164903, 6051189, 6148583, 6405026, 6869336, 6872390, 7205000, 7308606, 7886845, 8054980, 8388727, 8951126, 9412436, 9733784, 10310828, 11039307, 11573824, 12354302, 12805504, 13710488, 14303215, 14755353, 15576482, 16257772, 16889393, 17512640, 18352257, 19056214, 19645049, 20398309, 21245124, 22263229, 23188793]
9473B3188793J057666J227064J640597J775832K148104K656593K686031K729348
9465C9110028L012899K218318J227020P54147K19631q7806p5552L96830O63228
9456D7438743J060521J319940J726694J585612J219344L99907o1902p58144r14218
9447E3016497p50646m44750L98486N89876J307057P22557O48310j50008p92725
9438E4544654j173795j389424j474207r74328n50296L08267Q52601P47019R56306
9429E1846797K75320o88991j920765k657811l129714l356888l128662k625872
9421C4613414k264659k299622j699410j476344j451346r81384j186509j072713
9413B2181427r03993q46795q51966r25740q80322q12594j018564q62481q63896
$$ y = [23188793, 24246459, 25473523, 27114120, 28889952, 31038056, 33694649, 36380680, 39110028, 42122927, 44341245, 45568265, 46322412, 46542043, 46454237, 46378685, 46775515, 47438743, 48499264, 49819204, 51545898, 53131510, 54350854, 54750761, 54688859, 53930715, 53016497, 52265851, 51821101, 52219587, 52809463, 54116520, 54839077, 55487387, 55337379, 54544654, 53370859, 51981435, 50507228, 49532900, 48982604, 49290871, 50143472, 50890491, 51846797, 52122117, 51433126, 49512361, 46854550, 43724836, 40367948, 37239286, 34613414, 32348755, 30049133, 28349723, 26873379, 25422033, 24440649, 23254140, 22181427, 21277434, 20430639, 19578673, 18652933, 17772611, 16960017, 15941453, 15078972, 14215076]
9404A4215076q62246m28831p01475n11933o68648n49194l66244m36274l97533
9395I292698K983m96820k19631j80352k80829j93486k15870J90866j48789j16960
9385G633810l20935J56114M1083j26238J19530n0795j04832j93118j06938j24182
9375F923499J0578j81481R8713k61190k64094N6616j67223k04436J54659j35551
9365F030090j8056q2762l7206R5298J28545k0162K54770m573J88609j09030R1337
9354F516860N8197K54514J41532k66456o9495q4168o7119j66070k27896p1224
9344F018675L8624l89311O452k25490l77140L8586l5668p3412p3469j46848M2856
9333D823855J01025q1182QJ04361K6440K9667J14436N5042q3190j2778J9793M4093
$$ y = [14215076, 13352830, 12923999, 12222524, 11710591, 11041943, 10492749, 10126505, 9690231, 9292698, 9295681, 8798861, 8579230, 8398878, 8118049, 7924563, 7708693, 7899559, 7750770, 7633810, 7312875, 7468989, 7510072, 7383834, 7503364, 7452569, 7347737, 7154619, 7047681, 6923499, 6934077, 6752596, 6851309, 6590119, 6326025, 6382641, 6215418, 6010982, 6165641, 6030090, 6012034, 5929272, 5892066, 5987364, 6115909, 6095747, 6350517, 6345944, 6534553, 6425523, 6516860, 6575057, 6829571, 6971103, 6704647, 6635152, 6550984, 6483865, 6317795, 6089899, 6018675, 6057299, 5667988, 5674440, 5448950, 5071810, 5110396, 5074728, 5001316, 4927847, 4780999, 4823855, 4924880, 4843698, 4843706, 4948067, 4974507, 5004174, 5118610, 5173652, 5090462, 5077684, 5097477, 5141570]
9321E141570k10676j69015J53238j08231j72197o0537j21338p1917j04459J08192
9311D384630k71140p1017O0027J58368j90615r7584p0134N3108j48851K27645
9301D034437N1289J26743k52197m2520J24897O8712J31865n7740J0678j78635
9291D017529J79134J94800k28257J66233N407j051m9715J03953K45216j83782
9281D449467Q7312j8342J17807J84960M3648l8418J10272N1326Q9899J73617J63975
9270E415523k5233R7799K75315J1310K07405K29227K19812r5745L53750Q4212
9260F773375J50298K89184r553L00234K04906L30449L58590L47185N05152K44526
9250I494346M34265N43866K76650P53692L07695O43683Q83153J061528M49178
$$ y = [5141570, 4930894, 4761879, 4915117, 4806886, 4634689, 4574152, 4452814, 4380897, 4276438, 4384630, 4113490, 4042473, 4102500, 4260868, 4070253, 3972669, 3902535, 3955643, 3806792, 4034437, 4085726, 4212469, 3960272, 3917752, 4042649, 4111361, 4243226, 4185486, 4196164, 4017529, 4196663, 4391463, 4163206, 4329439, 4334846, 4333795, 4284080, 4388033, 4633249, 4449467, 4536779, 4518437, 4636244, 4821204, 4864852, 4826434, 4936706, 4988032, 5077931, 5251548, 5415523, 5390290, 5488089, 5763404, 5774714, 5982119, 6211346, 6431158, 6335413, 6689163, 6773375, 6923673, 7212857, 7203304, 7503538, 7708444, 8038893, 8397483, 8744668, 9249820, 9494346, 9928611, 10472477, 10749127, 11502819, 11810514, 12454197, 13337350, 14398878, 14848056]
9241A4848056J279600P36778J119709J123606J242111J585019J558880J637891
9233B5131650J627851K340680K409727K233229K909405K149192K550070J851930
9225D3203734J706404J559715J407058J533977J389145J112725N30280L77678
9217E2820716L34752L42820J19228O21103Q99884J286500J898832K082665K601289
9208F3007789L438357L603228M812082M784501N485727N654947M979718M134975
9200I9901324K748220J661479O87793K8702n67352n16627p32849n96917j088909
9191A01524864j171482j571971k079303k511808l034201l112119k739861k199139
9183H3104980j592259p64821r1850J28064L5933J88641k13869l59907p57481p16914
$$ y = [14848056, 16127656, 16864434, 17984143, 19107749, 20349860, 21934879, 23493759, 25131650, 26759501, 29100181, 31509908, 33743137, 36652542, 38801734, 41351804, 43203734, 44910138, 46469853, 47876911, 49410888, 50800033, 51912758, 52443038, 52820716, 53155468, 53498288, 53617516, 54238619, 55138503, 56425003, 58323835, 60406500, 63007789, 66446146, 70049374, 74861456, 79645957, 85131684, 90786631, 95766349, 99901324, 102649544, 104311023, 104998816, 105027518, 104460166, 103943539, 103210690, 102613773, 101524864, 100353382, 98781411, 96702108, 94190300, 91156099, 88043980, 85304119, 83104980, 81512721, 80747900, 80656050, 80784114, 80820047, 81008688, 80794819, 80434912, 79677431, 78960517]
9173G8960517m89795o69430l50522m40760J4342k03106m86871j222392k502061
9164G2609922l191346m179422m669388m335740l996197l822230l135773k809116
9156D2470710k584436k113608k011150j770313j706097j685031j298954j500685
9148B7800436j051483j032670j358027q66888r59557q35555q83681o33186m32331
9139A9747058m87625l85855n09133m48336l51324p14886l47631n18571m99776
9130A5483921l51267o22951o40129j91328l91483l21262o55548k82255k53306
9121A1774392m19541l56645k04855m01668j82691k14277o6728k1316K7163k02202
9111I731632Q2023l05685K1106l9829j20847j73617j76790j63943m5477j62290
$$ y = [78960517, 78470722, 77801292, 77450770, 77010010, 77024352, 76821246, 76334375, 75111983, 72609922, 69418576, 65239154, 60569766, 56234026, 52237829, 48415599, 45279826, 42470710, 39886274, 37772666, 35761516, 33991203, 32285106, 30600075, 29301121, 27800436, 26748953, 25716283, 24358256, 23491368, 22531811, 21696256, 20812575, 20179389, 19747058, 19259433, 18873578, 18364445, 17916109, 17564785, 16849899, 16502268, 15983697, 15483921, 15132654, 14509703, 13869574, 13678246, 13286763, 12965501, 12309953, 12027698, 11774392, 11354851, 10998206, 10793351, 10391683, 10208992, 9994715, 9927987, 9906671, 9933834, 9731632, 9813655, 9507970, 9529076, 9489247, 9368400, 9194783, 9017993, 8854050, 8808573, 8646283]
9101H646283q6698m63935k18902m4036k68519l60358p3554k03904j0215j47530
9091F768632j38265J01337k2840p4739l16015J87644K7854K14970o8006L99234
9081G079806L0570K55986K80606J15246L1679P4538K54415k00109k34450r9067
9071G589220k71412l54990m32373j74689l50297l17464M0562l89140J5163k85375
9061E069205j08970J5537l1686k56454J55223m9114J2733J40614j14757K77898
9051E110229J28611O6688K17305j30037j28555L27429j89728j60546n9688n08833
9041D672875K02437k84717k67991j45715q9336k16874O3160o5774j38500J16932
9031C846497j69621M9971K1140j58167J38571p4624l100J71850K77122p6382K99892
$$ y = [8646283, 8559585, 8095650, 7876748, 7832712, 7564193, 7203835, 7130281, 6926377, 6916162, 6768632, 6630367, 6731704, 6708864, 6634125, 6318110, 6505754, 6533608, 6748578, 6680572, 7079806, 7110376, 7366362, 7646968, 7762214, 7793893, 7868431, 8122846, 7922737, 7688287, 7589220, 7317808, 6962818, 6530445, 6355756, 6005459, 5687995, 5728557, 5339417, 5354580, 5069205, 4960235, 4975772, 4944086, 4687632, 4842855, 4793741, 4806474, 4947088, 4832331, 5110229, 5238840, 5305528, 5522833, 5392796, 5264241, 5591670, 5401942, 5241396, 5181708, 4672875, 4875312, 4590595, 4322604, 4176889, 4087553, 3870679, 3933839, 3868065, 3729565, 3846497, 3676876, 3726847, 3747987, 3589820, 3728391, 3653767, 3650667, 3822517, 4099639, 4023257, 4323149]
9020D323149J02501J7700j73010L27903k67064l04052Q177j65281j8482l13202
9010C538339k64123J9367l21178J63860l10653o945l40409J9349o4188j31005
9000B302414J29532Q336n6748p1484j85787J10165O0367n6525o6794o4007M25029
8989B534498j17424k32139P9726n8734J5500k19691j76273m9054j71688L2606
8979A637327k11132J46244j60975k96340L14300m2774j92700m1211Q7731k03949
8969A036521J24759j59510Q7004r6549J36744K213j58436N0706J02634k41223
8959H84863K97060j04167k74806J1749k6371R9207k7660j70670K79774j65994
8949H02985L136j29453J22031L00477l54245j6025J14021k09728K76141l67996
$$ y = [4323149, 4425650, 4443350, 4270340, 4598243, 4331179, 4027127, 4035304, 3870023, 3851541, 3538339, 3274216, 3293583, 2972405, 3136265, 2825612, 2818667, 2478258, 2497607, 2433419, 2302414, 2431946, 2440282, 2383534, 2312050, 2126263, 2236428, 2296795, 2240270, 2173476, 2109469, 2534498, 2417074, 2184935, 2264661, 2205927, 2221427, 2001736, 1825463, 1776409, 1604721, 1637327, 1426195, 1572439, 1411464, 1115124, 1429424, 1386650, 1193950, 1152739, 1240470, 1036521, 1161280, 1001770, 1088774, 992225, 1128969, 1131182, 972746, 1023452, 1126086, 884863, 1181923, 1077756, 802950, 814699, 788328, 887535, 859875, 689205, 968979, 802985, 806121, 676668, 798699, 1099176, 744931, 728906, 842927, 633199, 909340, 541344]
8939E41344J40981R6315K7201j28605J15752O008J50752k37186J7522p9387J19702
8928G70399j32861Q4699m3113R8774j72279j3483J82949j19738N2041m7302j3821
8917F46265l5549m8354N8171J01254j84920K8660L6037l2158J53277j75286J07927
8906F55324O873J72475j62323N9805j43487R3812j07701J13880J3336J7837j25199
8895E94632P8148j1826N9810J08928j70219J04211j30544r8191K44220q3269K18388
8884I14288k23599J82877k73378J52917q1592j30767M02811q2538j12045n8422
8874F90552J07908o572K9496j64212J50870r4330J47216n1096Q1881j48619p10
8863G42384N6806j02525K08871j66915N5999Q4788j5816m6071J273P1123l78450
$$ y = [541344, 682325, 778640, 805841, 677236, 792988, 798996, 949748, 712562, 730084, 650697, 770399, 637538, 722237, 679124, 777898, 605619, 592136, 775085, 655347, 707388, 660086, 646265, 610716, 562362, 620533, 721787, 536867, 565527, 601564, 569406, 722683, 547397, 655324, 662197, 834672, 672349, 732154, 588667, 682479, 574778, 688658, 701994, 719831, 594632, 672780, 660954, 720764, 829692, 659473, 763684, 633140, 534949, 779169, 695900, 914288, 690689, 873566, 600188, 753105, 671513, 540746, 943557, 861019, 748974, 690552, 798460, 791888, 821384, 657172, 808042, 713712, 860928, 809832, 891713, 743094, 742384, 799190, 696665, 905536, 738621, 794620, 879408, 863592, 817521, 818794, 889917, 511467]
8852E11467K50434n319k8674p3412k6461J24311O3870m840k4317j51949N1169
8841F86279K6267j45506K04660k24644J63546j26904R3702m8800K6894j15989
8831E39505N7637J05848r25q6274L4233k6308K4993p0245L3584R6646l5836r5730
8819E77128j32657J75982j25057K6220k364q8522N9412M8928p7170O6776j11546
8808D17130R447M1674J3644l3519r9831L4465Q6605n4423r1120J71597p6953j17536
8796C01180P3977k9163J29725r6915Q3109j07529n3736P4173j00036J34144j41631
8785B67298K88422q0768k09038m4885J98529m0355L7332J387j62404m6926j3998
8774A94594J57739k63740K26639o5954N1627k52165M0893J66223o0471Q0129j57159
$$ y = [511467, 761901, 756582, 727908, 654496, 628035, 752346, 816216, 811376, 787059, 635110, 686279, 712546, 567040, 771700, 547056, 710602, 583698, 677400, 628600, 655494, 539505, 597142, 702990, 702065, 615791, 650024, 623716, 648709, 578464, 612048, 708694, 672858, 577128, 444471, 620453, 495396, 521616, 519252, 430730, 490142, 539070, 461900, 528676, 417130, 426577, 468251, 481895, 448376, 348545, 383010, 469615, 415192, 324072, 495669, 418716, 301180, 375157, 345994, 475719, 378804, 461913, 354384, 300648, 374821, 274785, 408929, 267298, 555720, 474952, 265914, 221029, 419558, 379203, 416535, 417922, 255518, 208592, 194594, 352333, 88593, 315232, 249278, 300905, 48740, 89633, 255856, 195385, 275514, 118355]
8763A18355m7895K56843k38742J23708K7690j01009K92211J9381k12611L5303
8753B73234N3469j35515O8266M0260q4971P0952r3393J60255p2955j51930P1005
8742A98677j47083m0462N9993Q71L06148k29149N9506k11637J82785j50208J6425
8731D5866o5424Q4728J27403n120k21530J88675k4547J17094M6026j49533r1534
8720E2104J7657M4775j50598K25057k6957o5255O1179N9997j40166j51609J97782
8709A23966N7832l087j23927o408Q1580j74936K07211j7273j38061J34382o5797
8698G5482L6457j00316J06107j20485K32783P2723j37351L4033J01157j48103
8688A52487r3356K01040O4737l5924k68838P4488P9513K922J07834j62626l3181
$$ y = [118355, 70460, 327303, 88561, 212269, 239959, 138950, 431161, 450542, 237931, 273234, 326703, 191188, 259454, 299714, 214743, 285695, 192302, 352557, 279602, 127672, 198677, 51594, 11132, 71125, 71996, 378144, 148995, 208501, -3136, 179649, 29441, 45866, -19558, 65170, 192573, 187453, -34077, 154598, 130051, 247145, 293171, 143638, 52104, 69761, 114536, -36062, 188995, 162038, 96783, 157962, 217959, 77793, -73816, 123966, 181798, 178711, 54784, 48376, 129956, -44980, 162231, 144958, 6897, 141279, 75482, 111939, 11623, 117730, -2755, 230028, 302751, 165400, 199433, 300590, 152487, 59131, 260171, 324908, 288984, 20146, 94634, 174147, 177069, 284903, 122277, 89096]
8677H9096N9018l265m3171J901J30515l11803K41961k23907K21633k67898L01818
8666A95898m1894j99697J8199K48785J40501l11447Q3855r298j35276L219K8266
8655B1111J44725j45265O1526p6220K06341k2010q1770R3807j68836n794j989
8644B5626m1829J10323k1917J27827j97278P3304p2912K00727j70426m849R9697
8633A28293J8711m2359K282K0237o7333k222Q5729k9065R1997r8811o2755P920
8621E2624J97502o4528k02016J76397J3723k02021J74015j93607J23510j25892
8611e0293J53950L2804m1285J16766j52159p8062R0931J34126j69839l7882J84055
8600A83112j35901o0566K74007l8279j51332k09984J68733K36534j16453j21509
$$ y = [89096, 148114, 144849, 101678, 103579, 234094, -77709, 164252, -59655, 161978, -105920, 195898, 154004, -45693, -27494, 221291, 361792, 50345, 134200, 124902, -10374, -7155, 21111, 165836, 20571, 82097, 5877, 212218, 190208, 108438, 202245, 33409, 27615, 25626, -16203, 94120, 72203, 200030, 2752, 76056, 3144, 203871, 33445, 28596, 128293, 147004, 104645, 106927, 127164, 59831, 57609, 143338, 114273, 206270, 107459, 44704, 52624, 250126, 185598, -16418, 159979, 173702, -28319, 145696, -47911, 75599, -50293, 103657, 136461, 95176, 211942, 59783, -18279, 72652, 206778, 36939, -943, 183112, 47211, -13355, 260652, 222373, 71041, -138943, 29790, 266324, 149871, 28362]
8590B8362J00192l7881P1212j90130R8039j04663N8136J41198J51819l80433K08625
8579A44476j95413O6025J25875l011j50688k2365Q2205Q828k1250P6003m3950
8568F6735R2590j62946o7440L41172k03718N446J21983p0957k23767N7034M7569
8557C701O3758r8J15371o8298N7669o0353J26830k26540J58937K9192j91916N5513
8545F3766J06847p9506m3994J45801m9544j0887J87053j23792M8546k37240K41985
8534B49035M30943q69428J06308O3452m5675R686K19947j67055j2716K91302l63541
8523h7742J06990R5600j45070J22411N9748k00673n3075P9713r8981J6515K00366
8512I5802j99047K38789J03376k98862Q8147p2096K5691j4960J34649j59069p6005
$$ y = [28362, 128554, 90673, 161885, -28245, 69794, -34869, 23267, 164465, 316284, -64149, 144476, -50937, 15088, 140963, 137952, -12736, -35101, 47104, 55932, 34682, 110685, 66735, 159325, -3621, -71061, 270111, 66393, 71839, 193822, 122865, -100902, -43868, 3701, 67459, 67361, 182732, 114434, 172103, 111750, 238580, 12040, 170977, 200169, 8253, 63766, 170613, 91107, 47113, 192914, 143370, 132483, 319536, 195744, 244290, 7050, 249035, 679978, -189450, -83142, -19690, -65365, -55679, 164268, -2787, -15503, 275799, -87742, 19248, 114848, -30222, 92189, 151937, -48736, -101811, -22098, -121079, -104564, 95802, -103245, 135544, 238920, -59942, 28205, -43891, -18200, -33160, 101489, -57580, -133585]
8501a33585j1587n8812K94639j03639Q4887j75235J89445q7380N3691m9151k26135
8490b22862K38486J16063N9079l45359J39532P9977j81530N9452n7483J05897
8480h748R3278j88593J05338J735N288Q7564j18073J26812l9405j94085J34999
8469F110j99433K98282j38792J08916k8263q1205k49222K42172j0813j00448J74248
8458B1552J061Q0363j41639k8023Q7181q354l4058j33292J31160r2851J90221
8447G3321r7798L3603J45020q9240r8411J11367p5771j1635J43416j83998j34402
8436a84528J98317j41186R1722J04262l0582j26242J24576j33811K09179j30795
8426a9088N658q8190J79950J34642l40529p553R6253J19680K8160k25949K63141
$$ y = [-133585, -145172, -203984, 90655, -12984, 71903, -103332, 86113, -1267, 52424, 3273, -222862, 15624, 131687, 190766, -154593, -15061, 64916, -116614, -57162, -114645, -8748, 84530, -104063, 1275, 3010, 8298, 95862, -22211, 104601, 65196, -128889, 6110, -193323, 104959, -33833, 75083, 46820, -34385, -283607, -41435, -52248, -152696, 21552, 22613, 102976, -38663, -66686, 20495, 12141, -21917, -155209, -24049, -116900, 73321, -24477, 9126, 154146, 64906, -33505, 77862, 2091, -9544, 133872, -50126, -184528, 13789, -127397, -35675, 68587, 38005, -88237, 36339, -97472, 111707, -19088, -13430, -101620, 78330, 212972, -127557, -135110, -38857, 80823, 108983, -116966, 146175]
8415A46175j11322P4731j78606L54920j42762j28614J63459k27848J9316r2124
8405a22675l0992O3323P9004J04237k45016J00689K7993J35891k15701J76954
8395G3707l2497L6272L6381j14095J8247r7212L0518K29806j60642J7062k29067
8384a91520J60564k6734M8005J72161r7248o2703R9776J00221j30288j11921J20249
8373H0562k2791L0727j20690j38651J51377J66257j71264l9924J01534N9520k32188
8362a35531K10152j68505P4513M2653K6777k2290J28137k34046l8850L3233M7799
8351c5958J32429L3766m254k24787K40465j48183R8398o0542j22353n1543J09899
8340c2663J86234M06r9201K5249k32891R9121N5018J53199n526k69499J66957
$$ y = [146175, 34853, 109584, -69022, 285898, 143136, 14522, 177981, -49867, -30551, -122675, -153667, -90344, -11340, 92897, -152119, -51430, -23437, 112454, -103247, 73707, 41210, 77482, 113863, -232, 18015, -79197, -48679, 181127, 20485, 37547, -191520, -30956, -57690, -9685, 162476, 65228, 2525, 102301, 202522, 72234, -39687, 80562, 57771, 88498, -32192, -170843, -19466, 146791, -24473, -64397, 37137, 96657, -135531, 74621, -93884, -19371, 23282, 50059, 27769, 155906, -78140, -116990, -83757, -35958, 96471, 130237, 125983, -98804, 141661, -6522, 91876, 31334, -91019, -142562, -32663, 153571, 153977, 54776, 80025, -152866, -53745, 1273, 154472, 148946, -120553, 46404]
8329D6404j16635j12430K06570J8901q4810P8494N8733j42315N8705j00652M8408
8318d0627O511n2332K4851J85811j44178J1879O9039r585o9418J08834j68364
8307g7579J98597Q7867k78768M5621Q1765J2253k62888K86098q5300J07784j67139
8296e1689q2947K57548j01663Q3443p8508J71991k8263k63959K18775q9987q9738
8285e4997p0699R6911M8751j57114K55029o4903p2752J42528Q108m9008j18848
8274c6994J31388K2380j85181M0697j2166J35322j39459k0106J68870R3875j05805
8263I2821j25641K65851j84411O1322o1060m6473J4453J3285J70638k23145p2081
8252i4441J75836k10581J00659J45388m9660n5328j95914L13172l7227j29266
$$ y = [46404, -70231, -182661, 23909, 42810, -42000, 36494, 95227, -47088, 11617, -89035, -40627, -34116, -86448, -61597, 124214, -19964, -8085, 60954, 51369, -18049, 90785, -77579, 121018, 208885, -69883, -24262, 57503, 69756, -193132, 92966, 7666, 115450, -51689, -134636, 122912, 21249, 104692, 26184, 198175, 169912, -94047, 124728, 34741, -54997, -125696, -28785, 19966, -137148, 117881, 52978, -19774, 122754, 130862, 81854, -36994, 94394, 116774, -68407, -27710, -39876, 95446, -44013, -64119, 104751, 198626, 92821, -32820, 233031, 48620, 109942, 48882, 2409, 16862, 30147, 200785, -22360, -94441, 81395, -129186, -28527, 116861, 67201, 11873, -184041, 129131, 91904, -37362]
8242c7362Q0634O6305k10214L2576P7337j19419l1188K38754O8843j83781O9425
8231E1910k09821J77664K22907j93327k5669k7037K6436N4353q8853O0047J4891
8220F3501N5926l08157L22150l72872K21932J5222M2964J10051o267j8497L7425
8209A63378p9776j72469J67721P2192J24854j53021n5858j35959L03798K70043
8199E04903m46698K18763k7560J97622r014j71643K19211j483830J596238k88422
8189C09570J78346J98306j00645k1263K01991j64905k34549J50223j98666O4908
8179C83316k53876K32095j52743O2535M8447r829j24740J27558k88701L34277
8169C58339l18262L9136k6062K19694j38567k5893J02118Q399M6879k34587K41463
$$ y = [-37362, 43272, 109577, -100637, -68061, 9276, -110143, -141331, 97423, 166266, -17515, 51910, -157911, 19753, 242660, 49333, 23664, -3373, 23063, 77416, -11437, 48610, 63501, 119427, -188730, 133420, -239452, -17520, -2298, 40666, 150717, 144450, 125953, 163378, 83602, -88867, 78854, 151046, 275900, 122879, 67021, -68938, 234860, 504903, 58205, 276968, 249408, 447030, 438016, 266373, 485584, -998246, 597992, 309570, 487916, 686222, 585577, 564314, 766305, 601400, 366851, 517074, 318408, 383316, 129440, 361535, 208792, 271327, 319774, 309945, 185205, 312763, 24062, 358339, 40077, 79213, 53151, 272845, 134278, 108385, 210503, 218902, 265781, 31194, 272657]
8158B72657j85907r2093n2548J01537l291m6532j01180P8191J06159J21364k15048
8147a6691K10723j22467N4898j45719m0612k1415Q4865Q5341J13869k46526P0413
8136B6679q9118n8795K45112j27712J17649j60447K28251k56715L36115j22852
8126A38167O5851k28861Q9227j42632J6906K16949j23262k3262J92932j48546
8116E3469L2778q5465j56144Q1987J28687O8838o5367J93605k52847M0901j29801
8105h9359J43552J3446L8464j68558R7174L9958l1220m0660J95431l4586j61792
8094A850j3519k0001J43464k8754l0877l29700K24610J89545j91606o8549K57155
8083A33618m5697j3414J1814k1957k70427J70394J40521j59233n4218K26651j97812
$$ y = [272657, 86750, -5343, -57891, 43646, 40355, -6177, -107357, -29166, 76993, 198357, -16691, 194032, 71565, 126463, -19256, -59868, -81283, 3582, 88923, 202792, -43734, 26679, -62439, -121234, 123878, -3834, 113815, -46632, 181619, -75096, 261019, 138167, 204018, -24843, 64384, -78248, -61342, 155607, 32345, 9083, 202015, 53469, 86247, 782, -155362, -73375, 55312, 124150, 58783, 252388, -459, 40442, -89359, 54193, 67639, 106103, -62455, 34719, 74677, 43457, 2797, 198228, 163642, 1850, -11669, -31670, 111794, 83040, 52163, -277537, -52927, 136618, -54988, -123537, 133618, 87921, 74507, 86321, 64364, -206063, -35669, 104852, -54381, -108599, 118052, -79760]
8072g9760J51297j07645J05651p1816K9157O2642j40220j5242J51790q1043o5466
8061f0655j6493J40973J8315j69832K85873k71143J09814J08546j17906q1191
8051e3699O8917P1391j73152J74198q2559k27173K76600J36957j52989o1227m4171
8040f6907O3766O6030O8224m5444j31386J71254l0836j17898J05568k14105J62024
8029C0290m8000Q3355k39516J89896l3756L13129j67567r0070m6371q0800j9248
8018a08658J26985o903j11991O5534J27988k1483m6787J8111p0278N6523L9380
8007F8421J4113j01502q6081p5259J1180K27209J69696j19713j05132P3143j1702
7996F4373p2236J01182N2112k74998q3658J26346M8354O8257J1280J5230j15086
$$ y = [-79760, 71537, -36108, 69543, -2273, 26884, 89526, -50694, -65936, 85854, 4811, -60655, -77148, 63825, 82140, -87692, 198181, -72962, 36852, 145398, 27492, -53699, 15218, 86609, -86543, 87655, 5096, -222077, 54523, 191480, 38491, -22736, -66907, -3141, 62889, 131113, 85669, -45717, 125537, 94701, -23197, 82371, -131734, 30290, -17710, 65645, -173871, 16025, -17731, 295398, 127831, 37761, -8610, -89410, -108658, 18327, 11424, -100567, -35033, 92955, 71472, 24685, 42796, -27482, 29041, 68421, 82534, -18968, -105049, -180308, -169128, 58081, 227777, 108064, 2932, 76075, 64373, -7863, 93319, 145431, -129567, -213225, -86879, -38525, 29732, 41012, 56242, -58844]
7985e8844K02833l1903j34948N5980j38839J18100j72821J74621j24823J45170
7975C4526p2388J93203P7090k91461Q3679j94257N7202O6808n8433N1462N6657
7964D088r1095J64250k4941m3292k06938Q0957K11355K9861k4314J18126k51612
7953c3555J46873o9710N3919k5106k0770q4396J35653j03292N3853Q5426j82685
7942d3790J92895K3775j31718P6119L9100j0173n5957k03420K29146k40769J08794
7931a5998K11479j36693l0755j23998M1051J60105j96442J34582j0070P345j40299
7920i9693Q695J39896k09992k778L62067k87446J00320J27279j26302J15806j11921
7909A5931J54502j54259R5085q4600J02177j14858j31985K57246p3849j70825
$$ y = [-58844, 143989, 112086, -22862, 33118, -105721, 12379, -160442, 14179, -110644, 34526, -37862, 155341, 232431, -59030, 24649, -169608, -112406, -45598, -104031, -52569, 4088, -87007, 77243, 52302, 9010, -197928, -116971, 94384, 124245, 99931, 218057, -33555, 113318, 43608, 97527, 72421, 51651, -32745, 102908, -384, 53469, 138895, -43790, 149105, 172880, 41162, 117281, 156381, 146208, 90251, -113169, 115977, -124792, -15998, 195481, 58788, 28033, -95965, -54914, 105191, -91251, 43331, 33261, 40606, -99693, -90998, 48898, -161094, -163872, 198195, -89251, 11069, 138348, 12046, 127852, 15931, 170433, 16174, 111259, 26659, 128836, 13978, -118007, 139239, 65390, -105435]
7899a05435n6647P7349K04902j56325J4825O4835k0854N3704r5761J69716j82724
7888c2415J3547J54001J0037j55778J55061p7898j33732m0835K2472J2305J28081
7877E4846Q924j18486O3491M3168n5204M6825K64947k22459J25321j77132j6615
7866A7626N404m6304R9285k2923J37010j59019J0652l7080J14110L1462p278N3197
7854A96142j23289P1354q8996Q55756j066050j36660J29326J93671k88606M12273
7844A54921k47455K34851k61233J72170r3099P6589M6230j8536k12026J93667
7834D6079k8136M8568M358M5083K6787j04185O9766O9568q6358R4458l22248N7379
7822g8881J14935l4030M1172o6522L8146J04241m0002l4345j47880Q0634J07856
$$ y = [-105435, -162082, -84733, 120169, -36156, -21331, 43504, 22650, 76354, -19407, 150309, -32415, -18868, 135133, 145170, -10608, 144453, 66555, -67177, -108012, -85540, -73235, 54846, 63770, -54716, 8775, 51943, -3261, 43564, 308511, 86052, 211373, 34241, 17626, 23030, -23274, 76011, 53088, 190098, 31079, 41731, 4651, 118761, 150223, 142945, 196142, 72853, 144207, 55211, 910967, -155083, -291743, -162417, 31254, -257352, 154921, -92534, 142317, -118916, 53254, -39845, 36744, 82974, 64438, -147588, 46079, 17943, 66511, 70869, 115952, 142739, 38554, 108320, 177888, 91530, 185988, -136260, -78881, 36054, 2024, 43196, -23326, 14820, 119061, 79059, 44714, -103166, -22532, 85324]
7811H5324N2716j10419l7133N199J51331N6520q1897r8740L6229J22775j28285
7800E3620K2998m2939J45997j15314j50701J09220k90105L59965j35252J25692
7790H3181j83497K6912J47424m3305j40902j8104J60858q4954J04240P7253N1146
7779A80252k43945K27107n5220j9460J61465j35898N9052k60086L64189k29345
7769D8111J15846J21895k05360K0191j4204J1492j66115Q0677k2163K02730j94972
7758a872N4041q4640R6318l4374p8315Q4119k29J1368J44629j74396N8253p6822
7746a920N3905o3810m3499l7368R3502r3277K44627K4577k02436K97806k37358
7735C4749j28046J18733K360k13N9267j11300J31477O978K1891j5213k3543k68142
$$ y = [85324, 138040, 27621, -9512, -4313, 147018, 203538, 121641, 22901, 59130, 181905, 53620, 76618, 33679, 179676, 64362, -86339, 22881, -267224, 92741, -42511, 83181, -100316, -73404, 74020, 30715, -110187, -128291, 32567, -52387, 51853, 129106, 180252, -63693, 163414, 108194, 88734, 250199, 114301, 173353, -86733, 277456, 48111, 163957, 285852, 80492, 100683, 86479, 97971, -68144, 12533, -9630, 193100, -1872, 52169, -32471, 63847, 29473, -48842, 35277, 35048, 46416, 191045, 16649, 74902, -1920, 51985, -11825, -55324, -92692, 810, -92467, 152160, 176737, -25699, 272107, 34749, -93297, 25436, 27796, 27583, 86850, -24450, 107027, 114005, 135896, 120683, 97140, -171002]
7723a71002L28795J25669k40816j4414N6307k35861K81548k66488J49350J6890
7713B9978j0095o7745J89189j45850N6080J37022j91908n659P0412n7401j3438
7702i415o7805K22029q2674j36205N0657Q8974k8951N3845p8419J30735r8537
7691D4234J9387m6477N7734j68400m6987M78829k35866M0394O4460r7083j33555
7680b3330O7356j63136N0697R6737j7586J68244j68138Q1446Q1847k19138L3597
7669a1404j10277L78875j72421j11362Q5907k6064J35878j31440M959M6419P8632
7658A67702m7533j01771N0902j08975J45362L872q8723N3589J42693j21158M2953
7647A38913N3386r5932l0189K0274N2051J7853j15460K96493l62066K24133j76074
$$ y = [-171002, 157793, 283462, 42646, 28232, 84539, -151322, 130226, -136262, 13088, 29978, 19883, -47862, 141327, -4523, 51557, 188579, -3329, -8988, 61424, 4023, -9415, -77220, 144809, 62135, -74070, -23413, 65561, 36610, 90455, 12036, 142771, 44234, 63621, 17144, 74878, -93522, -140509, 338320, 102454, 142848, 207308, 110225, -23330, 44026, -119110, -68413, 28324, 10738, 178982, 10844, 92290, 174137, -45001, -11404, -121681, 257194, 84773, -26589, 59318, 33254, 169132, 37692, 42651, 89070, 167702, 120169, 18398, 69300, -39675, 105687, 109559, 20836, 74425, 217118, 95960, 138913, 192299, 96367, 66178, 86452, 138503, 156356, 40896, 337389, -24677, 199456, 23382]
7636B3382J29683n1833j369P1772P861l6284J108Q5922J61910l02212o2054J15739
7624A43625j55934J99011j63757P0758k5940K2480M1230N2356j10793j8956J00662
7613A54742l1526J06453o3032j56490K6534P444P569N4571k81612L03736l747
7602A24642J34056k51036J09702K21756m81572P158M08242k98324J79724J4154
7592A68502o7085o2586N3204q5773K3476p0245J31618J48432q6643p2276J04134
7581A84758m6955L8250Q7671k20714J74890j27147K12995j17711M4239N5786j25630
7570A60432o367R3985M8134P3057j83083P5087L9162j81675J143R9346R784j20902
7558A08103K68546l37271J48704J42689k0779k37161O4290j36548M6812O2140
$$ y = [23382, 153065, 101232, 99863, 171635, 179496, 143212, 144320, 230242, 392152, 89940, 27886, 143625, -12309, 186702, 22945, 93703, 67763, 90243, 131473, 183829, 73036, 54080, 154742, 123216, 229669, 166637, 10147, 36681, 44125, 51694, 106265, -175347, 128389, 124642, 258698, 7662, 117364, 339120, -142452, -135294, 272948, -25376, 154348, 168502, 101417, 38831, 92035, 6262, 29738, -40507, 91111, 239543, 152900, 80624, 184758, 137803, 176053, 263724, 43010, 217900, 90753, 303748, 186037, 230276, 286062, 160432, 154065, 248050, 296184, 369241, 186158, 261245, 300407, 118732, 119875, 219221, 229005, 108103, 376649, 39378, 188082, 330771, 309992, 72831, 137121, 573, 47385, 109525]
7548A09525l4154L3653O69P1451L466o1488N6240r6808N5287p6056K7109L940
7536I2834p5956K58275q3384j34097J94202M203j620J21178O958n1642r7891p1949
7524A61111j20667K17560n8109J02493j94766J08714Q8525j49289J07665p5688
7514A87549k12864K83726k06850J09061p6707L25935l51013O0917J87437p6162
7504B31029o5655J94589j51453m7406O2216j26697m3245J60910j59600P7498J04311
7493B36497p8128N8901P3199j06754k23804J78920N8688r2425N4862L990R2999
7482B56945j588r5937j4139q1907J82078J09651k9634m9976P6911l1779Q3053
7471D03678o6885N074J6232L1913k86791L94905j37725j16227L1277Q5453j53543
$$ y = [109525, 75371, 109024, 109693, 181144, 184610, 123122, 179362, 82554, 137841, 61785, 88894, 92834, 16878, 275153, 191769, 57672, 251874, 256077, 254457, 375635, 382593, 330951, 233060, 161111, 40444, 258004, 199895, 302388, 107622, 216336, 304861, 155572, 263237, 187549, -25315, 258411, 51561, 160622, 83915, 409850, 58837, 119754, 307191, 231029, 165374, 359963, 208510, 161104, 223320, 96623, 53378, 214288, 54688, 132186, 236497, 158369, 217270, 290469, 183715, -40089, 138831, 197519, 105094, 159956, 163946, 256945, 255357, 159420, 145281, 63374, 245452, 355103, 325469, 275493, 352404, 320625, 403678, 336793, 341867, 358099, 390012, 103221, 498126, 360401, 244174, 275451, 360904, 207361]
7460B07361N7898n787J76144j06195r6972J24154p2449k7793o9647J6729N5530
7449B58973j30691J69083j67148K28769N6973k6598p9618J47594j46100J84498
7439D95735m5994r6816K9398l9113K91263l16905k6721J52127K2111m3516R6864
7428E18433M538r0234J76612o7275q5904K0680r1196J15205N0701k09786J14025
7417D55799O3694j42392L4584L6005p3628J31090l07118J07338j13630K05174
7407C96916M1565J85129j66253J24859l9619j10071k7652K15754k19553J77575
7397E78650q2296k6786J64172j27372k35413N8866K16433O0898Q7026l37970L28130
7386F84338k18182q6265J25886j4381J10320m1754J72235k64537q708K87160j87231
$$ y = [207361, 265259, 259472, 435616, 329421, 232449, 356603, 284154, 256361, 186714, 203443, 258973, 128282, 297365, 130217, 358986, 415959, 389361, 309743, 457337, 311237, 495735, 449741, 352925, 382323, 343210, 634473, 317568, 290847, 442974, 465085, 421569, 518433, 522971, 432737, 609349, 542074, 456170, 476850, 385654, 500859, 551560, 341774, 455799, 519493, 377101, 411685, 447690, 374062, 505152, 198034, 305372, 191742, 396916, 438481, 623610, 457357, 582216, 542597, 432526, 404874, 620628, 401075, 578650, 496354, 469568, 633740, 506368, 270955, 329821, 546254, 607152, 694178, 356208, 684338, 466156, 379891, 505777, 491396, 601716, 559962, 732197, 467660, 458952, 746112, 558881]
7375E58881p3916K53787o9493m3873j21275J27757j10967M3726j84242M7246K01507
7364F29138M4467l1748n9279K46977l83811J20555R8041j0057k0867J83928j68993
7353F48351J36305j74928J47784k65055J70412p5047N831l3601J81104o7812k89606
7342C83738J79255p5440J75406L4758j27216L422q1341K65126j21653L0398l9285
7331F27168K44459m1030k69195j3442J57068j37761K19317j83648O0773J13479
7321G77188q6748m7110L03175p1040n7182j5101l6321O7786J0322N2394j41825
7310G55538N5860k5048q487O2501J46303N5391j49242p0204K30162k19761O9639
7299I02652k842L50488m20285J5738Q5658j2631j50968K16338m4016J20974j22819
$$ y = [558881, 484965, 738752, 669259, 625386, 504111, 631868, 520901, 564627, 380385, 427631, 629138, 673605, 641857, 582578, 829555, 445744, 566299, 664340, 654283, 633416, 817344, 648351, 784656, 609728, 757512, 492457, 662869, 587822, 593653, 560052, 741156, 673344, 383738, 562993, 487553, 662959, 697717, 570501, 573923, 492582, 757708, 636055, 666453, 627168, 871627, 830597, 561402, 547960, 705028, 567267, 786584, 602936, 663709, 777188, 690440, 643330, 946505, 875465, 818283, 803182, 766861, 834647, 844969, 897363, 755538, 811398, 786350, 777863, 840364, 986667, 1042058, 892816, 822612, 1052774, 833013, 902652, 899810, 1250298, 830013, 845751, 931409, 918778, 767810, 984148, 940132, 1061106, 938287]
7288I38287r8098J37504j05374L18968m12813J69863P0197L6407M4748q383P6680
7277A167986k6740m7751k03024J24560M0328K49059k65590j9160K14089j31862
7267A101895m292R6572j7391j14962J45320n1786j16766J46834Q2395j4998k38176
7256A014645J53056l0166O8408r0349Q2119O9570J54200J2572j37739L6318j75566
7245A157068O3307K37948j34645J9264J56334j87652M3080n1172J78060k4976
7235A456616J39909N9369j69098o2127L496j09297J52032o5613j52642M30423
7225A683068J265j45527O3091j1697O8554k4174O6544N9405k7003j71970J13251
7214A674807N2798J37207k41021L19976j81066R7843M0057j54765j37044L88552
$$ y = [938287, 840189, 977693, 872319, 1191287, 778474, 948337, 1018534, 1054941, 1099689, 1091306, 1167986, 1141246, 1093495, 890471, 1015031, 1055359, 1304418, 1038828, 1019668, 1233757, 1101895, 1097603, 1194175, 1176784, 1061822, 1207142, 1155356, 1038590, 1185424, 1267819, 1252821, 1014645, 1167701, 1137535, 1205943, 1115594, 1197713, 1267283, 1421483, 1434055, 1296316, 1332634, 1157068, 1220375, 1458323, 1323678, 1342942, 1499276, 1311624, 1354704, 1303532, 1481592, 1456616, 1596525, 1655894, 1486796, 1424669, 1428165, 1318868, 1470900, 1405287, 1252645, 1683068, 1684333, 1538806, 1601897, 1590200, 1658754, 1634580, 1701124, 1760529, 1733526, 1561556, 1674807, 1727605, 1864812, 1623791, 1943767, 1762701, 1860544, 1900601, 1745836, 1608792, 1997344]
7204A997344O7019k7897j32366q3609K19297M1627R7308r3693J7318K15092J6321
7193B333761j04476J95496j31293J18866l0795j1909Q2767J60963j34494N2618
7183B531504L3629J77170p2544M2198J06847J86771N3074j443O9064p7424K11847
7172C260693j11540O6458P5597q309p5362J39264K1773K93257r1474J0649J0509
7161C591515O8891J21318J25869l4982k06397K57393j14041m6796N3843K19808
7151D036421K15620k31853r6469L13787m1690m3260N8761K77317k825R3825j61513
7140D418121K14878M0979J68886J70660P7883j02524M06921l42461J75732j5644
7130E213431L90755M1725J74417M5257J44121q5861J26110J00090L1098J19885
$$ y = [1997344, 2064363, 2036466, 1904100, 1820491, 2039788, 2081415, 2178723, 2085030, 2102348, 2317440, 2333761, 2229285, 2424781, 2293488, 2412354, 2381559, 2369650, 2452417, 2613380, 2478886, 2531504, 2565133, 2742303, 2669759, 2711957, 2818804, 3005575, 3058649, 3057206, 3126270, 3048846, 3260693, 3149153, 3215611, 3291208, 3282899, 3207537, 3346801, 3368574, 3661831, 3570357, 3581006, 3591515, 3660406, 3781724, 3907593, 3872611, 3666214, 3923607, 3809566, 3762770, 3816613, 4036421, 4252041, 4020188, 3923719, 4237506, 4195816, 4152556, 4211317, 4488634, 4485809, 4579634, 4418121, 4632999, 4673978, 4842864, 5013524, 5091407, 4988883, 5395804, 5053343, 5229075, 5213431, 5604186, 5645911, 5820328, 5865585, 6009706, 5923845, 6049955, 6150045, 6181143, 6301028]
7120F301028J4213N9644J23504J98454K57079Q4946m343K26200J89978J52931
7110G603634J45820J1800J54105J55863L04184j0109L63735K26505L83928M75836
7100I815301J64814L46242K08948J68591L31805P00566J13850N99248N29853N05113
7090A3484331P14774O98284P98558P66598P98021O81617J199275R10876J139165
7081B1191499J181519J320361J551090J768802J790235J930217K275307K716105
7073C5725135K636678L461016L591153L870630M088462M842540N717219N929088
7065F9861921O407428N555059M546472N753736P063639Q340021R228421J0246669
7057A27003366J2680151J4526075J8419215K3568061K4492280K6309778K5957125
$$ y = [6301028, 6315241, 6374885, 6498389, 6696843, 6953922, 7038868, 7034525, 7260725, 7450703, 7603634, 7749454, 7761254, 7915359, 8071222, 8375406, 8365297, 8729032, 8955537, 9339465, 9815301, 9980115, 10326357, 10535305, 10703896, 11035701, 11736267, 11850117, 12449365, 12979218, 13484331, 14199105, 14897389, 15695947, 16462545, 17260566, 17942183, 19141458, 20052334, 21191499, 22373018, 23693379, 25244469, 27013271, 28803506, 30733723, 33009030, 35725135, 38361813, 41822829, 45413982, 49284612, 53373074, 58215614, 63932833, 69861921, 76269349, 81824408, 86370880, 92124616, 99188255, 107528276, 116756697, 127003366, 139683517, 154209592, 172628807, 196196868, 220689148, 246998926, 272956051]
7050B72956051P003881p589071j7648308k5043918k8682224k5579125j8745691
7043A56671595j5533288j3215186j1862990j0907511r301545r011595q103370
7036G8736110o698421n873980n199146m359447l876882l465318l475775k749946
7028D3037195k706264k471025k080536j943700j832157j759400j498773j589076
7020B7156264j202634j272004j064440j096532p21237j071858r20812r20156n47943
7011A8338648o31045p66250n26519n88564p18511l70150o04636n81493m45911
7002A3105569k38612n31268m85329k91835n90767j05384m08612m69732j03649
6993I880381m47499j26277k38352l20006j14059l11495l60339j58203j61158m09057
$$ y = [272956051, 279959932, 272370861, 254722553, 229678635, 200996411, 175417286, 156671595, 141138307, 127923121, 116060131, 105152620, 95851075, 86839480, 78736110, 72037689, 66163709, 60964563, 56605116, 52728234, 49262916, 45787141, 43037195, 40330931, 37859906, 35779370, 33835670, 32003513, 30244113, 28745340, 27156264, 25953630, 24681626, 23617186, 22520654, 21799417, 20727559, 19806747, 18886591, 18338648, 17707603, 16941353, 16414834, 15826270, 15107759, 14737609, 14132973, 13551480, 13105569, 12866957, 12335689, 11850360, 11558525, 10967758, 10862374, 10453762, 9984030, 9880381, 9432882, 9306605, 9068253, 8748247, 8634188, 8322693, 7962354, 7804151, 7642993, 7233936]
6983G233936j89406L0130j62549k89364r5645q5543r7813j8613o7813k50794k55215
6972E751311k29895K34922p1313j66193p1604j02371R3666k93917M5973q4597
6962E105982N5491l32043J42523J8933l06805p2133O293p2147j49860j02775L09622
6951D603081l59170r0222K21211j88093L5896k6713n9462j73453K72784k24291
6941D011568q7204M5395o752j98952K09630j69005k0899J88161l03890o0097J44799
6930C752754j21889J17753J7940J08785j52404j68929N4728n3608R5750L9173
6920C690053m6463k6150k47931K34521M6763j43234K20286L9787R5798l7413q5378
6909C740639n226O7022J42378j22176m4931J29241j00020m6411O1385J25010M9128
$$ y = [7233936, 7044530, 7074660, 6912111, 6622747, 6527102, 6441559, 6343746, 6325133, 6257320, 6006526, 5751311, 5521416, 5756338, 5685025, 5518832, 5447228, 5344857, 5438523, 5144606, 5190579, 5105982, 5161473, 4829430, 4971953, 4990886, 4684081, 4611948, 4618241, 4546094, 4396234, 4293459, 4603081, 4243911, 4153689, 4374900, 4186807, 4222703, 4195990, 4136528, 3963075, 4235859, 4011568, 3924364, 3969759, 3963007, 3764055, 3973685, 3804680, 3783781, 3971942, 3668052, 3607955, 3752754, 3630865, 3748618, 3766558, 3875343, 3722939, 3554010, 3608738, 3555130, 3650880, 3690053, 3643590, 3617440, 3369509, 3604030, 3650793, 3507559, 3727845, 3767632, 3863430, 3826017, 3740639, 3735413, 3802435, 3944813, 3822637, 3777706, 3906947, 3806927, 3760516, 3821901, 3946911, 3996039]
6898C996039o2211J7849L7620j50537K55877O531p1088K09244Q1589m358j56276
6887D160279K08012j3178n2663J87778O1183J00002m9144J7178P8038J59458O2316
6876D919259j17355J94485J76140p1029R6008K89605j61032N2017L21159j50085
6866E549172P7495K7581L46611K06617J08350Q7312N242K52489Q1265J74444J22190
6855G038768M88496o1729K72816L65623O1358K08856K23589q2411L19913J35484
6845H970763L60299N7114L34439K78190L66395Q1526K54281L17690M29876P84112
6835A2234685M4717M11393O65408O01560P20566M73342Q33101O47964Q05678Q17540
6825A8255954P46833J371644Q67280R81066J208997R28965J112705J166480J057100
$$ y = [3996039, 3933828, 3951677, 3989297, 3838760, 4094637, 4101168, 4030080, 4239324, 4320913, 4316555, 4160279, 4368291, 4355113, 4302450, 4490228, 4551411, 4651413, 4602269, 4619447, 4697485, 4856943, 4919259, 4801904, 4996389, 5172529, 5101500, 5197508, 5487113, 5326081, 5378098, 5699257, 5549172, 5626667, 5654248, 6000859, 6207476, 6315826, 6403138, 6408380, 6660869, 6742134, 6916578, 7038768, 7527264, 7465535, 7738351, 8103974, 8165332, 8374188, 8597777, 8515366, 8835279, 8970763, 9331062, 9388176, 9722615, 10000805, 10367200, 10448726, 10703007, 11020697, 11450573, 12234685, 12279402, 12690795, 13356203, 13957763, 14678329, 15151671, 15984772, 16632736, 17438414, 18255954, 19002787, 20374431, 21241711, 22222777, 23431774, 24360739, 25473444, 26639924, 27697024]
6816B7697024J100538J208821J306572J337982J277472J332638J009333J223809
6808C7494189J075001Q50442L21956L63346O63450K5858M24086O15691O15229
6799D2449248Q16473R32056R50771J403131J451771J513120J898938J891151J930471
6790E5237130K144561K338764K662186K919470K871990L024272L418736L101397
6782G7718506K944535K621085J586998Q15543k91550r97269j783937k069733k614974
6773G7929204k165398k262744j899626j663161j238323r15083q42132k94861j98923
6764F6448953M70443N84830N75284J111187J462013J599264J533368J867881K282244
6755G7935467K486069K289829K147292J365831P28133M0803j323981k115202k827646
$$ y = [27697024, 28797562, 30006383, 31312955, 32650937, 33928409, 35261047, 36270380, 37494189, 38569190, 39419632, 39741588, 40104934, 40768384, 40794242, 41218328, 41834019, 42449248, 43265721, 44197777, 45148548, 46551679, 48003450, 49516570, 51415508, 53306659, 55237130, 57381691, 59720455, 62382641, 65302111, 68174101, 71198373, 74617109, 77718506, 80663041, 83284126, 84871124, 85686667, 85395117, 84397848, 82613911, 80544178, 77929204, 75763806, 73501062, 71601436, 69938275, 68699952, 67784869, 66942737, 66647876, 66448953, 66919396, 67504226, 68079510, 69190697, 70652710, 72251974, 73785342, 75653223, 77935467, 80421536, 82711365, 84858657, 86224488, 86952621, 86993424, 85669443, 83554241, 80726595]
6746H0726595l219059l405496l549758l445747l169811k918852k701361k500820
6738E5815691k247719j580505j655318j580666j369578j095522r28686p87465
6730D4570232p06506n22295m34083m24525m88211j67020n28435o43940l63129
6721D0292088q37286j130893j406677j511396j531377j577698j648588j453115
6713B9195058j690510j405042j470558j164686j047434q55940j029303j130083
6705A9401502q33652r10931p13389r36759m19217q68465o26650p62964m73778
6696A2855697n72412l51206o41205n82585m8630o45377m84651j79140m35792j73680
6686H741019l03088k23490l86536o9537l83677k78525k86060j26642k11246l49808
$$ y = [80726595, 77507536, 74102040, 70552282, 67106535, 63936724, 61017872, 58316511, 55815691, 53567972, 51987467, 50332149, 48751483, 47381905, 46286383, 45357697, 44570232, 43863726, 43341431, 42907348, 42482823, 41994612, 41827592, 41299157, 40655217, 40292088, 39454802, 38323909, 36917232, 35405836, 33874459, 32296761, 30648173, 29195058, 27504548, 26099506, 24628948, 23464262, 22416828, 21560888, 20531585, 19401502, 18567850, 17656919, 16943530, 16006771, 15587554, 14719089, 14092439, 13329475, 12855697, 12283285, 11932079, 11290874, 10708289, 10659659, 10014282, 9529631, 9350491, 8914699, 8741019, 8437931, 8214441, 7827905, 7758368, 7374691, 7096166, 6810106, 6683464, 6472218, 6122410]
6676F122410m9931p6316k18195K881k91782m8095j91718k3160l22121j82646J04547
6665D825874k47445j08247j51497N0022K5605l16426j93290j12626N1240p0573
6655C752637p9587j17923j42219M2117j89667n353J4454J03906k46296k1314M9369
6644C160124k22441j68448q0805M6008r0121l596q8757l4306k28411P9677J88627
6633B557551k67988J36299j42766j0397j46128L12498k02301j10381q54p86j47861
6622A976886N2161k00470J69349K8771j71802l2509j6730J9477L6111k55828n4009
6611A551407K45232m4502J44498l43249M794k8226P698r8342M7057P4736j60874
6600A400229J13840k38070J82127m3462r8832J25509n8829n2748R2452j17962
$$ y = [6122410, 6072479, 5996163, 5777968, 5780849, 5489067, 5440972, 5249254, 5226094, 4903973, 4721327, 4825874, 4578429, 4470182, 4318685, 4368707, 4394312, 4077886, 3884596, 3771970, 3823210, 3752637, 3673050, 3555127, 3412908, 3455025, 3265358, 3260005, 3274459, 3378365, 3132069, 3110755, 3160124, 2937683, 2769235, 2688430, 2734438, 2644317, 2640721, 2551964, 2517658, 2289247, 2368924, 2557551, 2289563, 2425862, 2283096, 2272699, 2126571, 2439069, 2236768, 2126387, 2125533, 2124747, 1976886, 2029047, 1828577, 1997926, 2026697, 1854895, 1822386, 1805656, 1825133, 1861244, 1605416, 1551407, 1796639, 1752137, 1896635, 1553386, 1558180, 1529954, 1537652, 1439310, 1486367, 1561103, 1400229, 1514069, 1275999, 1458126, 1414664, 1315832, 1441341, 1382512, 1329764, 1422216, 1304254]
6590A304254o3180m4341K06700k95204J46959j08723O4864k00301O6476J31833
6580A209337j20873l4826K12085q4116q1452J61390j60700J846j2997m5085N5267
6569A099876k82687K31563P415n8265Q8358j24098L9687q4838M6511j9026p3127
6558H71369J3395J00110o8068l6446M182J3277J3731k16347K2539J06043K9648
6547H53433p8020M1445L0673P32J47534j07122n6404K3410q3100J59006l4427
6536H97160l6360k17398Q8563J53924j38185L2297l8528J51600j7015j65500K45076
6525I55634m5837j12009j32440J86589n8758O7372O5514k62431J45657o3038M6187
6514G92440k9117J05287N856j55567R5876l2074k644O1115J18275k59055K4035
$$ y = [1304254, 1241074, 1196733, 1403433, 1108229, 1255188, 1146465, 1211329, 1011028, 1077504, 1209337, 1088464, 1053638, 1265723, 1181607, 1100155, 1261545, 1100845, 1102691, 1089694, 1044609, 1099876, 817189, 1048752, 1056167, 997902, 1086260, 962162, 1001849, 917011, 963522, 944496, 871369, 884764, 984874, 916806, 880360, 884542, 897819, 911550, 695203, 717742, 823785, 853433, 775413, 816858, 847531, 848263, 995797, 888675, 832271, 855681, 772581, 931587, 897160, 860800, 643402, 731965, 885889, 747704, 780001, 741473, 893073, 876058, 710558, 955634, 909797, 797788, 665348, 851937, 793179, 860551, 926065, 663634, 809291, 746253, 792440, 763323, 868610, 874466, 718899, 814775, 782701, 780057, 841172, 959447, 700392, 724427]
6503G24427r2027M71969l16545m5250J49260J8282K340r5243K97206j21011n5096
6492I38312k02891J39532J09471L2270n1198k00608J83602L1744j10275R4731
6482I64690m6925l7936n834O106q6968q3799M4355L5479Q5357j47146k1755J01449
6470H07073J57019l7109j56054O5429k1208M2349R1596j18857N213q5849Q1134
6459H30736j9055o0723k8465p5586J15130q7481P5044p1656l2037K48482m28157
6448D66232J66610N3322L0083R4332j38433q5239M7482r0126o4508R1245j52987
6437D18013P0368P9477p3812J2751j2193m0192K46477j25667j60964J41707q7884
6426D68081N9030j83003M626J6197m0970r5935K14492k7157J24313j84378m8240
$$ y = [724427, 632400, 1104369, 787824, 742574, 891834, 910116, 912456, 817213, 1114419, 993408, 938312, 735421, 874953, 984424, 1016694, 965496, 764888, 948490, 980234, 869959, 964690, 917765, 879829, 873995, 880101, 793133, 709334, 753689, 789168, 874525, 727379, 705624, 807073, 964092, 926983, 770929, 836358, 815150, 857499, 949095, 830238, 835451, 749602, 830736, 811681, 750958, 722493, 646907, 762037, 674556, 749600, 677944, 645907, 894389, 466232, 632842, 686164, 716247, 810579, 672146, 586907, 634389, 544263, 479755, 571000, 418013, 488381, 567858, 494046, 506797, 494604, 454412, 700889, 575222, 414258, 555965, 468081, 527111, 344108, 348734, 364931, 323961, 228026, 442518, 415361, 539674, 355296, 307056]
6415C07056j10116K57999k32704J72147k10797L01791l00302J33J13094j01405
6405A96896J16615j43462N9162K24398j53041p5922J31538j58667L9402q2394
6395A54525J31789j24766J09928j13888l356K29142n345n8315M1225mj4610k05404
6383A40921J37190j85222L96412j13143k74816K07211N2448k58615J55128k0815
6373B36699k12510K73614m7621O7324J3479J9733j76410P8882J26586n8857j43098
6362A77821K8924J49011j79783J6040j5436N956K324j45121P7575K6550J87969
6351C31830j91756J52720M9289j45159k1809k9440J5638O5482p2231J15995j04820
6340A65739N1438k13323J41614k3777K99729l85860L22148j32496q9703J45468
$$ y = [307056, 196940, 454939, 222235, 394382, 183585, 485376, 185074, 185207, 298301, 196896, 313511, 170049, 229211, 453609, 300568, 224646, 356184, 197517, 236919, 154525, 286314, 161548, 271476, 157588, 154232, 383374, 378029, 319714, 360939, 360935, 346325, 140921, 278111, 92889, 489301, 376158, 101342, 308553, 361001, 102386, 257514, 236699, 24189, 297803, 250182, 317506, 330985, 350718, 174308, 253190, 379776, 320919, 177821, 206745, 355756, 175973, 192013, 176577, 182533, 184857, 39736, 117311, 143861, 331830, 140074, 292794, 342083, 196924, 175115, 145675, 161313, 226795, 154564, 270559, 165739, 217177, 3854, 145468, 121691, 421420, 35560, 357708, 225212, 135509, 280977]
6330B80977k82641N4200J40068L7711P1239j00141J4907l7839K34191l15546o9842
6319B7284J33533M4743j6733J29661k81447k0955J83262K837q0486k2004R0877
6308A90572j73690L83268j85674N7871j69276j0308L5970j1023j4457l1790J08927
6297A80390m3640O3929J01980l6943j07171N6904P9867q0660J8363j37183l1982
6286F3854J6818p2063J71446M8262j13328J92517j43824j47309Q5894L13485k17585
6275A98167P0744j06688j43828J75377K7944j88480J48220M4369j18294q1376
6265B6155J21530O5003L8614n2633N4963j46345j5366M6118p7601M6611K7006
6254A34055L3298P1303J07037k72142k0772K48504m7498k54087K10440O0227l17242
$$ y = [280977, -1664, 52536, 192604, 230315, 301554, 201413, 216320, 178481, 412672, 97126, 27284, 160817, 205560, 188827, 318488, 37041, 16086, 199348, 202185, 121699, 99695, 190572, 16882, 400150, 214476, 272347, 103071, 92763, 128733, 117710, 103253, 71463, 180390, 136750, 200679, 302659, 265716, 158545, 215449, 295316, 214656, 233019, 95836, 63854, 80672, 8609, 180055, 228317, 114989, 307506, 163682, 16373, 102267, 415752, 198167, 268911, 162223, 18395, 193772, 221716, 33236, 181456, 225825, 107531, 26155, 147685, 212688, 251302, 198669, 253632, 107287, 91921, 138039, 60438, 107049, 134055, 167353, 238656, 345693, 73551, 52779, 301283, 253785, -302, 210138, 270365, -46877]
6243d6877J17819m7534p3630J73279j07111J51531Q3990r5147k4687j82976J92469
6232A41126J9941j00934J03743k04098J45551j0355L4665j29815K3696Q2294j66475
6221f0661K54704K7767m6821J43728j83587O8062q9972j7255j62474P9476R0328
6210A03295J85067l6657n0802n5619K3730j27148o2524N422j9234R7561J20326
6199A83417j7757k70666K05491K00759o3048j55680J1758N1365J32696k59518
6189A8817Q4300J80560p216L5406l20783N9784J26025R3876P594k84517J61185
6178A55031L6078k65781J37782K7578m1630J56339m8468k1623l4267j57287K51672
6167A95424m1064m2200k62297P5968J64124L4008q8436R0868k06632J89704K8058
$$ y = [-46877, 70942, 23408, -50222, 123057, 15946, 167477, 251467, 156320, 131633, -51343, 141126, 161067, 60133, 163876, -40222, 105329, 94974, 129639, -176, 23520, 105814, -60661, 194043, 221810, 174989, 318717, 135130, 203192, 113220, 95965, -66509, 12967, 103295, 288362, 251705, 200903, 145284, 169014, 41866, -20658, -15236, -34470, 63091, 183417, 165660, -105006, 100485, 301244, 238196, 82516, 94274, 145639, 278335, 18817, 103117, 283677, 276461, 311867, -8916, 50868, 176893, 270769, 278363, -6154, 155031, 191109, -74672, 63110, 90688, 49058, 205397, 156929, 135306, 101039, -56248, 195424, 154360, 112160, -150137, -74169, 89955, 123963, 35527, 126395, -80237, 109467, 137525]
6156A37525J7816j4p181Q8198l1258q6113R0842n6633M7687j57931J56876P5992
6144B75806k9400j4233k68640K04460l68J18913j50891P954n8028J51806o1893
6133A75486J0864K4586j83349O6777J18602k2212j2757j89436L5147m5371K65621
6122B43958j38328R2881j54908P7995P1607j9142o9708k3336M2500K30499n01481
6111a47463K54945m6427L1060J17457L5545k24409N7871O4499K2369k6249j05473
6100C3725J77189k73554K17426n9805M3346J80087j36069j24806k7508J51964
6090A81995j20342K6848K250K3730k4831J7013k51081N32282k57357J25056J75537
6079D31100l34006J01489J7518k45512Q5175J55566L7197R132l8553j8853J19785
$$ y = [137525, 155341, 155327, 148146, 236344, 205086, 118973, 209815, 153182, 200869, 42938, 199814, 275806, 246406, 232173, -36467, 167993, 167625, 286538, 135647, 143601, 85573, 237379, 175486, 186350, 210936, 27587, 94364, 212966, 190754, 177997, -11439, 23708, -21663, 243958, 105630, 198511, 43603, 121598, 193205, 174063, 104355, 81019, 123519, 354018, -147463, 107482, 61055, 92115, 209572, 245117, 20708, 78579, 143078, 165447, 139198, 33725, 210914, -62640, 154786, 94981, 138327, 318414, 182345, 57539, 30031, 181995, 61653, 88501, 90751, 114481, 89650, 106663, -144418, 387864, 130507, 255563, 431100, 97094, 198583, 216101, -29411, 55764, 211330, 248527, 257659, 219106, 200253, 320038]
6068C20038q9616J61848k25362K01914q8889R463j48555J48981q7449j51917R8562
6057A49018L3457j03543M2286k7512J87050j5461m7719M515j5512j2470K6941
6046B21050k8392J38323j33493O4520J1700r0581j33498J96047r4524j3758q0590
6035E6804L64540l75411K99391l2805J01520j54993Q5898r6228j35529K09244
6025C22431k16080K77208j47188J7558j37194O5190J78590n1629o8685n2873k8464
6014A58864J50152p391L8402M7325L775j57887j5903O8429k0222j26540M3419
6003A82423Q5110j70538J69680N8997q2339j20878J8323J22337l3137J25549o5372
5992B90155j7719j44601J59491J57712j82902k3199P0475j89898K36613q3957
$$ y = [320038, 230422, 392270, 166908, 368822, 279933, 289396, 140841, 289822, 202373, 50456, 149018, 182475, 78932, 121218, 93706, 280756, 265295, 217576, 222091, 206579, 194109, 221050, 192658, 330981, 197488, 262008, 273708, 183127, 49629, 245676, 151152, 137394, 56804, 421344, 45933, 345324, 312519, 414039, 259046, 344944, 248716, 113187, 322431, 106351, 383559, 236371, 253929, 116735, 181925, 360515, 308886, 240201, 187328, 158864, 309016, 301625, 340027, 387352, 391127, 233240, 217337, 285766, 265544, 139004, 182423, 267533, 96995, 266675, 325672, 243333, 122455, 140778, 263115, 229978, 355527, 290155, 272436, 127835, 287326, 445038, 262136, 238937, 309412, 119514, 356127, 272170]
5982B72170k69401Q3708J60623j21699j3135r132J89368Q618j16649K56612m02164
5971C8919K09646N6273J11810j58815Q6421k09270r9024J68846R1891k20617k790
5960G3290K05536L4481n4453P8226j51554r0132J7180J00597J82470J302k69518
5949A27425J50470K1743J2736L8845l2286l21472K90215K4084L899p7470j03401
5938A34788J85380j55858J06626J38276m40703K63447l5761J5611J427k6945P0022
5927B56310J07411j77540Q0231K925p2937p7909O4288J51714j20237r3297K14448
5916C35407j66784J14091j04928R3068O1805J04412k49203M4803J04068q6271
5906B50468l864L1710m4851n8791K52436j40424p6083r1793k0414J69080N1476
$$ y = [272170, 2769, 86477, 247100, 125401, 112266, 103134, 292502, 301120, 184471, 441083, 38919, 248565, 304838, 416648, 257833, 344254, 134984, 35960, 204806, 296697, 76080, 73290, 278826, 313307, 258854, 337080, 185526, 95394, 112574, 213171, 395641, 396943, 127425, 277895, 299638, 312374, 351219, 318933, -2539, 287676, 311760, 315659, 238189, 134788, 320168, 164310, 270936, 409212, -31491, 231956, 196195, 211806, 213233, 186288, 256310, 363721, 186181, 266412, 269337, 196400, 118491, 182779, 334493, 214256, 120959, 335407, 168623, 282714, 177786, 270854, 332659, 437071, 187868, 232671, 336739, 250468, 246604, 278314, 233463, 174672, 427108, 286684, 210601, 118808, 98394, 267474, 318950]
5895C18950l7956K1607r0863J14224J2422n8659k74868L12398n7364l4551o2290
5884A63050O5766J00119j06797J43595j68511K7465l2659M2084k70723K67473
5874B30862K5071p3327P9531q6675J41966P9860k64283J51622m8550j6920R2224
5863C11381L0973j37277O7494O4088j63990j68311K61511Q8638J5753k54888k6777
5852H8595J18844J53615j20374L8471j11373j993Q9323n286P0872j69063j2484
5841A39147k3142K6308n9897O4406K20414j67660P5381o2084j73009J45066O156
5830A91086J2643J41172k70661M7786R1152K6099j36645J25399O4887P7786j83565
5819A87139k1522j41054L15099m2741j56488J23099l2553k25079J52022k20068
$$ y = [318950, 280994, 302601, 211738, 325962, 338384, 279725, 4857, 317255, 259891, 225340, 163050, 228816, 328935, 222138, 365733, 197222, 224687, 192028, 234112, -36611, 230862, 255933, 182606, 262137, 175462, 317428, 397288, 133005, 284627, 236077, 219157, 311381, 342354, 205077, 272571, 336659, 172669, 4358, 265869, 354507, 370260, 115372, 88595, 207439, 361054, 240680, 279151, 167778, 165785, 255108, 249822, 320694, 151631, 139147, 116005, 142313, 82416, 146822, 367236, 199576, 274957, 212873, 39864, 184930, 191086, 203729, 344901, 74240, 122026, 213178, 239277, 102632, 228031, 292918, 370704, 187139, 165617, 24563, 339662, 296921, 140433, 263532, 230979, 5900, 157922, -62146]
5809f2146K53365m4937k3275j13765K56460Q6796n9087M320j95523O2598J35082
5798B99888q0516m2743k11117J06735m1091R8329j02763K37124k32301J45509
5788A77054P5929n6203j68641Q4794L8449R3821k45847K34025M2764k58588J82329
5777A99886o8222O2293J06822j86728j26005K51132j78553K45269k31479J41114
5767B15529J41897m66057J44419J52462j24072K5755n0664J63686q9463m3214
5757G0278Q38K22882l45984J17742L0870m6033Q1433m8297p0532M5046O6660P436
5745A32339J00171J7415k21039J49485j17373J58386k32942p430R3866J73444
5735B46322q5226j26037K0052J0906N9042k87348M37057j77776O7588j0849k9670
$$ y = [-62146, 191219, 146282, 123007, 9242, 265702, 352498, 293411, 297731, 102208, 164806, 299888, 219372, 176629, -34488, 72247, 31156, 129485, 26722, 263846, 31545, 177054, 252983, 196780, 28139, 112933, 151382, 245203, -644, 233381, 276145, 17557, 199886, 131664, 193957, 300779, 114051, -11954, 239178, 60625, 305894, 74415, 215529, 357426, -108631, 35788, 188250, 64178, 89933, 39269, 202955, 113492, 70278, 71116, 293998, -51986, 65756, 96626, 50593, 132026, 83729, 13197, 58243, 124903, 132339, 232510, 249925, 28886, 178371, 60998, 219384, -13558, -20988, 72878, 246322, 161096, 35059, 55111, 66017, 125059, -162289, 274768, 96992, 164580, 153731, 124061]
5724A24061p136j14997J12638o6144M5084j77673L11066k13695L9029k1323J13693
5713A44603l3613j9913O2563j8767J1489j65200J19926K0934m4085K02295n1628
5702B28604j0636L3253j51267j13060L2646j5314J43932r0048Q2822l0675k5276
5691H4981L3555o1314P0510j70037K77473p0392O8301j63765j14344J64849l2812
5680H7005l3870j18546K83154j30454p006Q6040p8778L3428l4314J73232j85969
5669G3922J13975j24199p5153J67156J3802k08661L97883l88901J52371j32588
5659a0393J58067j02333k5592L3930K45751j61625j24925r7380K38995p0112o0381
5648B4002j5186L52644j79026q3755O9257k9188J1329k41539l9277J84379J00600
$$ y = [124061, 116925, 1928, 114566, 48422, 93506, -84167, 226899, 13204, 52233, 30910, 144603, 110990, 91077, 153640, 134873, 146362, -18838, 101088, 122022, 77937, 280232, 228604, 217968, 251221, 99954, -13106, 19540, 4226, 148158, 58110, 140932, 110257, 84981, 118536, 57222, 127732, -42305, 235168, 164776, 233077, 69312, -45032, 119817, 87005, 53135, -65411, 217743, 87289, 80283, 166323, 87545, 120973, 86659, 259891, 73922, 187897, 63698, -11455, 155701, 169503, -39158, 358725, -30176, 122195, -10393, 147674, 45341, 19749, 53679, 299430, 137805, 12880, -84500, 154495, 84383, 24002, 8816, 361460, 182434, 98679, 167936, 138748, 150077, -91462, -130739, 53640, 154240]
5637A54240o8521j27106j1550K38782K5759j63076j32393P9718K6364N4976j9503
5626E7690j5449k3077K63843k71808O2204n39J30016M8567O1386k50392K60313
5615C22754k18230j02555K9289J44561j59177j7055L7359k7852J31021j36889
5605C226K08310k77500J96585j8414J5888k9352J40576j58272l5520J34908k49628
5594f9193J01232J4230l8038l4494K02380j9906k07016J46156J22090k025j52179
5583F3237O3005R1528j02762J14343n1770j39600k46P98J99794j43873k48574
5572a54120J81573j15644K60731k51059J09258p0693K18477p9757o5295n6999
5562b3528N3388K9143k23197L83484k84774P2795k4714L0206o275K92255k61629
$$ y = [154240, 85719, -41387, -52937, 185845, 211604, 48528, -83865, -4147, 22217, 77193, 57690, 42241, 19164, 283007, 11199, 73403, 72864, 202880, 251447, 312833, 62441, 322754, 104524, 1969, 31258, 175819, 16642, -413, 36946, 9094, 140115, 3226, 211536, -65964, 130621, 112207, 128095, 98743, 239319, 81047, 45527, 180435, -69193, 32039, 46269, 8231, -26263, 176117, 156211, -50805, 95351, 217441, 215416, 63237, 126242, 217770, 115008, 229351, 177581, 37981, 37735, 38533, 238327, 94454, -154120, 27453, -88191, 172540, -78519, 30739, -39954, 178523, 98766, 33471, -23528, 29860, 59003, -164194, 219290, -65484, 7311, -17403, 12803, 6528, 298783, 37154]
5551C7154j508j51047K15982P8769j00388J37958j00121J939l4165J11889k73512
5540g7050J15515Q9540k85179J14695Q5529J3416j254M0031O5574o2449J38399
5529B36767q1438j63132K26066l32707J15681Q5099p9982P8639n5811J68594k58489
5518f0713M9857r0639L33505n8908r29L0045j45399m3605J43617j86925k1474
5507e1568L85943k42266J09630j73708n9944K07038j44560l9148J46055j13135
5497B4337j32398K10437p1865m142J9752J77722k55325n980O3683j3618J36516
5486A49119n9611k07885J04898Q6730j46383J1638K63180o1937J5361K4654M476
5475A84240k41320J31214o546J60743l04645P6963O8794Q3699m8670n8194J32079
$$ y = [37154, 35646, -115401, 100581, 179350, 78962, 216920, 116799, 118738, 84573, 196462, -77050, 38465, 128005, -157174, -42479, 43050, 56466, 55212, 95243, 160817, 98368, 236767, 155329, -7803, 218263, -114444, 1237, 86336, 6354, 84993, 29182, 197776, -60713, -10856, -101495, 232010, 173102, 172173, 202218, 56819, 13214, 156831, -30094, -51568, 334375, 92109, 201739, 28031, -31913, 175125, 30565, -8583, 137472, 24337, -108061, 102376, 30511, 26369, 46121, 223843, -31482, -37462, 26221, 12603, 149119, 89508, -118377, -13479, 73251, -73132, -61494, 201686, 139749, 155110, 179764, 184240, -57080, 74134, 67588, 228331, -76314, 649, 69443, 153142, 104472, 46278, 178357]
5464A78357J03313r1198P1912o9109j93395R3985j91037J43917j9095Q0786J14746
5453B23182j72741J01012j30820J7934K10063j55335p5553o4503K77375l874j14374
5442A12366k03630K76163o8201j82759J46682o1745j49669K88345j52039m0623
5432c5110J39378L5282m7221r6101L02466j58878J10638l14873J19417n3374P5117
5421G6741j69194K50121R3308k26299L3445j0038j30409J60348o6413J82136j76138
5410A7608P0623P5966k7780o8593O9600p2032q0869J15318p5397p4488K70096
5399B20052j74681j57601J75347K0977J21179J7389q877k14075M9720j01170J63688
5388A11948j9125L5867l04212L89977j02172k3059j36064R1013L1503m3553J08461
$$ y = [178357, 281670, 190472, 262384, 193275, -120, 93865, -97172, 46745, 27650, 108436, 223182, 50441, 151453, 20633, 38567, 248630, 93295, 17742, -46761, 230614, 226740, 112366, -91264, 184899, 116698, -66061, 80621, 18876, -130793, 157552, 5513, -35110, 104268, 139550, 92329, -3772, 298694, 139816, 250454, -64419, 54998, 1624, 76741, -92453, 157668, 250976, 24677, 58122, 48084, -82325, 78023, 11610, 193746, 17608, 88231, 164197, 136417, 67824, 137424, 65392, -15477, 99841, 24444, -50044, 220052, 45371, -112230, 63117, 84094, 205273, 222662, 213785, -290, 49430, -51740, 111948, 92823, 128690, -175522, 214455, 112283, 89224, -46840, 44173, 75676, 32123, 140584]
5377A40584K9991L4140L6724m6890o0244Q826l29219K17826R4475k20054M86679
5366C92838k81766k49326L9653J18952J09776J30212k43861q2825P8255J1621
5356B3529L06366k87347K386O0952k35868K69798m1401K3135j68543R1264O6920
5345A11191N4271O5475r803j20253o2291L2039J15285n1835j26246l1795J78721
5334A54759K96494l33234k1180l1755J17326n5580J8845j67311J31209n0907J81276
5323B39942k01178l5569j0462r0407K08048L2805J417j22199N6977j0188N7008
5312A26194j11327O9430J02769p4802j7099M766N0253k01259K14216q7400N5980
5301A31721j67685J22567k238N1345k19587K06417n8827p7480N8648O1252j00483
$$ y = [140584, 170575, 204715, 241439, 194549, 134305, 143131, -186088, 31738, 126213, -93841, 392838, 111072, -138254, -98601, 20351, 130127, 260339, 16478, -66347, 11908, 23529, 329895, 42548, 44934, 105886, -129982, 139816, 98415, 121550, -46993, 44271, 111191, 165462, 230937, 221134, 100881, 38590, 70629, 185914, 134079, 7833, -23962, 154759, 451253, 118019, 96839, 65084, 182410, 126830, 145675, -21636, 109573, 58666, 239942, 38764, 3195, -7267, -97674, 110374, 143179, 144596, 22397, 79374, 69186, 126194, 14867, 84297, 187066, 112264, 95165, 99931, 150184, -51075, 163141, 75741, 131721, -35964, 86603, 84365, 135710, -83877, 122540, 63713, -13767, 44881, 106133, 5650]
5290E650k9801r872k1362Q4600j19210J22859N4830j21532N4388l6617K47462
5279B31395n5681k08748J60744n1698J15444k03207j35667K01436L8314o4967
5269B7365k136J24656j75063l0866J79493j8384j8779K02215j70153j01264m2130
5258b5046J52436r8261j3201K37438j44665K370K18700n5450q0772j76766q4027
5247f7244R1373j06272K52911r5716R0929j96896J44842j68473J13639p7124K05016
5236A86985l7758j00304J07797j26766K00631j13681o8504k7130j00493j5689
5226i4912J02973j16109K18855o7169J6001K0791k07596K54112J34035j82811
5216G8170l5117o5191j93150N09748k24094k5538M9808P8677j03718o8636m073
$$ y = [5650, -24151, -34023, -55385, 29215, -89995, 32864, 87694, -33838, 20550, -16067, 231395, 175714, -33034, 127710, 76012, 191456, -11751, -147418, 54018, 92332, 27365, 25229, 149885, -25178, -56044, 123449, 105065, 86286, 288501, 118348, 17084, -25046, 127390, 29129, 15928, 253366, 108701, 111071, 329771, 274321, 193549, 16783, -67244, 24129, -82143, 170768, 75052, 165981, -30915, 113927, -54546, 59093, -18031, 186985, 149227, 48923, 156720, 29954, 230585, 116904, 48400, 21270, -79223, -94912, 8061, -108048, 110807, 43638, 59639, 80430, -127166, 126946, 260981, 78170, 43053, -22138, -215288, 294460, 70366, 44828, 94636, 173313, 69595, 959, -3114]
5205c114L4903o5047P3397K09337j92863k9451K0239l7919k3799J30485k7900
5194H8268q082m5357m6907O8598J80774j88039J65593n1408j02743M0831r32L0339
5182A30935O9981q7880j46784P5306p4512J83623k17586K35186j05189M1749j9882
5171H4947O4394n1753J43608o4787m5792p9125j9121P9710j75068O9145J7668
5160B3826J00041K4046l7848k6086n1924N1705m034k21305J83284J39671r587
5149A71789j3013P8029l21278J31014K0177r6739J80088j08598o8890J58331p9616
5138E1294l676Q8535j88346o570K9684j3111K15508k85237O1695N8031J17164
5127A24971J71288k01389n0678J71657r2389K954r9414J68597n4273n0551o3930
$$ y = [-3114, 31789, -33258, 40139, 249476, 56613, 27162, 47401, 9482, -14317, 116168, 88268, 80186, 34829, -12078, 56520, 237294, 49255, 214848, 163440, 60697, 101528, 100596, 130935, 200916, 113036, -33748, 41558, -32954, 150669, -66917, 168269, 63080, 104829, 84947, 149341, 97588, 241196, 176409, 130617, 51492, 32371, 112081, -62987, 6158, 23826, 123867, 147913, 110065, 83979, 32055, 83760, 79726, -141579, 41705, 181376, 171789, 158776, 236805, -84473, 46541, 66718, -30021, 150067, 41469, -27421, 130910, 51294, 47618, 136153, -52193, -58763, -29079, -42190, 173318, -111919, -50224, 7807, 124971, 296259, 94870, 44192, 215849, 123460, 126414, 27000, 195597, 141324, 90773, 26843]
5116B6843K9201l7126P6250j11012Q5660n2721O2979J15173j99292O4663J31318
5105A91936k25827J72692J5274j3224p8986j4457L3392J84568j11235r7261O0148
5094A17020M3396j92704J23110K3653K1739r2250l8538O4812O0861Q4442l26946
5083a11405J78992l6659r9080Q1372L9165L01102l18221n3235R7897j39932J71634
5072A11630J93625j42077k51978J82422J27718j20019p1279M3616k9133J08092
5062A52617m4592Q5844l7579j29308P9545P4495l1188p9016R0031Q2926p5182
5051A68593k11654K20431j06918J48086j41847q0856N3877J24963p1650j54652
5041e1627J84132o6910k010q3715m7150J11430N7414K4679K6733K2547o352L6435
$$ y = [26843, 56044, 18918, 95168, -15844, 69816, 17095, 80074, 195247, -4045, 60618, 191936, -33891, 138801, 154075, 140851, 61865, 47408, 80800, 265368, 154133, 56872, 117020, 160416, -32288, 90822, 114475, 136214, 43964, 5426, 70238, 131099, 215541, -111405, 67587, 30928, -68152, 13220, 52385, 353487, 35266, -17969, 79928, -60004, 111630, 305255, 163178, -88800, 93622, 221340, 101321, 30042, 73658, 44525, 152617, 108025, 193869, 156290, 26982, 106527, 181022, 149834, 70818, 160849, 243775, 168593, -43061, 177370, 70452, 218538, 76691, -4165, 49712, 174675, 103025, -51627, 132505, 65595, 63585, -20130, -67280, 44150, 101564, 126243, 152976, 175523, 169171, 205606]
5029B05606m2118r5800k7547N3765o1538J64492o5769Q7441m1688J7865j70676
5018B4033Q8728m5576Q7690R3459j01050j9561Q4402j20608r3098K22808J6442
5007B37669m8576J10417r8062l3032l3396R1079l40221L45948n4372N442r7449
4996H5447o3318N6697K8431Q3326p1016P600o3269R5671m0725p692k9618j07272
4984b5738K98725r4313j10829J98324l15423K48989k17809K16787j37931l7974
4974B2808K45319j04472q073j41720J35035m3185J09748N226j26468j8607j52343
4963g6732K91975j47731J70344n1468n2508j87747K40924J18749k30270O1183
4953A36719K0826K8933j73623j5154J19130P9536j06772J14866r6285P9699J7971
$$ y = [205606, 163488, 67688, 40141, 93906, 32368, 196860, 131091, 218532, 176844, 194709, 24033, 112761, 67185, 154875, 248334, 147284, 127723, 212125, 91517, -1581, 221227, 237669, 189093, 299510, 201448, 168416, 135020, 226099, -114122, 231826, 177454, 182896, 85447, 22129, 78826, 107257, 190583, 119567, 127167, 63898, 159569, 118844, 111152, 81534, -25738, 272987, 178674, 67845, 266169, -49254, 199735, -18074, 198713, 60782, 22808, 268127, 163655, 155582, 13862, 148897, 105712, 215460, 220686, 94218, 75611, -76732, 215243, 67512, 237856, 186388, 133880, -53867, 187057, 305806, 75536, 136719, 157545, 186478, 12855, -2299, 116831, 196367, 89595, 204461, 108176, 187875, 205846]
4942B05846Q0894k4458j99047P7267k07667J76546k795j08404p3861J47639J00129
4931A72089q3740J32307q6908p8479J70955j19836N8584J76849k22115l5334J32362
4920B16734r1926M8497j7738k1893J04084l06645L07541j53289O4627r8440m8436
4909C116K21488M7824o8934j62512O6423J4699R2637M8118m6348q7778r2865o3012
4897b7144j521K20348o0446r3317M3422k796R698J32990j46243Q8232l8485Q3626
4885B08364j03634m2065M3210M8475j17833J73621M2412l1752M5261J89093k48213
4874B06939j18616J15422j79652l2228K26041p2878l9132J68179k64825L14729
4864C23979r7273j10923K91360j27340j20364Q5864j25007M5345M6260Q9538j48733
$$ y = [205846, 286740, 262282, 63235, 140502, -67165, 109381, 106586, -1818, -75679, 71960, 172089, 88349, 220656, 133748, 55269, 226224, 106388, 164972, 341821, 119706, 84372, 216734, 124808, 173305, 155567, 133674, 237758, -68887, 238654, 85365, 149992, 51552, 3116, 224604, 272428, 203494, 40982, 107405, 122104, 214741, 262859, 216511, 128733, 35868, -27144, -28665, 191683, 131237, 37920, 81342, 78546, 88244, 221234, 74991, 163223, 124738, 208364, 104730, 62665, 105875, 154350, 36517, 210138, 252550, 220798, 266059, 455152, 206939, 88323, 203745, 24093, -8135, 217906, 145028, 105896, 274075, 9250, 323979, 226706, 115783, 407143, 279803, 159439, 245303, 120296, 165641, 211901, 301439, 152706]
4853A52706M1801l0906j28603O8945J11164o6875j14344K69837k20456K14524
4843B97793l5623j58733Q4490k3491k38791J21099J12866k2769J18952k1336l7143
4832A97314n5954q9448J3885j8110J42414L4990J10119j00342q1301J23268j21823
4821A55012n461K2419Q5174N9296j37822J75243k57837O2630J33429r3428k217
4810A96438j04099J93624l400j23532n3744L1595J60960j09702m0718J74331j53968
4799A67785J57832q5437J68543O7016l30900K14915l38061M33137j15076p6739
4789B63015j3287j7723Q8064l662l3967p5777L2989J21077O3366j17956J20213
4778D26352q9512K03677j26095m5943J63799J10853m0350k36693J60471J87360
$$ y = [152706, 194507, 163601, 34998, 103943, 215107, 148232, 33888, 303725, 83269, 297793, 262170, 103437, 187927, 164436, -74355, 46744, 159610, 136841, 255793, 234457, 197314, 141360, 51912, 65797, 47687, 190101, 225091, 335210, 234868, 153567, 276835, 155012, 149551, 171970, 257144, 316440, 178618, 353861, 96024, 158654, 292083, 198655, 196438, 92339, 285963, 282563, 159031, 105287, 136882, 297842, 188140, 147422, 321753, 167785, 325617, 240180, 408723, 475739, 144839, 359754, 21693, 454830, 339754, 263015, 249728, 232005, 320069, 316407, 282440, 206663, 239652, 360729, 424095, 306139, 426352, 336840, 540517, 414422, 368479, 532278, 643131, 602781, 366088, 526559, 713919]
4768G13919j05968M4860J6299j63111K0634n5446R2668m4126j75240J12668n8527
4757C98630J02201K2184j72681j54015K15457l0642N1298l07303K95357k65361
4747A55125J39092O105J15520j54489J00616j23212J34410j6006r5904q4757O1977
4736B38477N4707K5508l8203J70831q6399R092k0025j30662K1388O0466L2825
4725C38005J27649n2165j38451P8155J23386j68882P5242l144j9431K14564j51116
4714D23812K0228J2572j41117k3972K38918o3496j79825J57647m9253J4234J95700
4703F05448l9497K3356r3416k03168K35084n4985P9188j29115J1232p63P1139
4692E04503R7543r3615P1296p7824J3257r4050J12002J6812J22428j96369n4286
$$ y = [713919, 607951, 652811, 669110, 505999, 526633, 471187, 563855, 519729, 344489, 457157, 398630, 500831, 523015, 350334, 196319, 411776, 381134, 432432, 125129, 420486, 155125, 294217, 300322, 415842, 261353, 361969, 238757, 373167, 357161, 261257, 176500, 238477, 293184, 318692, 280489, 451320, 364921, 374013, 353988, 223326, 244714, 305180, 338005, 465654, 413489, 275038, 353193, 476579, 307697, 382939, 379795, 360364, 574928, 423812, 444040, 456612, 315495, 291523, 530441, 466945, 287120, 444767, 395514, 409748, 605448, 565951, 589307, 495891, 292723, 527807, 472822, 552010, 422895, 434127, 433364, 504503, 602046, 508431, 579727, 501903, 515160, 421110, 533112, 549924, 672352, 475983, 421697]
4681D21697m3232J39579N3580m238M337R2135j2686L9019n7419j210j94536L689
4669D40715J11090k5481O00O4214j05145j57938J50838p1743O3858J51393m1734
4658E80667N114K995L5106N7585J53115j81234K63000l53730J14717j1800J33043
4647G98578j95009Q8474J3612J22662j40197K3201K1977J91479q8689j40685K29631
4636I25034K13851n69011L35995n1130J58854l3354M4538o8205N0216R838o2514
4625I54112J51471j21003K53105j94895J52200o1335J64764o8067M4294p7045
4615A197601K3535m7388K48328k10943Q0772j0759L3988k05104K47414k18495
4605A138949K73195k54271O1160K53980j54303P3561M4828J2015Q2341O1672p0901
$$ y = [421697, 378465, 518044, 571624, 567386, 571723, 663858, 651172, 690191, 632772, 631562, 437026, 440715, 551805, 526324, 526924, 591138, 485993, 328055, 478893, 407150, 471008, 622401, 580667, 585781, 588776, 623882, 681467, 834582, 653348, 916348, 562618, 677335, 665535, 798578, 603569, 692043, 705655, 828317, 688120, 711321, 733298, 924777, 836088, 695403, 925034, 1138885, 569874, 905869, 854739, 1013593, 980239, 1024777, 956572, 1006788, 1016626, 954112, 1105583, 984580, 1237685, 1042790, 1194990, 1133655, 1298419, 1230352, 1274646, 1197601, 1221136, 1173748, 1422076, 1211133, 1291905, 1281146, 1315134, 1110030, 1357444, 1138949, 1412144, 1157873, 1219033, 1473013, 1318710, 1392271, 1437099, 1449114, 1531455, 1593127, 1522226]
4594A522226M7208J49712J09911J58341k88955K40972L7794j10983j2124R0652
4584A944754k47718n5855j9809k88576L29317j61038o303o3055k2997J91508m0329
4573A559899k26647K03692j9928l9555q0287L40296j06122n9290n461P1175j0698
4562A627074o1476L28875l09861R2946k79934P2681p0062o13l1875r4536J91215
4551A464434J29818j31598j26680O0091O1424r5218J61732r5780r8926j0292Q3032
4540A402037K7385P5919J8686j61574k7826L2239J20964o5271J30418j52376J85293
4529A585894L4374l8125o8963l1035N6234N418o5632J84914j56230J32097k46079
4518A392867m9473L37270n4913q1936K09573j99318K62530j07291N3551R917j5359
$$ y = [1522226, 1569434, 1719146, 1829057, 1987398, 1698443, 1939415, 1977209, 1866226, 1854102, 1944754, 1697036, 1641181, 1621372, 1332796, 1662113, 1501075, 1494772, 1431717, 1408720, 1600228, 1559899, 1333252, 1536944, 1517016, 1477461, 1397174, 1737470, 1631348, 1572058, 1566597, 1637772, 1627074, 1565598, 1894473, 1584612, 1677558, 1397624, 1470305, 1400243, 1399630, 1367755, 1273219, 1464434, 1594252, 1462654, 1335974, 1396065, 1457489, 1362271, 1524003, 1428223, 1329297, 1319005, 1402037, 1429422, 1505341, 1524027, 1362453, 1334627, 1366866, 1487830, 1422559, 1552977, 1400601, 1585894, 1620268, 1582143, 1513180, 1482145, 1538379, 1543797, 1478165, 1663079, 1506849, 1638946, 1392867, 1343394, 1680664, 1625751, 1543815, 1753388, 1554070, 1816600, 1709309, 1762860, 1772777, 1757418]
4507A757418j5321J60600L1188n1358K5038J59508j94924N6105q1298L53785M9394
4496B250135j06882R7204j69159j7424K89336L2734j94739O9504n090Q2936J41595
4485B470150K5893m5720N7267O3323J22099j58092J42084J37009p6349j15081
4475B622583J00984J75227J09929N3157r3712K03723j3661j50409K20737J51197
4465C379755j31193R8749n8912K27302J75620O4840j70123M920K66688m1865M04300
4454D220081l29499L60804O3435j62515q8430J02516K87211R487J80393R2254
4444D735737J91607j60604J49451Q8513Q4394J20657J76792M7546K1061J46229
4434E601383J5744K27229J25962K55458J66878j0664K34222K42497N3092N3335
$$ y = [1757418, 1742097, 1902697, 1933885, 1882527, 1907565, 2067073, 1872149, 1928254, 1846956, 2200741, 2250135, 2143253, 2240457, 2071298, 2053874, 2343210, 2375944, 2181205, 2250709, 2245619, 2328555, 2470150, 2496043, 2450323, 2507590, 2570913, 2693012, 2534920, 2677004, 2814013, 2737664, 2622583, 2723567, 2898794, 3008723, 3061880, 2968168, 3171891, 3158230, 3007821, 3228558, 3379755, 3248562, 3347311, 3288399, 3515701, 3691321, 3756161, 3586038, 3590958, 3857646, 3815781, 4220081, 3890582, 4251386, 4314821, 4152306, 4063876, 4166392, 4453603, 4463090, 4643483, 4735737, 4927344, 4766740, 4916191, 5004704, 5089098, 5209755, 5386547, 5434093, 5455154, 5601383, 5617127, 5844356, 5970318, 6225776, 6392654, 6381990, 6616212, 6858709, 6911801, 6965136]
4424F965136K63636P2685O3980K78566J20217M91196N633l6585L44450J71284
4414H740198K13136K33845L4637M11285L83753K46232K50967M29577M73353N34500
4404A1951483L59596L59006N91508P50484N46785M79757R00550P07844O29257
4395A7276270J189833O64462J010173J140101J323868J220805J376671J347236
4387B6549419J624586J723482J715006K027631J819473K010643K373413K028709
4379D1872362K316377K538168K619687K874236L358309L423424L965980M150294
4371F7118837M352021M596323N109806N249498N578948N198010M604228L877633
4363A05685304K279419J206968Q2001j133413q72355j400944j095207p47317j11613
$$ y = [6965136, 7228772, 7301457, 7365437, 7644003, 7764220, 8255416, 8261049, 8224464, 8568914, 8740198, 8953334, 9187179, 9221816, 9633101, 10016854, 10263086, 10514053, 10943630, 11416983, 11951483, 12311079, 12670085, 13261593, 14012077, 14558862, 15038619, 15939169, 16647013, 17276270, 18466103, 19130565, 20140738, 21280839, 22604707, 23825512, 25202183, 26549419, 28174005, 29897487, 31612493, 33640124, 35459597, 37470240, 39843653, 41872362, 44188739, 46726907, 49346594, 52220830, 55579139, 59002563, 62968543, 67118837, 71470858, 76067181, 81176987, 86426485, 92005433, 97203443, 101807671, 105685304, 107964723, 109171691, 109253692, 108120279, 107247924, 105846980, 104751773, 104004456, 103892843]
4354A03892843k85201P3550P85201O48774J413395J848002K097791L000383M051878
4345A17526616M333605M885657N846104O232758P369291P805436Q703705Q943115
4337A71646287Q717586P143662L551673n12419m427646p307523r500094j0168408
4329A59143118r886104q547406p866996p129977o165479n504144m923573m090246
4321A05029193l593604l016086k494999j617179j095896q19953j47528J98411
4313I2442359M10138J139248J098737J571322J448093P77683M75504n57739k019836
4304I6785509l400849m477283n085892n330475n684747m937184m884946m588822
4296E8395311m089753l772884l643930k929483k982857k658937k333219k334794
$$ y = [103892843, 103607642, 103681192, 104466393, 105115167, 106528562, 108376564, 110474355, 113474738, 117526616, 121860221, 126745878, 132591982, 138824740, 146194031, 153999467, 162703172, 171646287, 180363873, 187507535, 191059208, 190546789, 186119143, 178811620, 169311526, 159143118, 149257014, 140709608, 132842612, 125712635, 119547156, 114043012, 109119439, 105029193, 101435589, 98419503, 95924504, 94307325, 93211429, 92391476, 92243948, 92442359, 92852497, 93991745, 95090482, 96661804, 98109897, 98887580, 99363084, 98805345, 96785509, 93384660, 88907377, 83821485, 78491010, 72806263, 67869079, 62984133, 58395311, 54305558, 50532674, 46888744, 43959261, 40976404, 38317467, 35984248, 33649454]
4288C3649454j817810j910636j522056j567781j443829j225874j228051j156069
4280B1777348q33094r22704q85862q07358r76436n03489q87761m39050p54993
4271A4766601o24962l84369o08091l06509m44491l72490m72451k22064n60337
4262A0770837l14925k59596k66581m24052J9007l06973l91080j82584l13081j38315
4252H192657j08402l88937l3759l02210l42343l0132k49337l01398q4074j91949
4242F160116K8075m01562K3281j97552j24829k9686j93306M1525j27792j86444
4232D991826j81284J29057k04076K3173j00962L9764k86128M5787k20677p5113
4222D161367j20335J8710k51256j57235P150m9143o0674r9130P8251j24227j90568
$$ y = [33649454, 31831644, 29921008, 28398952, 26831171, 25387342, 24161468, 22933417, 21777348, 20944254, 20021550, 19135688, 18328330, 17351894, 16848405, 15960644, 15521594, 14766601, 14141639, 13757270, 13149179, 12842670, 12398179, 12025689, 11553238, 11331174, 10770837, 10455912, 10196316, 9929735, 9505683, 9524690, 9217717, 8826637, 8644053, 8330972, 8192657, 8084255, 7695318, 7661559, 7359349, 7017006, 6986874, 6737537, 6436139, 6352065, 6160116, 6188191, 5786629, 5809910, 5612358, 5487529, 5457843, 5264537, 5306062, 5178270, 4991826, 4810542, 4939599, 4735523, 4758696, 4657734, 4697498, 4411370, 4457157, 4236480, 4161367, 4041032, 4059742, 3808486, 3651251, 3658401, 3609258, 3548584, 3449454, 3527705, 3403478, 3212910]
4211C212910J33536R3057k92104m9820q951j55863P9208J661m8074M5112O2479
4200C073151j07833j37106L6445j06358r7275N0645j60575q4393j03310J63020
4190B526411j93921J42913j88268j92798J19888J10879j06805N1860j02374j12468
4180B055317P7327o4381k4126K7968N2252q9295Q27N7960j96325j6644k9978M4626
4168A895528n1096j12424N902j45654J33805j63844J66902j15461r4501Q1226
4158A600383j27115Q7022p3648m1472k4432J26161k0606n71M3844j24158q5808
4147A359600K13165j18578J32644k41826p5732j55607K58818O2941J53163j67981
4137A420607Q448j07037o0414J13987o5927j40585k0757m6382Q7424J7823Q6472
$$ y = [3212910, 3346446, 3439503, 3147399, 3097579, 3088628, 2932765, 3011973, 3013634, 2965560, 3010672, 3073151, 2965318, 2828212, 2864657, 2758299, 2661024, 2711669, 2551094, 2466701, 2363391, 2526411, 2332490, 2475403, 2287135, 2094337, 2214225, 2325104, 2218299, 2270159, 2167785, 2055317, 2132644, 2068263, 2044137, 2072105, 2124357, 2035062, 2035889, 2093849, 1897524, 1880880, 1850902, 1895528, 1844432, 1732008, 1737910, 1592256, 1726061, 1562217, 1729119, 1613658, 1519157, 1600383, 1473268, 1560290, 1486642, 1445170, 1420738, 1546899, 1526293, 1525722, 1569566, 1445408, 1359600, 1572765, 1454187, 1586831, 1345005, 1269273, 1113666, 1372484, 1435425, 1588588, 1420607, 1429055, 1322018, 1261604, 1375591, 1309664, 1169079, 1148322, 1101940, 1189364, 1207187, 1293659]
4126A293659o8622M3054k0517j20168N948n222O0184j11691K51471j00631J70999
4115A398464k12421K1169M9871J42496j28874K41957k13882m6631J62104Q6388
4105A500641L9192L6426j94947j01771J45740N3028R77j98227k5263O7038j12023
4094A210811m7546M7707J61986k51500K91407j20112J77188j92980n5724K95913
4084A517150k76314J26884J23531m769O6027J46893o394K7678p4524k0358j929
4073A623875o7959j21987j06259P7409k10734P8565j4349j728j29296M7766J28890
4062A304193k52405J92752p0584j85058L41513l69370J62884j6840P1216L1419
4052A209720k9132j51340J73170j38573k167K2253n9671K5660p3460N5989k51214
$$ y = [1293659, 1225037, 1268091, 1247574, 1127406, 1133354, 1128132, 1188316, 1076625, 1328096, 1227465, 1398464, 1186043, 1207212, 1257083, 1399579, 1270705, 1512662, 1298780, 1252149, 1414253, 1500641, 1539833, 1576259, 1381312, 1279541, 1425281, 1478309, 1479286, 1281059, 1255796, 1322834, 1210811, 1163265, 1210972, 1372958, 1121458, 1412865, 1292753, 1469941, 1276961, 1221237, 1517150, 1240836, 1367720, 1491251, 1486482, 1552509, 1699402, 1693008, 1720686, 1646162, 1625804, 1623875, 1555916, 1433929, 1327670, 1405079, 1194345, 1272910, 1258561, 1256833, 1127537, 1175303, 1304193, 1051788, 1244540, 1173956, 988898, 1330411, 961041, 1123925, 1107085, 1178301, 1209720, 1180588, 1029248, 1202418, 1063845, 1061678, 1083931, 1024260, 1049920, 976460, 1032449, 781235]
4041G81235R9809k12222N8022J6863n1811J2332L8771k25334K17124j69313J30333
4030F95809r446j21582Q4230k42542K75323R210R227k54243J19779l7287n4571
4019D73907l1101q7713p3855K58512n5626j09583J16049j74527J69182J77186
4009F62431j91849j49695K18328j14742j52881K05007j45226j68018J75982n1256
3999B88081R1137r0082J39627M4192k37524O8601M7447O3679j50652n1668r7867
3988A14971J46770k3145j17008J06553q2373O0575l2054j65793K43634k01137
3978E0993K12938n2598J69086j90736N1190l5212j05835k703P7069K24810j79972
3967B19030o922K7879J8472p6492l1767p7846J06227o4487R9176P2918j9158j48203
$$ y = [781235, 881044, 668822, 726844, 743707, 691896, 704228, 742999, 517665, 734789, 565476, 695809, 686363, 564781, 649011, 406469, 681792, 691002, 700229, 445986, 565765, 528478, 473907, 442806, 355093, 281238, 539750, 484124, 374541, 490590, 316063, 485245, 662431, 470582, 320887, 539215, 424473, 271592, 476599, 331373, 163355, 339337, 288081, 379218, 289136, 428763, 472955, 235431, 304032, 351479, 415158, 264506, 212838, 114971, 261741, 238596, 121588, 228141, 145768, 206343, 174289, 8496, 252130, 50993, 263931, 211333, 380419, 189683, 240873, 205661, 99826, 97123, 174192, 399002, 219030, 212108, 239987, 258459, 181967, 150200, 72354, 178581, 114094, 213270, 286188, 267030, 118827]
3955A18827p424J22323N1369k98167K06425J35572j05780p8588j28984J39483
3945A55056J8706J326N6827k32811K44568j02924J11059j43488M1388k675p4221
$$ y = [118827, 111403, 233726, 285095, -13072, 193353, 328925, 223145, 144557, 15573, 155056, 173762, 175088, 231915, -896, 243672, 140748, 251807, 108319, 149707, 147032, 72811]
$$ [...]
##END NTUPLES=NMR SPECTRUM
##END=
