##TITLE=abcd
##JCAMPDX= 6.0         $$ Bruker NMR JCAMP-DX V2.0
##DATA TYPE= NMR SPECTRUM
##DATA CLASS= NTUPLES
##ORIGIN= UXNMR, Bruker Analytische Messtechnik GmbH
##OWNER= root
$$ XWIN-NMR		Version 3.5
$$ Sat Feb 22 17:13:12 2025 Russian Standard Time (UT+4h)  servis@DPX200
##.OBSERVE FREQUENCY= 200.131235884673
##.OBSERVE NUCLEUS= ^1H
##.ACQUISITION MODE= SIMULTANEOUS
##.ACQUISITION SCHEME= undefined
##.AVERAGES= 32
##.DIGITISER RES= 18
##SPECTROMETER/DATA SYSTEM= spect
##.PULSE SEQUENCE= zg
##.SOLVENT NAME= D2O
##.SHIFT REFERENCE= (INTERNAL, D2O, 0, 16.4885)
##AUDIT TRAIL= $$ (NUMBER, WHEN, WHO, WHERE, WHAT)
$$ ##TITLE= Audit trail, XWIN-NMR		Version 3.5
$$ ##JCAMPDX= 5.01
$$ ##ORIGIN= Bruker BioSpin GmbH
$$ ##OWNER= servis
$$ F:\spectra/data/av/nmr/H1/1/pdata/1/auditp.txt
$$ ##AUDIT TRAIL=  $$ (NUMBER, WHEN, WHO, WHERE, WHAT)
(   1,<2025-02-22 17:06:39.18 +0400>,<servis>,<DPX200>,
      <created by zg, POWCHK disabled, PULCHK disabled
       configuration hash MD5:
       00 E9 B6 7A A2 85 ED C7 34 08 36 98 17 FE 4E 26
       data hash MD5: 32K
       20 3F DC E2 A1 3D CC 54 EE C6 B4 F1 07 62 F6 E9>)
(   2,<2025-02-22 17:12:18.42 +0400>,<servis>,<DPX200>,
      <Start of raw data processing
       efp BC_mod = 2 LB = 0.05 FT_mod = 6 PKNL = 1 PHC0 = -264.1254 PHC1 = 1.301534 SI = 16K 
       data hash MD5: 16K
       DF 80 E2 76 68 36 1D AB BD F4 62 D1 A2 51 76 6A>)
(   3,<2025-02-22 17:12:41.84 +0400>,<servis>,<DPX200>,
      <pk PHC0 = -1.999999 PHC1 = 0 
       data hash MD5: 16K
       78 73 8B 20 74 2A 5A 3C 4A 1B 90 A6 0A DE A4 34>)
$$ ##END=
$$ 
$$ hash MD5
$$ 02 E6 31 51 17 D1 39 46 5D 67 3E B5 B9 6A 37 EE
##$RELAX= 
##$RELAX= 
##$RELAX= 
##$RELAX= 
##$RELAX= 
##$RELAX= 
##$RELAX= 
##$RELAX= 
$$ Bruker specific parameters
$$ --------------------------
##$DU= <F:\spectra>
##$EXPNO= 1
##$NAME= <H1>
##$PROCNO= 1
##$TYPE= <nmr>
##$USER= <av>
##$AMP= (0..31)
100 100 100 100 100 100 100 100 100 100 100 100 100 100 100 100 100 100 
100 100 100 100 100 100 100 100 100 100 100 100 100 100 
##$AQSEQ= 0
##$AQ_mod= 1
##$AUNM= <au_zg>
##$AUTOPOS= <>
##$BF1= 200.13
##$BF2= 200.13
##$BF3= 200.13
##$BF4= 200.13
##$BF5= 500.13
##$BF6= 500.13
##$BF7= 500.13
##$BF8= 500.13
##$BYTORDA= 1
##$CFDGTYP= 0
##$CFRGTYP= 5
##$CHEMSTR= <none>
##$CNST= (0..31)
1 1 145 1 1 1 1 1 1 1 1 1 1 1 1 1 1 1 1 1 1 1 1 1 1 1 1 1 1 1 1 1 
##$CPDPRG= <>
##$CPDPRG1= <>
##$CPDPRG2= <>
##$CPDPRG3= <>
##$CPDPRG4= <mlev>
##$CPDPRG5= <mlev>
##$CPDPRG6= <mlev>
##$CPDPRG7= <mlev>
##$CPDPRG8= <mlev>
##$CPDPRGB= <>
##$CPDPRGT= <>
##$D= (0..31)
0 2 0 0 0 0 0 0 0 0.06 0 0 0 0 0 0 0.0002 0 0 0 0 0 0 0 0 0 0 0 0 0 0 
0 
##$DATE= 1740229598
##$DBL= (0..7)
120 120 120 120 120 120 120 120 
##$DBP= (0..7)
150 150 150 150 150 150 150 150 
##$DBP07= 0
##$DBPNAM0= <>
##$DBPNAM1= <>
##$DBPNAM2= <>
##$DBPNAM3= <>
##$DBPNAM4= <>
##$DBPNAM5= <>
##$DBPNAM6= <>
##$DBPNAM7= <>
##$DBPOAL= (0..7)
0.5 0.5 0.5 0.5 0.5 0.5 0.5 0.5 
##$DBPOFFS= (0..7)
0 0 0 0 0 0 0 0 
##$DE= 6
##$DECBNUC= <off>
##$DECIM= 32
$$ [...]
##$SUBNAM4= <"">
##$SUBNAM5= <"">
##$SUBNAM6= <"">
##$SUBNAM7= <"">
##$SUBNAM8= <"">
##$SUBNAM9= <"">
##$SW= 20.6817932712277
##$SWIBOX= (0..15)
0 0 3 0 0 0 0 0 0 0 0 0 0 0 0 0 
##$SW_h= 4139.07284768212
##$TD= 32768
##$TD0= 1
##$TE= 0
##$TE2= 300
##$TE3= 300
##$TEG= 300
##$TL= (0..7)
0 120 120 120 120 120 120 120 
##$TP= (0..7)
150 150 150 150 150 150 150 150 
##$TP07= 0
##$TPNAME0= <>
##$TPNAME1= <>
##$TPNAME2= <>
##$TPNAME3= <>
##$TPNAME4= <>
##$TPNAME5= <>
##$TPNAME6= <>
##$TPNAME7= <>
##$TPOAL= (0..7)
0.5 0.5 0.5 0.5 0.5 0.5 0.5 0.5 
##$TPOFFS= (0..7)
0 0 0 0 0 0 0 0 
##$TUNHIN= 0
##$TUNHOUT= 0
##$TUNXOUT= 0
##$USERA1= <user>
##$USERA2= <user>
##$USERA3= <user>
##$USERA4= <user>
##$USERA5= <user>
##$V9= 5
##$VALIST= <valist>
##$VCLIST= <CCCCCCCCCCCCCCC>
##$VD= 0
##$VDLIST= <DDDDDDDDDDDDDDD>
##$VPLIST= <PPPPPPPPPPPPPPP>
##$VTLIST= <TTTTTTTTTTTTTTT>
##$WBST= 1024
##$WBSW= 30
##$XGAIN= (0..3)
0 0 0 0 
##$XL= 0
##$YL= 0
##$YMAX_a= 319623
##$YMIN_a= -315769
##$ZGOPTNS= <>
##$ZL1= 120
##$ZL2= 120
##$ZL3= 120
##$ZL4= 120
##$ABSF1= 0
##$ABSF2= 0
##$ABSG= 0
##$ABSL= 0
##$ALPHA= 0
##$AQORDER= 0
##$ASSFAC= 0
##$ASSFACI= 0
##$ASSFACX= 0
##$ASSWID= 0
##$AUNMP= <proc_1d>
##$AZFE= 0.1
##$AZFW= 0.1
##$BCFW= 0
##$BC_mod= 2
##$BYTORDP= 0
##$COROFFS= 0
##$CY= 18.4799938201904
##$DATMOD= 1
##$DC= 0
##$DFILT= <>
##$DTYPP= 0
##$F1P= 9.9274215381318
##$F2P= -0.165520771350173
##$FCOR= 1
##$FTSIZE= 16384
##$FT_mod= 6
##$GAMMA= 0
##$GB= 0
##$INTBC= 1
##$INTSCL= 4.127829e-11
##$ISEN= 128
##$LB= 0.05
##$LEV0= 0
##$LPBIN= 0
##$MAXI= 10000
##$MC2= 0
##$MEAN= 0
##$ME_mod= 0
##$MI= 50
##$NCOEF= 0
##$NC_proc= -6
##$NLEV= 6
##$NOISF1= 3.799351
##$NOISF2= 2.8
##$NSP= 0
##$NTH_PI= 0
##$NZP= 0
##$OFFSET= 16.48848
##$PC= 4
##$PHC0= -266.1254
##$PHC1= 1.301534
##$PH_mod= 1
##$PKNL= yes
##$PPARMOD= 0
##$PSCAL= 4
##$PSIGN= 0
##$REVERSE= no
##$SF= 200.130005582386
##$SI= 16384
##$SIGF1= 3
##$SIGF2= 2
##$SINO= 400
##$SIOLD= 16384
##$SREGLST= <1H.CDCl3>
##$SSB= 0
##$STSI= 16384
##$STSR= 0
##$SW_p= 4139.07284768211
##$SYMM= 0
##$S_DEV= 0
##$TDeff= 32768
##$TDoff= 0
##$TI= <>
##$TILT= no
##$TM1= 0
##$TM2= 0
##$TOPLEV= 0
##$USERP1= <user>
##$USERP2= <user>
##$USERP3= <user>
##$USERP4= <user>
##$USERP5= <user>
##$WDW= 1
##$XDIM= 16384
##$YMAX_p= 323597587
##$YMIN_p= -1126308
$$ End of Bruker specific parameters
$$ ---------------------------------
##NTUPLES= NMR SPECTRUM
##VAR_NAME=  FREQUENCY,     SPECTRUM/REAL,   SPECTRUM/IMAG
##SYMBOL=    X,             R,               I
##VAR_TYPE=  INDEPENDENT,   DEPENDENT,       DEPENDENT
##VAR_FORM=  AFFN,          ASDF,            ASDF
##VAR_DIM=   16384,         16384,           16384
##UNITS=     HZ,            ARBITRARY UNITS, ARBITRARY UNITS
##FACTOR=    0.252644378177508, 1,           1
##FIRST=     3299.83951724647, 0,            0
##LAST=      -839.233330435636, 0,           0
##MIN=       -839.233330435636, -1126308,    0
##MAX=       3299.83951724647, 323597587,    0
$$ Real data points
##PAGE= N=1
##DATA TABLE= (X++(R..R)), XYDATA
$$ [...]
10071B239667J62945j94717J4896j1292q6288K11830l04494J84898m6003j6551
10061B154891K1226o2210p9826K49550j41192l3306n8925O7035J32011q9578j59446
10050B000230J92970k99054M10598n131o605K8618K05864j69622M3305r6395J79711
10039B484489L0975Q7107j68063L21706p5489J29147j04902p2550K09145J70011
10029C011576q661L0719J22928j56059K52180K68107q3080K4819J88125K06026
10019C856680J32833m6541M03914K5073P7906L60976P6612P8341L93688K44480
10009E603962P2350N08067K99309o0199O80506K87312M94722M14751M93340O57880
9999I452000O97914N60616Q14690J065009Q00402J333438J054721J268270J486850
$$ plain form
10071 2239667 2402612 2207895 2222791 2211499 2125211 2337041 2032547 2217445 2171442 2154891
10061 2154891 2176117 2113907 2034081 2283631 2142439 2109133 2050208 2117243 2249254 2159676 2000230
10050 2000230 2193200 1894146 2304744 2299613 2293008 2321626 2527490 2357868 2401173 2304778 2484489
10039 2484489 2515464 2602571 2434508 2756214 2680725 2809872 2704970 2632420 2841565 3011576
10029 3011576 3002915 3033634 3156562 3000503 3252683 3520790 3437710 3462529 3650654 3856680
10019 3856680 3989513 3942972 4346886 4371959 4449865 4810841 4887453 4965794 5359482 5603962
10009 5603962 5676312 6184379 6483688 6423489 7103995 7391307 7886029 8300780 8794120 9452000
9999 9452000 10149914 10710530 11525220 12590229 13390631 14724069 15778790 17047060 18533910
9990A8533910J557372J929817K137031K089663K717994L100515L622448L755309
9982C9444059L775039L917973L806610L298447K929361K289306J711369N86292
9974F1758456Q1788p82810j572100k057906k491460k635112k685346k004796k293089
9965D5317625j466408r38155m26814J30755J011395J367617J827859K820310K840816
9956E2485000K763990L124622K594775K351108J444603Q43353j85297j071081
9948F4351073j701446k708242l245430l793920l990250m153038m235632l717714
9940C6805401l480813l181426k736507k333331j853304j876694j452121j138515
9932A8752690j256045p67076p74871n39427n73330m88085o05904l56220k86478
$$ plain form
9990 18533910 20091282 22021099 24158130 26247793 28965787 32066302 35688750 39444059
9982 39444059 43219098 47137071 50943681 54242128 57171489 59460795 61172164 61758456
9974 61758456 61840244 61057434 59485334 57427428 54935968 52300856 49615510 47610714 45317625
9965 45317625 43851217 42913062 42486248 42617003 43628398 44996015 46823874 49644184 52485000
9956 52485000 55248990 58373612 60968387 63319495 64764098 65607451 65422154 64351073
9948 64351073 62649627 59941385 56695955 52902035 48911785 44758747 40523115 36805401
9940 36805401 33324588 30143162 27406655 25073324 23220020 21343326 19891205 18752690
9932 18752690 17496645 16729569 15954698 15415271 14841941 14353856 13747952 13391732 13105254
9923A3105254j46516n43034k21320o76761k46046k72990n05218n00245m68747
9914I524377k45776k53569m31558k79532j18315l81863j20918J18772l27998O0639
9904G544259j976J25727k6875N0742K17056l4062j81392K01964p984l53663L7870
9893G571666l01544j64115l89016l78349q9864j69737k70317m35690r6670k63841
9883E012523j90245r8514j69587M8516l70777R9866q5589r4424q6587l6245j86260
9872C842677j26038P570r01K3218r5089r200j79607R2107n752J23773M1896j08843
9860C605811p0700J4694M935K16487l02405P3481J38156k36895j17638L03052
9850C628978p6948n8805L82561k02366m2296J94612j39267J60406j02912J26914
$$ plain form
9923 13105254 12958738 12415704 12194384 11517623 11271577 10998587 10493369 9993124 9524377
9914 9524377 9278601 9025032 8593474 8313942 8195627 7813764 7692846 7811618 7483620 7544259
9904 7544259 7542283 7668010 7641135 7691877 7908933 7874871 7693479 7895443 7887459 7533796 7571666
9893 7571666 7270122 7106007 6716991 6338642 6248778 6079041 5808724 5373034 5276364 5012523
9883 5012523 4822278 4723764 4554177 4602693 4231916 4331782 4246193 4151769 4065182 4028937 3842677
9872 3842677 3716639 3724209 3723308 3746526 3651437 3642237 3462630 3554737 3548985 3672758 3714654 3605811
9860 3605811 3535111 3549805 3554740 3771227 3468822 3542303 3680459 3443564 3325926 3628978
9850 3628978 3552030 3493225 3875786 3673420 3631124 3825736 3686469 3846875 3743963 3870877
9840C870877j327L9828J02850J05535k689K28288m2189K49191R8755K8353J99712
9829D877184K61262k05464K79057K75284M96983L28319N7765K01074M30341O05420
9819G607225J70589K09487O75683M68620L79208P19884Q40747Q04595P88323J332038
9809A3996399J163617J260972J306230J711354J493508J334118J058673P26009
9801B4050880Q14526L47295K08155l31645l79436o40799o25572o20611r78435
9792B1844358k60476m00303k50885j66417K86093L39274P77607O76722R08978
9783B3754951J237302J478287K342958K018279K584632K928767L208262L402262
9775D2955700L640213L480046L010547K985550K151460J709132P85614R1319o13991
$$ plain form
9840 3870877 3869550 3909378 4012228 4117763 4115074 4343362 4301173 4550364 4649119 4677472 4877184
9829 4877184 5138446 4932982 5212039 5487323 5984306 6312625 6370390 6571464 7001805 7607225
9819 7607225 7777814 7987301 8662984 9131604 9510812 10230696 11071443 11876038 12664361 13996399
9809 13996399 15160016 16420988 17727218 19438572 20932080 22266198 23324871 24050880
9801 24050880 24865406 25212701 25420856 25089211 24709775 24068976 23443404 22822793 21844358
9792 21844358 21583882 21183579 20932694 20766277 21052370 21391644 22169251 22845973 23754951
9783 23754951 24992253 26470540 28813498 30831777 33416409 36345176 39553438 42955700
9775 42955700 46595913 50075959 53086506 56072056 58223516 59932648 60718262 60809581 60195590
9766F0195590j385189j895049k668018l013972k935789l201087k911776k667908
9758C9516802k271742j710845j307255j271676n17539l15052K47307N52357R76455
9749C3898812J319890J922273K337606K641720K789125L122993K599299K614805
9741E3246523K077624J492369O04888o6513p35557j476793k166092k665300k892773
9732D7418376l249500k914989k713432k630833j988397j875456j371289r56707
9724B9717773o98887m12296n7640K32166N61907L96183Q93703J131644J183111
9715C2947664J733130J761686K494657K327787L114688L624705M183708M653294
9707E6841319M737292M928227M739015M381797L376214L407943K233315J497036
$$ plain form
9766 60195590 58810401 56915352 54247334 51233362 48297573 45096486 42184710 39516802
9758 39516802 37245060 35534215 34226960 32955284 32437745 32122693 32370000 32922357 33898812
9749 33898812 35218702 37140975 39478581 42120301 44909426 48032419 50631718 53246523
9741 53246523 55324147 56816516 57421404 57354891 56619334 55142541 52976449 50311149 47418376
9732 47418376 44168876 41253887 38540455 35909622 33921225 32045769 30674480 29717773
9724 29717773 29018886 28606590 28548950 28781116 29343023 29739206 30632909 31764553 32947664
9715 32947664 34680794 36442480 38937137 41264924 44379612 48004317 52188025 56841319
9707 56841319 61578611 66506838 71245853 75627650 79003864 82411807 84645122 86142158
9699H6142158M93188m67232j707018k856487l708905m422056m845780n030352
9691F3597516m823980m835189m175348l627951l151454k628306k077742j848459
9683C6429087j342612o63462m10720r4621M65617O22194J267892J562172J953454
9674C9789001K183051K380637K171033J842655J497330J091869O35352J25721
9666E1716649n27591q99779j463954j918949k186420k374951k829303k814578
9658C6701124k680428k635662k312456j919660j992261j543116j613241j149369
9650B0854931r84728q92105j101223o47745j090662o16835n70039p84339m86896
9641A3680359o92481n84992o25938m22408o90677k12302k90247n39476k97551
$$ plain form
9699 86142158 86635346 86168114 84461096 81604609 77895704 73473648 68627868 63597516
9691 63597516 58773536 53938347 49762999 46135048 42983594 40355288 38277546 36429087
9683 36429087 35086475 34423013 34012293 33917672 34383289 35005483 36273375 37835547 39789001
9674 39789001 41972052 44352689 46523722 48366377 49863707 50955576 51590928 51716649
9666 51716649 51189058 50289279 48825325 46906376 44719956 42345005 39515702 36701124
9658 36701124 34020696 31385034 29072578 27152918 25160657 23617541 22004300 20854931
9650 20854931 19870203 18978098 17876875 17229130 16138468 15521633 14951594 14167255 13680359
9641 13680359 12987878 12402886 11776948 11354540 10663863 10451561 10161314 9621838 9324287
9632I324287k17324m52986j71338l11755j82350J80441k88521J21617k58798j9734
9622G723539j6080j47091j76659Q8555k85464k51825J21039O4355l40813r9905
9612F679651k27664J365l10797m29356J19506k24194l34121N2525l08155K624
9602E021384k74797k5875L7368j92975m1125N8906p0885j13627k56802J57786
9592D299358k2549j78176M2195K6272m8539m2304m6568J47122j33965j51566J12206
9581D003486L5510L9216m4260k06579n4557L74315j71184J04287Q3176j74394
9571C989016q0055J60669j52993M7716p5667P095J60402k84014J41002j74502
9561C738669m6758M9406l1854J84141r8932n5301r9087L6953J50675J07557q2582
$$ plain form
9632 9324287 9106963 8653977 8482639 8170884 7988534 8168975 7880454 8002071 7743273 7723539
9622 7723539 7707459 7560368 7383709 7472264 7186800 6934975 7056014 7120369 6779556 6679651
9612 6679651 6451987 6453352 6142555 5713199 5832705 5608511 5274390 5326915 5018760 5021384
9602 5021384 4746587 4720712 4758080 4565105 4523980 4582886 4512001 4398374 4141572 4299358
9592 4299358 4276809 4098633 4140828 4167100 4118561 4076257 4029689 4176811 4042846 3891280 4003486
9581 4003486 4038996 4078212 4033952 3827373 3772816 4147131 3975947 4080234 4163410 3989016
9571 3989016 3908961 4069630 3916637 3964353 3888686 3895781 4056183 3772169 3913171 3738669
9561 3738669 3691911 3741317 3709463 3893604 3794672 3739371 3640284 3677237 3827912 3935469 3852887
9550C852887J10730n0072p4463J39287l365n7788K01916j57282K4794K43455j64039
9539D066060J66105j57426M9917n0404J60491j02348J16491k57516K60187k41211
9529D010346K68624J78356J4911J31997K59549o7736n6264K91844j25983J67517
9519E073161N9223J22693K83851k662K53696P7789K95776R3555J96938M07544
9509F861564J78437K74665M01769K39549M24108L95439K91500R56156M40875L91797
9499A0855859Q35389Q01423O89786M55084J135109M57720N11957P51192M44244
9490A6937763M77289Q82929M54696O91877J007601P50059J041444J542382J676361
9481B5462401K076644K663561K549877L254794K840199K774804K529451J787142
$$ plain form
9550 3852887 3963617 3913545 3839082 3978369 3975004 3917216 4119132 3961850 3986644 4230099 4066060
9539 4066060 4232165 4074739 4124656 4074252 4234743 4132395 4248886 3991370 4251557 4010346
9529 4010346 4278970 4457326 4472237 4604234 4863783 4796047 4739783 5031627 4905644 5073161
9519 5073161 5132384 5255077 5538928 5536266 5789962 5867751 6163527 6257082 6454020 6861564
9509 6861564 7040001 7314666 7716435 7955984 8380092 8775531 9067031 10023187 10464062 10855859
9499 10855859 11691248 12492671 13182457 13637541 14772650 15230370 15742327 16493519 16937763
9490 16937763 17415052 18297981 18752677 19444554 20452155 21202214 22243658 23786040 25462401
9481 25462401 27539045 30202606 32752483 36007277 38847476 41622280 44151731 45938873
9473D5938873J222986Q68965J87804L17577K58214O70494Q03980J090717J502711
9464E2862321J115675J070584N26665K01980j05105k81817k26986q1124J24871
9455E5207064L32184M40396M87298J66482K57852n80417o14602r50136q38571
9446E3907550o28242m27957O2565N80325N54730N02416L11447o04921j348423
9437E2909490j964588k872450l014060l304896l470477l325694k959990k379172
9429B9618163j929662j867626j629318j110214r77158r58692p60206q63364p60917
9420A8761006r77037r34842r78851p71556r10780m96192j087222o58302o30145
9411A1316079n91087m62368o21335j57512m06552n09078k85132j56854k48181
$$ plain form
9473 45938873 47161859 48030824 48218628 48536205 48794419 49464913 50268893 51359610 52862321
9464 52862321 53977996 55048580 55575245 55777225 55672120 55390303 55163317 55082193 55207064
9455 55207064 55539248 55979644 56466942 56633424 56891276 56310859 55696257 54746121 53907550
9446 53907550 53279308 52851351 52913916 53494241 54048971 54551387 54862834 54257913 52909490
9437 52909490 50944902 48072452 45058392 41753496 38283019 34957325 31997335 29618163
9429 29618163 27688501 25820875 24191557 23081343 22104185 21145493 20385287 19521923 18761006
9420 18761006 17783969 16849127 15870276 15098720 14187940 13691748 12604526 11946224 11316079
9411 11316079 10724992 10262624 9641289 9483777 9077225 8568147 8283015 8126161 7877980
9402G877980j87362k97638J6747j70888j14212j98322L05269j20686q2718k6523
9392G001647O3153k13810K24346p6176j16058j34272j71102p1843j60545P8560
9382F423900j77943l38613M1150j84786k7334k01245P6524M0871m2990K49242
9372E858776k39734R9187J89111J57816J24997J74955O2970J66442K8068K33135
9362F855723j07188Q2655j55334Q4882l46001j13212m31633j10895j6490k15496
9352E527011k77893j66297j76399o3309j35831j2649j69756n4778n0293N4205
9342D474011M2504N5276J92672p8607J0589K36202l22980J82433J42080r7298
9332D836882P8237j9877l54100k3367l4710j92764q6458l7044k05700q9638J36645
$$ plain form
9402 7877980 7690618 7392980 7409727 7238839 7124627 6926305 7231574 7110888 7028170 7001647
9392 7001647 7064800 6850990 7075336 6999160 6883102 6748830 6577728 6505885 6345340 6423900
9382 6423900 6245957 5907344 5948494 5763708 5736374 5535129 5611653 5652524 5609534 5858776
9372 5858776 5619042 5718229 5907340 6065156 6190153 6365108 6428078 6594520 6622588 6855723
9362 6855723 6748535 6831190 6675856 6760738 6414737 6301525 5869892 5758997 5742507 5527011
9352 5527011 5249118 5082821 4906422 4843113 4707282 4694633 4524877 4470099 4419806 4474011
9342 4474011 4516515 4571791 4764463 4685856 4696445 4932647 4609667 4792100 4934180 4836882
9332 4836882 4915119 4895242 4541142 4517775 4483065 4290301 4203843 4166799 3961099 3871461 4008106
9321D008106l92716J58954N4039j78266j7975j5807M9519k21808P6191J09905
9311C630142j07196p604r830K76705j67360j54122J69198o0546P9391K90662K6963
9300C966403k43794J2995M2454k881K73593k67125K74888j04639L4818K28231
9290D214943m2192P0524r1470Q5599M07J90437j13886M06039p3508M25256q9595
9279D982554K20657j60079L12263N6874L07713n8032L40279q2420L27361K03270
9269F450440J80163N5142J63807M71402J38289K65845K22352K44229O04336K69949
9259I065954M66675P95548K82746N85360P25233Q61721N45039J053146Q57600
9250A5239022R12009J113385J409262J455668J399760K127728K171241K275998
$$ plain form
9321 4008106 3615390 3774344 3828383 3650117 3632142 3616335 3665854 3444046 3520237 3630142
9311 3630142 3522946 3515342 3505512 3782217 3614857 3460735 3629933 3569387 3648778 3939440 3966403
9300 3966403 3722609 3735604 3778058 3775177 4048770 3781645 4056533 3951894 3986712 4214943
9290 4214943 4172751 4243275 4151805 4237404 4237811 4428248 4314362 4720401 4646893 5072149 4982554
9279 4982554 5203211 5043132 5355395 5412269 5719982 5661950 6002229 5919809 6247170 6450440
9269 6450440 6630603 6685745 6849552 7320954 7459243 7725088 7947440 8191669 8796005 9065954
9259 9065954 9532629 10328177 10610923 11196283 11921516 12783237 13328276 14381422 15239022
9250 15239022 16151031 17264416 18673678 20129346 21529106 23656834 25828075 28104073
9242B8104073K641522K465098K942115K623142K360311K598327J913086K140439
9234D7788113J621843J126180J166758L94829M54375K76661k77417L0859j42623
9225E2439578l0556O37242Q99578J543175K177561K948563L716758M738207N369650
9216G4439756N961520O371256N974591N583987N073393L775546K812123J610847
9208A11603019O71106L29698o63957j086926j439850j575578k028785k548321
9200A03260406l075669k990392l257909l326274k947315k767539j584371j524791
9192H1786146p49266k47939j56007L28129L06781o6166o2249K06002p3773J61726
9182H1433384r2660o678q682l29646q96255j655056k331789l437463m023099m395380
$$ plain form
9242 28104073 30745595 33210693 36152808 38775950 41136261 43734588 45647674 47788113
9234 47788113 49409956 50536136 51702894 52097723 52552098 52828759 52551342 52582201 52439578
9225 52439578 52409022 53046264 53945842 55489017 57666578 60615141 64331899 69070106 74439756
9216 74439756 80401276 86772532 92747123 98331110 103404503 107180049 109992172 111603019
9208 111603019 112274125 112603823 111939866 110852940 109413090 107837512 105808727 103260406
9200 103260406 100184737 97194345 93936436 90610162 87662847 84895308 83310937 81786146
9192 81786146 81036880 80788941 80632934 80961063 81267844 81201678 81139429 81345431 81271658 81433384
9182 81433384 81340724 81334046 81325364 80995718 80099463 78444407 76112618 72675155 68652056 64256676
9172F4256676m482939m770138m575468m098766l682627l284905k907415k321763
9164C4132655k110685j950178j487343j405376j153633j187718r95995r88831
9156B2852896j140736o88902o88553o72747o75378k39894p74710l13810m71028
9147A7187138m46992m19992l57367k69848o44593k58104p09552m71282k92028
9138A3317380m63402o48021l04124l46446n00119m23730l37018m04696k7056m36703
9128I426065k43813k46699r7760J51554j98649K31661m96803J86113m7773L8217
9118H702113j24706j39283L76730k28720N7892l02055n0338k25349q9992l70573
9108G605719j39138l32933k92676j22393r9329l90436o4588k10746j37041j948
$$ plain form
9172 64256676 59773737 55003599 50428131 46329365 42646738 39361833 36454418 34132655
9164 34132655 32021970 30071792 28584449 27179073 26025440 24837722 23841727 22852896
9156 22852896 21712160 21023258 20334705 19661958 18986580 18746686 17971976 17658166 17187138
9147 17187138 16740146 16320154 15962787 15692939 15048346 14790242 14080690 13609408 13317380
9138 13317380 12853978 12205957 11901833 11555387 11055268 10631538 10294520 9889824 9862768 9426065
9128 9426065 9182252 8935553 8837793 8989347 8790698 9022359 8525556 8711669 8663896 8702113
9118 8702113 8577407 8438124 8814854 8586134 8644026 8341971 8291633 8066284 7976292 7605719
9108 7605719 7466581 7133648 6840972 6718579 6619250 6228814 6164226 5953480 5816439 5814491
9098E814491j42618L13873l01099K25228R2865J83881J10592O3544M03487K08168
9088F972412K43146K26589K10641j4065P6148P6946k6941k31347j30446l95793
9078G007290k57120m24112n2468l57613l84501k67130j65532k56408j40529J17567
9068D819444k03334j63214K78299j45773J31923N8419R8225M3617O8753k7123
9058D959236L23502j83600l7077q0355m7530j34863j34311j71299j79449k71292
9048D042962l73001l2316r2732R153n7790J6201q1433j08435K1641l8330J45420
9037C451340p8238R469J71875J86367K61616Q674J85382j04053K13334j5019q4979
9026D205768j28790r1370L0317l57221k39146k53236N0923k26128j44631p9061
$$ plain form
9098 5814491 5671873 5985746 5684647 5909875 6002740 6186621 6297213 6360757 6764244 6972412
9088 6972412 7215558 7442147 7652788 7638723 7714871 7791817 7764876 7533529 7403083 7007290
9078 7007290 6750170 6326058 6273590 5915977 5531476 5264346 5098814 4842406 4701877 4819444
9068 4819444 4616110 4452896 4731195 4585422 4717345 4775764 4873989 4917606 4986359 4959236
9058 4959236 5282738 5099138 5062061 4981706 4934176 4799313 4665002 4493703 4314254 4042962
9048 4042962 3669961 3637645 3544913 3554066 3496276 3512477 3431044 3322609 3344250 3305920 3451340
9037 3451340 3373102 3382571 3554446 3740813 4002429 4011103 4196485 4092432 4305766 4290747 4205768
9026 4205768 4076978 3985608 4015925 3658704 3419558 3166322 3217245 2991117 2846486 2767425
9016B767425k47253o6022j37173J17028q8467k11730J801j03754J0613j51872
9006A890596J18320J794L8858j57426J22422j11054K10109k1362j89394M229n1557
8995A855535p15J32425k68476M4497K0272k8668j93340j17619N7900k83558K3328
8984A241581L7315j46923J35085r5438j3017m211O0240q0124k42500K3734J52483
8973A068225j37451r2968M0666N6916J74337p6768j66532P4187j56741L2339o9953
8962G46257M9904J54571k6521j59116n637J34262J36673M9188l01809q1009L06511
8951A003274j57931j48806J06052N6814j89025J00259M9021n2022N7429j65231
8941F59834J28731m969n5591J05439L4948r5883j28639K34450n8306K8575p1804
$$ plain form
9016 2767425 2520172 2454150 2316977 2434005 2345538 2133808 2135609 2031855 2042468 1890596
9006 1890596 2008916 2010710 2049568 1892142 2014564 1903510 2113619 2092257 1902863 1907092 1855535
8995 1855535 1854820 1987245 1718769 1763266 1783538 1754870 1561530 1443911 1501811 1218253 1241581
8984 1241581 1278896 1131973 1267058 1171620 1158603 1154392 1214632 1134508 892008 915742 1068225
8973 1068225 930774 837806 878472 935388 1109725 1032957 866425 940612 783871 816210 746257
8962 746257 796161 950732 924211 765095 759458 893720 1030393 1079581 777772 696763 1003274
8951 1003274 845343 696537 802589 859403 670378 770637 819658 767636 825065 659834
8941 659834 788565 783596 728005 833444 868392 772509 643870 878320 820014 848589 776785
8930G76785j18456N7513j75143L53803k30892P29J47032q0641p6383j75759K25258
8919G03846O0761k9754j02673r4938J22263j64197P2952R5916L2463k4179J31529
8908H03989j9865L0631j29069j3297J61624q0959J68617k40461j8951K61077l9991
8897H83345j82118J3318P6187k45514K49242Q9256k97977L08421m7104m1845K07207
8886A012418k36072m8592N2470J35363o6854l7448L9228P7654J55213j17592J2932
8875I78720l0494J4062L1290P6319J47385j31016j7020N2914j9628n5407R5293
8864A142418J3891k28942L5077J39312N29k18070K22974j80840J08928j91553
8854H43724K02922n9914r3236L88153l17511j3839o5272J46027M9252l28066K87294
$$ plain form
8930 776785 658329 715842 540699 894502 663610 664339 811371 730730 654347 478588 703846
8919 703846 764607 734853 632180 537242 659505 495308 568260 664176 696639 672460 803989
8908 803989 784124 814755 685686 672389 834013 753054 921671 681210 662259 923336 883345
8897 883345 701227 714545 790732 545218 794460 883716 585739 894160 847056 805211 1012418
8886 1012418 776346 727754 780224 915587 848733 811285 850513 928167 1083380 965788 978720
8875 978720 948226 962288 993578 1069897 1217282 1086266 1069246 1122160 1102532 1047125 1142418
8864 1142418 1156309 927367 962444 1101756 1102285 884215 1107189 926349 1035277 843724
8854 843724 1046646 986732 893496 1281649 964138 950299 885027 1031054 1080306 752240 1039534
8843A039534j90501J40236M4173k07973P5157l3516K04163n0543j50384r5283
8833G75063M5817j57245L04357k93794k8871M7718r0621M7832N0318r8057P9847
8822F82364K12635m15757J14891l6622K21463j85768R5802k03409K5632P0847
8812E82078m3722K02417j34592K7269j93504K83289o3433k58043R0734M04060
8802H96553l93443P8015n1319j34962L0404J90304n2138K552J99292l81001K1309
8791D05566K24604j47077J77163n2007R3823K14177l71036M3053N1465k37783
8781D01948K8077J28953p0838j4074J40849k13529o3464j20162K12246l3533p613
8770C88860r0725j7911O3856o6672M9798o3697O5289P2178J2752j23599n0166
$$ plain form
8843 1039534 849033 989269 1033442 825469 900626 867110 1071273 1020730 870346 775063
8833 775063 820880 663635 967992 674198 645327 693045 602424 650256 700574 602517 682364
8822 682364 894999 479242 594133 557511 778974 593206 689008 485599 511231 582078
8812 582078 538356 740773 606181 633450 439946 723235 659802 401759 492493 896553
8802 896553 503110 581125 529806 394844 425248 615552 563414 565966 765258 384257 405566
8791 405566 630170 483093 660256 608249 702072 916249 545213 588266 639731 401948
8781 401948 430025 558978 488140 474066 614915 401386 337922 217760 430006 396473 388860
8770 388860 298135 280224 344080 277408 327206 263509 328798 400976 413728 290129 239963
8759B39963l46L11372k69651j59503J37929K3628N4164k3158j8438j19992m5218
8748A30750J68675q915p7474j10722K91234n9724k37662K20253q5770p7278N5632
8737B08999J824J7355m2146Q5396M2838j44333L5658J6357o9670L4429Q3204l00289
8725c0378L3067K05704k2418k7941R1540O346q6092j507j29189j2226J11528J33670
8713B72104j73405J52844j42484j2943p7388J86573m8275O4403j80038j4796K18989
8702B45584j10299J40662j98432J42376m991j87742J38522m0017R5952j29478
8692I2137R9599j45067J43259k73898K11689K32781o8342k56159J75297j00379
8682A10917P4133R448m5487m7044J26591Q6273j42201O2692k07321J29578k0398
$$ plain form
8759 239963 239617 550989 281338 121835 259764 283392 337556 314398 295960 175968 130750
8748 130750 299425 290510 213036 102314 393548 333824 96162 316415 230645 153367 208999
8737 208999 210823 228178 186032 271428 314266 169933 205591 221948 152278 186707 269911 -30378
8725 -30378 2689 208393 185975 158034 249574 255920 169828 168321 39132 26906 138434 272104
8713 272104 98699 251543 109059 96116 18728 205301 157026 221429 41391 26595 245584
8702 245584 135285 275947 77515 219891 214900 27158 165680 125663 221615 92137
8692 92137 191736 46669 189928 -83970 127719 360500 292158 35999 211296 110917
8682 110917 185050 194498 149011 101967 228558 314831 172630 235322 28001 157579 137181
8671A37181P4863L9101N1582k51043k0823R0364J65326l4790j2215k28720Q0358
8660I1184R5635j01686J05568P9511k78938J49177o3325P783r1489k7137K45518
8649B11801j07038o3715J30204p8190J26699p2682j92443L293J78214n056j39577
8638h490J79978r9504j53224L16846k44928K16401J10610k68685o4243L7125J71972
8627A93858K19701j62739j64746q6888M3220J53495n1657j3131O9271j77688j38346
8616a15650K72709r1373J84386k35911J60583j91249J99806j70571N8245Q2612
8606A53587j49839L05230k46664K9090p7039J86777k50185K20240k35899J07533
8596D2831J47225k310q9371J52018l32986J50481J52230j29924l2165J0141J78590
$$ plain form
8671 137181 212044 251145 302727 51684 30861 121225 286551 251761 239546 10826 91184
8660 91184 186819 85133 190701 270212 -8726 140451 77126 84909 -6580 -33717 211801
8649 211801 104763 41048 171252 93062 219761 147079 -45364 -42071 136143 131087 -8490
8638 -8490 171488 71984 -81240 235606 -9322 207079 317689 49004 -15239 21886 193858
8627 193858 413559 250820 86074 -814 42406 195901 144244 131113 200384 22696 -115650
8616 -115650 157059 65686 250072 14161 174744 -16505 183301 12730 70975 153587
8606 153587 3748 308978 62314 91404 14365 201142 -49043 171197 -64702 42831
8596 42831 190056 187746 98375 250393 -82593 67888 220118 90194 58029 68170 246760
8585B46760k8009j41504o5738J44972M684L3562m2360j42218J77698O3890L8407
8574B90144R0212p9762j60202J36722P9801j00869j09994J72420j52914M6709
8564B12267P1774j27267l9664J9224O3227N0596j16449l7310J58111J8142j96530
8553G6121K005j3540R5366l4533j61273J80356p6700J52136L3535j15116L5412
8542A73769R3427p8439Q4409j56640J34529k00253j24442j052668K919966j328368
8532D65290k25809J43227k67651K9116K0149j00783J65866r2027J25548j30834
8522A32092j06802Q0426P1510m8029r402n7014J8791J4112p5095J16557o4118
8511G3028k538L428k2020Q5788o8267K7218j56973K21425r620q2882j40554q8037
$$ plain form
8585 246760 218751 77247 11509 156481 161165 194727 152367 10149 187847 251737 290144
8574 290144 380356 300594 140392 277114 356915 256046 146052 318472 165558 212267
8564 212267 284041 156774 117110 136334 199561 250157 133708 96398 254509 272651 76121
8553 76121 78126 64586 159952 125419 -35854 144502 67802 219938 253473 138357 173769
8542 173769 267196 188757 273166 116526 251055 50802 -73640 -1126308 1793658 465290
8532 465290 239481 382708 115057 144173 164322 63539 229405 137378 262926 132092
8522 132092 25290 105716 177226 129197 119795 62781 81572 95684 20589 137146 73028
8511 73028 70490 73918 51898 137686 69419 96637 -60336 161089 151469 68587 -71967 -160004
8499a60004J97710o9102K1354o537K47610k02569O2441j64747J58671j36377K68202
8488B16652k97814K68647j48682q09K7715j04022J54781o1543K8433k7984O1220
8477A16594k31159L16385q1622m8476k28801L34932k00890L6075q156J37766l6426
8466A06222K7819J31459l0701j10795p0243j65884Q733Q8399O1970j73055K42374
8455A16298r3454K4045q9713K49312l31465K23769J4129j07250P3065J1989q9191
8444A534n8027J63396k71755K47720J26074n1213j91809l9906K27391j84322K077
8433b8840l0144k3753J10994P2913n5471r19j81824O2614M198m1290J096K48200
8421A37774l87287J53116J78234J12829r7931k86393J62315N8614j5879k19694
$$ plain form
8499 -160004 37706 -31396 -10042 -16579 231031 28462 90903 -73844 84827 -51550 216652
8488 216652 -81162 187485 38803 37994 65709 -38313 116468 54925 83358 55374 116594
8477 116594 -114565 201820 120198 71722 -157079 177853 -23037 13038 4882 142648 106222
8466 106222 134041 265500 234799 124004 53761 -112123 -103390 -14991 46979 -126076 116298
8455 116298 22844 46889 -42824 206488 -124977 98792 112921 5671 78736 90725 1534
8444 1534 -56493 106903 -164852 82868 208942 157729 -34080 -73986 153405 -30917 -28840
8433 -28840 -58984 -82737 28257 101170 45699 44780 -137044 -74430 -70232 -111522 -110426 137774
8421 137774 -249513 -96397 81837 194666 96735 -189658 -27343 31271 15392 -204302
8411b04302J42550J53984j28561k8981J70857o995j81542L5476q7916J90571J4864
8400G0005O558M3891p1874j01527J08681q5209j9851K214P5552J2967j3754o8348
8388d0695j04966K33262N1963j29389j1152J46848r8428K4018o2267J39408l047
8377A45555j50751l1063M016O2957p3837O8802q9045J25711Q3094l25980K68233
8366H7692j25989R5899o4673K4167K308J61251j71250q0138J33040k02856K63394
8355A22845k424j37654p3663J32554O809l1111R7079n4577r4131N6100M3714J83542
8343B49083m1063j25465q06k14691L25447j42673M6725j55754l7063J06006l0711
8332b0965o6128O99M1055j479K6795L2909j24612K12517o0094J2273O8690n6173
$$ plain form
8411 -204302 -61752 92232 -36329 -65310 105547 98552 -82990 -47514 -135430 55141 70005
8400 70005 76563 120454 48580 -52947 55734 -29475 -49326 -47112 28440 41407 27653 -40695
8388 -40695 -145661 87601 139564 10175 -977 145871 47443 71461 9194 148602 145555
8377 145555 -5196 -36259 -32243 30714 -43123 25679 -63366 62345 145439 -180541 87692
8366 87692 -38297 57602 -7071 17096 19404 180655 9405 -70733 62307 -140549 122845
8355 122845 120421 -17233 -90896 41658 48467 17356 114435 59858 -34273 21827 65541 249083
8343 249083 208020 82555 81749 -132942 192505 49832 96557 -59197 -96260 9746 -20965
8332 -20965 -87093 -86394 -45339 -46818 -20023 12886 -111726 100791 40697 52970 121660 65487
8320F5487p8337K5184L752P2924j09996l2450J46114j62063Q2153l8415J80797
8309A55150m0161n2423q0875J14064J8021k20545R1996R0312j45949K25643j14448
8298D0785J4467M0905k48990J67436j81259J10456K81921j75329j61891K02409
8288I0910p1901K5360q6469m5998K04602J7749j42766m5322M2795l0986K53479
8277B11453j54596o6097p5564K97753l9087j68217J24272l320j40884N8546M6394
8266I0653R0881j60715J37440Q996p524j9105j50217J28265j26147j05530K66562
8255A53559M040j25628j22585J08582J00132k59369K02180j11091J58114J2476
8245A20410p9054n007m3106k1704N3099L4189j90290K02820Q8360j92059J50964
$$ plain form
8320 65487 -12850 12334 16086 89010 -20986 -53436 92678 -69385 12768 -25647 155150
8309 155150 114989 62566 -18309 95755 113776 -106769 -14773 75539 -70410 155233 40785
8298 40785 55252 96157 -152833 14603 -166656 -56200 225721 50392 -111499 90910
8288 90910 19009 44369 -42100 -88098 116504 134253 -8513 -53835 -11040 -42026 211453
8277 211453 56857 -9240 -84804 212949 173862 5645 129917 126597 -14287 44259 90653
8266 90653 181534 20819 158259 167255 159731 140626 -9591 118674 -7473 -113003 153559
8255 153559 157599 31971 -90614 17968 118100 -141269 60911 -50180 107934 120410
8245 120410 41356 36349 -6757 -28461 24638 58827 -131463 71357 159717 -32342 118622
8234A18622n0618j39111K56098l4945l06192M0696K87692o7117k6607J04414j18347
8223F4585r4116J62431j30142K6070J69460j14028J2787k2035J77192j2915k61138
8212b1849r4985J92495R2466J38807J1825j24788K13152j88792J46189j0431J38393
8201D92482p4547q7477L53718J29690n7473j57773K06564n20927J70629N53307
8191A008193p59297k32945M24277o7040j46250k88171K48950N8750L3753j09271
8181A70949O5977k3023j54142R8277j52308J02697o0847K999J2581J89397m4322
8170B08235j52280J04858J01255j19756m4143l6429k65688L92453p9551m6978
8160F1976j43158J57771q5448K57846k44848P1263j23623K07991l13198J53626
$$ plain form
8234 118622 68004 -71107 184991 150046 -156146 -115450 172242 105125 78518 182932 64585
8223 64585 -29531 132900 2758 28828 198288 84260 97047 75012 252204 239289 -21849
8212 -21849 -116834 75661 168127 306934 318759 193971 407123 218331 364520 354089 492482
8201 492482 417935 330458 684176 813866 756393 598620 805184 284257 454886 1008193
8191 1008193 248896 15951 440228 373188 226938 -61233 187717 246467 280220 170949
8181 170949 236926 213903 59761 158038 5730 108427 47580 50579 63160 252557 208235
8170 208235 55955 160813 262068 142312 98169 61740 -203948 188505 108954 61976
8160 61976 -81182 76589 -8859 248987 4139 75402 -48221 159770 -153428 198
8150A98R585j99302R5344n4802K51738J37k48087J01072Q3786O1037j41617j62444
8138b03355M5295O9343n0263K9295K32741j11175K2817P2650j55833K00456j05681
8127D6290J21714k32547K2767N313J77347j31292j00794J62811j62956Q4047M6596
8116C9296n9316R599J04264p9431l1698J90756j47381J4122j3716m5711J36970
8105A17754P8954j71546M8458j10653J25275L9143j09332j77171J15189P7105
8095C3176m9083M6038j07187P1201J86861k05776R2183L7093o0863k23505J83935
8084D073j15549O5439J23949o3889p0728j0287k864K49484k04800N7495L9302
8073G1625k72174J76924J98873j93615J32783M9864k21342L8451j07395J98878
$$ plain form
8150 198 9783 -189519 -94175 -148977 102761 102898 -145189 -44117 39669 100706 -40911 -203355
8138 -203355 -158060 -88717 -138980 -109685 123056 11881 34698 107348 -48485 151971 46290
8127 46290 168004 -64543 -41776 -36463 140884 9592 -91202 71609 -91347 -7300 39296
8116 39296 -20020 -10421 93843 14412 -17286 173470 26089 40211 26495 -19216 117754
8105 117754 196708 25162 73620 -37033 88242 127385 18053 -159118 -43929 33176
8095 33176 -15907 30131 -77056 -5855 181006 -24770 67413 104506 43643 -179862 4073
8084 4073 -111476 -46037 77912 14023 -56705 -66992 -69856 179628 -25172 32323 71625
8073 71625 -200549 -23625 175248 -18367 114416 164280 -57062 -18611 -126006 72872
8063G2872j99958k4528R3130Q0673P2694l1905N7636j14551J78821k00338J61622
8052A46168k50913N6873K6899l9238j18548L32242k29034p35J16918j46826Q1808
8041b4386j34691K97726l10075J29481J22810J28047j71033r8279M3590M6047
8031B9237L0312q8576k10487J73186J77310M746K1699k72976J05373k0770N6824
8020E878M7763k01395m7778K65551p3294K01704o5421j18242R228q7659k0512
8009h4177j36360N1598L76275k88535P3211K12259j32029Q4497j58254J7799J8680
7998C4964j36787K03594N153j45037J3302R2528O5158l23002l0278J97437R8213
7987G5245l08318K55526J72242m9288k63736J42068J24454k49206n751J75108
$$ plain form
8063 72872 -127086 -151614 -58484 22189 94883 62978 120614 6063 184884 -15454 146168
8052 146168 -104745 -47872 -20973 -60211 -178759 153483 -75551 -76286 40632 -106194 -24386
8041 -24386 -159077 138649 -171426 -41945 80865 208912 37879 -60400 -16810 29237
8031 29237 59549 -29027 -239514 -66328 110982 115728 137427 -135549 -30176 -50946 5878
8020 5878 53641 -147754 -195532 70019 -3275 198429 133008 14766 23994 -63665 -84177
8009 -84177 -220537 -168939 207336 -81199 -7988 204271 72242 156739 -1515 16284 34964
7998 34964 -101823 101771 106924 -38113 -24811 67717 132875 -190127 -220405 -22968 75245
7987 75245 -233073 22453 194695 145407 -118329 23739 148193 -101013 -106764 68344
7977F8344j1102m3658j02477L1097j21533N2812k6485J52857J1081o9710o1919
7966a20693M9377k3685J49511k30273J58952R6868j19523Q900o7121K00117j0265
7955I2165j73930J04883K0714M7858r4566k3290m5180J53239L4721j38712p6283
7944i8381K66777l14630J18932m2259J71112j13694k4852R7415p9954r254K37358
7933B08570k91676P4604Q5901M3789j25250P0544L8873j6292j39837r1393J71222
7922B9055j36887k2508K86568j68215q8947l4940P664J52185j51723L7225K6265
7911f4258N7098r2216J53305l210l01627K57131q3270j11553J62536L7876j82827
7900a71015J94835n5936N8247L9029j29513J03128M0916j44822K8226J08839j24176
$$ plain form
7977 68344 57242 13584 -88893 -57796 -179329 -126517 -153002 -145 10936 -58774 -120693
7966 -120693 -71316 -95001 54510 -175763 -16811 80057 -39466 -30566 -97687 102430 92165
7955 92165 -81765 23118 43832 91690 -2876 -26166 -71346 81893 116614 -22098 -98381
7944 -98381 168396 -146234 -27302 -69561 101551 -12143 -36995 60420 -19534 -28788 208570
7933 208570 -83106 -8502 77399 121188 -4062 66482 105355 89063 -50774 -142167 29055
7922 29055 -107832 -130340 156228 -11987 -100934 -135874 -128210 23975 -127748 -90523 -64258
7911 -64258 -7160 -99376 53929 50719 -250908 6223 -77047 -188600 -26064 11812 -171015
7900 -171015 23820 -32116 26131 65160 -64353 38775 79691 -65131 -36905 71934 -52242
7889e2242O7211J06901j08965O0746j24521J07018P457q4964L663j27525j8735
7878a63956P0879K62519o2382j44690J27509q8219J14966o5782L4882l8018j42998
7867i5290K25246j55473Q824J69305j20926k01908J56379J25682j13917j98964
7857b01042n5079J66448R0369O69j38022j40111J12022J451114q19554m64623
7847B191K28072k38364m8553J59117j66070j90232K20852J09491o5543K5059L3572
7836F9592J1646j49337J41195k6187j41071K47952j59749m3170J37908j15783
7826b7004o4812Q1212J30710k22351P1599J71058j93469P5706q341L6833N0190
7815A01331m42106M69425p9435j28740l295L09337k38143j65318J29538n1926
$$ plain form
7889 -52242 14969 121870 12905 73651 -50870 56148 63605 -21359 -17696 -145221 -163956
7878 -163956 -93077 169442 107060 -37630 89879 1660 116626 50844 85726 47708 -95290
7867 -95290 129956 -25517 -16693 152612 31686 -170222 -13843 111839 -2078 -201042
7857 -201042 -256121 -89673 696 1365 -136657 -276768 -164746 1286368 466814 2191
7847 2191 230263 -8101 -56654 102463 -63607 -253839 -32987 76504 10961 36020 69592
7836 69592 81238 -68099 73096 46909 -94162 153790 -5959 -49129 88779 -27004
7826 -27004 -91816 -10604 120106 -102245 -30646 140412 -53057 22649 14308 51141 101331
7815 101331 -340775 128650 49215 -79525 -82820 226517 -11626 -176944 -47406 -99332
7805i9332J11353p7424n1611K74133k61995O9636k2578K46168o8298l6137M0702
7794A24617j3053j58389k795q9571K24406j47333O5083J05521o6208M0444j98457
7783a15735Q1858o7662P3541Q8252M1122m6797k9007n4278j5843o0941J09195
7772C705J21067r7578k2334K6410j63798J7415o3703J37298k80684L52555l5209
7761d856J9715j748k3350O1340l4778j14188Q7782L2711j44662L17569l32867
7750a37332K7778o1344m7981M0545J74646Q7004j81029J33661j25961M2742o7794
7739a15065K26646q9585R7951j81594N8760j30051Q9287J3959l7762q9750O5437
7728i1767K40755j68879J19082j3162J7743L6501r0868j71062J39300m5440M9178
$$ plain form
7805 -99332 12021 -65403 -117014 157119 -104876 -35240 -57818 188350 120052 83915 124617
7794 124617 111564 -46825 -49620 -139191 85215 -62118 2965 108486 42278 82722 -115735
7783 -115735 -33877 -101539 -27998 60254 101376 54579 25572 -28706 -44549 -105490 3705
7772 3705 124772 27194 4860 31270 -132528 -115113 -178816 -41518 -322202 30353 -4856
7761 -4856 14859 13111 -10239 51101 16323 -97865 -10083 22628 -122034 195535 -137332
7750 -137332 -109554 -170898 -218879 -178334 -3688 83316 -97713 35948 -90013 -47271 -115065
7739 -115065 111581 21996 119947 -61647 -2887 -132938 -43651 -29692 -67454 -157204 -91767
7728 -91767 148988 -19891 99191 86029 103772 140273 49405 -121657 17643 -27797 21381
7717B1381k0063r0675O1002P3038J92582n7971q8453k31748J77002Q2502q4371
7706C4226l3812K4072R425l4907Q2752k59263L19182k70337J20444J71492r5190
7695F8084J3457P8961p8316m4217k9480K4065J06971j15256m9247m2014P889K32634
7683A73531l12075K34662n7903L0520q5596Q2544M4662m0828q3681J8291j998
7672B129q3979J85147j94041J38817k3207j43792J84314m1629p1083J65470q4222
7661C3924q2606J33539j45785P9185J26091j18656R598J93819l42907m9471O8591
7650i4678J83954n1108L6444J28532k34867l0726n60J07748K2051p8251m921K6981
7638A0599m5455P4738k74771L33112L8062k10258J16855j77832L04208m4236o8201
$$ plain form
7717 21381 1318 -89357 -28355 44683 237265 179294 90841 -140907 36095 118597 34226
7706 34226 414 24486 33911 -996 81756 -177507 141675 -128662 -8218 163274 68084
7695 68084 81541 160502 82186 37969 8489 32554 139525 24269 -24978 -66992 -59103 173531
7683 173531 -138544 96118 38215 68735 -16861 65683 110345 69517 -14164 4127 2129
7672 2129 -81850 103297 -90744 48073 24866 -118926 65388 23759 -47324 118146 33924
7661 33924 -48682 84857 -60928 18257 144348 25692 35290 229109 -113798 -163269 -94678
7650 -94678 89276 38168 74612 203144 -31723 -62449 -63009 44739 66790 -11461 -16382 10599
7638 10599 -34856 39882 -234889 98223 136285 -73973 42882 -134950 169258 125022 56821
7627E6821k5702L8497J84864j65515j30120l867Q8214O4407j20046R387K60155
7616B57095k06279J34149j56234P1828j33550J1378M0946R9122k24132J51366
7606D5689m2291J66839j66798M4028j57661J89819M779k32200M14599j68821Q6417
7595A84399j93098J75747j03902M5916J69283k62021K2337N7529N0104l41753
7585a95459K84818L3943j38321l4779j31134J60682M4637o6712K50470l23032
7575a14887k949J58575o5311J05363j14533J03752l6090n2671j10013L27457j14644
7564H4049j43629K52733l2044q1630L06044l83026O0465Q5025j27722N3701J00619
7553A74585J01728j86615J04904j78598M8039J77279j82959m5548r1235K57769
$$ plain form
7627 56821 31119 69616 254480 88965 -41155 -45022 43192 107599 -12447 -3060 257095
7616 257095 50816 184965 28731 100559 -32991 -21613 19333 118455 -105677 45689
7606 45689 3398 170237 3439 47467 -110194 79625 84404 -147796 266803 97982 184399
7595 184399 -8699 167048 63146 109062 278345 16324 38661 96190 146294 -195459
7585 -195459 89359 123302 -15019 -49798 -180932 -20250 24387 -42325 208145 -114887
7575 -114887 -117836 40739 -24572 80791 -33742 70010 33920 -18751 -128764 198693 84049
7564 84049 -59580 193153 161109 79479 385523 2497 62962 147987 20265 73966 174585
7553 174585 276313 89698 194602 16004 64043 241322 58363 12815 -78420 179349
7543A79349l4455j9148k41890K37239K4953j76075J91636j64796K3603L18863
7533C39279m43428K79250j49622Q9061j37018K61763k58841J08227M6030l530
7523A31171P4692j67000K6239J32271L7387j34067r1834O1887R6376L3015k36870
7512c6733o0093M11704k51708j20877Q2502p4301J50018j33816J54189n6560J14465
7501A78790P3533j23906o9623L1323r8466J32564j01341L311J78090q7799j58759
7490d2283K98604j6986O5528j32493N040j04659L291M6517J81326k35608j888
7479F6389P8426K410N6741j2541J68734j16821j06801P5964k9015O3883r7628
7468A49741p7831J33585o9939J94292j10779l843l3218o9629M1351N324j23292
$$ plain form
7543 179349 144894 125746 -116144 121095 146048 -30027 161609 -3187 20416 339279
7533 339279 -104149 175101 25479 114540 -22478 239285 -19556 88671 134701 131171
7523 131171 205863 38863 65102 197373 234760 100693 8859 70746 167122 200137 -36733
7512 -36733 -96826 314878 63170 -57707 24795 -49506 100512 -33304 120885 64325 178790
7501 178790 252323 128417 58794 90117 -8349 124215 22874 26185 204275 116476 -42283
7490 -42283 256321 239335 304863 172370 177410 72751 76042 122559 303885 68277 66389
7479 66389 144815 147225 203966 191425 360159 243338 136537 212501 183486 247369 149741
7468 149741 71910 205495 135556 329848 219069 215226 182008 112379 153730 159054 35762
7457C5762K35342j14693J12031q8504J03572J9540j98977R9263M9388J04388n1140
7446C05972r5911J30428j63772K31464K9028p9059j68439K02466P5365J33666
7436F01208k49826K23246j52577p9705m5495p3664K32068j57559j29570J91885
7426C60011k7303P3232n5962L4061n0936L2892j57050J88060Q2972j76341J23574
7415D27210l49718L42488K6565j57890q3607J05685J11976m8238p9649O2316r7709
7404B59429J912R0842k9807k5724j13660Q3739O2510M6525l8581q9418P9827p9445
7392B48149M2581q0416J13336L2125q0785Q7563o1398J60050j65593m3100O1031
7381C13543J48873O4146k84477J65264m6591j09666K06532j13840r2037J29337
$$ plain form
7457 35762 271104 156411 268442 179938 283510 303050 104073 203336 252724 357112 305972
7446 305972 210061 340489 176717 408181 437209 358150 189711 392177 467542 601208
7436 601208 351382 574628 422051 342346 296851 223187 455255 297696 168126 360011
7426 360011 332708 405940 349978 384039 333103 365995 208945 397005 479977 303636 427210
7415 427210 77492 419980 446545 288655 205048 310733 422709 374471 294822 357138 259429
7404 259429 261341 352183 322376 296652 182992 266731 329241 375766 337185 247767 327594 248149
7392 248149 290730 210314 323650 355775 274990 362553 301155 461205 295612 252512 313543
7381 313543 462416 526562 242085 407349 360758 251092 457624 343784 251747 381084
7371C81084j35854N0337O1033K8791J39779R0723j14061k261j00997J16312k59896
7360B54990J52860p3828L6892R0491q1576p6665J03162O1739M2898p9203j54727
7349B77033l1709L44868k29701J27989P053R2910L0292L5727q3032O3739j08339
7338E26830P2653j47550K02910K9475J13291k13150J00536L6662J640J38379j91208
7327F70468J9182m134O8784p7925L100n4276N0535J75186q9134K3417r5070j96371
7315D93762K67693k18198Q6094R7666j48633K00795J17945j1980k87961Q0685
7305F77868N5138L5217k1780r856j2570p1588J49033k98537J95905q8486J33889
7294G44233J86338n087k16040L52444k6119l12864Q429J66298n3688J52883l5872
$$ plain form
7371 381084 245230 295567 356600 385391 525170 615893 501832 499571 398574 514886 254990
7360 254990 407850 334022 370914 461405 379829 303164 406326 468065 510963 431760 277033
7349 277033 245324 590192 360491 488480 495533 588443 618735 654462 571430 635169 526830
7338 526830 599483 451933 654843 684318 797609 584459 684995 721657 723297 861676 670468
7327 670468 689650 685516 754300 676375 679475 625199 675734 850920 761786 785203 690133 493762
7315 493762 761455 543257 629351 727017 578384 779179 897124 885144 597183 677868
7305 677868 733006 768223 746443 736587 724017 652429 801462 502925 698830 610344 744233
7294 744233 930571 925484 709444 1061888 1035769 722905 731334 897632 843944 996827 960955
7283I60955K8494l5531r8478j0449J36449j84234J18472q6123K15003L1031k09201
7272H66388J8583P501J54850j01644K0555j7084j45964J60881K5362j66962K86151
7261A108617j89734J43501P4949Q9218l04212K84549o2418j39746P7816l3275
7251A049265J25166j33003M8260o2359K16325K435k29733K13539j60950R8440
7241A167385K06377r9081o4160j08205K32203J02328q2025R1590r6275J3282l1329
7230A332090k4164k079M5289M2342n3052J53113j83714R354R8064n4201J35917
7219A498959q0787L03910j35520P432j61848K62107O2518j56482Q9526j10689
7209A579126J20852j5045q9434N2620j2882K94510P076k03537L26707r6915j36450
$$ plain form
7283 960955 989449 953918 855440 844991 981440 797206 915678 829555 1044558 1075589 866388
7272 866388 884971 892472 1047322 945678 966233 949149 803185 964066 989428 822466 1108617
7261 1108617 918883 1062384 1137333 1226551 922339 1206888 1144470 1004724 1082540 1049265
7251 1049265 1174431 1041428 1089688 1027329 1243654 1246089 1016356 1229895 1068945 1167385
7241 1167385 1373762 1274681 1210521 1102316 1334519 1436847 1354822 1446412 1350137 1363419 1332090
7230 1332090 1307926 1305847 1351136 1393478 1340426 1493539 1309825 1319179 1417243 1363042 1498959
7219 1498959 1418172 1722082 1586562 1593994 1432146 1694253 1756771 1600289 1689815 1579126
7209 1579126 1699978 1684933 1595499 1648119 1635237 1929747 1936823 1733286 2059993 1963078 1826628
7198A826628m7118K01884N3978K2585K3294N6422O8030j97212J79098j1999l0856
7187B144734J50655n2339K6939M8919j25335N4507j072L29735j59058q403J93314
7176B602596j97908J89906J55337o2126J4617J00209J1282M2544J16545J5731
7166B988733M6189l0683J72667J44835L9962o9850J07275J91723k25625K31624
7156C596850J06190J3548k40873K66202q5097L4331J23780J60924m8719J9579
7146C946715J09803J27007L9774O9937p7571O8758J89349l0476l8644J75680K1126
7135D601458Q1801K03711j17201j6148R6953j57265K98001p2579J57810M5382
7125E121923L59327o039Q2479J39577N6045M4291J95332J21095J51461N2914J04665
$$ plain form
7198 1826628 1779510 1981394 2035372 2057957 2081251 2137673 2205703 2008491 2187589 2175590 2144734
7187 2144734 2295389 2243050 2269989 2318908 2193573 2248080 2247008 2576743 2417685 2409282 2602596
7176 2602596 2404688 2594594 2749931 2687805 2702422 2802631 2813913 2856457 2973002 2988733
7166 2988733 3034922 3004239 3176906 3321741 3361703 3291853 3399128 3590851 3365226 3596850
7156 3596850 3703040 3716588 3475715 3741917 3656820 3691151 3814931 3975855 3927136 3946715
7146 3946715 4056518 4183525 4223299 4293236 4215665 4284423 4473772 4443296 4404652 4580332 4601458
7135 4601458 4683259 4886970 4769769 4753621 4850574 4693309 4991310 4918731 5076541 5121923
7125 5121923 5481250 5475211 5557690 5697267 5753312 5797603 5992935 6114030 6265491 6318405 6423070
7114F423070L6157L73519k5050K78735M04762j61913K86423K91190K6840M40276
7104H374009L21778l0819L26290K23336K33138M94784K95710K92637L49668K53869
7094A1134400M45901L79333L13095M88296O04708N76893O41183O55971O71069
7085A5910849O54797J068642O51242J021622J042013J203661J380185J689399
7077B4622410J725269J933726J962034K540591K909605L023512L484677M162196
7069D6364020N586617P578163K827308J880760L809934N527088O256346N502355
7061H5332591O795505Q320174J0651879J4768529K0247643K2598164L1186237
7054A99900722M3358455L8540391L3116034Q681985m409586j1993718j3089671
$$ plain form
7114 6423070 6459227 6832746 6807696 7086431 7491193 7329280 7615703 7906893 7933733 8374009
7104 8374009 8695787 8664968 8991258 9214594 9447732 9942516 10238226 10530863 10880531 11134400
7094 11134400 11580301 11959634 12272729 12761025 13365733 13942626 14583809 15239780 15910849
7085 15910849 16565646 17634288 18285530 19307152 20349165 21552826 22933011 24622410
7077 24622410 26347679 28281405 30243439 32784030 35693635 38717147 42201824 46364020
7069 46364020 51950637 59528800 62356108 64236868 68046802 73573890 79830236 85332591
7061 85332591 92128096 100448270 111100149 125868678 146116321 168714485 199900722
7054 199900722 243259177 281799568 314915602 323597587 319188001 307194283 294104612
7047B94104612j9693198m8376170l0932424k1930566k4695142k2142709j9222814
7040A07111589j4200603j0225625q208596o318589n883669n165122m338284l865526
7032D8905575l956323l019990k621869k436963k068021j805857j660966j517679
7024B9817907j273948j062459j347745j381499j259052j036782j155705q26748
7016B0473969r55172j150870o17779r20764q23485n34872o20540p06455l89427
7007A3754605n95958n43276m36075m75314k16529m47121l06949n24234l14285
6998I894864k36440j52477m22781l80884j4964m42394J63847m74721j45423o1158
6988G727469l17473j70576m0151j11420j80555o8278n0138j21900k34411j5290
$$ plain form
7047 294104612 274411414 226035244 195102820 173172254 148477112 126334403 107111589
7040 107111589 92910986 82685361 74476765 68158176 62274507 57109385 52771101 48905575
7032 48905575 44949252 41929262 39307393 36870430 34802409 32996552 31335586 29817907
7024 29817907 28543959 27481500 26133755 24752256 23493204 22456422 21300717 20473969
7016 20473969 19518797 18367927 17750148 16829384 16005899 15471027 14850487 14144032 13754605
7007 13754605 13158647 12615371 12179296 11703982 11487453 11040332 10733383 10209149 9894864
6998 9894864 9658424 9505947 9083166 8702282 8687318 8244924 8408771 7934050 7788627 7727469
6988 7727469 7409996 7239420 7199269 7087849 6907294 6839016 6788878 6666978 6432567 6417277
6978F417277j80219p975k06273k30719K071l19605J72784j77836j56848n9211
6968E253446m497j0885p0989q8197r1245k55783N7074k2092j63357m7253j17161
6957D439061J10646q0213j17715p9738K18677l18032J00472j59830Q813J21054
6947D243195k2556l03826Q9316n4223r7584q2285J51786j22033q863J78999k84291
6936C687635K31308o2758P3728p1207o8502J67374j04594j36357K39724r6220
6926C860131j67261L6506k5549J38014N766j38170L9008J26538m1234Q2005n0718
6915C865036j93310K86780M8046j0460J5897Q8199j12233M1973Q658j67R8378
6904D136797j63701R5705j17314J0474j02688K58079K8915K82877j95413O5450
$$ plain form
6978 6417277 6237058 6229083 6022810 5792091 5794162 5474557 5647341 5469505 5312657 5253446
6968 5253446 5248949 5238064 5167075 5078878 4987633 4731850 4788924 4766832 4603475 4556222 4439061
6957 4439061 4549707 4469494 4351779 4272041 4490718 4172686 4273158 4113328 4122141 4243195
6947 4243195 4220639 3916813 4006129 3951906 3854322 3772037 3923823 3801790 3792927 3971926 3687635
6936 3687635 3918943 3856185 3929913 3858706 3790204 3957578 3852984 3716627 3956351 3860131
6926 3860131 3692870 3729376 3703827 3841841 3847607 3709437 3748445 3874983 3833749 3915754 3865036
6915 3865036 3671726 3958506 4006552 3996092 4011989 4100188 3987955 4029928 4038586 4038419 4136797
6904 4136797 3973096 4068801 3951487 3961961 3859273 4117352 4146267 4429144 4233731 4299181
6894D299181p3641L6374J38118L4611K1651o3124L62875o0938n0943J92037O3660
6883D899861J29893J50674L1962p4906J42513N2617J20789J43456Q5317R2597
6873E774773J04295j0390J42633K04048l6665K30054K45881O1568O0361K96699
6863G073257K47948L22003M3221L24784L09476J75058P4780K70390J40436K58405
6853I239758L18720k6925L14768K51436K53317L19192J82711M58909K45220O21842
6843A2178948L97437N49683M68696P12400N62767R77370O79634Q62324J043511
6834A8432770Q84833J147665R41122J207375J154352J291778J184775J400766
6826B7645436J604657J317381J392580J734568J258293J368530J307074Q95235
$$ plain form
6894 4299181 4225540 4261914 4400032 4434643 4456294 4393170 4756045 4695107 4644164 4836201 4899861
6883 4899861 5029754 5180428 5212390 5137484 5279997 5332614 5453403 5596859 5682176 5774773
6873 5774773 5879068 5868678 6011311 6215359 6178694 6408748 6654629 6716197 6776558 7073257
6863 7073257 7321205 7643208 7686429 8011213 8320689 8495747 8570527 8840917 8981353 9239758
6853 9239758 9558478 9531553 9846321 10097757 10351074 10670266 10852977 11311886 11557106 12178948
6843 12178948 12576385 13126068 13594764 14307164 14869931 15847301 16526935 17389259 18432770
6834 18432770 19317603 20465268 21406390 22613765 23768117 25059895 26244670 27645436
6826 27645436 29250093 30567474 31960054 33694622 34952915 36321445 37628519 38523754
6818C8523754R11158L49902O77395J59177J78763J97097m0643K49075L06075Q10820
6808D2322573Q48981P21377J152609J360258J736868J956206K043592K427252
6800E4569716K839239K855690L527170L693172L931898M137275L894017L853066
6792H3301243L143233K633077J501607M09787l48068j304498k001008l056391
6784H4278982l032825l113072l178209k838613k453933j754021j783141j091002
6776F5034166l74314j53280K50583O68739J217663J558623J833786K254607K852467
6767G5143040L078095L418302L105770L091999K485176J752095Q84150n71986
6759I2386641j342246k296576l374180l415034m462540m206176m202207l940928
$$ plain form
6818 38523754 39434912 39784814 40462209 40621386 40800149 40997246 40956603 41205678 41511753 42322573
6808 42322573 43171554 43892931 45045540 46405798 48142666 50098872 52142464 54569716
6800 54569716 57408955 60264645 63791815 67484987 71416885 75554160 79448177 83301243
6792 83301243 86444476 89077553 90579160 90988947 90640879 89336381 87335373 84278982
6784 84278982 81246157 78133085 74954876 72116263 69662330 67908309 66125168 65034166
6776 65034166 64659852 64506572 64757155 65425894 66643557 68202180 70035966 72290573 75143040
6767 75143040 78221135 81639437 84745207 87837206 90322382 92074477 92958627 92386641
6759 92386641 91044395 88747819 85373639 81958605 77496065 73289889 69087682 65146754
6751F5146754l949465l253365l008002k594264j927228k134369j495029j303694
6743D5481338n38521r77002p82535k03513n24452k41095n874K20023l73523j41755
6733D1913091l34887q97389p93537r42687j448359j656632j832937j586308j889224
6724C0531131j807883j541294j692425j425147j426362j572260r07281j083108
6716A9075371q58483r57627j010136n78768n84411j082244m65161p09854n46188
6707A2282499m69387p23819o710q71264l28957l15895l52611n26775j83051j67597
6697H336433m40759l13992k66067j58152l05330k30443k42558j16639j02394k81606
6687E878493Q553l11395n3146k24668k37848k1459P8642j69992l30427q1338q4519
$$ plain form
6751 65146754 61197289 57943924 54935922 52341658 50414430 48280061 46785032 45481338
6743 45481338 44942817 43965815 43183280 42979767 42455315 42214220 42208346 42428369 42054846 41913091
6733 41913091 41578204 40680815 39887278 38944591 37496232 35839600 34006663 32420355 30531131
6724 30531131 28723248 27181954 25489529 24064382 22638020 21065760 20158479 19075371
6716 19075371 18216888 17259261 16249125 15670357 15085946 14003702 13538541 12828687 12282499
6707 12282499 11813112 11089293 11082583 10211319 9882362 9566467 9213856 8687081 8504030 8336433
6697 8336433 7895674 7581682 7315615 7157463 6852133 6621690 6379132 6262493 6160099 5878493
6687 5878493 5887046 5575651 5522505 5297837 5059989 5038530 5117172 4947180 4616753 4535415 4450896
6676D450896j21345j50119k6558o7748j56850O7323q7656j42752m05375K61013
6666C620829j30130k05370J58859j41808K2314j03727k11464r5510O1029j9609
6656B955413j98324o608o2623L8484j1710k13670l7296j68j94159J42826j68653
6645B243512J53532j74074N3142R3576l43989J55777N867R9627l49540j30395
6635A807035M6906N056k55683L37285k29140O83o2256R5033p3735k1873K34548
6624A883859k92082K0475J43407m0721l28744O9827j56410J7017L09653p6671
6614A549610j7885k90899J22981j38846J37850m8998J09831q0950j04839j15049
6604A122806J36299M8727N6606j19548j3453M9823J5266k64284J3203P2892J30636
$$ plain form
6676 4450896 4329551 4179432 4152874 4085126 3928276 3995599 3907943 3765191 3359816 3620829
6666 3620829 3490699 3285329 3444188 3302380 3324694 3220967 3009503 2913993 2975022 2955413
6656 2955413 2757089 2750481 2687858 2726342 2714632 2500962 2463666 2463498 2269339 2412165 2243512
6645 2243512 2397044 2222970 2276112 2369688 2025699 2181476 2187343 2286970 1937430 1807035
6635 1807035 1853941 1858997 1603314 1940599 1711459 1712142 1649886 1744919 1671184 1649311 1883859
6624 1883859 1591777 1612252 1755659 1714938 1386194 1456021 1299611 1316628 1626281 1549610
6614 1549610 1531725 1240826 1363807 1224961 1362811 1313813 1423644 1342694 1237855 1122806
6604 1122806 1259105 1307832 1364438 1244890 1231437 1281260 1296526 1032242 1045445 1118337 1248973
6593A248973j54518j69258K31656J9204J313j81932J11616J6174j98256j83296
6583G41676K22600j46254J27970L9634o3559O978J1555n4804J11038j15448l0253
6572H51133J40078o2485M0320l12660K13216J0865n496n5097J66118j36508J3252
6561H62736j16815R3137j525j85782K59402o64m4542o6457K04617j41014M044
6550H67137j43559J05267J06666N1412j42504M9296j11827k51098L11978o6937
6540G75831L3276k8812J17114j60452O0884K97615k98206k2937m8456r3358R4140
6529G26639J55189K2569l08438K20701j09849L8141Q7730Q9552q6406J12445l9470
6518I08803j08148N0518k6320r675K4m2798J40290n1140K5752R2602j90882K15901
$$ plain form
6593 1248973 1094455 925197 1156853 1176057 1177370 995438 1107054 1123228 924972 741676
6583 741676 964276 818022 945992 985626 922067 929045 940600 885796 996834 881386 851133
6572 851133 991211 928726 969046 656386 869602 880467 874971 819874 985992 849484 862736
6561 862736 745921 839058 837533 651751 911153 910489 865947 799490 1004107 863093 867137
6550 867137 723578 828845 935511 986923 844419 893715 781888 530790 842768 775831
6540 775831 809107 780295 897409 736957 797841 1095456 797250 774313 725857 632499 726639
6529 726639 881828 904397 595959 816660 706811 744952 832682 922234 835828 948273 908803
6518 908803 800655 851173 824853 815178 815202 772404 912694 861554 887306 979908 789026 1004927
6506A004927J41254j65315K9258l11411L02101j01940Q1058P2770j11018O3055
6496A004739K5698p6695j3002K21049k91582L4186o0047K50015k08596L2970k9581
6485H89154k0288R1896k5964J18569k02505J04124O8582k14703J68984o0054M0350
6474I58145n0954m4867k1306m9280L2343j27481J06850J32092l46070K16939o8421
6463G37990J07131N9587J2689j26012o7258j31670J98583p9395j36756Q5245J4321
6452F74455J65419j73924k2449K4749L860q5522M720o7886R1790n2759j9573K69066
6440H11946n8933j95791j01746K17294k12145Q1697n9579k900J16182k24504l4653
6429C36868J43335p1037R2678m0535J26195l156l43805K5783J62691j06126Q1545
$$ plain form
6506 1004927 1146181 980866 1010124 698713 1000814 898874 979932 1052702 941684 1004739
6496 1004739 1030437 953742 940740 1161789 870207 904393 844346 1094361 885765 918735 889154
6485 889154 868866 960762 934798 1053367 850862 954986 1023568 808865 977849 917795 958145
6474 958145 907191 862324 841018 791738 824081 696600 803450 935542 589472 806411 737990
6463 737990 845121 904708 917397 791385 724127 592457 791040 711645 574889 660134 674455
6452 674455 839874 665950 643501 668250 672110 586588 591308 523422 615212 562453 542880 811946
6440 811946 753013 557222 455476 672770 460625 542322 482743 479843 596025 371521 336868
6429 336868 480203 409166 501844 461309 587504 584348 240543 266326 429017 322891 404436
6418D04436q171k5976m7543K87356k34411K02659j62550L1893l9731M3109p7510
6407C73561R9848o4943o621j55575J65010J62716k17042j11357O0789N7809J06116
6396D70311k37496l1713K09894k01542K70351l07853Q0993J00054K06373k05519
6386C53853j19425j70018P6033l7455K33303Q2074j30256L1584n2163o1999K1218
6375B26749J49996N733j55565J01953J00708K2435l25828J4172J32270J34149
6365D06772k0704j46872J18819j75288P779J96434k43303J04949k0092J0375P1887
6354C10756j22811l2145J82112n6665k8310k7614n877o416j49316K40882R7664
6343D02260p2815n7843k9014P6774j63745K20606J4164k74596J36833n1544J65144
$$ plain form
6418 404436 396265 370289 322746 610102 375691 578350 415800 447693 407962 451071 373561
6407 373561 473409 408466 401845 246270 411280 573996 356954 245597 306386 364195 470311
6396 470311 232815 201102 410996 209454 479805 171952 252945 352999 559372 353853
6386 353853 234428 64410 140443 102988 336291 418365 288109 319693 267530 205531 226749
6375 226749 376745 382478 226913 328866 429574 452009 126181 140353 272623 406772
6365 406772 386068 239196 358015 182727 190506 386940 143637 248586 228494 238869 310756
6354 310756 187945 155800 337912 281247 252937 225323 219446 213030 63714 304596 402260
6343 402260 329445 271602 242588 319362 155617 376223 390387 115791 252624 201080 366224
6332C66224j31524m9447q4958J52675L1500j80144L2027O7141J90359k07518m0281
6321A46054J05137m8494j372n2400L4423M8173j6155J08684j38932J8582o9814
6310A33886N3402P3904j53669O2872P3192R5839r6295M8708J15916J9791q1118
6299C46428k10830K05427N3519j22742N9247p1883K9626l5092k5906l6107j30075
6288F1612R6074K1793L2078r9438j0074J09596r9410j3080J21220j27076q8117
6277E178K12008q9809J72194n9725N6928o9714m8078j0506j04218R1259P7751
6266B33268J31731j35334k7470J96080k84929K62287j41550j1749m8644K965J11368
6255B88023o2700j86040J66349n3763l2593J15357m6221P4327q7668j12450p6760
$$ plain form
6332 366224 234700 185253 100295 252970 284470 104326 136353 203494 393853 186335 146054
6321 146054 251191 202697 201325 148925 183348 231521 215366 324050 185118 203700 133886
6310 133886 187288 261192 107523 170395 243587 339426 243131 291839 407755 427546 346428
6299 346428 135598 341025 394544 271802 331049 259166 288792 253700 227794 191687 61612
6288 61612 157686 179479 211557 112119 102045 211641 112231 99151 220371 93295 5178
6277 5178 217186 127377 299571 239846 296774 227060 178982 168476 64258 155517 233268
6266 233268 364999 229665 202195 398275 113346 375633 234083 222334 173690 176655 288023
6255 288023 225323 39283 205632 151869 119276 234633 188412 262739 175071 62621 -14139
6244a4139K19466J0633j92513Q322N4271J50581k90453K10289q1178M3331l3237
6233H5373O3615r0394J42281N9896N1639j72584q4720J72330J03393p9826N7641
6222C08644j34457K0344m3992r3333J1939O5666j7199j2786J4054J07215j31423
6211I4672M4402L5888r2023J86207P3411j50907j92296J61129r6954P4170O9455
6200B07154J00106k05701K3741K10893j98147J54688p7672o6230O6028M2924j45933
6189A11851J63612M0720k41926K48960R41q6797r0166m4573j26426J11541q8442
6178g05K26396J14118k53108J55841j6893K4536j40379R6920o3918J5564r554
6167A48818j876j77811K13062j06123L8405J2636j57954J15611O2035l5064r764
$$ plain form
6244 -14139 205327 215960 23447 31769 86040 236621 -53832 156457 75279 118610 85373
6233 85373 148988 58594 200875 260771 312410 139826 55106 227436 330829 251003 308644
6222 308644 174187 194531 150539 57206 69145 134811 117612 104826 118880 226095 94672
6211 94672 139074 174962 82939 269146 342557 191650 -646 160483 63529 137699 207154
6200 207154 307260 101559 125300 336193 138046 292734 215062 148832 214860 257784 111851
6189 111851 275463 316183 74257 323217 324158 237361 147195 102622 -23804 87737 -705
6178 -705 225691 339809 86701 242542 225649 250185 109806 206726 142808 158372 148818
6167 148818 146942 -30869 182193 76070 114475 127111 -30843 84768 146803 111739 101975
6156A01975J53737j40300K32364k89289M5416J99222j69288k0772J28627k5517
6146B16175k60652J51050K60458k90774R213j0645O0220p4305N0006J11463o3740
6135A58469m5279M1745J60701k01337J57462p8191j24215K52359j36850P4233
6125B59097j83607J4251j56423M46744k63501J49553n2996k557J1850M4961p9000
6114A88372L0467j54836m8723J51922J24190o0776j60091M6086J7850J60828l1998
6103B63291j80719J49234j03643q4927J29380J34562k75380L26100j46219o7081
6093A44598q1916J38434o0730j35126K34140r3332J91134j57140J4516j75953
6083A8625K88149j84417q9743K09846N310J1558l6174K0606r6805N6376o6320
$$ plain form
6156 101975 255712 115412 347776 58487 103903 303125 133837 113065 241692 216175
6146 216175 -44477 106573 367031 76257 85470 74825 135045 60740 110746 222209 158469
6135 158469 113190 154935 315636 114299 271761 193570 69355 321714 184864 259097
6125 259097 75490 89741 -66682 380062 116561 266114 213118 210561 222411 267372 188372
6114 188372 218839 64003 15280 167202 291392 230616 70525 116611 134461 295289 263291
6103 263291 82572 231806 128163 43236 172616 307178 31798 357898 211679 144598
6093 144598 62682 201116 140386 5260 239400 146068 337202 180062 194578 18625
6083 18625 306774 122357 32614 242460 247770 259328 223154 243760 146955 203331 137011
6072A37011J26194L978r8416L4926L9967j68420L19170q4669Q807O3480k19547
6061A62481J5499p4871J11956m6786J67363j62703m6456J93982r7439m6294r691
6050A67041J4296L06395k6636l33885Q4257J44948j17738j37489Q9135M9352q0898
6039A58778J51339N5043j82455K40868j94340J40984p7200n3283J4607o2840q2315
6028A09186K96323k25866N979J11185N376j40360L2692N2202J69231m0879j55510
6017B19559J11815M8810M8073K7028j45360j6216P0840K2966o2870o9693l1095
6006B23857q5350k1810J59029M854M1205q4165q2377k5113J51308j2484N0949
5995C19903J4814J11849k23547J09724l4586m4496K609J6744O7614j74420J23613
$$ plain form
6072 137011 263205 267183 168767 203693 243660 75240 394410 309741 318548 382028 162481
6061 162481 177980 103109 215065 168279 335642 172939 126483 320465 223026 176732 167041
6050 167041 181337 487732 461096 127211 211468 356416 238678 101189 190324 239676 158778
6039 158778 310117 365160 182705 423573 229233 370217 293017 239734 254341 191501 109186
6028 109186 405509 179643 185622 296807 302183 161823 194515 246717 415948 375069 219559
6017 219559 331374 380184 428257 455285 309925 293709 364549 387515 324645 254952 223857
6006 223857 138507 116697 275726 280580 321785 237620 155243 130130 281438 268954 319903
5995 319903 334717 446566 223019 332743 298157 253661 256270 273014 340628 166208 289821
5984B89821P0512j8853j34303k26286L08177o0158K40948l50565K44574j12327
5974B51540o2554J89524M878k38045J13668R7408k338o8786l4699j03767L6821
5963A83650P8726j60575m5172J9354P9676m4156j1416O7534P9228K0864j01148
5952A66565P2249o8379N2570l004J4864J14399j4444j23501K2026O7719l9677
5941B61387K0365O9194j22713Q4150j03891J49231m0815K69127k36102k0377j3150
5930C16406R921j62555J23455J59360n4584j54908O0797j47139K85385k65846
5920A70292J20921J2632O2243j40865K20623j23565O1971M840j85902j8179J45859
5909C30870n1188L5133j61687M3624J08724j79850J14366j83778K28712N392j4865
$$ plain form
5984 289821 360333 341480 207177 -19109 289068 228910 469858 119293 363867 251540
5974 251540 188986 378510 383388 145343 259011 356419 354081 285295 250596 146829 183650
5963 183650 262376 101801 56629 75983 155659 111503 100087 167621 246849 267713 166565
5952 166565 238814 170435 223005 220001 234865 349264 334820 211319 233345 301064 261387
5941 261387 281752 350946 228233 312383 208492 357723 316908 586035 349933 329556 316406
5930 316406 326327 163772 287227 446587 392003 237095 297892 150753 436138 170292
5920 170292 291213 303845 366088 225223 445846 322281 384252 389092 203190 185011 330870
5909 330870 279682 314815 153128 196752 305476 125626 239992 56214 284926 290318 275453
5898B75453o1882l808M4896j1327K2905M0515j05821k9843k5664J02709j86879
5887F1254J1134N6015K17762o6746l8761L1081L432J5320m0029J15925J6677l53885
5875B9179K18021o533l6274J88192q6201n7559J06836k14021O6122J75032j22476
5864B60318j02295K28480p7996o8900R8757j63322P9180j48363M7715k3122J19282
5853B49734r9682O2854j33298J98233m4567J939k03645L71033j65404P3844j40073
5842A70968r713J3006r561K6340K90022j29149j37267J20141j60507j4283R168
5831A69165R0968j832k86255K91216m9340q4018J76014J21360m30283R0322R950
5820I7267Q3430M6070m3482O8722k44234K22815R2804j68963N0488P0425J5463
$$ plain form
5898 275453 213571 209763 254659 243332 266237 306752 200931 171088 145424 248133 61254
5887 61254 72388 128403 346165 279419 240658 271739 275171 290491 250462 366387 383064 29179
5875 29179 247200 240667 204393 392585 306384 248825 355661 141640 207762 382794 260318
5864 260318 158023 386503 308507 239607 338364 175042 254222 105859 153574 130452 249734
5853 249734 150052 212906 79608 277841 233274 235213 31568 402601 237197 311041 170968
5842 170968 161255 174261 164700 191040 481062 351913 214646 334787 174280 159997 169165
5831 169165 260133 258301 -27954 263262 213922 129904 305918 427278 -3005 87317 97267
5820 97267 180697 226767 183285 252007 7773 230588 323392 154429 204917 275342 290805
5809B90805j67141O0067J75248j74597L3748o9978J54134M232j71993o1604J15066
5798A87987J2340J12859l7124j29419J28244k88048J52651r8369l0077J21365
5788A32409k6389J09399o4928J27029P3409j07785r3229j16420p4882L67542j62758
5777A63397Q6295k73276K96773J12722j14010j49345J67003j57300m9863j4726
5767F7670k0324J14545n0457L4366j41796K07480k88860J73675N78K22719k7800
5756B91796m1273m20283J45060J44662l9113O6211N1635N7277j16791K09910m30639
5745h1548K39361J7570j85220j5950P3910m6530N4056q3052N0796J09995k7646
5734A05742j02264J08652K02905k19853P7196o9168j9467n2579K3340M7340J661
$$ plain form
5809 290805 123664 183731 358979 184382 218130 148152 302286 306518 134525 72921 187987
5798 187987 200327 313186 276062 146643 274887 -13161 139490 41121 11044 132409
5788 132409 106020 215419 150491 277520 350929 243144 149915 33495 -41387 326155 163397
5777 163397 249692 -23584 273189 385911 271901 122556 289559 132259 82396 67670
5767 67670 47346 161891 111434 145800 4004 211484 -77376 96299 96877 319596 291796
5756 291796 250523 -169760 -24700 119962 80849 147060 198695 255972 139181 349091 -81548
5745 -81548 157813 175383 -9837 -25787 48123 1593 55649 -27403 23393 133388 105742
5734 105742 3478 112130 315035 95182 172378 103210 83743 31164 54504 101844 103505
5723A03505N1259k37210J18870J28437o1115J44632o0890J67531k75948K1698
5713A00769J05073r5739K953M3466M5311r5754o3183K58641k79029N6702J80102
5702B59312k95219J52078J54909j04487q1907K34J96030k28924J76253r655j24235
5691I4389J002L2004K01986r3873m4447J19527j39124L8320J18503O8599l27518
5680F9368J73137j12934J6543q7859M3700l9642L123J66224N2604k51926j03873
5669g1535o472K46626j53406N4018N2559J5971j46306J56079J42421k49253J2527
5658E3229j1415J09094k02366M9655n445K06846P7545k60726n6021P9298J25558
5647A65252l0397k04661J91922O280R7623j83749l0564J05665P8325J02019l03004
$$ plain form
5723 103505 154764 -82446 36424 164861 103746 248378 187488 355019 79071 100769
5713 100769 205842 110103 113056 156522 201833 106079 42896 301537 22508 79210 259312
5702 259312 -35907 116171 271080 166593 84686 84920 280950 52026 228279 218624 94389
5691 94389 95391 127395 329381 235508 191061 310588 171464 209784 328287 396886 69368
5680 69368 242505 129571 146114 58255 101955 62313 65436 231660 284264 32338 -71535
5669 -71535 -78007 168619 15213 69231 121790 137761 -8545 147534 289955 40702 53229
5658 53229 41814 150908 -51458 -1803 -7248 199598 277143 16417 -39604 39694 165252
5647 165252 134855 -69806 122116 128396 226019 42270 11706 117371 195696 297715 -5289
5636e289K63769k14608j65313K27766o3729j09448L34287j4100l4052j17308J65197
5625B67172k51562J16208J63918p8243j69562L2725n0922J30898j6635J09358
5615B53355k96733N7552J43906Q2182k8602j95345m1771J9330Q6204r949n8865
5604A1264J67634l3577j32958o047p6388J03701j54908J42182J33185p2837p5622
5593E629k8529J09138p2370R7587n6454J05066j68201J34055M6422o3525L0894
5582A39712L4165k6221p2748J66446k86901J3679O2041n7486p5018J54313J8463
5571G0445O8275o403j16395J63012m4256j07081j21566J81294o4773J95548o0052
5560A58048n8587j52877J79340M4584q522O6595k60352K43871j37228o8559L5984
$$ plain form
5636 -5289 258480 43872 -121441 106325 42596 -66852 267435 253335 219283 101975 267172
5625 267172 15610 131818 295736 217493 47931 80656 29734 160632 143997 253355
5615 253355 -43378 14174 158080 240262 211660 16315 -25456 -6126 80078 70129 11264
5604 11264 178898 145321 12363 6316 -70072 33629 -121279 20903 154088 81251 5629
5593 5629 -22900 86238 13868 111455 55001 160067 -8134 125921 172343 108818 139712
5582 139712 173877 147656 74908 241354 -45547 -31868 30173 -27313 -102331 51982 70445
5571 70445 138720 132317 15922 178934 134678 27597 -93969 87325 22552 218100 158048
5560 158048 99461 -53416 125924 170508 161986 228581 -31771 212100 74872 6313 42297
5549D2297M6304J8430r4638N6207R0679R9035k93892p6764K25739n5531j6431
5538D1435J02596r6030p6894m7361m6904J58323J33550m6167r685J9853o7143
5527F5573n1542q1015K48181j81375j5644K40854j45294r3438J34718j31130Q483
5516a629R8287J06382p4173l7027j11023R0831J20545l47148J90952J12116j47314
5505G99j1583j6954Q0673r9527J43537k43535L25784l46750M06704J42019j96560
5494A84607l6264j44110p9895l9341K07693L9726P0901k07706J237J7410j45726
5483a31468J19145K41514k19060K7540K33583l01978K32860j63292l9524j3657
5473a4337j45180K65944K39134l98267J28831p355p8732q3292J90788N1223J06788
$$ plain form
5549 42297 88601 107031 12393 68600 159279 258314 -35578 -112342 113397 57866 41435
5538 41435 144031 48001 -28893 -76254 -123158 35165 168715 122548 112863 132716 65573
5527 65573 14031 -66984 181197 -178 -15822 225032 79738 -13700 121018 -10112 -1629
5516 -1629 96658 203040 128867 91840 -19183 71648 192193 -154955 35997 148113 799
5505 799 -10784 -27738 52935 -46592 96945 -146590 179194 -167556 239148 381167 184607
5494 184607 148343 4233 -75662 -115003 92690 132416 203317 -4389 -3152 14258 -131468
5483 -131468 -12323 229191 10131 37671 271254 -30724 202136 38844 -680 -14337
5473 -14337 -159517 106427 345561 -52706 76125 68770 -9962 -93254 97534 148757 255545
5462B55545j44285k7614o3049L827K2794N9626O8789j91537M9604j9012K0505
5451C5193Q6033j59668N4607J59470j89445j5183O3392P7922L6082k03208o3116
5440a17921K30112o2764j54950K02237M7170r9455J291J22779r0670m6879O1171
5429I2121j0608r2670J87106J1843M4877j74906J23421m3034j41799K8016N9850
5418H4217J03887j91919K11095k75388J43229O3261p1188K22764k57688L309J88036
5407B23615j54393j2689R1528m9304J30640k9084k33521N2114L2239J50430j01189
5396A00386k73164L26896K6902R009j07654P2908m4126P7993j51485P0284o9190
5385C8759J20133j18197Q5706J59351k87155l7127j34456M24193l29852J17651
$$ plain form
5462 255545 111260 83646 20597 24424 47218 106844 175633 -15904 33700 14688 35193
5451 35193 121226 -38442 16165 175635 -13810 -28993 34399 112321 148403 -54805 -117921
5440 -117921 112191 49427 -105523 96714 143884 44429 45720 168499 77829 30950 92121
5429 92121 81513 -11157 175949 187792 232669 57763 181184 138150 -3649 24367 84217
5418 84217 188104 -3815 207280 -68108 75121 138382 67194 289958 32270 35579 223615
5407 223615 69222 56533 148061 98757 229397 200313 -33208 18906 51145 201575 100386
5396 100386 -172778 154118 181020 190029 82375 155283 111157 189150 37665 107949 38759
5385 38759 158892 40695 126401 285752 -1403 -38530 -172986 251207 -78645 39006
5375C9006j12527K01747m9367k3492n0525J76340j83415M11268l18419j77103
5365h6487k8904Q0717R3181j10797J6091J09138J29406j85716J28164q6722Q3391
5354A41462o7596J02758q9679J1458J26113n1980j74008p436N0651k9637o2323
5343e0217R2802M7621J15280k07296J74793p5881R399Q1604j12642K0972j46120
5332d9685K05694n1901k1722l7895R6700L9389j60617j23697K49449j50056K9720
5321B5379K29799l81138J55037k0438M9123m6957j10540L02657j29099l281M402
5310G4944L304Q4014j0064k16996J18464J69478k77284M6514l5313m9917J50997
5299E8141n0263J10547k53215J34337J21814p350k810q6441M217J34625l6025
$$ plain form
5375 39006 -73521 128226 78859 55367 4842 181182 -2233 409035 90616 -86487
5365 -86487 -115391 -34674 58507 -52290 -36199 72939 202345 16629 144793 58071 141462
5354 141462 73866 176624 86945 98403 224516 172536 -1472 -8908 41743 12106 -50217
5343 -50217 42585 90206 205486 -1810 172983 97102 106501 188105 75463 96435 -49685
5332 -49685 156009 104108 82386 44491 141191 180580 19963 -103734 145715 -4341 25379
5321 25379 255178 -125960 29077 8639 57762 10805 -99735 202922 73823 70542 74944
5310 74944 78248 162262 152198 -64798 53666 223144 -54140 -7626 -42939 -92856 58141
5299 58141 7878 118425 -134790 -453 121361 114011 111201 24760 28977 163602 127577
5288A27577m5714M2592o6459J4523R9776k55204R9733J41353R1078k42853n3310
5277d6908K6143K1967j05384K42441m2872j69173K79718j61404l1924O8280J42015
5266B22899j72474j45735J74584j45709J99440j18900J82394k73963N4977N9593
5256C7106k9906J4312Q2927j15585M4089J71753j55121k2743M5101J1810l3744
5245D9999L0099p3013l5171J27873k86692K41330j76534K41789J1444q2890J07392
5234A55626q186Q140j65218P7616r2210J43022k00605J4536N9023m0306j4385
5223f2947M9046L8028N2963J84571l19952K33102k6258l2430p5064j96722N9352
5212i6311J53850K8659M3107k05890K63877k79107K65665j8439o9470%J09913
$$ plain form
5288 127577 81863 124455 57996 72519 172295 -82909 16824 158177 249255 6402 -46908
5277 -46908 -20765 1202 -104182 138259 95387 -73786 205932 44528 12604 80884 222899
5266 222899 50425 -95310 79274 -66435 133005 14105 196499 -77464 -22487 37106
5256 37106 7200 21512 104439 -11146 32943 204696 49575 26832 71933 83743 49999
5245 49999 80098 7085 -28086 99787 -186905 54425 -122109 119680 131124 48234 155626
5234 155626 147440 155580 -9638 67978 -24232 118790 -81815 -67279 -8256 -48562 -62947
5223 -62947 -13901 24127 77090 261661 -58291 174811 148553 116123 41059 -155663 -96311
5212 -96311 57539 86198 129305 -76585 187292 -91815 173850 155411 85941 85941 195854
5201A95854j44175j7135j42435K57158j80368M3468l5072R9238j34732J51229
5191I3030j91890R7566J07142j28582J32776q0061J61053q4813j21598L3750J04546
5180A22919l2066Q0207j24359m7550p8001K03317r9837R7767k6401o8242R1747
5169A19501j30496j0257J03518J4107j18644J20116j1890l7276k4315M2341j38706
5158g2001J52401L1503L7974k03193K91236r8930j19703n1195O6530K8398m1642
5147B1378p8396L02073o5345k50120L505q5786Q9053N8873J85Q4030J843O5938
5135A47231q0132J32444k70025J04183J31692m4828m8299k2801J43630j05968
5125H7127j76445K68872O019k66747K60537k54851o1331K29879o59k21833K08556
$$ plain form
5201 195854 51679 34544 -107891 149267 -31101 12367 -22705 76533 -58199 93030
5191 93030 -98860 -1294 105848 -22734 110042 29981 191034 106221 -15377 18373 122919
5180 122919 90853 171060 46701 -849 -78850 124467 24630 122397 95996 27754 119501
5169 119501 -10995 -21252 82266 96373 -22271 97845 85955 48679 24364 66705 -72001
5158 -72001 80400 111903 149877 -53316 237920 138990 19287 -31908 34622 63020 21378
5147 21378 -57018 245055 179710 -70410 -66905 -152691 -63638 -4765 -4580 79450 81293 147231
5135 147231 67099 199543 -70482 33701 165393 120565 72266 49465 193095 87127
5125 87127 -89318 179554 185573 -81174 179363 -75488 -136819 93060 92401 -129432 79124
5114G9124J8270n1678j23186O7989K9590N5177q0199M1942J80432j63944R659
5103F3176q1271J45201K5121p9864L9503J6356J53182k08781M0349k57560L12969
5092A68381q2389K5212Q6213M4595p9362P8885k42154J2276k9578J05480O388
5081I3947q0790N0794K8979M7126j02522m9494N6850l5155Q2828j16536J31358
5070A07385j79717L6337J6183J06241j84290J91253j48247J82185J10556k34791
5060C095J06617k74003J53748j5716K01344n4455J20412j03284j10285P4963R3183
5049A95619j9624k66103J51494j48679J56477N8570j92801J08780p6531R8226
5039F5428Q2173q9993J33932k42465R5541K26470k17875K3042o2386L4027l3471
$$ plain form
5114 79124 97394 45716 -77470 -9481 20109 75286 -4913 37029 217461 53517 63176
5103 63176 -18095 127106 152227 72363 111866 128222 281404 72623 112972 -144588 168381
5092 168381 85992 111204 197417 242012 162650 241535 -619 11657 -17921 87559 93947
5081 93947 13157 63951 92930 140056 37534 -11960 44890 9735 92563 -23973 107385
5070 107385 -72332 -35995 -19812 86429 -97861 93392 -54855 127330 237886 3095
5060 3095 109712 -164291 -10543 -26259 175085 120630 241042 137758 27473 102436 195619
5049 195619 175995 -90108 61386 -87293 69184 127754 -65047 43733 -32798 65428
5039 65428 147601 57608 191540 -50925 44616 271086 53211 76253 13867 47894 14423
5028A4423M776J23558m5377j43718J76506P605m6326p1048n622K4783R7595K9405
5016A66560j05605k12108L01363j40738p2359K44332j69669J87317j71337J29525
5006A57281k41589J33403p4599J66108J27256j20539k11515L0802P6642P5228
4996A18478j29011j42739J58226j48772N5284K34922k8742l9147l7349P6764j93934
4985g6020J44575K61354k69307j48802K67361j19662K22115l47431P070J75152
4975A16405q6779M277J16466j7088j00908J43121k9499j65196K48793P7702k39635
4964F7659R9035q2504j82354K13678m236O1772j72123J06200l0254P0626q4347
4953F3152M7825J0887j37594m1399M2915K00672q3232j72123J57272k4604m8780
$$ plain form
5028 14423 19199 142757 97380 -46338 130168 137773 91447 20399 14777 39560 137155 166560
5016 166560 60955 -151153 150210 9472 -62887 181445 11776 199093 27756 157281
5006 157281 -84308 49095 -25504 140604 267860 147321 -64194 -33392 43250 118478
4996 118478 -10533 -153272 4954 -143818 -88534 146388 117646 78499 41150 117914 -76020
4985 -76020 68555 329909 60602 -88200 179161 59499 281614 -65817 -58747 116405
4975 116405 29626 33903 150369 133281 32373 175494 145995 -19201 229592 307294 67659
4964 67659 166694 84190 -98164 115514 111278 173050 927 107127 76873 147499 63152
4953 63152 110977 121864 -15730 -57129 -14214 186458 103226 -68897 88375 63771 14991
4942A4991J6272J09381j57413J43362q0869Q0959J43716j97054R7912j06066R6215
4931A61406j05646J78220K12428n49764K13062j7900p9262J69361j22915Q6732
4921A45722j38128J77033J03502l28743J90307J9323j56189L6546j5695q101Q4726
4910A10303J402r1982Q8911k9520n0518M8683j42547J41336J31257j33071Q663
4899H2917K5091r0178J68574L0463o3496N1k22594K01479j75100R4625M6708J08885
4887B07425k14484Q060J10609r7815K1803Q897l9308J9592L0609k6279o0037P8788
4875D7860L1928o7670n4895K15522j26516p1415O8184j95513K86146K5517m696
4864A54452N1594j58136o029M5795K5498j32087K51579j10334k0942k5747n989
$$ plain form
4942 14991 31263 140644 -16769 126593 45724 126683 270399 73345 171257 65191 161406
4931 161406 55760 233980 446408 -103356 109706 91806 12544 181905 58990 145722
4921 145722 7594 184627 288129 -40614 149693 169016 12827 49373 33678 25577 110303
4910 110303 111705 19723 108634 79114 28596 77279 -65268 76068 207325 74254 82917
4899 82917 108008 17830 186404 216867 153371 153422 -69172 132307 -42793 51832 98540 207425
4887 207425 -7059 1001 111610 13795 35598 44495 5187 24779 55388 29109 -30928 47860
4875 47860 79788 12118 -42777 172745 46229 -25186 42998 -152515 133631 159148 154452
4864 154452 206046 47910 41881 87676 113174 -18913 232666 122332 101390 75643 69654
4853F9654j38101J14896P6196K0075J19042l34345J50670j24711k0344J67608
4843A00640k9547p3766J32679j32010M2150r8147J61317L18846j96735n2520j018
4832A71889k3136q7292Q0605N4107L8389j8836o6095n1365J97033k21803N0998
4821A24494k45363J83683J27738J30230l76159O6964M3633M9362p1512l1221J41765
4810A43614J22483o2498j04532J39260j82526J45129J0820p3346j7437J7783J28882
4799B67632j17267K14449p8612p7724R217P8280p80k42620K60649j65910K46128
4788C93442m5231n4377p824K18749r4179K1715L48498j26488K5828J2100O1683
4777G53916L2047j19914K06072k91787m5618K2146J96925l32235p0282P0803K5553
$$ plain form
4853 69654 -68447 46449 122645 142720 261762 -72583 78087 -46624 -66968 100640
4843 100640 71093 -2673 130006 -2004 40146 -58001 103316 422162 225427 172907 171889
4832 171889 148753 61461 142066 196173 234562 215726 149631 98266 295299 73496 124494
4821 124494 -120869 62814 190552 320782 -55377 11587 55220 104582 33070 1849 143614
4810 143614 266097 203599 99067 238327 55801 200930 211750 138404 120967 138750 267632
4799 267632 150365 364814 286202 208478 217695 295975 295195 52575 313224 147314 393442
4788 393442 348211 293834 286010 504759 410580 432295 780793 654305 680133 692233 753916
4777 753916 785963 666049 872121 580334 534716 556862 753787 421552 351270 422073 447626
4766D47626j11915j46768J81462j4014k57722J45114j33488J37836R6876Q7673
4756D32680l04748J91823j34269J06667n3055M900m066R5135Qj39165K83211j30831
4744C48290j28016m2845M7626o5542m4640K04377q236j27757M1541J1551J88837
4733D25186k7661m2622j65798J52668j57506J70797L1627m1888p2894N3688l7077
4722B88520N6443q1649J13967r8001q0639p5380J65565N4387j15813O1992j51638
4711A37754J52282R428k9442P6941j16977O999J97100k46420J60106j53487K17251
4700D11535q0546k476j40288L5281K51375j71089K3137l9880o5544j4393N4534
4689B61646J84537j21725j10021N9874n9735R0005p6363K17762j01894M8342O3152
$$ plain form
4766 447626 335711 188943 370405 356391 98669 243783 110295 248131 345007 432680
4756 432680 127932 319755 185486 292153 239098 243998 239932 335067 335075 195910 479121 348290
4744 348290 220274 177429 225055 159513 114873 319250 311014 183257 224798 236349 425186
4733 425186 397525 354903 189105 341773 184267 355064 386691 344803 271909 325597 288520
4722 288520 344963 263314 377281 279280 198641 123261 288826 343213 227400 289392 137754
4711 137754 290036 299464 270022 346963 229986 236985 434085 187665 347771 194284 411535
4700 411535 330989 328513 188225 223506 474881 303792 326929 287049 221505 207112 261646
4689 261646 446183 324458 214437 274311 214576 304581 228218 445980 344086 392428 455580
4678D55580j56079m0593J64011R0319j23951L074k10412L73423n0305j17984p9067
4667C08016J92777J37736q3197k27545K64083j88987j25048M00551M1022j56879
4657E62529J1675N0926O9036k17370J16995k7610j9292K03269q2964P5602o5284
4646F77512J56743L7897p0390o253J05192o883o9511K3105j87594L43208P5705
4635A078731r7127q593J14849j3128R1522J12587N8227r134j34899J64276l3904
4624A323407q0994k8140M5366K6055m4750l4469L9001O3996n8978L0320R3636
4613A374450L4524K1085R7549k04015p2690P4517N1130J80513N8984J7077j3831
4602A619293J81131r7015O4J56762p86k6256L4957k09932j26759K67982j03354
$$ plain form
4678 455580 299501 258908 422919 513238 389287 392361 181949 555372 505067 387083 308016
4667 308016 500793 638529 555332 327787 591870 402883 277835 678386 719408 562529
4657 562529 574204 625130 694166 476796 593791 566181 546889 750158 667194 742796 677512
4646 677512 834255 872152 801762 795509 900701 893818 824307 847412 659818 1003026 1078731
4635 1078731 981604 973011 1087860 1074732 1166254 1278841 1337068 1327934 1193035 1357311 1323407
4624 1323407 1242413 1214273 1259639 1285694 1240944 1206475 1245476 1309472 1250494 1280814 1374450
4613 1374450 1408974 1430059 1527608 1323593 1250903 1325420 1376550 1557063 1616047 1633124 1619293
4602 1619293 1800424 1703409 1703473 1860235 1859449 1833193 1868150 1658218 1531459 1799441 1696087
4591A696087l13236L8767Q165Q6211k42242M2091j8906J88385o4193q8844R7314
4580A429599l13467L81644q8112M1706J80156j96227J3320J33476j58652J31438
4570A554881j29951K5467k59156K78672q2230M2838m8414J4841l0278j18691J39580
4559A387559j85959N0177O0021J13040j03098j80872J58458J67553j77652J29340
4549A418567l418p671p4040M7376k70736L04104j01038J3396J65427j8741j54754
4538A318472J38193j06404J45264q8936M1604J25876L2061j76228O4810P9620
4528A574332k33529l4623L07783j08620k4800K34411p1913J20386j00471j982
4518A660974K16218j89264J82959l8409J02543k26704O3388R3247N7962j08570
$$ plain form
4591 1696087 1382851 1421618 1429783 1515994 1273752 1315843 1296937 1485322 1421129 1332285 1429599
4580 1429599 1116132 1497776 1409664 1451370 1631526 1435299 1448619 1582095 1423443 1554881
4570 1554881 1424930 1450397 1191241 1469913 1387683 1430521 1382107 1396948 1366670 1247979 1387559
4559 1387559 1201600 1251777 1311798 1424838 1321740 1140868 1299326 1466879 1289227 1418567
4549 1418567 1415149 1407478 1333438 1380814 1110078 1414182 1313144 1326540 1491967 1473226 1318472
4538 1318472 1456665 1350261 1495525 1406589 1448193 1574069 1606130 1429902 1494712 1574332
4528 1574332 1340803 1306180 1613963 1505343 1480543 1714954 1643041 1763427 1662956 1660974
4518 1660974 1877192 1687928 1870887 1832478 1935021 1708317 1771705 1864952 1922914 1814344
4508A814344R7654q6777J1553J3797J15727R1564O8959k46292J69139J55990M5153
4497B250811r6467J31670K43415n47150M32148k22995J50390l9998K02021R2327
4487B596172O1291j86931j33405M27271O5139j59939l3195J03381L70851j88118
4477B922517J39145P1073J46955j49312J18608J64418J08895P4114M3243J3387
4467C653043N2858L78730j35378M8667J07056J35370Q0664o2197Q3801J68983
4457D511597j92915L73073P9355r3656J73281Q909Q5253L3953L1079L37068j55777
4446E191220J85878J91840O0929l4677L39987K89925R0924J5999L85866J20582
4436F838473j0902L68940P2240J80476J09158l5665K51656P3970J79207K98841
$$ plain form
4508 1814344 1911998 1825221 1836774 1850571 1966298 2057862 2126821 1880529 2049668 2205658 2250811
4497 2250811 2154344 2286014 2529429 1982279 2414427 2191432 2341822 2301824 2503845 2596172
4487 2596172 2657463 2470532 2337127 2764398 2829537 2669598 2636403 2739784 3110635 2922517
4477 2922517 3061662 3132735 3279690 3130378 3248986 3413404 3522299 3596413 3639656 3653043
4467 3653043 3705901 4084631 3949253 3997920 4104976 4240346 4321010 4258813 4342614 4511597
4457 4511597 4318682 4691755 4771110 4677454 4850735 4859644 4944897 4978850 5009929 5346997 5191220
4446 5191220 5377098 5568938 5629867 5595190 5935177 6225102 6316026 6332025 6717891 6838473
4436 6838473 6827571 7196511 7268751 7449227 7558385 7522720 7774376 7848346 8027553 8326394
4426H326394o3682J78510M40365j74184M32797J42046M38898K34325K26839K27524
4416A0409832K55996M96657M71454L43802N78544K33430P51543M62500N50648
4407A4554406P40052P51085O85204Q44857R45028R83682Q59434J199737J213596
4398B2777081J295331J657027J550735J826485J807257K084177J840891K148549
4390C6987533K240877K234970K681741K807558L184109L426673L814713M302997
4382F1681171M934815N051813N847626O318414O211650O345817N322885M900187
4374A06614378L473148K248533R36522j37581j360744j792572j972364k423628
4366A05585692j531366j789699j076115m65649k33802O54821J087642J620989
$$ plain form
4426 8326394 8262712 8441222 8881587 8707403 9140200 9282246 9721144 9955469 10182308 10409832
4416 10409832 10665828 11162485 11633939 11977741 12556285 12789715 13541258 14003758 14554406
4407 14554406 15294458 16045543 16730747 17575604 18520632 19504314 20363748 21563485 22777081
4398 22777081 24072412 25729439 27280174 29106659 30913916 32998093 34838984 36987533
4390 36987533 39228410 41463380 44145121 46952679 50136788 53563461 57378174 61681171
4382 61681171 66615986 71667799 77515425 83833839 90045489 96391306 101714191 106614378
4374 106614378 110087526 112336059 113272581 113135000 111774256 109981684 108009320 105585692
4366 105585692 104054326 102264627 101188512 100722863 100489061 101143882 102231524 103852513
4358A03852513K551531L223841M195998N595254O538938P713698R150132J0642403
4350A53464308J1237479J1631548J0620295R156428O374624L238686o48241m680676
4342B00394451p723716r655791j1329386j2005478j1745711j1115392r726883
4335A27092094q390792p405377o222805m707384m054348l119596k149272j052613
4327H9989907j074897N0739O81084J503276J766944K325583K491481K742591K447280
4318A02923988J504109N02835p10214k167499l676119m552903n393149n844176
4310H2586872o278830o276765o171220n414410n161595m566430m058582l477953
4302D1181087l296261k523236k392392k115155j964098j689452j589108j300960
$$ plain form
4358 103852513 106404044 109627885 113823883 119419137 125958075 133671773 142821905 153464308
4350 153464308 164701787 176333335 186953630 196110058 202484682 205723368 205075127 200394451
4342 200394451 192670735 183014944 171685558 159680080 147934369 136818977 127092094
4335 127092094 118701302 111295925 105073120 100365736 96311388 93191792 91042520 89989907
4327 89989907 88915010 88965749 89646833 91150109 92917053 95242636 97734117 100476708 102923988
4318 102923988 104428097 104930932 104220718 102053219 98377100 93824197 88431048 82586872
4310 82586872 76308042 70031277 63860057 58445647 53284052 48717622 44659040 41181087
4302 41181087 37884826 35361590 32969198 30854043 28889945 27200493 25611385 24310425
4294B4310425j603692q56564j095228r31785r87611p60748q74841n15171p12194
4285A5972591p08483p21519n31890m34925l78145o71745m24222m22009k11184
4276A1468469m75728m10302k76929k81184k22200k09255N6463m53494l17292j93092
4266H685456l15068r4201j44280k85335l29539j63293k97993M7267l48631j4718
4256F739665l87235k66695k7727j6755k16196j46546j12135j43927l2715l28123
4246E061611j19084L1833r0670p8614j62817j7146J42164k68450K27392r0525
4236D635694j33952k31528l4370j42300P1823l57369k5151J38191k74371O2046
4226C708713l91075K02101j45429M498l3813k42739l5332k52555K27427j00599
$$ plain form
4294 24310425 22706733 21850169 20754941 19823156 18835545 18074797 17199956 16684785 15972591
4285 15972591 15264108 14542589 14010699 13575774 13197629 12525884 12101662 11679653 11468469
4276 11468469 10992741 10582439 10305510 10024326 9802126 9592871 9649334 9195840 8878548 8685456
4266 8685456 8370388 8276187 8131907 7846572 7517033 7353740 7055747 7103014 6754383 6739665
4256 6739665 6352430 6085735 6058008 6041253 5825057 5678511 5566376 5422449 5389734 5061611
4246 5061611 4942527 4974360 4883690 4805076 4642259 4625113 4767277 4498827 4726219 4635694
4236 4635694 4501742 4270214 4235844 4093544 4165367 3807998 3782847 3921038 3646667 3708713
4226 3708713 3317638 3519739 3374310 3378808 3344995 3102256 3066924 2814369 3041796 2941197
4216B941197q6532p3497l1944m1031N5598o8678j85785o2960J4595k29832p6635
4205B154496J57373p4148r4772R4334j5920P4499K0771j61198q7244o8469k1329
4194A978393j06208Q2051q2096j53753J53264K0141M5500q7750n2921k8704K8066
4183A795983j12418J6840k82480J58094P6721L9859j48426j36330J54493N2723
4173A615059M7351J78800l84787O844J1840o7659R220j0828m4066K3872n6354
4162A329292J34582n8152M5550j45731M0497N2360j26044j3965r908L4192O2999
4151A345672p5432J17098l1830p2160m8412m6796K00088K4060j10843k97560P1436
4140A075321J36784q9697j03863L28523j27342l8530j63723k2694K60757j82260
$$ plain form
4216 2941197 2854665 2781168 2749224 2708193 2763791 2695113 2509328 2446368 2460963 2231131 2154496
4205 2154496 2311869 2237721 2142949 2237283 2221363 2295862 2316633 2155435 2068191 1999722 1978393
4194 1978393 1872185 1954236 1872140 1718387 1871651 1891792 1937292 1849542 1796621 1767917 1795983
4183 1795983 1683565 1700405 1417925 1576019 1652740 1692599 1544173 1407843 1562336 1615059
4173 1615059 1662410 1841210 1456423 1463267 1475107 1407448 1416668 1405840 1361774 1385646 1329292
4162 1329292 1463874 1405722 1451272 1305541 1346038 1398398 1272354 1258389 1248481 1282673 1345672
4151 1345672 1270240 1387338 1355508 1283348 1234936 1188140 1388228 1412288 1301445 1003885 1075321
4140 1075321 1212105 1122408 1018545 1347068 1219726 1181196 1017473 994779 1255536 1073276
4130A073276R0843N4976j3813P9047j4810p2463m8322o6491J94395J10671j65510
4119A221799r0497R1290J27824M6826K57904m13768q7937K76910q6125k36010
4109A108216J94858M3165j81381R1377P7710j80239R5201j91757R3986K61880
4099A413016p5936m2218K2371J94211j88135R7611L29740j25777p3173l1574l4896
4088A485240J74492o2691M9006J13219j54987j42467m6642m9911j11720N8736
4078A312275j05274q456j24439j54828K02984L1688j38633J92264j09741r1106
4068A006734J14195J36011k51334n825J94808n9336p134n5144P6913j21347K8959
4057A057500P2314l52964K08563k1589j30247J02105j13773r5555l2612K94208
$$ plain form
4130 1073276 1164119 1219095 1205282 1284329 1269519 1197056 1148734 1082243 1276638 1387309 1221799
4119 1221799 1131302 1222592 1350416 1397242 1655146 1241378 1153441 1430351 1344226 1108216
4109 1108216 1303074 1346239 1164858 1256235 1333945 1153706 1248907 1057150 1151136 1413016
4099 1413016 1337080 1294862 1317233 1511444 1323309 1420920 1750660 1624883 1551710 1520136 1485240
4088 1485240 1659732 1597041 1646047 1759266 1604279 1461812 1415170 1365259 1253539 1312275
4078 1312275 1207001 1198545 1074106 919278 1122262 1153950 1015317 1207581 1097840 1006734
4068 1006734 1120929 1256940 1005606 999781 1194589 1135253 1128119 1072975 1149888 1028541 1057500
4057 1057500 1129814 776850 985413 963824 833577 935682 821909 726354 693742 987950
4047I87950r4116j00464m7203J28668J065k49336J35749N3412k06196q7683q6627
4036D35219J22230j26946J98965l4616O4252L4165j73624j09101R1394j55078
4026C46860R8635j03313R0681J98331r3129j2666o1160J33701n1564k21944J24989
4015D49421j80120N1130L67259j14604j75322N7561M1943o3228p036P5586j8419
4004D84171p1896J90784r1318j54530l5972L3094j65751J24677M7005n2639K27252
3993E34877k73346O9663k6088k015J2898K05987J7537j56466m3911K4762q5922
3982B77976q303p1382K23419m1751q5458k1133J34926r2539j83654K59694l9327
3971C52468j37839J50246j97073j14582K65115J05637k13585J6741J61630j52779
$$ plain form
4047 987950 893834 793370 746167 874835 875900 626564 762313 815725 609529 521846 435219
4036 435219 557449 430503 629468 594852 659104 693269 519645 410544 501938 346860
4026 346860 445495 342182 432863 631194 538065 525399 464239 597940 546376 324432 449421
4015 449421 269301 320431 687690 573086 397764 455325 497268 434040 427004 502590 484171
4004 484171 412275 603059 511741 357211 321239 354333 188582 313259 360264 307625 534877
3993 534877 261531 331194 305106 303091 315989 521976 539513 383047 339136 363898 277976
3982 277976 269673 198291 421710 379959 294501 273368 408294 315755 132101 391795 352468
3971 352468 214629 364875 167802 53220 318335 423972 210387 227128 388758 235979
3961B35979l4095P9503O1027J83705k82184j21656P6811N7381J83892r8938r589
3950C31836n9544O3394K9884n6904q3980J96965j39221j58180J73849k5857J840
$$ plain form
3961 235979 201884 281387 342414 526119 243935 122279 199090 256471 440363 341425 331836
3950 331836 272292 335686 365570 308666 224686 421651 282430 124250 298099 272242 274082
$$ [...]
##END NTUPLES=NMR SPECTRUM
##END=
