##TITLE=abcd
##JCAMPDX= 6.0         $$ Bruker NMR JCAMP-DX V2.0
##DATA TYPE= NMR SPECTRUM
##DATA CLASS= NTUPLES
##ORIGIN= UXNMR, Bruker Analytische Messtechnik GmbH
##OWNER= root
$$ XWIN-NMR		Version 3.5
$$ Sun Feb 16 14:29:19 2025 Russian Standard Time (UT+4h)  servis@DPX200
##.OBSERVE FREQUENCY= 200.131235884673
##.OBSERVE NUCLEUS= ^1H
##.ACQUISITION MODE= SIMULTANEOUS
##.ACQUISITION SCHEME= undefined
##.AVERAGES= 32
##.DIGITISER RES= 18
##SPECTROMETER/DATA SYSTEM= spect
##.PULSE SEQUENCE= zg
##.SOLVENT NAME= D2O
##.SHIFT REFERENCE= (INTERNAL, D2O, 0, 16.4885)
##AUDIT TRAIL= $$ (NUMBER, WHEN, WHO, WHERE, WHAT)
$$ ##TITLE= Audit trail, XWIN-NMR		Version 3.5
$$ ##JCAMPDX= 5.01
$$ ##ORIGIN= Bruker BioSpin GmbH
$$ ##OWNER= servis
$$ F:\spectra/data/av/nmr/H1/1/pdata/1/auditp.txt
$$ ##AUDIT TRAIL=  $$ (NUMBER, WHEN, WHO, WHERE, WHAT)
(   1,<2025-02-16 14:28:23.70 +0400>,<servis>,<DPX200>,
      <created by zg, POWCHK disabled, PULCHK disabled
       configuration hash MD5:
       00 E9 B6 7A A2 85 ED C7 34 08 36 98 17 FE 4E 26
       data hash MD5: 32K
       2D 4B BA A3 32 F1 92 7B 1C CE BE 3F 39 FC F7 A9>)
(   2,<2025-02-16 14:28:38.14 +0400>,<servis>,<DPX200>,
      <Start of raw data processing
       efp BC_mod = 2 LB = 0.05 FT_mod = 6 PKNL = 1 PHC0 = -263.1254 PHC1 = 1.301534 SI = 16K 
       data hash MD5: 16K
       AA 25 23 A4 A7 A9 68 0A EF 22 CE 2D A9 00 84 C6>)
(   3,<2025-02-16 14:28:47.73 +0400>,<servis>,<DPX200>,
      <pk PHC0 = -4.6 PHC1 = 0 
       data hash MD5: 16K
       99 73 11 C5 BB 99 07 2F 94 E1 FB F7 56 A1 58 92>)
$$ ##END=
$$ 
$$ hash MD5
$$ 58 C8 AD 7F F4 8F 49 2C 48 AF 9C E0 90 41 E1 09
##$RELAX= 
##$RELAX= 
##$RELAX= 
##$RELAX= 
##$RELAX= 
##$RELAX= 
##$RELAX= 
##$RELAX= 
$$ Bruker specific parameters
$$ --------------------------
##$DU= <F:\spectra>
##$EXPNO= 1
##$NAME= <H1>
##$PROCNO= 1
##$TYPE= <nmr>
##$USER= <av>
##$AMP= (0..31)
100 100 100 100 100 100 100 100 100 100 100 100 100 100 100 100 100 100 
100 100 100 100 100 100 100 100 100 100 100 100 100 100 
##$AQSEQ= 0
##$AQ_mod= 1
##$AUNM= <au_zg>
##$AUTOPOS= <>
##$BF1= 200.13
##$BF2= 200.13
##$BF3= 200.13
##$BF4= 200.13
##$BF5= 500.13
##$BF6= 500.13
##$BF7= 500.13
##$BF8= 500.13
##$BYTORDA= 1
##$CFDGTYP= 0
##$CFRGTYP= 5
##$CHEMSTR= <none>
##$CNST= (0..31)
1 1 145 1 1 1 1 1 1 1 1 1 1 1 1 1 1 1 1 1 1 1 1 1 1 1 1 1 1 1 1 1 
##$CPDPRG= <>
##$CPDPRG1= <>
##$CPDPRG2= <>
##$CPDPRG3= <>
##$CPDPRG4= <mlev>
##$CPDPRG5= <mlev>
##$CPDPRG6= <mlev>
##$CPDPRG7= <mlev>
##$CPDPRG8= <mlev>
##$CPDPRGB= <>
##$CPDPRGT= <>
##$D= (0..31)
0 2 0 0 0 0 0 0 0 0.06 0 0 0 0 0 0 0.0002 0 0 0 0 0 0 0 0 0 0 0 0 0 0 
0 
##$DATE= 1739701703
##$DBL= (0..7)
120 120 120 120 120 120 120 120 
##$DBP= (0..7)
150 150 150 150 150 150 150 150 
##$DBP07= 0
##$DBPNAM0= <>
##$DBPNAM1= <>
##$DBPNAM2= <>
##$DBPNAM3= <>
##$DBPNAM4= <>
##$DBPNAM5= <>
##$DBPNAM6= <>
##$DBPNAM7= <>
##$DBPOAL= (0..7)
0.5 0.5 0.5 0.5 0.5 0.5 0.5 0.5 
##$DBPOFFS= (0..7)
0 0 0 0 0 0 0 0 
##$DE= 6
##$DECBNUC= <off>
##$DECIM= 32
$$ [...]
##$SUBNAM4= <"">
##$SUBNAM5= <"">
##$SUBNAM6= <"">
##$SUBNAM7= <"">
##$SUBNAM8= <"">
##$SUBNAM9= <"">
##$SW= 20.6817932712277
##$SWIBOX= (0..15)
0 0 3 0 0 0 0 0 0 0 0 0 0 0 0 0 
##$SW_h= 4139.07284768212
##$TD= 32768
##$TD0= 1
##$TE= 0
##$TE2= 300
##$TE3= 300
##$TEG= 300
##$TL= (0..7)
0 120 120 120 120 120 120 120 
##$TP= (0..7)
150 150 150 150 150 150 150 150 
##$TP07= 0
##$TPNAME0= <>
##$TPNAME1= <>
##$TPNAME2= <>
##$TPNAME3= <>
##$TPNAME4= <>
##$TPNAME5= <>
##$TPNAME6= <>
##$TPNAME7= <>
##$TPOAL= (0..7)
0.5 0.5 0.5 0.5 0.5 0.5 0.5 0.5 
##$TPOFFS= (0..7)
0 0 0 0 0 0 0 0 
##$TUNHIN= 0
##$TUNHOUT= 0
##$TUNXOUT= 0
##$USERA1= <user>
##$USERA2= <user>
##$USERA3= <user>
##$USERA4= <user>
##$USERA5= <user>
##$V9= 5
##$VALIST= <valist>
##$VCLIST= <CCCCCCCCCCCCCCC>
##$VD= 0
##$VDLIST= <DDDDDDDDDDDDDDD>
##$VPLIST= <PPPPPPPPPPPPPPP>
##$VTLIST= <TTTTTTTTTTTTTTT>
##$WBST= 1024
##$WBSW= 30
##$XGAIN= (0..3)
0 0 0 0 
##$XL= 0
##$YL= 0
##$YMAX_a= 313435
##$YMIN_a= -313285
##$ZGOPTNS= <>
##$ZL1= 120
##$ZL2= 120
##$ZL3= 120
##$ZL4= 120
##$ABSF1= 0
##$ABSF2= 0
##$ABSG= 0
##$ABSL= 0
##$ALPHA= 0
##$AQORDER= 0
##$ASSFAC= 0
##$ASSFACI= 0
##$ASSFACX= 0
##$ASSWID= 0
##$AUNMP= <proc_1d>
##$AZFE= 0.1
##$AZFW= 0.1
##$BCFW= 0
##$BC_mod= 2
##$BYTORDP= 0
##$COROFFS= 0
##$CY= 18.4799938201904
##$DATMOD= 1
##$DC= 0
##$DFILT= <>
##$DTYPP= 0
##$F1P= 9.9274215381318
##$F2P= -0.165520771350173
##$FCOR= 1
##$FTSIZE= 16384
##$FT_mod= 6
##$GAMMA= 0
##$GB= 0
##$INTBC= 1
##$INTSCL= 4.127829e-11
##$ISEN= 128
##$LB= 0.05
##$LEV0= 0
##$LPBIN= 0
##$MAXI= 10000
##$MC2= 0
##$MEAN= 0
##$ME_mod= 0
##$MI= 50
##$NCOEF= 0
##$NC_proc= -6
##$NLEV= 6
##$NOISF1= 3.799351
##$NOISF2= 2.8
##$NSP= 0
##$NTH_PI= 0
##$NZP= 0
##$OFFSET= 16.48848
##$PC= 4
##$PHC0= -267.7254
##$PHC1= 1.301534
##$PH_mod= 1
##$PKNL= yes
##$PPARMOD= 0
##$PSCAL= 4
##$PSIGN= 0
##$REVERSE= no
##$SF= 200.130005582386
##$SI= 16384
##$SIGF1= 3
##$SIGF2= 2
##$SINO= 400
##$SIOLD= 16384
##$SREGLST= <1H.CDCl3>
##$SSB= 0
##$STSI= 16384
##$STSR= 0
##$SW_p= 4139.07284768211
##$SYMM= 0
##$S_DEV= 0
##$TDeff= 32768
##$TDoff= 0
##$TI= <>
##$TILT= no
##$TM1= 0
##$TM2= 0
##$TOPLEV= 0
##$USERP1= <user>
##$USERP2= <user>
##$USERP3= <user>
##$USERP4= <user>
##$USERP5= <user>
##$WDW= 1
##$XDIM= 16384
##$YMAX_p= 323080032
##$YMIN_p= -1147336
$$ End of Bruker specific parameters
$$ ---------------------------------
##NTUPLES= NMR SPECTRUM
##VAR_NAME=  FREQUENCY,     SPECTRUM/REAL,   SPECTRUM/IMAG
##SYMBOL=    X,             R,               I
##VAR_TYPE=  INDEPENDENT,   DEPENDENT,       DEPENDENT
##VAR_FORM=  AFFN,          ASDF,            ASDF
##VAR_DIM=   16384,         16384,           16384
##UNITS=     HZ,            ARBITRARY UNITS, ARBITRARY UNITS
##FACTOR=    0.252644378177508, 1,           1
##FIRST=     3299.83951724647, 0,            0
##LAST=      -839.233330435636, 0,           0
##MIN=       -839.233330435636, -1147336,    0
##MAX=       3299.83951724647, 323080032,    0
$$ Real data points
##PAGE= N=1
##DATA TABLE= (X++(R..R)), XYDATA
$$ [...]
10080E259951j25657j76851J84688M1248l98776l78129m1069l27002j2506l05310
10070C720587k07273N9113m80516p6402O4166j88559J36074m5761k12564j0994
10060B757871k629m917k6590j87340K84799n2489j9299j42402J75784q1281O2045
10049B763552m7537n1329J54679k5492m3796K40407k07906R7848K57242k62235
10039B875433O5315n50K6808K63977n6785m8009j14209L70444q5651N2464L0844
10028C380081j4784N8404J42000n3569P5386J42521J3578Q6552L2568Q8226L7989
10017C988952J57068Q5957O8408J87314q3655J84740K34479L0701J23632P6433
10007E054029M40318n1574N25088j870K74923J60818L19598L08041L27840L42488
$$ plain form
10080 5259951 5134294 4957443 5142131 5183379 4784603 4406474 4365405 4038403 4025897 3720587
10070 3720587 3513314 3572427 3091911 3015509 3079675 2891116 3027190 2981429 2768865 2757871
10060 2757871 2755242 2750325 2723735 2536395 2821194 2768705 2749406 2607004 2782788 2701507 2763552
10049 2763552 2716015 2664686 2819365 2793873 2750077 2990484 2782578 2880426 3137668 2875433
10039 2875433 2940748 2940198 2967006 3230983 3174198 3126189 3011980 3382424 3296773 3349237 3380081
10028 3380081 3365297 3423701 3565701 3512132 3587518 3730039 3743617 3830169 3862737 3950963 3988952
10017 3988952 4146020 4231977 4300385 4487699 4404044 4588784 4823263 4853964 4977596 5054029
10007 5054029 5494347 5442773 5967861 5965991 6240914 6401732 6721330 7029371 7357211 7699699
9997G699699N50379K71292N72956O07371O81781N22960R61246L42884J155250
9988A3365818P63610J347266P53043J241200J080944J306531J619245J523023
9980B3000680K051158K003026K455957K993463L318491M077997M247424M645752
9972D8793948M558058M216225L350232L024572K048888J284191O0872r32595j694722
9963F4709669k929480l404345l576537l596789l172584k075298k029978j402787
9955D2521871m94245J60257P63947J424643J947061K791142L372461L704973M009504
9946F0201614L334820K944105K072728J239893j49432o27859k059045k905380
9938F4051444l978493m793863n216305m785600m789009m340417l739792l501154
$$ plain form
9997 7699699 8250078 8521370 9094326 9701697 10383478 10906438 11867684 12210568 13365818
9988 13365818 14129428 15476694 16229737 17470937 18551881 19858412 21477657 23000680
9980 23000680 25051838 27054864 29510821 32504284 35822775 39900772 44148196 48793948
9972 48793948 53352006 57568231 60918463 63943035 65991923 67276114 67336986 66404391 64709669
9963 64709669 61780189 58375844 54799307 51202518 48029934 45954636 43924658 42521871
9955 42521871 42027626 42187883 42951830 44376473 46323534 49114676 52487137 56192110 60201614
9946 60201614 63536434 66480539 68553267 69793160 69643728 69015869 66956824 64051444
9938 64051444 60072951 55279088 50062783 45277183 40488174 36147757 32407965 28906811
9930B8906811k454178k296945j823757j539683j598360j279734p49324r63599
9922A6201231q19984o34436n57961n94427j62911m10758l90778j93877m78967
9913A1957132k80474l96206k21661m31497k40843l76255l99404n74121m32524
9904H604147n01821j12334k79052j85958j17682k57999J21313n9995j08905m3722
9894G057992N8725K60502r319R1103J74008j38201K58053j77550j53075j10524
9884G311714k76735k78188k57815l62046k00023k83011k07531k61067j59229k58239
9874D767830o442k18901j04625M1045l73349J00533k9571J44588m2681j48159
9864D130268j36638n1172o9212J9637J8483r5903j8762k1957j46575J32931r4092
$$ plain form
9930 28906811 26452633 24155688 22331931 20792248 19193888 17914154 17164830 16201231
9922 16201231 15381247 14746811 14188850 13594423 13431512 13020754 12629976 12436099 11957132
9913 11957132 11676658 11280452 11058791 10627294 10386451 10010196 9610792 9036671 8604147
9904 8604147 8102326 7989992 7710940 7524982 7407300 7149301 7270614 7210619 7101714 7057992
9894 7057992 7116717 7377219 7367900 7459003 7633011 7494810 7752863 7575313 7422238 7311714
9884 7311714 7034979 6756791 6498976 6136930 5936907 5653896 5446365 5185298 5026069 4767830
9874 4767830 4761388 4542487 4437862 4478907 4105558 4206091 4176520 4321108 4278427 4130268
9864 4130268 3993630 3942458 3873246 3892883 3911366 3815463 3796701 3774744 3628169 3761100 3667008
9853C667008M6617K91885j79480q6547j6739o9911Q5680L0820J97733K9051M3113
9842D039230m4083j51044M0752J32984O1775N0028R8189k07918K97995K03820
9832D521728R786j9400J60867q0516K45941Q3818J76458J32212J41047K07584
9822E579525n0251J66826L06352K88519Q3623M10018K65807K71401K87277N41280
9812H150377J02615N48297L73313N56684M53765O29944N57690N20910Q42682R67925
9802A3704202J067348J136273J625601J631978J903325J872507J689075J230004
9794B5860313O74068P14866L12861J77412l40151m65176q97118j435607q53604
9785B3747864o61785n31356o32248J87304J12471K85140L36499Q26450O99943
$$ plain form
9853 3667008 3713625 4005510 3826030 3739483 3722744 3652833 3738513 3769333 3967066 3996117 4039230
9842 4039230 3995147 3844103 3884855 4017839 4079614 4129642 4227831 4019913 4317908 4521728
9832 4521728 4531514 4512114 4672981 4592465 4838406 4922224 5098682 5230894 5371941 5579525
9822 5579525 5529274 5696100 6002452 6290971 6374594 6784612 7050419 7321820 7609097 8150377
9812 8150377 8252992 8801289 9174602 9731286 10185051 10814995 11372685 11893595 12736277 13704202
9802 13704202 14771550 15907823 17533424 19165402 21068727 22941234 24630309 25860313
9794 25860313 26534381 27249247 27562108 27739520 27399369 26934193 26037075 24601468 23747864
9785 23747864 23086079 22554723 21922475 22109779 22222250 22507390 22843889 23670339 24370282
9776B4370282Q95574J340832J671669J444858K114014K805592K916272L587656
9768D1146749L840522L945610L812979L718641L121702K690556J844505N82851
9760F4704115R962r51735j693303k443210l240056l593650l717449l736455l387981
9751D1950238k799025k254779j654332j231514p21822n00702m9682J41259O82946
9742C3562587R43803J224763J763835K359864K971836L470912L854180L907609
9734E4059389K942716K297711J296643M72288k54115q76231j862213k494127l531805
9725E2050256m128891l799902l683311k825733k332881j722069j312414r63646
9717C1281409n17942k46370J73400K08266L02082O65833P98782J053729J239035
$$ plain form
9776 24370282 25265856 26606688 28278357 29723215 31837229 34642821 37559093 41146749
9768 41146749 44987271 48932881 52745860 56464501 59586203 62276759 64121264 64704115
9760 64704115 64714077 63762342 62069039 59625829 56385773 52792123 49074674 45338219 41950238
9751 41950238 39151213 36896434 35242102 34010588 33288766 32788064 32738382 32879641 33562587
9742 33562587 34506390 35731153 37494988 39854852 42826688 46297600 50151780 54059389
9734 54059389 57002105 59299816 60596459 61068747 60814632 59938401 58076188 55582061 52050256
9725 52050256 47921365 44121463 40438152 37612419 35279538 33557469 32245055 31281409
9717 31281409 30763467 30517097 30690497 30898763 31200845 31866678 32665460 33719189 34958224
9708C4958224J489841J804327K238314K617464L149835L605218M646220M855716
9700E9365159N685188N860361N748004M512775L832425K285701J336056J307113
9692H9932782L12122q09243k052799l403516m777554n799275o432792n718071
9684F1251654n465677m866804m015313l383661k776866k119799j696007j278875
9676C5648652j040470o31927j62684j01798M2923O90713J298786J442928K117484
9667C9304607K467411K857683K598436K457566J482876P86968n4139m51911p68638
9658E0680859p85069j667150j850502k710922k733648l132051k942528l207170
9650C1651819k357599k572136k158656j598142j235655j366259j119578j000164
$$ plain form
9708 34958224 36448065 38252392 40490706 43108170 46258005 49863223 54509443 59365159
9700 59365159 65050347 70910708 76658712 81171487 85003912 87289613 88625669 89932782
9692 89932782 90244904 89435661 87382862 83979346 79201792 73402517 66969725 61251654
9684 61251654 55785977 50919173 46903860 43520199 40743333 38623534 36927527 35648652
9676 35648652 34608182 33976255 33813571 33711773 33754696 34445409 35744195 37187123 39304607
9667 39304607 41772018 44629701 47228137 49685703 51168579 51955547 51901408 51449497 50680859
9658 50680859 49895790 48228640 46378138 43667216 40933568 37801517 34858989 31651819
9650 31651819 29294220 26722084 24563428 22965286 21729631 20363372 19243794 18243630
9642A8243630q78424p37521p43328n13983n57950r43981l66090p99579p58397
9633A1944377o07549l18439p95234k19502p23637j89731l30255l22739l82571
9624H054720j36094k79697j85179j20646k08748q3444J892j70924R9957k47583
9614F724254n5343J06377j13185R920p873k56331M1796q4017k07754j68386m34804
9603E554654L5826l65615j10761k69452M7966m85893m0447j48762J19021j67671
9593D168866J05380k39930N5896j0305J4420l46827N4004J33205j92988M7410
9583C789131L3359k3124j33059j76294J82657p9131k42160K58582r4079j58225
9573C357657j415R2780P2741j63483J56340q8039J03141k8594n851j26337P8098
$$ plain form
9642 18243630 17365206 16627685 15884357 15370374 14812424 13868443 13502353 12702774 11944377
9633 11944377 11336828 11018389 10223155 10003653 9280016 9090285 8760030 8437291 8054720
9624 8054720 7918626 7638929 7453750 7333104 7124356 7040912 7042804 6871880 6971837 6724254
9614 6724254 6668911 6775288 6662103 6672023 6664150 6407819 6449615 6365598 6157844 5989458 5554654
9603 5554654 5590480 5224865 5114104 4844652 4892618 4406725 4366278 4217516 4336537 4168866
9593 4168866 4274246 4034316 4090212 4079907 4094327 3747500 3801504 3934709 3741721 3789131
9583 3789131 3822490 3799366 3666307 3490013 3672670 3593539 3351379 3609961 3515882 3357657
9573 3357657 3356242 3449022 3521763 3358280 3514620 3426581 3529722 3501128 3495277 3368940 3447038
9562C447038J35142l1176k4304k79027L0761J18026j6863O2192k03504K18244
9552C456529j38482M3051R536R367K4320k8071J75931l09036L42531k21239J48324
9541C512761M3218r6418K5082O1974K3491R2092j3838J26936J02047j25839K3714
9530C775220J16766J5508k50100K20943N7217J18842j70537J88077o6245J2089
9520D017780L57068m6519J7580K84858N9276p5997n0167N05879n1218K84311j22685
9509E180166K35606J77942K24502p5736M68111K3276K25479J02226K24565K39256
9499G025393M89426J75833O53809L77949L90626O85189O23132P28742N90784P73400
9489A2514283R64337O00545J008027P75197Q09191L74223M78675L09610Q20056
$$ plain form
9562 3447038 3582180 3551004 3526700 3247673 3278434 3396460 3379597 3441789 3238285 3456529
9552 3456529 3318047 3361098 3370634 3380001 3404321 3376250 3552181 3243145 3585676 3364437 3512761
9541 3512761 3555979 3459561 3484643 3546617 3570108 3662200 3648362 3775298 3877345 3751506 3775220
9530 3775220 3891986 3907494 3657394 3878337 3935554 4054396 3883859 4071936 4005691 4017780
9520 4017780 4374848 4328329 4345909 4630767 4690043 4614046 4563879 5069758 5018540 5302851 5180166
9509 5180166 5415772 5593714 5818216 5742480 6210591 6233867 6459346 6561572 6786137 7025393
9499 7025393 7514819 7690652 8344461 8722410 9113036 9798225 10421357 11150099 11740883 12514283
9489 12514283 13478620 14079165 15087192 15862389 16671580 17045803 17524478 17834088 18654144
9480A8654144M81106O59559P14172Q53432J057124J133877J678797J601693K133308
9471B8967212K558439L163778L389604M317868L864064L145196J838695M72176
9463E1717032n82238q47279j142073l69456K21372R05682J722111K430935K704069
9454E6760155K065898Q70036o13888q90353j933221j369480j028410k03754Q61153
9445E4518136J514935J751252J314352N30210j003835j713032k181239k274195
9437E2456584j591397j31491J29448J166629K082392K468312J643973l97834k167211
9428E5659405l619046m615674n038482m301113l878004l309112k861924k171168
9420B5864882j547225j306605r43804q26142o50738j073629o44463o36417p07745
$$ plain form
9480 18654144 19135250 19794809 20508981 21362413 22419537 23553414 25232211 26833904 28967212
9471 28967212 31525651 34689429 38079033 42396901 46260965 49406161 51244856 51717032
9463 51717032 51134794 50287515 49145442 48775986 48997358 49903040 51625151 54056086 56760155
9454 56760155 58826053 59696089 59082201 58191848 56258627 54889147 53860737 53656983 54518136
9445 54518136 56033071 57784323 59098675 59628885 58625050 56912018 54730779 52456584
9437 52456584 50865187 50733696 50863144 52029773 54112165 56580477 58224450 57826616 55659405
9428 55659405 52040359 47424685 42386203 38085090 34207086 30897974 28036050 25864882
9420 25864882 24317657 23011052 22067248 21241106 20590368 19516739 18872276 18235859 17528114
9411A7528114q73898j081919q76570j147728q70865r51101p42686n74729o19986
9402I788632l91986n54165m39956k98040l29747o7635k92766l18561k04057k88596
9392F603123J63900k23574q3934L4759k37183K28054j62934L05768j67835k94151
9382F165993P0098N3607N7607j77077j00180k07157j03009p3489k10517J67191
9372E643067k38517k71397j77300q203P723r9432K4861Q6365J36553J57633J55618
9361E416971O3555P0872P321L81018j5742K06252Q6077J14977j59475Q3090K6244
9350F281160j26240l61983N623k49599j06492l36422m07337J426l03672J39935
9340D536399k00403m6666M8587j91871M75L7071j1482M1146K86128m7455L20188
$$ plain form
9411 17528114 16654216 15572297 14695727 13547999 12677134 11726033 10983347 10408618 9788632
9402 9788632 9396646 8842481 8402525 8104485 7774738 7707103 7414337 7095776 6891719 6603123
9392 6603123 6767023 6543449 6459515 6494274 6257091 6485145 6322211 6627979 6460144 6165993
9382 6165993 6236091 6289698 6347305 6170228 6070048 5862891 5759882 5686393 5475876 5643067
9372 5643067 5404550 5133153 4955853 4947650 4955373 4855941 4880802 4967167 5103720 5261353 5416971
9361 5416971 5480526 5551398 5558719 5939737 5923995 6130247 6216324 6331301 6171826 6254916 6281160
9350 6281160 6154920 5792937 5798560 5548961 5442469 5106047 4698710 4700136 4396464 4536399
9340 4536399 4335996 4289330 4337917 4146046 4146521 4183592 4172110 4213256 4499384 4451929 4772117
9329D772117l59862K18899K4372Q6844N9427l6750m2981j9524j1753k54472k58051
9318D178266o7699j22751P8513j75335R452m7712m42245K05534J52781k6191r6400
9307C646213o5373P0721J01886j26349M6500L1409N4705n5115K13151j78889O6678
9296C805537L910J60749k6885J05061k3574j7984Q4665j81761J61032l0087K18959
9285D259622J8800j21871J12683J76571j05939K0561L58037l08785L52465Q3732
9275D845876J26090p0483K32674J17812K7648R9535K11102J49758J42687K04936
9265F087635o7008n448M96723K4066K25083Q3098K54711L43777J84779L12857
9255G940273M72204R0800N39503M70018M68771O09734L49261O58705Q36387N78061
$$ plain form
9329 4772117 4412255 4631154 4655526 4742370 4801797 4765047 4722066 4702542 4690789 4436317 4178266
9318 4178266 4110567 3987816 4066329 3890994 3900446 3852734 3410489 3616023 3768804 3742613 3646213
9307 3646213 3580840 3651561 3753447 3627098 3673598 3705007 3759712 3704597 3917748 3738859 3805537
9296 3805537 3809447 3970196 3943311 4048372 4024798 4006814 4091479 3909718 4070750 4040663 4259622
9285 4259622 4278422 4156551 4269234 4445805 4339866 4360427 4718464 4409679 4762144 4845876
9275 4845876 4971966 4901483 5134157 5251969 5279617 5379152 5590254 5740012 5882699 6087635
9265 6087635 6020627 6015179 6511902 6535968 6761051 6844149 7098860 7442637 7627416 7940273
9255 7940273 8412477 8503277 9042780 9512798 9981569 10591303 10940564 11599269 12435656 13013717
9245A3013717Q03421Q00190Q68216R18546J081162J232491J091095J423666J604990
9236B2837494J817709K185341K341579K962892L246561L437781L439296K874277
9228D5142930K239739J762827J935419J337435J750559J389549R11007l4550p65688
9219E5669227n13054r03240l59729j24009K18222O61515J469385K398560K675930
9210F1192807L929286M588126N655765O926473P822364Q346260P923461O150826
9202A12535368M128498J896361M33848r33421j503427j982058j981316j896771
9194A10697082j862883j541137k087163k785342l589235m165633m098037m102539
9186H6465113l408510k232997j311406j82975P93785J226311J202766P59043p9887
$$ plain form
9245 13013717 13817138 14617328 15485544 16404090 17485252 18717743 19808838 21232504 22837494
9236 22837494 24655203 26840544 29182123 32145015 35391576 38829357 42268653 45142930
9228 45142930 47382669 49145496 51080915 52418350 54168909 55558458 56469465 56434915 55669227
9219 55669227 55156173 54252933 53893204 53769195 53987417 54648932 56118317 58516877 61192807
9210 61192807 65122093 69710219 75365984 82292457 90114821 98461081 106384542 112535368
9202 112535368 116663866 118560227 118994075 118060654 116557227 114575169 112593853 110697082
9194 110697082 108834199 107293062 105205899 102420557 98831322 94665689 90567652 86465113
9186 86465113 83056603 80823606 79512200 79329225 80123010 81349321 82552087 83311130 83231243
9177H3231243j8258m95825m63883j016638o57755l00857J31795Q87621N01031
9168H1798474p04304k320506m166544n747062o305141o076010n329676m998710
9160D6150521m083226l890648l039100k298345j911746j581088j304050j302002
9152B6740316j325132j135597j436643q79262r35820r54467r60913p72864o55133
9143A7684485p68830l58492n62262j35624m41583k00389m31533m79386p16095
9134A3590291m31412n61328l60416m66123k85175j21566m43113l95778n33139
9125I992241m73851k49575l42787k97023j22070l46478j35817j65893j03703j47424
9115G607620j66706K80943q8982k01853J17117n4133P8634k86979J57760k36269
$$ plain form
9177 83231243 83212985 82717160 82253277 81236639 80578884 80278027 80409822 81297443 81798474
9168 81798474 81094170 78773664 74607120 68860058 62554917 56478907 51149231 46150521
9160 46150521 42067295 38176647 35137547 32839202 30927456 29346368 28042318 26740316
9152 26740316 25415184 24279587 22842944 21963682 21027862 20073395 19112482 18339618 17684485
9143 17684485 16915655 16557163 15994901 15859277 15417694 15217305 14785772 14306386 13590291
9134 13590291 13158879 12597551 12237135 11771012 11485837 11364271 10921158 10525380 9992241
9125 9992241 9518390 9268815 8926028 8629005 8506935 8160457 8024640 7858747 7755044 7607620
9115 7607620 7440914 7721857 7632875 7431022 7548139 7494006 7572640 7285661 7443421 7207152
9105G207152j07402m1851k57091k14276k07351l88741j49703j10380j54940n17882
9095E057535J08682l46374J5839j02257J01937j47301J73683j36159L29724j9752
9085E035557R9541K98797L38304K7238N15358K64630K48971K5410m3711q3034
9075F727061q0386k23442k51781n96536J9301o33239j53433m07622j79439k41290
9065C979194k87416J89410m64098N8890l016P665p743m4488o0045J66687J69769
9054C704809J7017J73352L98058J79400Q7520q9663J0124Q3410l42200J5283l02554
9043C934556l92577k66258n4645j83777k04070l6963r1785j84450R7402r7060
9033B520373J10063j67828L31289l5760o4372j799J37386K17877l1803K83016
$$ plain form
9105 7207152 7099750 7057899 6800808 6586532 6379181 5990440 5840737 5730357 5575417 5057535
9095 5057535 5166217 4819843 4835682 4733425 4835362 4688061 4861744 4725585 5055309 5035557
9085 5035557 5135098 5433895 5772199 5799437 6314795 6579425 6828396 6853806 6810095 6727061
9075 6727061 6646675 6423233 6171452 5574916 5594217 4960978 4807545 4399923 4220484 3979194
9065 3979194 3691778 3881188 3417090 3475980 3472964 3480629 3472886 3428398 3368353 3535040 3704809
9054 3704809 3721826 3895178 4293236 4472636 4560156 4470493 4480617 4564027 4221827 4237110 3934556
9043 3934556 3541979 3275721 3221076 3037299 2833229 2796266 2704481 2520031 2617433 2520373
9033 2520373 2630436 2462608 2793897 2758137 2693765 2691966 2829352 3047229 3015426 3298442
9023C298442O9024N7954P6407K59398n8712q5883K991l90784j05105j27196k66843
9012B729693l12443j64733k05421j64856j04646L9703j49216M8007k24283p1042
9002A420763K209L050L0049j2607N1069R4794k46789r0083K34616N6942P6111
8991A620124m3713M1222j0726M3097N129k39983k45040N1799p7580j30222P5135
8980A089242j85374j43865K2845n3976O1033l17349J12676j7106l7395p5759j20546
8969C34426L13452J25795l31986K36709k4876k30944J45395m3590j68282p8103
8959B77996j21792J97059J36790j13155r3487J39732J21151j96170J81089k50284
8949B78929J83113q3541L3742O0286j19136J79082j49484J70406l05215L3062
$$ plain form
9023 3298442 3367466 3425420 3501827 3761225 3702513 3616630 3619621 3228837 3123732 2996536 2729693
9012 2729693 2417250 2252517 2047096 1882240 1777594 1817297 1668081 1716088 1491805 1420763
9002 1420763 1422972 1426022 1456071 1443464 1494533 1589327 1342538 1252455 1487071 1544013 1620124
8991 1620124 1576411 1617633 1606907 1650004 1655133 1415150 1170110 1221909 1144329 1014107 1089242
8980 1089242 903868 760003 782848 728872 789905 472556 585232 568126 530731 454972 334426
8969 334426 647878 773673 441687 678396 653520 422576 567971 524381 356099 277996
8959 277996 156204 353263 490053 376898 283411 423143 544294 348124 529213 278929
8949 278929 462042 378501 412243 472529 353393 532475 382991 553397 248182 281244
8939B81244j17268J44730o6039o8749l2293P4221m491M9863J10621j97152k111
8928A72576Q4082n624P3303j25096o3499P9531q977M3688j31667K98098k33000
8917A83415J80046k56568N2652K47756j91682l8306l1845j59005L76035m4877
8907C17621J3321r4165l6249J03315K6968r5608J12943l7456J40370q8812K8525
8896C90773J04144K4470j05047Q3770j1352l19235J96153J85884J10254k80922
8886C78892J06688k7643J11898P5456L1937n3229j81691J08357j44848J07298
8876E13115K5649P59p5414J89918j16398O6588j14319J66517p0937K8931O769
8865F21178N6892k00687K55263p3191J23510l33569O0103L0794Q3766q1071K03425
$$ plain form
8939 281244 163976 308706 242667 173918 141625 215846 211355 261218 371839 174687 172576
8928 172576 256658 251034 324337 199241 135742 215273 206296 249984 118317 416415 183415
8917 183415 363461 106893 159545 407301 215619 177313 145468 -13537 362498 317621
8907 317621 330942 236777 200528 303843 330811 235203 348146 310690 451060 362248 390773
8896 390773 494917 519387 414340 498110 486758 167523 363676 549560 659814 378892
8886 378892 485580 457937 569835 645291 677228 623999 442308 550665 405817 513115
8876 513115 538764 539523 464109 654027 537629 604217 489898 656415 585478 614409 621178
8865 621178 678070 477383 732646 659455 782965 449396 509499 540293 624059 542988 746413
8854G46413k11892M5034K96408j95659J5644n8649n6945q0068K99150k25356J00894
8843F74974R1316k55217o1128o7106K52J14632p2923R3580J4998j71454P5473
8832D37397j20406J06946j20092Q3595p1571r8423J10753M7298k6419p6341K50572
8821E23309j5710k86144K28212q6463n2417j45791K1691J26211j14408K81032
8811D79522l16017K47476j00335j84953J91553l4221J30107l9251p9899o3161
8801B30821p7458R5185N9462j75773K47794j74688j69683K57889J1145j59353
8791A45341p910o1863J57039K12101k03001k7428k60169K55162m2888p8121m4192
8780D4071M7984Q0694M1392j11408j02171J05913l0508J121k50513J64440J0117
$$ plain form
8854 746413 534521 579555 875963 680304 695948 637299 580354 500286 799436 574080 674974
8843 674974 766290 511073 449945 382839 383091 497723 424800 518380 533378 361924 437397
8832 437397 316991 423937 303845 387440 315869 217446 328199 375497 349078 272737 523309
8821 523309 507599 221455 449667 363204 310787 164996 186687 312898 198490 479522
8811 479522 163505 410981 310646 125693 317246 283025 413132 373881 293982 230821
8801 230821 153363 248548 308010 132237 380031 205343 35660 293549 304694 145341
8791 145341 137431 75568 232607 444708 241707 214279 -45890 209272 166384 88263 44071
8780 44071 92055 172749 214141 102733 562 106475 75967 77088 -173425 -8985 1132
8769A132M4358p5716K22450j69426J38368j98267j793J51778j68395J86467l02007
8758a71051J94079l3471J39564j82253j6692J2954J07040L1129j02078J10258
8748H9479j41650N9973l1630P7555R4623k42905J53109P824j13518j41124K35157
8737D6893j80526J80632l6761L8622o822K1222N0259j86446j38670J69329p3245
8726a15513J64304L3864l19685M9822L2360J87824N0618j91791l6904P1558K27611
8715A54068j26709J8705N0980j02165j832K160M6565j77894J21325j83589P0670
8704a27716K12615j1958l40578J40499J7418R7057j52172P0512M1602L9676J26922
8693A13877j55317J4707K3037p6872N1504M501k51846R5943O8104R4921K6802
$$ plain form
8769 1132 45490 -30226 192224 22798 161166 -37101 -38894 112884 -55511 130956 -171051
8758 -171051 23028 -10443 129121 -53132 -69824 -56870 50170 81299 -20779 89479
8748 89479 -52171 7802 -23828 53727 148350 -94555 58554 66378 -47140 -188264 46893
8737 46893 -133633 46999 10238 48860 42038 63260 113519 -72927 -211597 -42268 -115513
8726 -115513 48791 82655 -237030 -187208 -154848 32976 83594 -108197 -145101 -73543 154068
8715 154068 27359 46064 97044 -5121 -6953 -4793 41772 -136122 -14797 -198386 -127716
8704 -127716 84899 72941 -267637 -127138 -109720 -12663 -164835 -94323 -52721 -13045 113877
8693 113877 -41440 -26733 -3696 -80568 -29064 -24563 -276409 -180466 -112362 -17441 9361
8682I361P5495l55490K09765l2732O1063J39036r9477Q4226k43172K31380q4159
8671d704p8179j16784l891J19734j8286J18394p1440M5715J09516m7078j37430
8660h4433J17986r5075J7966k9947r6333J87549Q1586j41723o5830O2984Q975
8649c6295k41932K65109k76991J34756J19185k02339Q2611O8872n0983J3070M5245
8638g9692J66101j53332l7656L11987l73803K21110j82268O4369J00950n2251
8628a4485p926L1750k0208J2006M0061n7163O4619q7367j71275K54844o4413k8391
8616d7948N9282m0040r3707O2750P9745j043l627j55178p0353J40613Q3691m4406
8604c0221M8755r3350l1629k4521j4167K1997J153p6848Q1193m5445J30566p2605
$$ plain form
8682 9361 84856 -270634 -60869 -93601 -32538 106498 7021 91247 -151925 79455 -4704
8671 -4704 -82883 -199667 -203558 -83824 -102110 16284 -55156 -9441 100075 52997 -84433
8660 -84433 33553 -61522 -43556 -73503 -169836 17713 99299 -42424 -108254 -45270 -36295
8649 -36295 -278227 -13118 -290109 -155353 -36168 -238507 -155896 -87024 -138007 -124937 -79692
8638 -79692 86409 -66923 -104579 207408 -166395 54715 -127553 -63184 37766 -14485
8628 -14485 -22411 9339 -10869 1137 41198 -15965 48654 -38713 -209988 44856 -19557 -47948
8616 -47948 11334 -28706 -122413 -59663 20082 19039 15412 -139766 -210119 -69506 14185 -30221
8604 -30221 18534 -74816 -106445 -130966 -145133 -123136 -121983 -198831 -117638 -163083 -32517 -105122
8592a05122J84356j43077M590Q1704L0199j53657Q0163k26474Q5966J83867j79926
8581a57411m525J76202j32189Q0437q3880K3611n9269J84768n487J69093l38851
8570a47501J8538l4432J59692J9858J22725k77642P8886j53204O3505l7967O0216
8559a27326L11462j52208K9830k73124N7548Q424J95833m2719q3536p198j41890
8548b24904J70073O9903j34598P3824J53436j06181p4666O7915j04122Q9486K9188
8537I354o9356j23234J8346K73682k3191k33461k36311J91752N76830j63658k4398
8526A96355k8400l34022M4546J21188k66324K04743L5165k8927J25016q9239R993
8515i906j03484J60705j64338J23895J81883k84778Q5892J14883j59170M2193
$$ plain form
8592 -105122 79234 -63843 -59253 22451 52650 -101007 -20844 -247318 -161352 22515 -157411
8581 -157411 -161936 14266 -117923 -37486 -121366 -97755 -157024 27744 22257 191350 -147501
8570 -147501 -128963 -163395 -3703 16155 138880 -138762 -59876 -213080 -149575 -187542 -127326
8559 -127326 184136 31928 61758 -211366 -153818 -145394 50439 7720 -75816 -83014 -224904
8548 -224904 -54831 15072 -119526 -45702 107734 1553 -73113 -5198 -109320 -19834 9354
8537 9354 -60002 -183236 -164890 108792 85601 -147860 -384171 -192419 384411 220753 196355
8526 196355 167955 -166067 -121521 -333 -266657 -61914 -26749 -55676 69340 -19899 -9906
8515 -9906 -113390 47315 -117023 6872 188755 -96023 -10131 104752 -54418 -12225
8505a2225j21313l5066N3249j54079N9344P1132j76246J72059L14791k13638o6214
8494a08206p3080J04410N6721j15313J48990L3411L6235r4382j81074K50408j70455
8483a12335J0820J88924j09513o5729P3903k3725k9821J59514p6240N987q7328
8472f5543j29238K91626l37937J4934P8604m516m4372J50543K37118k68971j62390
8461b40142J41804J49012L6935j43825k4252R4523m2660R7440k26364P7586q5346
8450a65289J4835Q8578R7759K181j07140j75255J48804r0039J06821J8922J50321
8439I0498k41791J34749N1032j22544p6851N5050k4124n5270l2177J41077K49403
8428A69052k45040J70896j14257J47717k13853J5712L0452K5359j40565J79563
$$ plain form
8505 -12225 -133538 -168604 -115355 -269434 -210090 -138958 -315204 -143145 171646 -41992 -108206
8494 -108206 -181286 -76876 -20155 -135468 13522 46933 83168 -11214 -192288 58120 -112335
8483 -112335 -101515 87409 -22104 -87833 -13930 -37655 -67476 92038 15798 21785 -65543
8472 -65543 -194781 96845 -241092 -226158 -147554 -152070 -196442 -45899 191219 -77752 -240142
8461 -240142 -98338 50674 87609 -56216 -80468 14055 -28605 68835 -157529 -79943 -165289
8450 -165289 -150454 -61876 35883 38064 -69076 -244331 -95527 -185566 -78745 -59823 90498
8439 90498 -151293 -16544 34488 -88056 -164907 -109857 -133981 -189251 -221428 -80351 169052
8428 169052 -75988 94908 -19349 128368 -85485 -69773 -39321 -13962 -154527 25036
8418B5036J0855r7392L9662j3345q9752j78590M05522j60660l8233o7406R9029
8407f5274q4365j7095P2242o0333J13476M5061m0414J57135m8486q4207P8233
8396F5973j44285p8113J54067n557L7079o7900J70635k55923n357R1771o5891
8385a03501M5890J11797k19525L5402q666M6903J61223n8085k50937J42834o3167
8374a59832J20097J47464k17357L9485O3360n1349M5950k03728K11647Q0098j88285
8363a12450q0861K58962o3742j77298J91519o0468Q5035j57273J17812j41248
8353a40012O7779P0150k9779R4183j55816n0268J7207k1579m4211L0052M7675
8342a14619M590m7282Q3773J61489J08178l34306J07367q5878J88340p0093K3539
$$ plain form
8418 25036 35891 -61501 -21839 -35184 -124936 -303526 101996 -58664 -96897 -164303 -65274
8407 -65274 -149639 -166734 -94492 -154825 -41349 3712 -36702 120433 71947 -12260 65973
8396 65973 -78312 -156425 -2358 -7915 29164 -38736 131899 -124024 -129381 -37610 -103501
8385 -103501 -57611 54186 -165339 -129937 -138603 -91700 69523 11438 -239499 -96665 -159832
8374 -159832 -39735 107729 -109628 -70143 -6783 -58132 -12182 -215910 -4263 75835 -112450
8363 -112450 -193311 65651 1909 -175389 16130 -44338 40697 -116576 1236 -140012
8353 -140012 -72233 -2083 -31862 62321 -93495 -143763 -126556 -148135 -192346 -162294 -114619
8342 -114619 -110029 -157311 -73538 87951 196129 -138177 -30810 -116688 71652 1559 25098
8331B5098j58876J21386J29774p4638r5719L883M6020J30655k64941j57928J94641
8320a00645Q304J38066j61136N0614M8297P8005q2561p5735m145j4165J05578
8309i523j41734J23187j66146K09923p7831m958P0563N9998q3783R924L4507j0741
8297A3386j30557K42788k11527p0512K01107L235p9011j30178P2789J18268k5300
8286D488K3419j22279O3198p7588L583R5623Q2426j15644j9062J99412k30561
8275i2985J60429m3721J4780o3199J62096j48282m117j02449m876J68988P916
8264E4580p3335n2899Q0818q0843O7704L4922k823N9571r9827M0170M8475q8409
8252a1896R6304n2744p0747O7602J918j17690J02270l7380j28262Q3782L1017
$$ plain form
8331 25098 -133778 -12392 117382 42744 -52975 -49092 -3072 127583 -137358 -295286 -100645
8320 -100645 -92341 45725 -115411 -64797 -16500 61505 -21056 -96791 -100936 -115101 -9523
8309 -9523 -151257 -28070 -194216 15707 -62124 -67082 3481 63479 -20304 -10380 24127 13386
8297 13386 -117171 125617 -85910 -156422 44685 47920 -31091 -161269 -88480 29788 4488
8286 4488 27907 -94372 -31174 -108762 -105179 -9556 72870 -42774 -61836 137576 -92985
8275 -92985 67444 23723 38503 -24696 137400 -10882 -14999 -117448 -122324 46664 54580
8264 54580 -18755 -71654 9164 -71679 -3975 30947 28124 87695 -12132 28038 76513 -11896
8252 -11896 84408 31664 -39083 28519 30437 -87253 15017 -22363 -150625 -66843 -35826
8241c5826J28616J8867j96836Q5428Q6637j17552J4122r8731K33162k11718K06025
8230A12194k71380J99927k3159k2972K5394j57248J19088j85416M39918k53487
8220a7141j16320J92473L8733p8622j28223J60658j07899R1774j24974P2952n8004
8209g4593J01123P9152j0927N7735r6918p8646m574J02228J221J68683n3954n3674
8197A36856L06663j92006P6272L88594Q4100R36530r73245l29099J35812n8310
8187E12167L2570N8535j29325j75096Q7999j34124o4151j39686K48131k13282
8177H3738L32103m54083K68244k10164m5860p1450K53426J4172J02363P3261l21005
8166B4745j69961K48808j48898L11300j54553L957j13418K87160k97699P3304
$$ plain form
8241 -35826 92790 111657 -85179 249 86886 -30666 -16544 -115275 117887 -93831 112194
8230 112194 -159186 40741 17582 -5390 20004 -137244 -18156 -203572 236346 -17141
8220 -17141 -133461 59012 97745 19123 -109100 51558 -56341 35433 -89541 -16589 -74593
8209 -74593 26530 105682 94755 152490 55572 -23074 -27648 74580 75801 244484 190530 136856
8197 136856 443519 251513 327785 716379 800479 1737009 763764 434665 570477 512167
8187 512167 544737 603272 473947 298851 386850 252726 188575 48889 297020 83738
8177 83738 415841 -38242 230002 19838 -26022 -97472 155954 170126 272489 345750 24745
8166 24745 -145216 103592 -45306 265994 111441 115398 1980 289140 -8559 64745
8156F4745Q2087J0218k19116Q58O2474K29666k29205r8904m0397L03372j94347
8145b8549J16241m5116J08596k11150J93835k3967j52290M771j11040J05868r3292
8134a36093K9557N6159p2868m367j3408m2168Q066Q5219J93598k43750K01061
8123F1006j41225P27M7263J13043q8309N3784R5132k79462J29161N2071o9354
8112b6163Q940l75151L35840R2887n9346j20531J62684l7712j53454K27852J37186
8101A93032j20100j46163J38604r8957J29777j60423K08201k02126J73581j98986
8091h3560M18756k94212K1052j0697m0711J7704N8822Q9207j14444l6615q5762
8080f0460R3666q5647k7929L7600k9578j46322Q5160K2091J59831k02222J74852
$$ plain form
8156 64745 146832 157050 -62066 -61208 1266 230932 1727 -97177 -137574 165798 -28549
8145 -28549 87692 42576 151172 -59978 133857 109890 -42400 -37629 -148669 -42801 -136093
8134 -136093 -106536 -50377 -123245 -127612 -141020 -183188 -175122 -89903 103695 -140055 61006
8123 61006 -80219 -79492 -32229 80814 -7495 46289 141421 -138041 -8880 43191 -26163
8112 -26163 -17223 -392374 -56534 36353 -22993 -143524 19160 -18552 -172006 55846 193032
8101 193032 72932 -73231 65373 -33584 96193 -64230 143971 -58155 115426 -83560
8091 -83560 335196 40984 62036 51339 10628 28332 87154 176361 61917 25302 -60460
8080 -60460 33206 -52441 -80370 -42770 -72348 -218670 -133510 -111419 48412 -153810 21042
8069B1042J66699m8242j77206J06047N2620q7429r9734N1107Q2597l6840m3242
8058a2581J08491k4635j6266j08097R2165K6194J77372m9463j45553j20051P5817
8047C393j10387L2505l6764J19182L1471N7676j88655J35394j41831Q9599L8030
8036B9613P4818j55845n7872j06771J03249J11281M0399j89032J46239j80996
8026a84917K27722j29601Q5797r9201l7156Q6543J79074l0265L0738k88353J88291
8015B8672O16J53584j77488J55189m28148J60409O7166J22450j7707k08796J56380
8004A2327k02244L72410j64518N0512r1770O900o1762J38871j39160J53817J4719
7993I0102j07223p5885Q797r7496K80094k28038Q6054j226l1077O8487J80721
$$ plain form
8069 21042 187741 139499 -37707 68340 120960 33531 -66203 -15096 67501 30661 -12581
8058 -12581 95910 71275 55009 -53088 39077 65271 242643 193180 47627 -72424 3393
8047 3393 -106994 -74489 -111253 7929 39400 97076 -91579 43815 -98016 -8417 29613
8036 29613 104431 -51414 -109286 -216057 -112808 -1527 38872 -150160 -3921 -184917
8026 -184917 42805 -86796 -999 -100200 -137356 -50813 128261 97996 128734 -159619 28672
8015 28672 29288 182872 5384 160573 -267575 -107166 -40000 82450 64743 -144053 12327
8004 12327 -189917 182493 17975 68487 -23283 -16383 -78145 60726 -78434 75383 90102
7993 90102 -17121 -93006 -84209 -181705 98389 -129649 -43595 -44821 -75898 -7411 173310
7982A73310k2096o8194n940J02842j92311k8427k9490J96930q5536k5311r6457
7971h0680r835Q5050r1060J09129j12442M6324R0011k39683K28276l4358J18700
7960A09432j152m9040l15271K61698j03059K22336q4821K0977o9368r9571J02343
7949e496N8498p5846j0547Q6815n0214M4301j16042J65101J492k04384J21457
7938A5135j3286k6636k5307J48928j42085J9580K3323J5117M0887j1221Q5500
7927A29935n8675J9489j79620m7049K41587J17600j87972L6073k18425K24106
7917G7049o6613q3602J8437P9234p9526J3709N3853K7929p7142l3307J38527r6090
7905b7542j29827J80704m5333l851q9353o6890K30246l5354j01901n7123K35846
$$ plain form
7982 173310 151214 83020 77080 179922 -12389 -40816 -70306 126624 41088 15777 -80680
7971 -80680 -90515 -5465 -96525 12604 -99838 -53514 36497 -203186 25090 -9268 109432
7960 109432 108280 59240 -256031 5667 -97392 124944 40123 61100 -8268 -107839 -5496
7949 -5496 53002 -22844 -33391 53424 3210 47511 -68531 96570 98062 -106322 15135
7938 15135 1849 -24787 -50094 98834 -43251 -23671 -348 14769 55656 44435 129935
7927 129935 71260 90749 -88871 -135920 105667 223267 35295 71368 -147057 77049
7917 77049 10436 -73166 -54729 24505 -55021 -41312 12541 40470 -36672 -69979 68548 -27542
7905 -27542 -157369 23335 -21998 -25849 -115202 -182092 48154 12800 -89101 -146224 89622
7894H9622P7211j44618j20523L092M0559J12467R9391k52278J42764K2774L7395
7883A07856Q6704j35070k71545Q1681K24264k9729n9494j92836J17919K1395L034
7872d5821J25898r9507J34483j29590M6361j68081J33695j29975l2434K2280J08603
7861c4088j07243J86122n4922j94402j52253k55035n35515L003849j158715m13904
7851B83894N6280j62424L9239l8044k55565L05681m1025k8875o533J83966l64570
7840b7976J95589M1048L1199j23977J1793J6884j56710Q2591K71741k26442k2195
7829I3545N4664j31444j01962L02526k59838P4247q4197J10000r6862J65320K73
7818A26272j97792K46057k88607R3797R2493Q1688j26447L2661o048K6627j11210
$$ plain form
7894 89622 166833 22215 -98308 -95216 -54657 57810 157201 -95077 47687 70461 107856
7883 107856 194560 59490 -212055 -130374 93890 64161 4667 -188169 -70250 -48855 -45821
7872 -45821 80077 -19430 115053 -14537 31824 -136257 -2562 -132537 -164971 -142691 -34088
7861 -34088 -141331 44791 -10131 -204533 -356786 -611821 -1147336 1856513 697798 283894
7851 283894 340174 177750 216989 178945 -76620 229061 188036 159161 152628 336594 -27976
7840 -27976 167613 208661 239860 115883 127676 144560 -12150 70441 342182 115740 93545
7829 93545 148209 16765 -85197 217329 -42509 31738 -52459 57541 -39321 125999 126272
7818 126272 -71520 174537 -114070 -20273 72220 153908 27461 60122 54074 80701 -30509
7807c0509L0564Q8367j14953L4899M2245K19417o2609j33499r1585j5690P6904
7796D3551q6504L0295L1112l8521j05849K05501m5502J89148j29136j31750P7922
7785D0267P2652j02539l6244J85910Q2827k75116k4186K99474j35960O7250p0582
7774A03753p9017j11174L27111j29518J69682k38190J8239K822j07481J60223
7764A16450k37016K95940m0054p5810j05490k9743J64970J2329j05940J15273
7754A10909n9675Q748J90645j51727j60873J54166j70006K49728l6501k95079
7744a59665J73303R166L1217j61226R1357J16009p2616k967K140J7617J51279
7733A95614j73930o0920K04444J2934j42968J23682j81087M5926J81509k08776
$$ plain form
7807 -30509 55 88422 -26531 8368 50613 270030 207421 73922 -17663 -33353 43551
7796 43551 -42953 -12658 18454 -20067 -125916 79585 34083 223231 94095 -37655 40267
7785 40267 112919 10380 -25864 160046 242873 -32243 -56429 243045 107085 174335 103753
7774 103753 24736 -86438 240673 111155 280837 42647 60886 63708 -43773 116450
7764 116450 -120566 175374 135320 59510 -45980 -75723 89247 101576 -4364 110909
7754 110909 51234 59982 250627 98900 -61973 92193 -77813 171915 135414 -159665
7744 -159665 13638 22804 54021 -107205 -15848 100161 27545 24578 26718 44335 195614
7733 195614 21684 -39236 165208 178142 35174 158856 -22231 23695 205204 -3572
7723c572j7076K8272K00843k33536L6641K92382k65709j45513J68540j30368J54973
7712H5877Q4005k19293L9883N8728j04450P8811J45064j50700O9061N8179j48777
7701c612k8465m7811R1724n038R1187m9964o0089N3341P6486j15987j20506K33841
7689A15107l6405q2274J70016J0890j49221L5938p8417J04680m0445J46594j34704
7678F1759N709M8738K1801k8466P3227j23440J57263j43811n3971K25045j72524
7667G1330J74564j09165l9784J52352k48315P1491j23359M247l1675K06440P4979
7656B03105N003j94186M0126L4853r4518J23215J69883j93677K26437j50760p9112
7645I0369K6296j06128J86647r0888n6771J54742O8560q9906j09906P5080j56411
$$ plain form
7723 -3572 -20648 7624 208467 -25069 11572 303954 38245 -107268 61272 -69096 85877
7712 85877 169882 -49411 -9528 49200 -55250 23561 168625 17925 86986 145165 -3612
7701 -3612 -32077 -79888 11836 6798 97985 48021 -12068 41273 117759 1772 -118734 115107
7689 115107 78702 -3572 166444 177334 28113 64051 -14366 90314 49869 196463 61759
7678 61759 67468 116206 138007 109541 182768 59328 216591 72780 18809 243854 71330
7667 71330 245894 136729 96945 249297 982 72473 -50886 -46639 -78314 128126 203105
7656 203105 208108 13922 54048 88901 -5617 117598 287481 93804 320241 169481 90369
7645 90369 116665 10537 197184 106296 49525 204267 272827 182921 73015 148095 -8316
7634h316Q1305q6284M9532M0337j4906j068J15494N4794l9331k91572M58634j80293
7622A78326J373J44321j28666j02030P0645P7928j03746Q0378J9077n3756j70522
7611A3328L9975K52733j43485P3964P9876k47648J9700J86575k22527r6866J65833
7600A21458j67597l8139M01033j03666k5K2904j21112P1534k0872j10168M9617
7589A04967k1659M5260L297q9181K17646p9471M217r7717Q0875K05661l71541
7578B354J26933J27273p7381Q6086k01676j3971J75501K8846P4254k74613K18131
7567B71737m7601J21387j42726k47665L28955k13103R804J74350Q3051j98045
7557A40144N7636L26437q5159j96045j2364p7672J61665j17398K4132P2773k56170
$$ plain form
7634 -8316 72989 -13295 36237 76574 61668 60600 176094 230888 191557 -100015 358619 178326
7622 178326 179699 324020 195354 93324 163969 241897 138151 218529 237606 183850 13328
7611 13328 53303 306036 162551 236515 316391 68743 88443 275018 52491 -44375 121458
7600 121458 -46139 -84278 316755 213089 213064 235968 114856 186390 165518 55350 104967
7589 104967 83308 128568 131865 42684 260330 180859 185076 87359 168234 373895 2354
7578 2354 129287 256560 179179 265265 63589 49618 225119 253965 328219 53606 271737
7567 271737 224136 345523 202797 -44868 284087 70984 80788 255138 338189 140144
7557 140144 197780 524217 439058 243013 230649 152977 314642 197244 221376 294149 37979
7546C7979J60960J64847n3538m6633k8497K44012j72762j880j530J9335r3248
7535B29045L4516k8101n2580J08583R3423k4835k38818J10316J51346k13765m5831
7524A23299J30444k10565K52996n3063l5633J45095j19473l9531j9459R6344j61048
7513A09406j4810n2258J00220J24720M9878r4475K32450k58110l4909J95077m0405
7502C16784j85788m6642J79224L6489N8018k29932R9220n0624K80963k19102r5088
7491A43522K70883j14679j46424J18455j44648J09069m3170K09546j21486k1591
7481B59477J65387N0852m0298k11009J14110l1282J98778l1371o8044J53991k87472
7470B73119M2726Q8508k4766P0603K0515j24506M0457o5868p481M0930N9484j73002
$$ plain form
7546 37979 198939 363786 310248 263615 235118 479130 306368 304488 302958 322293 229045
7535 229045 263561 235460 182880 291463 384886 360051 121233 231549 382895 169130 123299
7524 123299 253743 43178 296174 243111 207478 352573 233100 193569 174110 270454 109406
7513 109406 94596 42338 142558 267278 317156 222681 455131 197021 162112 357189 316784
7502 316784 130996 84354 263578 300067 358085 128153 227373 176749 457712 238610 143522
7491 143522 414405 299726 153302 271757 127109 236178 193008 402554 281068 259477
7481 259477 424864 475716 435418 224409 338519 307237 506015 474644 406600 560591 273119
7470 273119 315845 404353 379587 450190 470705 346199 386656 320788 313307 354237 413721 240719
7458B40719J28309J11830q6047j1964k07144J01035K809J08121l3739j64437K71596
7447D61088j82303P9693J73603j99845K30790l4653j30569o5865J82124j48219
7437C65844K01835n6275j25641J37657K95487j89212J97147j61129O0122j29122
7427E96713P3287j43563K13994k50711N6204j46023J61125j73169K34721j05533
7417E17045k7964k0282m9610j30429Q5683J61784p6610q9346R9427j07871J59786
7406E21613m4590J01739r4495j13339J67824j9503p4030J89578J22929k06486
7396E51240Q4180j67976R2235J57613j33431k13557K08618o3750J27125j33816
7386E08481Q5538j02060L5718J54008j02858J81193l57158R8163J42544P7415
$$ plain form
7458 240719 369028 480858 394811 382847 175703 276738 279547 387668 353929 189492 461088
7447 461088 278785 358478 532081 332236 563026 528373 397804 331939 514063 365844
7437 365844 567679 511404 385763 523420 818907 629695 826842 665713 725835 596713
7427 596713 670000 526437 740431 489720 545924 399901 561026 387857 622578 517045
7417 517045 489081 468799 419189 288760 374443 536227 459617 370271 469698 361827 521613
7406 521613 477023 578762 484267 370928 538752 519249 445219 634797 757726 551240
7396 551240 635420 467444 559679 717292 583861 370304 578922 515172 642297 508481
7386 508481 594019 491959 527677 681685 578827 760020 402862 501025 643569 720984
7376G20984r8861j53148Q5841K4571p8464J49789o4661m9448k0682J70431q5814
7365F00538l2333P8020J5613J31871r7269q304Q49P7639k31273J16421M8453j02152
7353E98073R5311j81008J77318P3335n4744j83532J08664K32637k1490j62527
7343F82037J93322n2849m3399Q4056j763N9655m2384k4328L0003j6854M3189k223
7331I08462m022Q4465j57193J39745K07504j77568o9860J65295j28675j23034
7321H45119J88469q4060l1703O8142N3520n5280p0196J79550j8704L5249k12944
7310H97162O657Q4639J21745j08350J20062q8845J01038o7188M8009j89546J00972
7299A026355P7426O5865j7740r1671j1230q6161M4653l4759K79926l09236L60437
$$ plain form
7376 720984 622123 468975 554816 579387 500923 650712 586051 536603 515921 686352 600538
7365 600538 568205 646225 661838 793709 696440 688136 688985 766624 535351 651772 700225 598073
7353 598073 693384 512376 689694 763029 708285 524753 633417 866054 844564 682037
7343 682037 875359 822510 779111 863167 861404 921059 878675 854347 884350 867496 910685 908462
7331 908462 904440 988905 831712 971457 1178961 1001393 931533 1096828 968153 845119
7321 845119 1033588 949528 917825 985967 1039487 984207 914011 1093561 1074857 1110106 897162
7310 897162 903819 988458 1110203 1001853 1121915 1033070 1134108 1066920 1114929 925383 1026355
7299 1026355 1103781 1169646 1151906 1060235 1049005 962844 1007497 972738 1252664 943428 1303865
7288A303865r6463o1044p5314O4667P7950N6033m2405k11078J66566l2101M9431
7277A200107j1545m2741n7611K02759k45616K59681j27276n5917J49702n4141
7267A217402j82739M68234k37403n6674K44884k64057J51290l0801n0529J11259
7257A370866l6888P7836j6137q766M7242K4201O4093k19185J15986J26171k59098
7246A286321M65647j81687K9480j46031L20720o9613O8601j9399k66420K75651
7236A763270L928j43265K00924j60120r3006J82954N9963J741p9605o6571J42833
7225A813046j32768J3485J6853O9488N9341Q3939n8629m3142J9038J17496m7222
7214A910925K12599k84444K32347j19702K02974m395j78735O0780R2002j11028
$$ plain form
7288 1303865 1207402 1146358 1071044 1135711 1213661 1269694 1227289 1016211 1182777 1150676 1200107
7277 1200107 1188562 1145821 1088210 1290969 1045353 1305034 1177758 1121841 1271543 1217402
7267 1217402 1034663 1502897 1265494 1208820 1453704 1189647 1340937 1310136 1259607 1370866
7257 1370866 1333978 1411814 1395677 1386911 1434153 1458354 1522447 1303262 1419248 1545419 1286321
7246 1286321 1751968 1570281 1599761 1453730 1774450 1704837 1773438 1754039 1487619 1763270
7236 1763270 1767198 1623933 1824857 1664737 1571731 1754685 1814648 1816389 1736784 1670213 1813046
7225 1813046 1680278 1693763 1710616 1780104 1839445 1923384 1864755 1821613 1840651 1958147 1910925
7214 1910925 2123524 1839080 2071427 1951725 2154699 2150304 1971569 2032349 2124351 2013323
7204B013323n6649K86315j68307P7996N8635L9484j42569K24989o9744j2510Q6251
7193B337214n8378P5708K12755p7983k3773L29366q7245Q7461p8581J8616J26341
7182B861501K00303J30377j75965j0525R0878j9384L00576o1654p5047J82366
7172C423426J47953j17306J00536j42929J24830j6063K12353j63467Q5245O7619
7162C722197J17088j49003n522K64867l5231K26567k16396Q8266J64896O5230
7152D242959m0964j83908K74797r966K72195l2961n7273M4133r6466K23745j46681
7141D489610O7370M0659J91712j60925J18952R6287L16185j39001j155K3729L22768
7130E366191j33478L8498J77919K44476j10201J28613q1588J61256L52056k66813
$$ plain form
7204 2013323 1956674 2242989 2074682 2152678 2211313 2250797 2108228 2333217 2263473 2250963 2337214
7193 2337214 2278836 2354544 2567299 2489316 2465543 2794909 2707664 2795125 2716544 2735160 2861501
7182 2861501 3061804 3192181 3016216 3005691 3096569 3077185 3377761 3316107 3241060 3423426
7172 3423426 3571379 3454073 3554609 3411680 3536510 3520447 3732800 3569333 3654578 3722197
7162 3722197 3839285 3690282 3684760 3949627 3914396 4140963 3924567 4012833 4177729 4242959
7152 4242959 4201995 4018087 4292884 4282918 4555113 4522152 4464879 4509012 4412546 4636291 4489610
7141 4489610 4556980 4597639 4789351 4628426 4747378 4843665 5159850 5020849 5019694 5043423 5366191
7130 5366191 5232713 5271211 5449130 5693606 5583405 5712018 5630430 5791686 6143742 5876929
7120E876929J70184K93597K6185R6169j0980J97339Q7722N31243K0326j46011
7110G142703L30936J70633K08022N4029L55113J76693K01214J76540L24114J08879
7100I248876K14911M23510K49022M68960K85453O07461K96713L46396M04033L77163
7090A2922498O22073J95322L78732N47176N56494O63380Q83089P33153R62765
7081A8464682J038970J055279J375942J722416J894132K066207K536817L043237
7073C3197682L624996L956496M610005M594010L356456J781777J835953K846018
7065E9803393K989804L836737M552286N989855O658323Q045089J1174011J2115550
7057A15165048J4352586K0161910J9241393K9878848M5835370M0050231L2579979
$$ plain form
7120 5876929 6047113 6340710 6366895 6463064 6452084 6649423 6737145 7268388 7288714 7142703
7110 7142703 7473639 7644272 7852294 7906323 8261436 8438129 8639343 8815883 9139997 9248876
7100 9248876 9463787 9887297 10136319 10605279 10890732 11498193 11794906 12141302 12545335 12922498
7090 12922498 13544571 13739893 14118625 14665801 15222295 15885675 16768764 17501917 18464682
7081 18464682 19503652 20558931 21934873 23657289 25551421 27617628 30154445 33197682
7073 33197682 36822678 40779174 45389179 49983189 53339645 55121422 56957375 59803393
7065 59803393 62793197 66629934 71182220 77172075 83830398 91875487 103049498 115165048
7057 115165048 129517634 149679544 168920937 198799785 244635155 284685386 317265365
7050C17265365N814667k8168134j4936604n3082293l7404292k3853778k6373550
7043A39261381k4511974j8593546j2920753q911178p275149n692950m253700l656852
7035E3445279l662199l949946l540647k695301k894121k855030k218423k031415
7027B9598197j913774j491977j458720j261768j061221j095663j188138r28347
7019A9198589j104372j048608q40067q79539n88098o18887o90015n28353m84414
7010A2416236l36240o55724k94718m23829l29727m82380l53276l54453l17336
7001H868553l06417j59248l68914k73053j75863k94361k94250j1808k06627k57632
6991F520380j35695k70892j68585q91j56945r5992l1642j55770l3033j24229r8171
$$ plain form
7050 317265365 323080032 294911898 279975294 226893001 189488709 165634931 139261381
7043 139261381 114749407 96155861 83235108 74323930 67048781 61355831 57102131 53445279
7035 53445279 49783080 45833134 42292487 39597186 36703065 33848035 31629612 29598197
7027 29598197 27684423 26192446 24733726 23471958 22410737 21315074 20126936 19198589
7019 19198589 18094217 17045609 16205542 15326003 14737905 14119018 13429003 12900650 12416236
7010 12416236 12079996 11424272 11129554 10705725 10375998 9893618 9540342 9185889 8868553
7001 8868553 8562136 8402888 8033974 7760921 7585058 7290697 6996447 6984639 6778012 6520380
6991 6520380 6384685 6113793 5945208 5944317 5787372 5691380 5659738 5503968 5470935 5346706 5248535
6980E248535k41366p1743J97735m00586J76812l68140j43557K38061k46658J26468
6970D515561n6585j30122j65328M4394L8809k66584m5450J32024p6114j34395
6960C856210r0218k5419J39438k34906K4527j62377J64974k16892J4301j81483
6950C288155M6701r3982J85550j72602l7688q7997J56109k8537j58102Q9706o181
6939C181132k2746J71845k49209L4244Q0859o0430L6553q0804r0543J44405j03362
6928C041944K06117P806J00r5810J70776k30293L5158l6324J892K15701j10112
6917C206955o8538K06267K5916k12691J15981o1526K57449p7060m4095K5530N2933
6906C427121J69901k8673M2809p5873P8473J85840j05320p4268j25240Q2702J67526
$$ plain form
6980 5248535 5007169 4935426 5133161 4732575 4909387 4541247 4397690 4635751 4389093 4515561
6970 4515561 4458976 4328854 4163526 4207920 4246729 3980145 3934695 4066719 3990605 3856210
6960 3856210 3765992 3740573 3880011 3645105 3669632 3507255 3672229 3455337 3469638 3288155
6950 3288155 3334856 3240874 3426424 3253822 3216134 3128137 3284246 3255709 3097607 3187313 3181132
6939 3181132 3158386 3330231 3081022 3115266 3196125 3135695 3172248 3091444 3000901 3145306 3041944
6928 3041944 3248061 3255867 3255967 3160157 3330933 3100640 3135798 3099474 3101366 3317067 3206955
6917 3206955 3138417 3344684 3370600 3157909 3273890 3212364 3469813 3392753 3348658 3374188 3427121
6906 3427121 3597022 3568349 3611158 3535285 3613758 3799598 3694278 3620010 3494770 3577472 3744998
6895C744998Q340j24001M2083L20351j87843J73124N1458J02651j36957l1500
6885C962704K05060J64913j90686M26278k32262L11535j49569k695J76304N4471
6875D726053L5101J21322j1674J50893L0519J26989J74690K10991q1287l5948
6865E447649J65589K78328j62269K94515J48400J22979K14695J46708K70696J88562
6855G115852J49662K62094J09548K26567L22231J17414L83907J53193O1009J69488
6845I070965K41376K38666J80263N37987O401J82092K79109L86387N79182M71060
6835A2173488P11847L62521N32934Q22105N23377Q37134R24256J068561Q29696
6826A8785919R26340J070629J199954Q71184J166490J089030J323198J228978
$$ plain form
6895 3744998 3753338 3629337 3671420 3991771 3803928 3977052 4028510 4131161 3994204 3962704
6885 3962704 4167764 4332677 4141991 4568269 4336007 4647542 4497973 4495278 4671582 4726053
6875 4726053 4761154 4882476 4870802 5021695 5052214 5179203 5353893 5564884 5483597 5447649
6865 5447649 5613238 5891566 5729297 6023812 6172212 6295191 6509886 6656594 6927290 7115852
6855 7115852 7265514 7527608 7637156 7863723 8185954 8303368 8687275 8840468 8901477 9070965
6845 9070965 9312341 9551007 9731270 10269257 10275658 10457750 10736859 11123246 11702428 12173488
6835 12173488 12885335 13247856 13780790 14602895 15126272 15963406 16887662 17956223 18785919
6826 18785919 19712259 20782888 21982842 22854026 24020516 25109546 26432744 27661722
6818B7661722J306726J476488J600138J614223J490728J806063J539912J229518
6810C9725518R73269O31139M31622J83401J98768R2799k31981K2443J68092P58940
6800D2954010N57973R40654J080003J359019J428343K028284K161823K148431
6792E4658540K562211K942908L083745L656505M168195M052853M748701M607749
6784H4481407M256660L643075K681283J140125l80299j976391l039584l813089
6776H6993187m167946l728955l882941l259494k881252k149516j473531j433156
6768F4016396l55632l4749M45903P23302J164877J414893J916869K297091K641125
6759G4230075L097679L584605L704022L744357L755965K721182J730484K91183
$$ plain form
6818 27661722 28968448 30444936 32045074 33659297 35150025 36956088 38496000 39725518
6810 39725518 40698787 41329926 41761548 41944949 42143717 42236516 42004535 42026978 42195070 42954010
6800 42954010 43511983 44452637 45532640 46891659 48320002 50348286 52510109 54658540
6792 54658540 57220751 60163659 63247404 66903909 71072104 75124957 79873658 84481407
6784 84481407 88738067 92381142 95062425 96202550 95822251 93845860 90806276 86993187
6776 86993187 82825241 79096286 75213345 71953851 69072599 66923083 65449552 64016396
6768 64016396 63660764 63626015 64071918 64795220 65960097 67374990 69291859 71588950 74230075
6759 74230075 77327754 80912359 84616381 88360738 92116703 94837885 96568369 96859552
6751I6859552j292212l007557m120814m914883n227166n187620n266685m464363
6743F3378252l976485l325993l192728k392505k096784j778043j410490q23566
6735D4381658j002294p32917m59737o09386l08283j10352K4460N4523Q7084O1646
6725D1386402k35879l71755p60718j176636j515917j713641j968529k099656k092232
6716B9451439k004064j885061j459905j325366j477312j266065j363117q29382
6708A7841167j163357o94089j012502n18273o98651p67048n03958p17240n66266
6699A1199783o25217l74317o45772l59586m06163l12111n49636l65486k33907
6690G327588k67574m51920l5169l17981j17819k62294L6454n18448k6850k26290
$$ plain form
6751 96859552 95567340 92559783 88438969 83524086 78296920 73109300 67842615 63378252
6743 63378252 59401767 56075774 52883046 50490541 48393757 46615714 45205224 44381658
6735 44381658 43379364 42646447 42186710 41577324 41269041 41158689 41183149 41237672 41324756 41386402
6725 41386402 41150523 40778768 40018050 38841414 37325497 35611856 33643327 31543671 29451439
6716 29451439 27447375 25562314 24102409 22777043 21299731 20033666 18670549 17841167
6708 17841167 16677810 15983721 14971219 14452946 13754295 12987247 12483289 11766049 11199783
6699 11199783 10574566 10200249 9554477 9194891 8788728 8476617 7926981 7561495 7327588
6690 7327588 7060014 6608094 6572925 6254944 6137125 5874831 5911285 5392837 5365987 5139697
6680E139697k45449j09891j98446j08073j66128j12233j05826o0978p4915l59364
6670C598394j08045J47629k14590k20576O528M6275j89011o1894j18586O338j13103
6659B779359j47308J34208j94775R8510o0785l06393J27766j78402k2490j32789
6649B096901K61416j06645j85952j76900P3308J36722l10290k0740M5055Q4402
6639A897277k20457p7622J41029r0775R9956k20771o205J20317l18871L9068N0173
6628A413119j16088o751n8156J55055k19534L9157p8997J32995r1238l5673n341
6617A128548p9631J2492o2173r2621J57818K1004Q7231o6645j48251J8988j17897
6606H58863o9746J47432L9154j88507J24232p0262q3663J09927K0934k36601K82240
$$ plain form
6680 5139697 4894248 4784357 4585911 4477838 4311710 4199477 4093651 4032673 3957758 3598394
6670 3598394 3490349 3637978 3423388 3202812 3209340 3255615 3066604 3004710 2886124 2892462 2779359
6659 2779359 2632051 2766259 2571484 2669994 2609209 2302816 2430582 2252180 2229690 2096901
6649 2096901 2358317 2251672 2065720 1888820 1962128 2098850 1788560 1767820 1812875 1897277
6639 1897277 1676820 1599198 1740227 1649452 1749408 1528637 1522432 1642749 1323878 1362946 1413119
6628 1413119 1297031 1290280 1232124 1387179 1167645 1206802 1127805 1260800 1169562 1133889 1128548
6617 1128548 1048917 1061409 999236 906615 1064433 1085437 1172668 1106023 957772 976760 858863
6606 858863 789117 936549 975703 787196 911428 841166 757503 867430 888364 651763 934003
6595I34003k23969l6324k607o6384J56924j4809j77654J49260j5384j67180N4421
6584E90297N7312m8811R084J06831o9816L429N2616j08269q8688R7374r5754J12287
6572F17892o1565k60944K16021J2124r8478K51278o2587p7248l9311O7969j45411
6561D19740J88368n6174M5319k9669k32134O1308K14073j98699j45293L05589
6551E72428r5523J00289l01037M2134l2851K28783k05501l2535J14761j87000
6541B03948R7446j75248K39021r7775J36368K18203l00345j4914J16416j1554
6531D11566o9643J99264j61506l9904k1482P5766J48125j17296r8892L5739J57941
6520E19678k93321M5456J78860Q5566n6602r8276j72686k7616K66929l612N860
$$ plain form
6595 934003 710034 673710 671103 604719 761643 746834 569180 718440 703056 535876 590297
6584 590297 647609 598798 607882 714713 644897 648326 700942 592673 503985 601359 505605 617892
6572 617892 556327 295383 511404 523528 425050 676328 613741 536493 497182 565151 419740
6561 419740 608108 551934 597253 567584 335450 396758 610831 412132 266839 572428
6551 572428 476905 577194 276157 318291 285440 514223 308722 276187 390948 203948
6541 203948 301394 126146 365167 267392 403760 621963 321618 306704 423120 411566
6531 411566 341923 541187 379681 339777 318295 394061 542186 424890 325998 361737 519678
6520 519678 226357 271813 450673 536239 479637 381361 208675 181059 447988 444376 450236
6509D50236k3856o1751K17431k2479j80955K05511o4263k3480J52201j11556P5653
6498F12692J0664Q957J5713m0400J68204j76391m7091P4834q1108m2799l8419
6487D64856j6441R6551j4377l4645J4544n7714J11046j70119M7763J757J7844
6476D61065K73000q8636j60781K31174j51247q3035P2206r6556K5739J73135j88518
6465D67546J50498k32367J18060J93314j87018j26667K18330j76750M9187l4093
6455D40040n0273N8638k0093P6758j9714k57017J72792j14220m7946O0653J93539
6444D93157j64191N1567l6203o1735K3988n0093j3025R5114j50764K8878Q1048
6433B97741l2476j32970J23448n3776j9327l1980m0807L4954J79472j45800R8340
$$ plain form
6509 450236 426380 364629 582060 559581 378626 584137 519874 496394 648595 537039 612692
6498 612692 623356 632313 648026 607626 775830 599439 552348 627182 546074 503275 464856
6487 464856 448415 544966 530589 495944 510488 452774 563820 393701 441464 443221 461065
6476 461065 734065 645429 484648 715822 564575 481540 553746 457190 482929 656064 467546
6465 467546 618044 385677 503737 697051 510033 383366 601696 424946 474133 440040
6455 440040 389767 448405 428312 505070 485356 228339 401131 286911 238965 299618 493157
6444 493157 328966 380533 344330 282595 306583 256490 243465 338579 187815 216693 297741
6433 297741 265265 132295 255743 201967 182640 150660 109853 144807 324279 178479 276819
6422B76819M892k2960k47230L6682M5262J73580k58622J25766K9319P7963k53993
6411a2522K17323J0695j09604P1861j68387j8238q9016o6103L34125k1153j04356
6400D4625J70288k51776K89785k52486m7197r8830L33714r7396m1480p9430J15469
6389H5286N5138j16172j18329L07323k05266j754J40692J11988l02097l5004J37489
6378E9294j60591J09823Q3871k11646P1567l164k8063P1360J3623K2618j00061
6367g1369J76361k29446j5662L57991k11651k3841M7140K14602j72920j32152
6357f0947J06587Q750j56559K75202l24065P8622J07615P3675l4804L0747j04696
6346A27R6556m5056q1656O2565n7320J12286j42534J0100J32512r8178J5853l9399
$$ plain form
6422 276819 281711 258751 11521 48203 93465 267045 8423 134189 163508 241471 -12522
6411 -12522 204801 215496 105892 177753 9366 -8872 -97888 -163991 170134 148981 44625
6400 44625 214913 -36863 252922 436 -46761 -145591 188123 90727 49247 -30183 85286
6389 85286 140424 24252 -94077 213246 7980 6226 146918 258906 -43191 -78195 59294
6378 59294 -101297 8526 92397 -119249 -47682 -50846 -78909 -7549 6074 28692 -71369
6367 -71369 104992 -124454 -140116 217875 6224 -17617 29523 244125 71205 -60947
6357 -60947 45640 54390 -102169 173033 -151032 -72410 35205 108880 74076 104823 127
6346 127 96683 51627 -30029 32536 -24784 87502 -55032 -44932 87580 -10598 5255 -34144
6334c4144p6085L3518M5580J54542j97551o8700J73852o2663n6831J00217j40094
6323a28359J02073r8399K5020J39956r0711P6438j66256J94850j26973j17488
6313a89849K59162r4342j65237J74268n5982L9118m8120l2148L2459P5686j65290
6302a70275l587K24484j35623J27058Q6360j31849L3745k0556L5866J5189k8506
6291C2306j93732K52402o6850O4502l83647J81221J81002n6769p9669J70330n5468
6280D5628j57681J15608p8595K94478l28593P2818J10997k33917P8246n1047K69405
6269A37347J17001l29531J03361j44222N9258j6505j22036P3633J46028j14587
6259i0253P8899J1055k6092o3801J45140p6714J2026R037j54458l1266K27683
$$ plain form
6334 -34144 -110229 -76711 -31131 123411 -74140 -142840 31012 -31651 -88482 11735 -128359
6323 -128359 -26286 -124685 -99665 40291 -50420 26018 -140238 54612 -72361 -189849
6313 -189849 69313 -25029 -190266 -15998 -71980 -32862 -80982 -113130 -80671 -4985 -170275
6302 -170275 -173862 50622 -85001 42057 128417 -3432 30313 9757 45623 60812 32306
6291 32306 -161426 90976 24126 88628 -295019 -113798 67204 10435 -69234 101096 45628
6280 45628 -112053 3555 -75040 219438 -109155 -36337 74660 -159257 -81011 -132058 137347
6269 137347 254348 -75183 28178 -116044 -56786 -73291 -195327 -121694 24334 -90253
6259 -90253 -11354 -299 -26391 -90192 54948 -21766 -9740 -703 -155161 -186427 41256
6248D1256k1013R0387q9601K4988l1034j13340O5087k4480K03407k07415N1537
6237a0221j2712J14119l30732L9115J08714j35337L9859K6418J66790j14116J67035
6226E8932j81520J7317O201J77263k39130J35744j87986J63750q912M8285j31078
6215a41134o5318J50546j36292J25718k090O3686L7601q8433R0586k7840r2331
6204h5301J8724k16670K89307j22431R2052P9099J2666m6842j24362R8028J19941
6193A14211j38071M6518J24860j68708l4889N8310k1894r3178Q9856q6313J05000
6182d298K4816l748j48620J82084o3977j76224J88390l1579j45959R9174L7223
6171d2718L2577j07992K06826j80880J5408o1654Q9991k8180m0892o1432J37516
$$ plain form
6248 41256 20243 110630 21029 46017 14983 -98357 -33270 -57750 145657 -61758 -10221
6237 -10221 -22933 91186 -239546 -200431 -91717 -227054 -187195 -160777 6013 -108103 58932
6226 58932 -122588 -105271 -99070 78193 -160937 -25193 -213179 -49429 -58341 -10056 -141134
6215 -141134 -206452 -55906 -192198 -66480 -68570 -4884 32717 -55716 34870 7030 -85301
6204 -85301 -66577 -283247 6060 -116371 -24319 54780 67446 20604 -103758 -5730 114211
6193 114211 -23860 22658 147518 -21190 -56079 2231 -19663 -112841 -22985 -109298 -4298
6182 -4298 20518 16770 -131850 50234 -13743 -189967 -1577 -33156 -179115 -79941 -42718
6171 -42718 -10141 -118133 88693 -92187 -76779 -138433 -48442 -76622 -117514 -178946 -41430
6160d1430j052L7790j95130K11436J28677k18189j2759J0715R8351j36592L64062
6149B45879j54571k20165J58918N2636O079M0457j57085J87977j28794j72707
6139a41376J98783J27269j0408j92013J11486q7082J84459j40522J3470J7539
6129H1605j65125K16560l8565n781n7384P2718q6421m6233N3998j42410J13599
6118c439p8004K2935K0841k3443J9183J40629j80107L982P119N4915J21595J474
6106A07680j13612j81326J17687J5072j15556M06578j64937m3274K8812r3294
6096c6170J40893j36836R7931l7153j8059q2304k0574M3187R9009k0167O7320
6085I7077j64518P4840P5496l9845m0600J78993j08925p327n4408l2296J14358
$$ plain form
6160 -41430 -42482 -4692 -199822 11614 140291 -77898 -90657 -79942 18409 -118183 245879
6149 245879 91308 -128857 30061 82697 88776 129233 -27852 160125 31331 -141376
6139 -141376 57407 184676 174268 -17745 93741 6659 191118 50596 64066 81605
6129 81605 -83520 133040 94475 88694 31310 104028 17607 -28626 25372 -117038 -3439
6118 -3439 -81443 -58508 -37667 -61110 -41927 98702 -81405 -77423 -70304 -15389 106206 107680
6106 107680 -5932 -187258 -69571 -54499 -170055 236523 71586 28312 57124 -36170
6096 -36170 104723 -32113 65818 28665 10606 -71698 -92272 -49085 49924 29757 97077
6085 97077 -67441 7399 82895 43050 2450 181443 72518 65191 10783 -21513 92845
6074I2845j24942j43025K39564J75549n2953N8458k56037J44257p756J57807k00295
6063H3472J08183k7355r3677M6999j24346J25991l8030l2721m9259J85833m637
6052A80453j23948J90196j13122r1622n8680N3686O6332J5534k8885J4271M9219
6041A53434q6992P0291l16778K82594M1698O582Q101j02207Q0655j83258J76679
6030A30799Q0022J33255j05712j11165M1455j10135j75198K49413j54906R5897
6020G3725Q2266k0452k45060K36404N4672J1586j5953j6695k08378P2472J82394
6009B06981L4775j76879J28630j72630J72569J34989j56871j0116O7445j75173
5999E3720J63957L1680r1504q2708r848J8153p3649J53717O4112k02869J11808
$$ plain form
6074 92845 -32097 -175122 64442 239991 187038 245496 -10541 133716 125960 283767 83472
6063 83472 191655 164300 70623 117622 -6724 119267 81237 48516 -743 185090 180453
6052 180453 56505 246701 133579 41957 -16723 36963 103295 118829 89944 104215 153434
6041 153434 66442 136733 -180045 102549 144247 150829 158930 56723 137378 -45880 130799
6030 130799 210821 344076 238364 127199 168654 58519 -116679 132734 -22172 73725
6020 73725 155991 135539 -109521 126883 181555 193141 177188 160493 -47885 24587 206981
6009 206981 241756 64877 193507 20877 193446 328435 171564 161448 228893 53720
5999 53720 217677 249357 157853 75145 65297 83450 9801 163518 227630 24761 136569
5988A36569P5679L4568j33975L7402m543Q9321J8406k86642J66403l7450j25085
5977b9347n0099Q4737j122K17542k28297J39803j33737N1158J02179K3076O5008
5966B40901J0793j90467j4050J19922k11365M05812k57717J575R5332j38338n5965
5955F433O1488J45493L7380q934j45731L2874q3836K57825r7994q844q4565R5413
5943B07002P5566m15192L02547K9796n8647Q965L5300l8694j62711J70313j5179
5932A39066k14714L46412j72314o8518p0158J95150Q1649J3984j23033p7372K0603
5921G0755J12065r072k7047r9208J09596M1600K3359l13547J24039J60863j07796
5910H5607K03321k30264J16437J03211k57233K15961o0274j44786Q7186j58560
$$ plain form
5988 136569 212248 246816 112841 150243 145700 235021 253427 -33215 133188 95738 -29347
5977 -29347 -79446 5291 4169 221711 -6586 133217 -520 50638 152817 175893 240901
5966 240901 251694 61227 47177 167099 -44266 361546 103829 105404 200736 62398 6433
5955 6433 67921 213414 250794 241860 96129 129003 45167 302992 204998 196154 111589 207002
5943 207002 282568 -132624 169923 199719 141072 150037 185337 146643 -16068 154245 139066
5932 139066 -75648 270764 98450 29932 -40226 154924 236573 250557 127524 50152 70755
5921 70755 182820 173748 146701 47493 157089 198689 222048 -91499 32540 193403 85607
5910 85607 288928 58664 175101 278312 21079 237040 176766 31980 119166 -39394
5900c9394J47046J52865j30123j90590J04620R1544L3647L810J25457k53678n986
5889C9218j7128K46406j57378O6729Q8481j64103p1926m5962J51428j96925J30016
5878F8856J9363n082j32543J51193Q8133M759M2382n1059n3750M6802L0486q5351
5866A24189Q5061n9115k4333l5829J03422J493P4712k16588N9528j2634M7520
5855A47426L1312M776L841j81072l0110M1860K19054j96386l4284K15841q5387
5844A36871J57957j07615j73486o1322K12534k450j6249J5440j67589o5543J59828
5833H8376j13923K19973M7189j28762p6211J64670J7361j93445J23806k747j73752
5822b7465Q2651j69798L11515j00583p5772L243K05487m7084j23548k7428N3188
$$ plain form
5900 -39394 107652 260517 130394 -60196 44424 135968 169615 173425 298882 45204 39218
5889 39218 22090 268496 111118 177847 266328 102225 30299 -15663 135765 -61160 68856
5878 68856 88219 83137 -49406 101787 189920 194679 237061 186002 132252 179054 209540 124189
5866 124189 209250 150135 125802 89973 193395 194888 269600 53012 112540 99906 147426
5855 147426 178738 183514 187355 6283 -23827 18033 237087 40701 6417 222258 136871
5844 136871 294828 187213 13727 -47595 164939 162489 146240 161680 -5909 -71452 88376
5833 88376 -25547 194426 241615 112853 36642 201312 218673 25228 149034 146287 -27465
5822 -27465 55186 -114612 196903 96320 20548 23791 229278 182194 58646 31218 84406
5811H4406q8115J13892J25737j96674n2819L3066J61755j08676j4220k2999l7242
5800a889Q3868o2618M5668J82792j89925l7794J06153j66226J64796M6801K9397
5789B01023j03529k12279J66890Q6629J8356j46052J72378J0637k46098K61058
5779B09013k35305K18593k05267K64345j85882K42316k50887J53192k57320j43178
5769a90380J57535P1685Q4021k59917J52417m9015J78337j68995J05097j64351
5759h3566r542j6378L7779m8482J25090L9286J38013j12751p5735k9266M9812
5748A4260Q8754n23835M50081K5045j39848k2485J23289R8543j14203O5176l1886
5737C2891K9779J58405j89674j5869J11824j6892j84601l1509N0380Q7111J61729
$$ plain form
5811 84406 -3709 110183 235920 39246 -13573 19493 181248 72572 58352 35353 -1889
5800 -1889 81979 19361 65029 247821 57896 20102 126255 -39971 124825 171626 201023
5789 201023 97494 -114785 52105 138734 157090 11038 183416 194053 -52045 209013
5779 209013 -26292 192301 -12966 251379 65497 307813 56926 210118 -47202 -190380
5769 -190380 -32845 38840 122861 -137056 15361 -33654 144683 -24312 80785 -83566
5759 -83566 -93108 -109486 -71707 -120189 4901 44187 182200 69449 -6286 -35552 14260
5748 14260 103014 -420821 29260 54305 -85543 -108028 15261 113804 -399 64777 32891
5737 32891 62670 221075 31401 15532 127356 110464 -74137 -105646 -55266 31845 193574
5726A93574p0021p8675K3342j7861M1510P779O2462l9931l2093l5881L6359j76070
5714h5506R3956N0252L814J32910j89755J20498o2180n9426J770K5506j78921
5703a47082O0336J48705p6319j11196K28065q9181J71239j15911j53278J64805
5693H0183L4330o1954K9830m2038j06633K36689j48311J62495k44996j37700K50287
5682E2182o2887J47173j3518j56973N3851N3713o3207o5206L56627j79647j93198
5671g1090J17401q9839J60845l5216k7634K70799j20438j63891R4906k33579P7123
5660b0613K35199j50411J4167J05246j70652J97027o5645O9912k87883N2435J24680
5649A03462r7787Q6125J12750n8004Q2568k75706L092K43147j42288j73453J60579
$$ plain form
5726 193574 123553 44878 68220 50359 91869 99648 162110 122179 90086 54205 90564 -85506
5714 -85506 8450 58702 62516 195426 5671 126169 63989 4563 6333 31839 -147082
5703 -147082 -86746 61959 -14360 -125556 102509 13328 184567 68656 -84622 80183
5693 80183 114513 52559 82389 40351 -66282 170407 22096 184591 -60405 -198105 52182
5682 52182 -10705 136468 122950 -34023 19828 73541 10334 -54872 301755 122108 -71090
5671 -71090 46311 -43528 117317 82101 54467 325266 204828 40937 135843 -97736 -20613
5660 -20613 214586 64175 78342 183588 12936 209963 144318 214230 -73653 -21218 103462
5649 103462 5675 91800 204550 146546 229114 -46592 -43500 199647 57359 -116094 44485
5638D4485j11750L5547J78956k28002o5247J88037n0208J9062Q034Q6841k41704
5627a35949M08210k47836m3786L0696L3615J11707R282j66045N7759L2217j05375
5616a5505Q0R2402j83704J03642Q804n7928r483l7535K22364j5092K8787j52882
5604a6050j33386N4500J02598R8953K211j01289j08811J47852N8626j26175Q8690
5593F7719q9091N9754j17332J20201j82364R9804j18547J43076n8735J49702l9863
5582C4324r4288L6302k06272K61444o069j1507j47289j3573n3273J24877R4255
5571A8931P4004j41475J05795j20156J7129j52247L3686J41549l8018J30717j7005
5560E2910o2078O0200j57917J34205R5243r7825o4631R3133k9582R7210j96337
$$ plain form
5638 44485 -67265 -31718 147238 -80764 -146011 42026 -8182 10880 18914 105755 -135949
5627 -135949 272261 24425 -19361 11335 44950 156657 165939 -106 57653 89870 -15505
5616 -15505 -15425 76977 -106727 -3085 5719 -52209 -61692 -99227 123137 108045 136832 -16050
5604 -16050 -149436 -94936 7662 106615 108826 7537 -101274 46578 105204 -20971 67719
5593 67719 -21372 38382 -78950 41251 -141113 -41309 -159856 -16780 -75515 74187 34324
5582 34324 -59964 -23662 -229934 31510 25441 13934 -133355 -146928 -200201 -75324 18931
5571 18931 92935 -48540 57255 -62901 -45772 -198019 -164333 -22784 -60802 69915 52910
5560 52910 -9168 51032 -106885 27320 122563 24738 -39893 53240 23658 120868 -75469
5549g5469K33669j33871J41940r8202M8285k7139R0048q7444K9723j58017J50162
5538A13685j51518M9753N8309m1977p0042p430K41462j43986L1936j33202J00620
5527D7610o0266K43115j43734L5319r2391o2930r8001L22789k74789l2144K05185
5516H9763O9742j77805n810o5002R3559J5270j06071R3103j37240O8156j206j8373
5504h1914K81319l82289L07718j49033j77477J48857J83612k38135l6589J89617
5494D5686P0354j21511N805j3971L677j12831M2325n9356Q7663k0569J79801j13719
5482f646O966J6439k2832j1598R6198j53656m156Q2552l7858J22527k2964K46189
5470C11161l28845q0689K59556j8070p2019o2506j14451P913J28022n7325K04412
$$ plain form
5549 -75469 158200 24329 166269 68067 116352 89213 179261 91817 121540 -36477 113685
5538 113685 -37833 11920 70229 28252 -41790 -49220 192242 48256 80192 -53010 47610
5527 47610 -12656 230459 86725 122044 29653 -33277 -131278 191511 -83278 -115422 89763
5516 89763 159505 -18300 -24110 -89112 4447 19717 -86354 6749 -130491 -62335 -63541 -81914
5504 -81914 199405 -182884 124834 -24199 -201676 -52819 130793 -107342 -143931 45686
5494 45686 116040 -5471 334 -13637 -9960 -122791 -80466 -139822 -52159 -72728 107073 -6646
5482 -6646 320 16759 -6073 -17671 78527 -75129 -79285 3267 -34591 87936 64972 311161
5470 311161 -17684 -98373 161183 143113 71094 8588 -105863 -97950 30072 -27253 177159
5459A77159r9801L0280M8398j88741j07183K37486q3334P9574m8238p7996L00
5448c2096K9624m3744l9449J70955j65074Q4718N2249M7095l27938L53708p4275
5437E5773N1158q5690m0341J00188K77544l71875K7503j00741N8053J3750J7114
5426B436J7057l4789R0830m4440p0319O3396k5558r910q5350J60129l3417K39865
5414B69930l13448J92604j71196L2599L8270p0500K00269j40949m3156l0084O4093
5403B8432Q0069j04071n1523J27173l0223N8820N335K1758M0765j81551m9850
5392e4866p2309J23596q3059L09392l46682K00599J07745k61342N1310r512K64689
5381B29561j95618Q8830k0941K16741k18571k6853k1673J59375k65253Q9821j11623
$$ plain form
5459 177159 77358 107638 156036 -32705 -139888 97598 14264 93838 45600 -32396 -32096
5448 -32096 -2472 -46216 -85665 85290 -79784 4934 57183 104278 -223660 130048 55773
5437 55773 106931 21241 -19100 81088 358632 -13243 14260 -86481 -28428 -14678 2436
5426 2436 19493 -15296 75534 31094 -39225 24171 -1387 -11297 -96647 63482 30065 269930
5414 269930 -43518 149086 -22110 10489 48759 -21741 178528 37579 -5577 -35661 28432
5403 28432 108501 4430 -47093 80080 49857 108677 114012 135770 176535 -5016 -54866
5392 -54866 -127175 -3579 -86638 222754 -123928 76671 184416 -76926 -25616 -35128 229561
5381 229561 33943 122773 101832 318573 100002 73149 51476 210851 -54402 35419 -76204
5370g6204K95698k77096J4637Q3803j681N1190R6405n9303k10077J9363o5367
5359a28632J27533r860j06883J23279o6579n497J12015r595m3042J83017k34919
5348e9163J32288K2019N6499k65513M23495l64595R7723P4130j97689J49147j77050
5337a08709J62942q8509O8831J3538O9440k30748J94688R9565j5787k21065O2487
5326F673Q2745N398j04067J50130j44772O4904j5267j1672j11376K17292j90199
5315e0211K30301p9195j04866J15710k11089J09441p5587j38858J497K56805m5073
5304H875Q9362o7771j16263N8627J44951k23916O1335j42744K21368M1337j34795
5293e9634K00137k04442K40005k47633j71687K48052q2085R3595J70922k04314
$$ plain form
5370 -76204 219494 -57602 -42965 40838 39157 90347 186752 127449 -82628 -63265 -128632
5359 -128632 -1099 -10959 -117842 5437 -61142 -66639 45376 35781 -7261 175756 -59163
5348 -59163 73125 95144 151643 -113870 309625 -54970 42753 116883 -80806 68341 -108709
5337 -108709 54233 -34276 34555 48093 117533 -113215 81473 181038 165251 -55814 6673
5326 6673 89418 94816 -9251 140879 -3893 61011 45744 34072 -77304 139988 -50211
5315 -50211 180090 100895 -3971 111739 -99350 10091 -65496 -204354 -202857 53948 8875
5304 8875 98237 30466 -85797 -27170 117781 -106135 -44800 -187544 33824 75161 -59634
5293 -59634 140503 -63939 176066 -71567 -243254 4798 -77287 16308 187230 -17084
5283a7084J39182j40726J05643k02840J59848K2291r8410J57452K2388j38520
5273I224l1013M6008q0802q0472K31467p0868N9983J1887j05982k711Q9594J21849
5261A98164k00327M9463P3715M8804l82097L29009q2767O1213J08680p4392j61255
5250c1790K04483j61386K24786k86651J04791m6132j54435L04028l12172K3657
5240a30821J92886p0881j10217J14352j80087K59779r753o366q6197k2829P3886
5229B3752j44757J1693J55989K5461m6785J0262J15955r7451q9976J89653k00974
5218d7178N2925j53985K17188J23137j17659R023o8260J18540p6759q2959N0973
5207B4986J35030P186j89168O2077J85803j48335J43263j32413n656N8097M4589
$$ plain form
5283 -17084 122098 -18628 87015 -115825 44023 66314 -32096 125356 147744 9224
5273 9224 -21789 24219 -56583 -137055 94412 23544 83527 95414 -10568 -13279 76315 198164
5261 198164 -2163 47300 121015 169819 -212278 116731 33964 95177 203857 129465 -31790
5250 -31790 172693 11307 236093 -50558 54233 8101 -146334 157694 -154478 -130821
5240 -130821 62065 -8816 -119033 -4681 -184768 75011 65258 58892 -27305 -50134 23752
5229 23752 -121005 -109312 46677 72138 25353 35615 151570 54119 -35857 153796 -47178
5218 -47178 5747 -148238 68950 192087 74428 83451 15191 133731 56972 -25987 24986
5207 24986 160016 167202 -21966 40111 225914 77579 220842 88429 82773 140870 185459
5196A85459k46039m4269J90283p0973K1059k114N867J00224k5443O5963L4473
5185B14490j57758j7583m9669J57148N9744O8827j57603O7183L6891n8795j15781
5174D7094p2536K72143j12335J6687p1647K6363j50759L11887k34680J49814j9526
5163A62505k3687k88726K3735O6524L0320m7441N7705K37256j62311q1961M6507
5152B0426r9923K23430j72978M8926J22881k9145k08546K18393k18663N9520J65224
5141A29545j25404J69726k38629R4635P3300j08909J43890K0059j58132Q7731
5131H7812p006q8165J60076N0181j45035J25066k31423P2652J22264M3595p7183
5120A12834q1628L527J05710r9802J45289j68645r777K23854k86964p8646K58769
$$ plain form
5196 185459 -60580 -104849 85434 14461 35520 33406 39273 139497 114054 180017 214490
5185 214490 56732 39149 -10520 146628 206372 275199 117596 184779 221670 162875 47094
5174 47094 -25442 246701 134366 151053 79406 105769 -44990 266897 32217 182031 162505
5163 162505 138818 -149908 -126173 -59649 -29329 -76770 -19065 218191 55880 -26081 20426
5152 20426 -79497 143933 -29045 19881 142762 113617 -94929 123464 -95199 -35679 129545
5141 129545 4141 173867 -64762 29873 103173 -5736 138154 158213 81 87812
5131 87812 80806 -7359 152717 202898 57863 182929 -48494 24158 146422 190017 112834
5120 112834 31206 34733 140443 40641 185930 17285 7508 231362 -55602 -134248 124521
5109A24521J01836j31980K2484j42248J07024o889K7056j59476L09765Q6970j55482
5098A83581j6918k25056J52622j47421k5179M2391K36217k10293K60252k53106
5088b910J85981j41043K77659k85857K56964l08257l8302K0939l7308L1424J60631
5077A19921J01820m1722k14893K50777K3664j26831J6946K0874j00374R4914R637
5066A54733q8474M5784j288J14679j21442N1831k44054L59207m42552K01097M2359
5055G1880j36560Q2921J1690L6853j19462q0285K44581m2876Q711M9961R5067
5044B22481n7650j09140K15873k58633J21030L2438j11799N1380P0051k6725J1125
5033A60431j755j54754J00208J11072j86450J99033j5047j2918j47741k884J41429
$$ plain form
5109 124521 226357 94377 116861 -25387 81637 74748 101804 -57672 252093 339063 183581
5098 183581 166663 -58393 94229 -53192 -78371 -35980 200237 -10056 250196 -2910
5088 -2910 183071 42028 319687 33830 290794 -17463 -55765 -34826 -72134 -40710 119921
5077 119921 221741 180019 -34874 215903 239567 112736 129682 150556 50182 145096 154733
5066 154733 66259 112043 110755 225434 103992 155823 -88231 270976 -171576 29521 71880
5055 71880 -64680 18241 29931 66784 -52678 -132963 111618 68742 77453 127414 222481
5044 222481 164831 55691 271564 12931 133961 166399 54600 105980 176031 149306 160431
5033 160431 158676 3922 104130 215202 28752 227785 212738 199820 52079 49195 190624
5022A90624n4733M4420l7480q2701p6546K21062L5482j62758R9623j98828R3144
5011G1309K14361k06994J90407j94141r1469P1464J74340J5512j16833k00460
5001g2504p949k117L3390J11998J03348k80002J48207J21482j21399o4446J83369
4990A53377r9309N3106r8998R6399r0969l0466K41656j71729r1653M071M6233
4979A1718P5952j6588K01899l5027j3006j60221J76740L0252j27027m654J29073
4968B69111k30458j8390L8610J56179k04657P1196R2527j13450J42963L0425j77473
4957E6583N1474J46502l705k16529J02748J8046M0425O0253j63663L8460l7375
4946I3219K2453j46091K33814k4718j09617l3969K05871n830j63541J47538r3941
$$ plain form
5022 190624 135891 180311 142831 60130 -16416 204646 240128 77370 176993 -21835 71309
5011 71309 285670 78676 269083 74942 -16527 54937 229277 244789 127956 -72504
5001 -72504 -80453 -82570 -49180 62818 166166 -113836 34371 155853 34454 -29992 153377
4990 153377 54068 107174 8176 104575 13606 -16860 224796 53067 -38586 -34515 11718
4979 11718 87670 71082 272981 237954 224948 64727 241467 271719 144692 140038 269111
4968 269111 38653 20263 58873 215052 10395 81591 174118 60668 203631 234056 56583
4957 56583 108057 254559 250854 34325 137073 155119 195544 255797 92134 130594 93219
4946 93219 115672 -30419 203395 178677 69060 35091 240962 235132 71591 219129 125188
4935A25188n4914L9767j19660P255J61641r6965O2483l4957O7022j26842J33129
4924A63147j5931N4837k56j58775m8091J27399L11596k58889m7033m7742L31292
4913D11554k65946j74731K55069j64701K37393O0029j76400k66643L21241K6717
4903B63582r0985j52631O6292N5969o2162K0376J84936k64100R8984Q3301R2064
4892B95626L2582l09264J40560k1138P7429N5863r0964K02695k33241R8150j881
4881B46417j87322J55607j71305L1609J17210n537j3051p0130J73765k75022L24430
4870C26671r9802m3335l7265K48322l06179J57653p8609J289J59213j14019M4671
4859B58610j52794m7030j34711J57008j06557K01420P4675j35824j23615J60301
$$ plain form
4935 125188 70274 110041 -9619 -2364 159277 62312 124795 89838 156860 30018 163147
4924 163147 147216 202053 201797 43022 -5069 122330 433926 175037 128004 80262 411554
4913 411554 145608 -29123 225946 61245 298638 358667 182267 -84376 236865 263582
4903 263582 172597 19966 86258 142227 80065 100441 285377 21277 120261 203562 295626
4892 295626 328208 18944 159504 138366 215795 271658 180694 383389 150148 248298 246417
4881 246417 59095 214702 43397 75006 192216 186679 173628 103498 277263 2241 326671
4870 326671 226869 183534 146269 394591 88412 246065 167456 168745 327958 213939 258610
4859 258610 105816 58786 -75925 81083 -25474 175946 250621 114797 -8818 151483
4849A51483j3907p9212K29069o4780O8189m3643j32766k6822N2254j72238K24315
4838A91942J72526j67724J24040L5931j08652n7483J29660L1604k23005J92861
4828C21700j86058m2196K04930J81689m7655N842j47679m9817N0956M9610k05866
4817A35456q5053J65947j44781L0087J52848J03805k03736J46638j62472J08552
4807B47291R0995j95745Q4808j7809n9511K45267q399j20553m5745J47755j84015
4796A84339J16494J7184j65557J02879Q2486l7395J07475J12152j4129j46642
4786C59286J07775j95232J00668o9128J55048n9747O9689R56L0364j03826P8098
4775D73951j29494J58679J1816J68582J14099J89792k28283P4299n4396j55844
$$ plain form
4849 151483 137576 58364 287433 222653 290842 247199 114433 87611 139865 -32373 191942
4838 191942 364468 196744 320784 356715 248063 190580 320240 351844 128839 321700
4828 321700 135642 93446 298376 480065 432410 438252 290573 240756 291712 341322 135456
4817 135456 50403 216350 71569 101656 254504 358309 154573 301211 138739 247291
4807 247291 338286 142541 227349 209540 150029 395296 386897 266344 220599 368354 184339
4796 184339 300833 318017 152460 255339 337825 300430 407905 520057 505928 359286
4786 359286 467061 271829 372497 303369 458417 398670 468359 469315 499679 395853 473951
4775 473951 344457 503136 514952 683534 797633 987425 759142 833441 779045 623201
4765F23201r1765n8787j01788J98247j57177Q4111j85971J84521r9316R4960Q6472
4754E76708p5240l5984N7217l6217j52020K74009l41684R5909N1071N4783k02470
4743B66082J20759m6275M3348J53861q0744n0245K7231p1319j35901J37024l7176
4732C26645Q7435R9094k12367q741R0533r8617J5729J58348o8039Q0938j59112
4721C11846M6744N5884j3692K49086l54808R5925M4008o6022O9703O025J48367
4710E93066j71885J26401j83987L6514J14319p6865o5417R5173J0315j10247J07325
4699D74712m2955m3544J84757k27631P5830k6412J50357r1817K8667K5395J73726
4688F81085k23321Q1798K5278J23287k02945p905N2241j225J38849p0800J38622
$$ plain form
4765 623201 531436 472649 370861 569108 411931 496042 310071 494592 395276 490236 576708
4754 576708 501468 465484 522701 486484 334464 608473 266789 362698 413769 468552 266082
4743 266082 386841 340566 383914 537775 457031 406786 434017 362698 226797 363821 326645
4732 326645 414080 513174 300807 292066 382599 283982 299711 458059 390020 470958 311846
4721 311846 358590 414474 400782 649868 295060 390985 434993 368971 438674 444699 593066
4710 593066 421181 547582 363595 400109 514428 437563 372146 467319 477634 367387 474712
4699 474712 431757 388213 572970 345339 421169 394757 545114 453297 481964 507359 681085
4688 681085 457764 539562 564840 688127 485182 477277 529518 528293 667142 596342 734964
4677G34964j84159O3213j27132j40738K19389J2746m0233j54719J05174J25995
4667F14500k19478J84054L6387K3776Q7500o5669J03596p4402n718j54791K3043
4656E52798J50909j66571K74236j74040j7804J83120k9175o7824Q3208j53991
4646F34866K61748J24093j48121j95129J38231j34299J41771M7013K02292j35723
4636I36742N6262j02087M3837J05545J66814o3521J27866k46146L21704o0428
4626A286588J66024N0348j80358Q7905J91399j31329l4731O2342r8103J64529
4616A564614k0872j54892M3686n637O7010m2801Q9680j67315J45815P2114p4337
4605A517065j0152N106J52408k2050j18045M04598p6542k1536K49067j42244J43992
$$ plain form
4677 734964 550805 614018 486886 346148 565537 578283 538050 383331 488505 614500
4667 614500 395022 579076 615463 639239 726739 661070 764666 690264 684546 529755 552798
4656 552798 703707 537136 811372 637332 619528 802648 773473 705649 788857 634866
4646 634866 896614 1020707 872586 677457 815688 681389 823160 870173 1072465 936742
4636 936742 993004 890917 934754 1040299 1207113 1143592 1271458 1025312 1347016 1286588
4626 1286588 1452612 1502960 1322602 1410507 1601906 1470577 1435846 1498188 1400085 1564614
4616 1564614 1543742 1388850 1432536 1426899 1493909 1451108 1540788 1373473 1519288 1591402 1517065
4605 1517065 1506913 1512019 1664427 1642377 1524332 1928930 1852388 1830852 2079919 1937675 2081667
4594B081667Q3641p8136J42262J8699p0066l825n9489k02871N0330j85403P7167
4583A853976q3825j01072m8418K5830K0096M942n4548l332N8066R3466R4883l75361
4571A484703J72974l5724J83436q6224J45376j1186Q1832m4847O7738m659q4350
4560A869069n8328P2462j00178q4723p617k0359k262L2741j17672k69929K36153
4549A549357k0441J23936k59693K29808n7364j2335K3930O6494o7320J16891j94838
4538A498425K62595p1369k0240j26333L15776q0651j58761Q5456J00296j68842
4528A636352K2824N4563J39961J12607k93118K45748k71288J33463J07655N3936
4518A942703j56008n2845J91057j5678m4416n8791L3951L83841l67187J85571
$$ plain form
4594 2081667 2165308 2087172 2229434 2248133 2178067 2174242 2114753 1911882 1962212 1776809 1853976
4583 1853976 1770151 1669079 1620661 1646491 1666587 1671529 1616981 1613649 1671715 1765181 1860064 1484703
4571 1484703 1657677 1621953 1805389 1719165 1864541 1853355 1935187 1890340 1958078 1953419 1869069
4560 1869069 1810741 1883203 1783025 1698302 1690685 1670326 1668064 1700805 1583133 1313204 1549357
4549 1549357 1528916 1652852 1393159 1622967 1565603 1553268 1577198 1643692 1576372 1693263 1498425
4538 1498425 1761020 1689651 1669411 1543078 1858854 1778203 1619442 1704898 1805194 1636352
4528 1636352 1659176 1713739 1853700 1966307 1673189 1918937 1647649 1781112 1888767 1942703
4518 1942703 1786695 1733850 1924907 1909229 1864813 1806022 1839973 2223814 1856627 2042198
4508B042198m1293J16633P1480r1366P2520P1385K9367p2589J80087j08795J08196
4497B377823p8750R1009K2423K9181J52568L0945j03293N7153j92605K14217P950
4486B608621J21482K5309o8341N6192J57097J45136r1075J9061J01518Q1q1370
4475B993711J41504J31352P7183j1459J3990J96029M2966m851O9208Q7528m7209
4464C689952n0244Q7183J38855J20642q852N4638J29948K01053q3256K62063o9657
4453D472325J13350J45597r5318J05698J28330k42455K18571N8194J58533L24263
4443E387088j06632K6374O7848K26999k9951K00992L8560J77975J26311O2146
4433F177710J39601K41254J50037k0113K74155K23166J54978o3555M12221N0563
$$ plain form
4508 2042198 2000905 2117538 2189018 2097652 2170172 2241557 2270924 2198335 2378422 2269627 2377823
4497 2377823 2299073 2390082 2412505 2441686 2594254 2625199 2521906 2579059 2386454 2600671 2608621
4486 2608621 2730103 2755412 2687071 2743263 2900360 3045496 2954421 2973482 3075000 3075081 2993711
4475 2993711 3135215 3266567 3343750 3332291 3346281 3542310 3585276 3580425 3649633 3737161 3689952
4464 3689952 3639708 3726891 3865746 3986388 3977536 4032174 4162122 4363175 4279919 4541982 4472325
4453 4472325 4585675 4731272 4635954 4741652 4869982 4627527 4846098 4904292 5062825 5387088
4443 5387088 5280456 5306830 5374678 5601677 5571726 5772718 5811278 5989253 6115564 6177710
4433 6177710 6317311 6558565 6708602 6688489 6962644 7185810 7340788 7277233 7689454 7740017
4423G740017P922K05911O8523K29233K47952K61212K23440L6610J29024K92385
4413I442229K08528J35417N08467M03912K95305K78708N19554K44559K78686N27237
4403A2842602N44126P01033M89641P00134O20950O77716Q78678J191040P20495
4394A9366415R99404J346742J043924J550663J218072J858090J796767J837765
4386C1017842K034458J925349J882773K082509J848898J982331K521156K529968
4378D7825284K977310L438165L750584M284715M826495N283320O009517O476009
4370H4871399P050598P289584P266052O729282N141727K561270P97957j270460
4362A20437409k773726l234126l027087l107187k272534j461584j749673j121230
$$ plain form
4423 7740017 7747939 7953850 8022373 8251606 8499558 8760770 8984210 9020820 9149844 9442229
4413 9442229 9650757 9786174 10294641 10698553 10993858 11272566 11792120 12036679 12315365 12842602
4403 12842602 13386728 14087761 14577402 15277536 15898486 16576202 17454880 18645920 19366415
4394 19366415 20365819 21712561 22756485 24307148 25525220 27383310 29180077 31017842
4386 31017842 33052300 34977649 36860422 38942931 40791829 42774160 45295316 47825284
4378 47825284 50802594 54240759 57991343 62276058 67102553 72385873 78395390 84871399
4370 84871399 91921997 99211581 106477633 113206915 118348642 120909912 121707869 120437409
4362 120437409 117663683 114429557 111402470 108295283 106022749 104561165 102811492 101690262
4354A01690262n26007j99966P06859J304225K431090K933235M364428N308509
4346A18012635O804910P531709R199448J0034579J1497306J3354535J4305713
4339A90740835J4644527J1954179O865444p07767p344301j2117929j5280629j5997513
4331A72756846j4778405j3534047j2152809j0315316q428006o886852n669314
4324A00992097m215993l555820k572480j907915j343252o71837J11245P07082
4316H7543127J406306J713115K541334L146417L237325L441247L333627J675186
4308A08037684M52783k352595m153928o086566p246745p760324p686123p081205
4300F6122981o261490n859641m948142m657790l464621l050679k892499k419790
$$ plain form
4354 101690262 101164255 100964289 101671148 102975373 105406463 108339698 112704126 118012635
4346 118012635 124817545 132349254 141548702 151583281 163080587 176435122 190740835
4339 190740835 205385362 217339541 224204985 223497218 216152917 204034988 188754359 172756846
4331 172756846 157978441 144444394 132291585 121976269 113548263 106661411 100992097
4324 100992097 96776104 93220284 90647804 88739889 87396637 86724800 86836045 87543127
4316 87543127 88949433 90662548 93203882 96350299 99587624 103028871 106362498 108037684
4308 108037684 108490467 106137872 101983944 95897378 88650633 80890309 73204186 66122981
4300 66122981 59861491 54001850 49053708 44395918 40931297 37880618 34988119 32568329
4292C2568329k373999k079798j753071j579802j479670j425537j083922j302281
4284A9490249q84595j087638r07898o27552j040149n05910q57814n29968l29882
4275A2718843o10876m95513m99560n44594l65751n12585l04304k52027n09760
4266H623873l4133m47009j90172m09349j20105l20018j41015j33076l74065p3605
4256F381326l92020K50j80092l17257j31963o1795j94321q7048n9494k54977R1117
4245D793726j73043j10982o4982j62986n0886k53688k5425j49577j03610j96667
4235C501880J26836j59438O7799k78917J5380M3700k2295j51981k22194J01091
4225C021861n7914q6708j1784l5628j27893J400j74798n1948j21782j26128J10698
$$ plain form
4292 32568329 30194330 28114532 26361461 24781659 23301989 21876452 20792530 19490249
4284 19490249 18605654 17518016 16610118 15982566 14942417 14436507 13578693 13048725 12718843
4275 12718843 12107967 11612454 11112894 10568300 10202549 9689964 9385660 9133633 8623873
4266 8623873 8589740 8142731 7952559 7543210 7423105 7103087 6962072 6828996 6454931 6381326
4256 6381326 5989306 5989556 5809464 5492207 5360244 5298449 5104128 5017080 4957586 4702609 4793726
4245 4793726 4620683 4509701 4444719 4281733 4230847 3977159 3951734 3802157 3698547 3501880
4235 3501880 3628716 3469278 3537077 3258160 3273540 3317240 3294945 3142964 2920770 3021861
4225 3021861 2963947 2877239 2865455 2829827 2701934 2703334 2528536 2476588 2354806 2228678 2339376
4214B339376j03634O9840m2568M8382l06910k5874J71826j04618j38418q2694
4204A824708P1391N7508j37738K1980N4267j95852P8804j52438J41024j63057
4194A600597q8N9070j30715n5152k22224J17976J29952k32536K51276j18050k66528
4183A133578R3197N7471j20859j15257K09671j91712K15722j12837J5316J6289
4173A200579p8618k9632j49050J12928p1653K02660j37161J1808J9977k1064j38930
4162I21844m5487P6604k42373O6589q3805k7742J25120j19388J37191P6332k28712
4151F56173Q5739l29706L51094k38053J40833K3269P668J4985J947o919n8990
4140F48040P8863j24102r4640L2321n8470L44310k54182m4038Q5110o0160j9240
$$ plain form
4214 2339376 2235742 2305582 2263014 2311396 2004486 1978612 2150438 2045820 1907402 1824708
4204 1824708 1896099 1953607 1815869 1837849 1892116 1696264 1775068 1622630 1763654 1600597
4194 1600597 1600509 1659579 1528864 1473712 1251488 1369464 1499416 1266880 1518156 1400106 1133578
4183 1133578 1226775 1284246 1163387 1048130 1257801 1066089 1281811 1168974 1184290 1200579
4173 1200579 1121961 1092329 943279 1056207 984554 1187214 1050053 1061861 1081838 1060774 921844
4162 921844 876357 952961 710588 777177 693372 665630 790750 671362 808553 884885 656173
4151 656173 741912 412206 763300 525247 666080 689349 697017 712002 713949 707030 648040
4140 648040 726903 602801 508161 540482 482012 826322 572140 528102 613212 553052 533812
4129E33812L6862J7188K53930k29632J87093j41542l5274N6097M3110P466l4433
4118F94677N1408J4897Q3352o8418q410M8654J52196p9099j30284K79646p0662
4107I67957K6147j6054r784q1676k7815J71698q1757j89014p7467L0277q901j24234
4095E79377J53662N5745k76270J28758Q9528j30750J30143J05747K45410l4344
4085A047006j27940J80105j68189J23022K85741r8401M5287J33883j35820k11567
4075A073127M6197j86613J91498k43991L4978k2349j45347p5947o9767Q5178m9547
4064F37417j05288K35276j10114J1931O4267j38848J83741l01923L12341k14242
4054E74558J56320l1564P9071j65873n6553N5534P9140j20269j86780K95190j31510
$$ plain form
4129 533812 570674 587862 841792 612160 799253 657711 622437 678534 721644 729110 694677
4118 694677 746085 760982 844334 775916 767506 816160 968356 889257 758973 1038619 967957
4107 967957 994104 978050 968266 886590 858775 1030473 948716 759702 682235 712512 703611 579377
4095 579377 733039 788784 512514 641272 730800 600050 730193 835940 1081350 1047006
4085 1047006 919066 1099171 930982 1054004 1339745 1241344 1286631 1420514 1284694 1073127
4075 1073127 1119324 932711 1124209 880218 915196 892847 747500 671553 601786 686964 637417
4064 637417 532129 767405 657291 669222 733489 594641 778382 476459 788800 574558
4054 574558 730878 699314 778385 612512 555959 611493 690633 570364 383584 678774 547264
4043E47264J17762k20187p4110j56174J93405K3849k79542L48959r8808j56660
4033B45758j55391K48461k27117P4644L3632l9715K00888k28208k5910j40684
4023a3642K17129j71530r371O7780o6935J11615j89801J30940j8371J94366k52188
4012hJ4952L4395o2347J55863j3352j37304J35131j85350J41986j63649J31531
4001E1848k1968k4794O4179j19795l40j6534o1894J26971j54013J08278J19555
3990G1493j98529K18315k64569J89487k8615J40164m3584j12336l9807l6307k6422
3979a30710K67984j28803L1092K8739j83386J23531k0533O8993j04649k5897J77638
3968A03999M1313j13362J2792k8217L4458k9418k59248J5827o9906R4685L6280
$$ plain form
4043 547264 665026 444839 370729 214555 407960 431809 152267 501226 402418 245758
4033 245758 90367 338828 111711 186355 219987 180272 381160 152952 127042 -13642
4023 -13642 203487 31957 22586 90366 23431 135046 -54755 76185 57814 252180 -8
4012 -8 14944 49339 -13008 142855 129503 -7801 127330 -58020 83966 -79683 51848
4001 51848 29880 5086 69265 -50530 -50870 -67404 -129298 -2327 -156340 -48062 71493
3990 71493 -127036 91279 -173290 16197 -12418 127746 84162 -28174 -67981 -104288 -130710
3979 -130710 137274 8471 39563 68302 -115084 8447 -12086 56907 -47742 -73639 103999
3968 103999 145312 31950 44742 16525 50983 21565 -237683 -221856 -291762 -197077 -160797
3957a60797J05591J8669j35311k196J20763N2035j08077K41927r0333j18335k8998
3946a05062J10197o692K22200l36039J72303j93000J16304j45774j56449K10842
$$ plain form
3957 -160797 -55206 -36537 -171848 -174044 -53281 -1246 -109323 132604 42271 -76064 -105062
3946 -105062 5135 -1557 220643 -115396 56907 -136093 -19789 -165563 -322012 -111170
$$ [...]
##END NTUPLES=NMR SPECTRUM
##END=
