##TITLE=abcd
##JCAMPDX= 6.0         $$ Bruker NMR JCAMP-DX V2.0
##DATA TYPE= NMR FID
##DATA CLASS= NTUPLES
##ORIGIN= UXNMR, Bruker Analytische Messtechnik GmbH
##OWNER= root
$$ XWIN-NMR		Version 3.5
$$ Thu Jan 30 10:18:21 2025 Russian Standard Time (UT+4h)  servis@DPX200
##.OBSERVE FREQUENCY= 200.131235884673
##.OBSERVE NUCLEUS= ^1H
##.DELAY= (6, 6)
##.ACQUISITION MODE= SIMULTANEOUS
##.ACQUISITION SCHEME= undefined
##.AVERAGES= 32
##.DIGITISER RES= 18
##SPECTROMETER/DATA SYSTEM= spect
##.PULSE SEQUENCE= zg
##.SOLVENT NAME= DMSO
##.SHIFT REFERENCE= (INTERNAL, DMSO, 0, 16.5164)
##AUDIT TRAIL= $$ (NUMBER, WHEN, WHO, WHERE, WHAT)
$$ ##TITLE= Audit trail, XWIN-NMR		Version 3.5
$$ ##JCAMPDX= 5.01
$$ ##ORIGIN= Bruker BioSpin GmbH
$$ ##OWNER= servis
$$ F:\spectra/data/av/nmr/H1/1/audita.txt
$$ ##AUDIT TRAIL=  $$ (NUMBER, WHEN, WHO, WHERE, WHAT)
(   1,<2025-01-30 10:17:13.90 +0400>,<servis>,<DPX200>,
      <created by zg, POWCHK disabled, PULCHK disabled
       configuration hash MD5:
       00 E9 B6 7A A2 85 ED C7 34 08 36 98 17 FE 4E 26
       data hash MD5: 32K
       D4 64 17 7B 47 FB FC 75 64 7F 59 47 D4 D5 F1 88>)
$$ ##END=
$$ 
$$ hash MD5
$$ 73 E5 51 E9 C0 17 F4 8E 64 F4 2F B0 2B 49 6B 23
##$RELAX= 
##$RELAX= 
##$RELAX= 
##$RELAX= 
##$RELAX= 
##$RELAX= 
##$RELAX= 
##$RELAX= 
$$ Bruker specific parameters
$$ --------------------------
##$DU= <F:\spectra>
##$EXPNO= 1
##$NAME= <H1>
##$PROCNO= 1
##$TYPE= <nmr>
##$USER= <av>
##$AMP= (0..31)
100 100 100 100 100 100 100 100 100 100 100 100 100 100 100 100 100 100 
100 100 100 100 100 100 100 100 100 100 100 100 100 100 
##$AQSEQ= 0
##$AQ_mod= 1
##$AUNM= <au_zg>
##$AUTOPOS= <>
##$BF1= 200.13
##$BF2= 200.13
##$BF3= 200.13
##$BF4= 200.13
##$BF5= 500.13
##$BF6= 500.13
##$BF7= 500.13
##$BF8= 500.13
##$BYTORDA= 1
##$CFDGTYP= 0
##$CFRGTYP= 5
##$CHEMSTR= <none>
##$CNST= (0..31)
1 1 145 1 1 1 1 1 1 1 1 1 1 1 1 1 1 1 1 1 1 1 1 1 1 1 1 1 1 1 1 1 
##$CPDPRG= <>
##$CPDPRG1= <>
##$CPDPRG2= <>
##$CPDPRG3= <>
##$CPDPRG4= <mlev>
##$CPDPRG5= <mlev>
##$CPDPRG6= <mlev>
##$CPDPRG7= <mlev>
##$CPDPRG8= <mlev>
##$CPDPRGB= <>
##$CPDPRGT= <>
##$D= (0..31)
0 2 0 0 0 0 0 0 0 0.06 0 0 0 0 0 0 0.0002 0 0 0 0 0 0 0 0 0 0 0 0 0 0 
0 
##$DATE= 1738217833
##$DBL= (0..7)
120 120 120 120 120 120 120 120 
##$DBP= (0..7)
150 150 150 150 150 150 150 150 
##$DBP07= 0
##$DBPNAM0= <>
##$DBPNAM1= <>
##$DBPNAM2= <>
##$DBPNAM3= <>
##$DBPNAM4= <>
##$DBPNAM5= <>
##$DBPNAM6= <>
##$DBPNAM7= <>
##$DBPOAL= (0..7)
0.5 0.5 0.5 0.5 0.5 0.5 0.5 0.5 
##$DBPOFFS= (0..7)
0 0 0 0 0 0 0 0 
##$DE= 6
##$DECBNUC= <off>
##$DECIM= 32
##$DECNUC= <off>
##$DECSTAT= 4
##$DIGMOD= 1
##$DIGTYP= 9
##$DL= (0..7)
0 120 120 120 120 120 120 120 
##$DP= (0..7)
150 150 150 150 150 150 150 150 
##$DP07= 0
##$DPNAME0= <>
##$DPNAME1= <>
##$DPNAME2= <>
##$DPNAME3= <>
##$DPNAME4= <>
##$DPNAME5= <>
##$DPNAME6= <>
##$DPNAME7= <>
##$DPOAL= (0..7)
0.5 0.5 0.5 0.5 0.5 0.5 0.5 0.5 
##$DPOFFS= (0..7)
0 0 0 0 0 0 0 0 
##$DQDMODE= 0
##$DR= 18
##$DS= 0
##$DSLIST= <SSSSSSSSSSSSSSS>
##$DSPFIRM= 0
$$ [...]
##$SUBNAM0= <"">
##$SUBNAM1= <"">
##$SUBNAM2= <"">
##$SUBNAM3= <"">
##$SUBNAM4= <"">
##$SUBNAM5= <"">
##$SUBNAM6= <"">
##$SUBNAM7= <"">
##$SUBNAM8= <"">
##$SUBNAM9= <"">
##$SW= 20.6817932712277
##$SWIBOX= (0..15)
0 0 3 0 0 0 0 0 0 0 0 0 0 0 0 0 
##$SW_h= 4139.07284768212
##$TD= 32768
##$TD0= 1
##$TE= 0
##$TE2= 300
##$TE3= 300
##$TEG= 300
##$TL= (0..7)
0 120 120 120 120 120 120 120 
##$TP= (0..7)
150 150 150 150 150 150 150 150 
##$TP07= 0
##$TPNAME0= <>
##$TPNAME1= <>
##$TPNAME2= <>
##$TPNAME3= <>
##$TPNAME4= <>
##$TPNAME5= <>
##$TPNAME6= <>
##$TPNAME7= <>
##$TPOAL= (0..7)
0.5 0.5 0.5 0.5 0.5 0.5 0.5 0.5 
##$TPOFFS= (0..7)
0 0 0 0 0 0 0 0 
##$TUNHIN= 0
##$TUNHOUT= 0
##$TUNXOUT= 0
##$USERA1= <user>
##$USERA2= <user>
##$USERA3= <user>
##$USERA4= <user>
##$USERA5= <user>
##$V9= 5
##$VALIST= <valist>
##$VCLIST= <CCCCCCCCCCCCCCC>
##$VD= 0
##$VDLIST= <DDDDDDDDDDDDDDD>
##$VPLIST= <PPPPPPPPPPPPPPP>
##$VTLIST= <TTTTTTTTTTTTTTT>
##$WBST= 1024
##$WBSW= 30
##$XGAIN= (0..3)
0 0 0 0 
##$XL= 0
##$YL= 0
##$YMAX_a= 550336
##$YMIN_a= -528379
##$ZGOPTNS= <>
##$ZL1= 120
##$ZL2= 120
##$ZL3= 120
##$ZL4= 120
##$ABSF1= 10
##$ABSF2= 0
##$ABSG= 5
##$ABSL= 3
##$ALPHA= 0
##$AQORDER= 0
##$ASSFAC= 0
##$ASSFACI= 0
##$ASSFACX= 0
##$ASSWID= 0
##$AUNMP= <proc_1d>
##$AZFE= 0.1
##$AZFW= 0.1
##$BCFW= 1
##$BC_mod= 2
##$BYTORDP= 0
##$COROFFS= 0
##$CY= 19
##$DATMOD= 1
##$DC= 2
##$DFILT= <>
##$DTYPP= 0
##$F1P= 11.0000007629395
##$F2P= -0.999999237060547
##$FCOR= 0.5
##$FTSIZE= 0
##$FT_mod= 4
##$GAMMA= 1
##$GB= 1
##$INTBC= 1
##$INTSCL= 1
##$ISEN= 128
##$LB= 0.05
##$LEV0= 0
##$LPBIN= 0
##$MAXI= 10000
##$MC2= 0
##$MEAN= 0
##$ME_mod= 0
##$MI= 0
##$NCOEF= 0
##$NC_proc= 0
##$NLEV= 6
##$NOISF1= 0
##$NOISF2= 0
##$NSP= 1
##$NTH_PI= 0
##$NZP= 0
##$OFFSET= 16.51637
##$PC= 1
##$PHC0= -267.6919
##$PHC1= 5.101537
##$PH_mod= 0
##$PKNL= yes
##$PPARMOD= 0
##$PSCAL= 4
##$PSIGN= 0
##$REVERSE= no
##$SF= 200.13
##$SI= 16384
##$SIGF1= 0
##$SIGF2= 0
##$SINO= 400
##$SIOLD= 16384
##$SREGLST= <1H.CDCl3>
##$SSB= 0
##$STSI= 0
##$STSR= 0
##$SW_p= 4139.07284768211
##$SYMM= 0
##$S_DEV= 0
##$TDeff= 0
##$TDoff= 0
##$TI= <>
##$TILT= no
##$TM1= 0
##$TM2= 0
##$TOPLEV= 0
##$USERP1= <user>
##$USERP2= <user>
##$USERP3= <user>
##$USERP4= <user>
##$USERP5= <user>
##$WDW= 1
##$XDIM= 8192
##$YMAX_p= 0
##$YMIN_p= 0
$$ End of Bruker specific parameters
$$ ---------------------------------
##NTUPLES= NMR FID
##VAR_NAME=  TIME,          FID/REAL,        FID/IMAG
##SYMBOL=    X,             R,               I
##VAR_TYPE=  INDEPENDENT,   DEPENDENT,       DEPENDENT
##VAR_FORM=  AFFN,          ASDF,            ASDF
##VAR_DIM=   16384,         16384,           16384
##UNITS=     SECONDS,       ARBITRARY UNITS, ARBITRARY UNITS
##FACTOR=    0.0002416,     1,               1
##FIRST=     0,             0,               0
##LAST=      3.9581328,     0,               0
##MIN=       0,             -528379,         0
##MAX=       3.9581328,     550336,          0
$$ Real data points
##PAGE= N=1
##DATA TABLE= (X++(R..R)), XYDATA
$$ [...]
$$ plain form
8910 17 -19 13 -75 -108 46 151 -29 -9 -95 -26 53 -17 -26 -56 -45 83 -105 -38 -49 -24 -8 46 74 23 21 -39 -4 -12 5
8939 5 -38 49 -77 -6 9 24 -16 -89 38 60 20 13 -57 -2 -73 34 79 -127 82 39 81 151 -102 11 42 1 121
8966 121 86 -30 114 6 -28 56 -15 18 -75 -44 190 -26 27 -13 -43 -20 -24 -25 -121 23 -12 -24 -108 37 43 36 84 -80
8994 -80 -23 67 -24 -108 16 11 -1 209 1 -21 32 -85 19 45 101 -14 132 9 65 -55 -60 -12 111 50 44 -89
9020 -89 -71 -41 69 115 -58 -17 -27 -17 -16 -38 20 20 58 171 -30 -29 -44 45 -35 -48 46 26 -37 -86 47 102 -20 94
9048 94 14 43 24 19 20 116 -74 30 -25 93 -36 12 77 -11 30 57 95 -124 -2 34 67 -55 60 -49 -27 -99 8
9075 8 2 7 -36 53 -2 -39 92 57 -27 -57 16 -115 81 -40 -66 150 44 104 -14 155 159 16 24 57 -35 -29 62 66 54
9104 54 60 55 29 0 50 -6 -28 -26 59 165 -31 -148 -66 -18 -26 3 8 -53 5 27 32 13 -28 114 -58 -1 10 -12 65 -28 58
$$ packed form
8910A7l6L2q8l3J54J05j80K0q6O9P9p0rl0J1J28j88O7j1K5J6N4K8n1ko0L5qJ7
8939Em3Q7j26P1J5J5m0p3J27K2m0pp0N5p1J07M5k06K09m3M2P0k53J13L1m1J20
8966A21l5j16J44j08l4Q4p1L3r3L1K34k16N3m0l0K3mjr6J44l5j2q4J45OpM8j64
8994h0N7R0r1q4J24nj2K10k08k2N3j17J04K6N6j15J46j23N6j20nM8J23o1oj33
9020h9J8L0J10M6j73M1j0J0Jk2N8%L8J13k01Jj5Q9q0j3R4k0o3m9J33N5j22J14
9048I4q0K9j9nJR6j90J04n5J18j29M8O5q8M1K7L8k19J22L6L3j22J15j09K2p2J07
9075HoNm3Q9n5l7J31l5q4l0P3j31J96j21k6K16j06O0j18J69Mj43QL3r2OR1Mj2
9104E4Onk6k9N0n6k2KQ5J06j96j17Q2M8qK9No1N8K2Nj9m1J42j72N7J1k2P7r3Q6
$$ plain form
9135 58 78 58 83 54 43 -53 69 32 2 70 -36 3 -23 -77 3 140 -101 -36 42 78 2 -59 105 73 -75 30 -32
9162 -32 -42 -62 -35 -27 -63 -12 -11 0 -7 9 92 -15 -143 3 -63 48 54 66 58 -85 -51 88 104 -11 -72 3 38 70 -26
9191 -26 -42 15 48 -11 44 -17 -17 31 56 21 56 -60 74 -22 -12 -19 -50 47 49 -49 -45 62 -6 -92 -43 106 -43 3 30 -30
9221 -30 -66 -38 71 -42 57 -80 -49 -1 -9 -25 -10 -39 5 -100 -46 -5 39 -80 48 8 -38 81 -44 38 -104 1
9247 1 54 98 32 49 4 -27 67 72 -18 37 -66 24 -40 21 -63 76 55 -2 80 28 -65 -97 -17 123 -50 -43 -143 35 112
9276 112 42 -1 -87 42 -17 -92 -82 -8 39 -119 62 2 -34 -77 38 -61 -92 -40 128 52 38 -143 85 59 11 62
9302 62 -15 -3 -14 -3 -165 -14 -119 -69 38 -75 36 50 30 -100 -17 11 -22 -34 41 109 20 -75 88 125 29 -26
9328 -26 -7 72 -7 -84 -139 -45 87 -101 82 -15 123 -6 45 62 -60 38 -43 122 -67 35 -170 49 -7 -28 36
$$ packed form
9135E8K0k0K5k9j1r6J22l7l0O8j06L9k6n4Q0J37k41O5P8L6p6o1J64l2j48J05o2
9162c2j0k0K7Ql6N1JJ1pJ6Q3j07j28J46o6J11OJ2qj43L4J39J6j15o1P5L5L2r6
9191b6j6N7L3n9N5o1%M8K5l5L5j16J34r6J0pl1R7Kr8MJ07o8q6M9J49j49M6K7o0
9221c0l6K8J09j13R9j37L1M8qj6J5k9M4j05N4M1M4j19J28m0m6J19j25Q2j42J05
9247AN3M4o6J7m5l1R4Nr0N5j03R0o4O1q4J39k1n7Q2n2r3l2Q0J40j73Pj00J78P7
9276A12p0m3q6J29n9p5J0P4M7j58J81o0l6m3J15r9l1N2J68p6j4j81K28k6m8N1
9302F2p7J2j1J1j62J51j05N0J07j13J11J4k0j30Q3K8l3j2P5O8q9r5J63L7r6n5
9328b6J9P9p9p7n5R4J32j88J83r7J38j29N1J7j22R8q1J65j89J02k05K19n6k1O4
$$ plain form
9353 36 -9 -69 -60 79 19 -105 -27 59 37 -48 -77 -40 15 97 20 -46 -30 -36 -24 -89 -5 -225 16 57 51 -13 -141 41 2
9382 2 -6 -38 -57 -61 -1 15 -114 19 -51 -113 81 -2 -3 -30 55 89 70 -94 56 -36 7 173 3 -45 7 -105 55 0
9410 0 91 -49 6 2 -74 -37 18 32 47 79 3 -33 -35 -64 35 -112 -46 -35 -8 -117 40 -53 -34 -86 -21 -20 35 45 -63 51
9440 51 106 12 -11 -50 -114 9 -5 115 72 -63 33 -15 15 108 7 -65 -33 19 -68 30 -87 -6 -59 -78 -91 15 2
9467 2 -57 -7 32 31 -89 20 -159 46 -48 57 99 -78 79 -36 41 66 -1 -111 40 -11 83 13 -13 -51 31 76
9493 76 -78 -46 -27 -9 80 -18 164 -46 64 -31 58 67 38 27 -100 -41 -54 -148 -13 7 2 28 -58 -81 -14 15 22 24 -26
9522 -26 66 126 118 -57 0 11 -27 2 56 -105 -27 1 6 67 -80 -10 -18 85 -65 -14 -61 10 75 34 61 -149 -62 59
9550 59 93 -16 -85 -46 -42 107 48 -68 7 -49 -48 -37 5 43 23 -112 -20 -67 67 7 -47 -67 55 -41 150 51 -107
$$ packed form
9353C6m5o0RJ39o0j24P8Q6k2q5k9L7N5Q2p7o6J6oJ2o5Q4k20K41M1oo4j28J82l9
9382Bql2j9mO0J6j29J33p0o2J94q3jk7Q5L4j9j64J50r2M3J66j70m8N2j12J60n5
9410@R1j40N5mp6L7N5J4J5L2p6l6kk9R9j47O6J1K7j09J57r3J9n2O5JN5J0j08J14
9440E1N5r4k3l9o4J23j4J20m3j35R6m8L0R3j01p2L2N2q7R8j17Q1n3j9j3J06j3
9467Bn9N0L9jj20J09j79K05r4J05M2j77J57j15P7K5o7j10J51n1R4p0k6l8Q2M5
9493G6j54L2J9J8Q9r8J82k10J10r5Q9Rk9j1j27N9j3r4J35K0nK6q6k3O7K9PKn0
9522b6R2O0qj75N7J1l8K9N4j61P8K8NO1j47P0qJ03j50N1m7P1O5m1K7k10Q7J21
9550E9L4j09o9L9MJ49n9j16P5n6JJ1M2L8k0j35R2m7J34o0n4k0J22r6J91r9j58
$$ plain form
9577 -107 157 -24 15 47 -54 22 -83 -27 -40 139 -84 83 44 -66 7 -70 60 88 68 41 -49 101 33 38 7
9602 7 -80 -62 -5 67 85 119 -1 -31 -87 -24 43 30 35 23 50 46 -120 28 -42 216 62 -51 -8 -46 -7 101 102 -2
9630 -2 71 49 -8 -30 18 116 -27 5 -92 -3 -11 -120 -84 -17 19 -52 53 -14 -4 -46 85 -14 23 -55 25 19 -77 -9 7 -65
9660 -65 31 25 33 25 -36 -4 70 -24 -68 60 -27 -34 102 30 62 -52 56 6 60 -69 53 89 4 -27 -17 24 -69 73 -36
9689 -36 -21 4 -40 -10 -74 90 5 3 -21 -40 -40 -1 156 -30 -22 27 35 96 -47 79 49 -101 59 94 -98 109 -6
9716 -6 -30 49 75 86 42 12 -50 -41 4 11 -72 16 68 66 33 55 -121 -41 -36 -6 148 -91 73 -4 38 -77 -53 1 -2 5 40
9747 40 27 46 74 -39 43 -36 2 -119 11 -79 -45 46 55 95 -60 156 -21 60 70 -21 -36 67 87 -18 3 -73 25
9774 25 31 5 125 67 45 6 15 59 34 25 50 90 -35 51 29 -18 -129 8 39 31 108 -53 21 -50 -25 158 18 45 -49
$$ packed form
9577a07K64j81L9L2j01P6j05N6j3J79k23J67l9j10P3p7J30K8k0k7r0J50o8Nl1
9602Gq7J8N7P2J8L4j20l0n6O3O7j3Nj2K7mj66J48p0K58j54j13M3l8L9J08Jj04
9630bP3k2n7k2M8R8j43L2r7Q9qj09L6O7L6p1J05o7J0m2J31r9L7p8Q0or6O8J6p2
9660f5R6oQqo1L2P4r4m4J28q7pJ36p2L2j14J08n0N4j29J22L6q5l1J0M1r3J42j09
9689c6J5K5m4L0o4J64q5kk4j9%L9J57j86QM9QO1j43J26l0j50J60L5j92K07j15
9716fk4P9K6J1m4l0o2RM5Pq3Q8N2kl3K2j76Q0NL0J54k39J64p7M2j15K4N4lPL5
9747D0j3J9K8j13Q2p9L8j21J30r0L4R1RM0j55K16j77Q1J0r1j5J03K0j05K1p6R8
9774B5Ok6J20n8k2l9RM4k5rK5M0j25Q6k2m7j11J37L1qP7j61P4p1K5J83j40K7r4
$$ plain form
9803 -49 79 61 67 -148 -108 63 -99 96 30 -27 -55 0 140 -12 19 -112 -20 3 69 -5 -47 31 95 -4 -29 -114 99
9830 99 -88 73 95 39 -12 -82 -107 31 86 82 84 -30 55 -56 -83 21 142 -71 -23 52 10 45 -31 -28 72 -6 -46
9857 -46 -24 46 17 4 23 40 93 -46 37 -23 65 -47 -75 18 -45 -104 -108 -82 -31 26 32 32 -127 41 -40 32 143 25 50
9886 50 6 22 -24 107 -6 46 84 57 -51 28 -50 -35 -96 73 26 50 -8 37 -46 -20 5 -88 -37 -6 -14 70 -11 38 -29
9915 -29 4 -60 49 -5 -84 118 -38 -47 22 30 155 70 -3 -51 76 111 -16 29 -40 -85 32 -13 -145 33 -35 17 46
9942 46 -117 -112 17 -5 117 -59 166 24 67 -73 -89 -9 41 6 -28 47 45 42 25 -88 -27 28 -59 18 -33 35 -5 65
9970 65 -19 -29 101 -10 58 -69 -21 -20 72 127 -47 -4 -27 -84 62 131 40 -38 8 15 -113 -70 88 -81 -47 99 -34
9997 -34 -151 21 -49 -14 -41 52 43 9 24 -37 97 26 -23 -87 117 121 -9 -62 -22 94 35 14 -50 25 30 163 -45 29
$$ packed form
9803d9J28j8Ok15M0J71j62J95o6n7k8N5J40j52L1j31R2K3O6p4m2P8O4r9k5q5K13
9830I9j87J61K2n6n1p0k5J38N5mKj14Q5j11k7J04J21k13M8P5m2L5p6LJ00p8m0
9857d6K2P0k9j3J9J7N3j39Q3o0Q8j12k8R3o3n9mK6N1N7O%j59J68q1P2J11j18K5
9886E0m4J6m6J31j13N2L8k7j08P9p8J5o1J69m7K4n8M5q3K6K5r3N1L1qQ4q1M9o7
9915b9L3o4J09n4p9K02j56rO9QJ25q5p3m8J27L5j27M5o9m5J17m5j32J78o8N2K9
9942D6j63NJ29k2J22j76K25j42M3j40j6Q0N0l5l4P5klj7j13O1N5q7P7n1O8m0P0
9970F5q4j0J30j11O8j27M8JR2N5j74M3k3n7J46O9r1p8M6Pj28M3J58j69L4J46j33
9997c4j17J72p0L5k7R3rl4J5o1J34p1m9o4K04Mj30n3M0J16n9k1o4P5NJ33k08P4
$$ plain form
10025 29 20 -1 71 -24 115 41 48 48 -23 122 43 -42 -63 -60 75 87 50 39 26 -93 -80 26 92 -47 -73 -132 -102 -92 85
10054 85 74 58 -60 -37 17 43 -51 -38 25 14 25 -26 44 93 -108 49 -10 -36 149 27 32 22 -75 22 28 -67 -58 32 45
10083 45 -14 87 -89 -66 60 43 111 15 -1 -12 16 66 -20 135 -41 -6 48 9 80 7 17 -18 48 -5 -48 -22 -154
10110 -154 6 37 95 66 -132 -61 -88 63 -74 22 -37 9 150 -72 1 -101 54 99 -31 34 22 -26 -91 30
10134 30 -23 -45 -101 51 -49 -67 -10 143 -56 24 -47 -59 -24 -16 61 7 104 -9 54 -27 145 22 -57 -42 52 -70
10160 -70 37 27 71 111 -44 140 -73 88 24 106 -10 -76 -83 84 36 38 59 -17 -19 -66 -20 -28 133 -79 12 -85 108
10187 108 7 98 -121 -93 -25 48 175 -65 47 58 -103 89 -11 -37 64 -9 53 -41 -71 108 32 36 -21 -45 22
10212 22 -62 -57 43 51 63 19 -69 99 20 77 -41 9 49 -55 -75 -19 1 -75 42 152 -40 61 49 17 -9 -95 119
$$ packed form
10025B9rk1P2r5J39p4P%p1J45p9q5k1LJ35J2l7j1j3j19J3J06O6j39k6n9L0J0J77
10054H5j1j6j18K3N4K6r4J3O3j1J1n1P0M9k01J57n9k6J85j22Nj0r7R7Or5RR0J3
10083D5n9J01j76K3J26j7O8r6j6j1K8N0q6J55j76L5N4l9P1p3J0l5O6n3m3K6j32
10110a54J60L1N8k9j98P1k7J51j37R6n9M6J41k22P3j02J55M5j30O5j2m8o5J21
10134C0n3k2n6J52j00j8N7J53j99Q0p1j2L5QP7n4R7j13O3q1J72j23p9J5R4j22
10160g0J07j0M4M0j55J84k13J61o4Q2j16o6pJ67m8KK1p6km7M6qJ61k12R1r7J93
10187A08j01R1k19K8O8P3J27k40J12J1j61J92j00k6J01p3O2r4l0J79p6Mn7k4O7
10212B2q4NJ00QJ2m4q8J68p9N7j18N0M0j04k0N6K0p6J17J10j92J01j2l2k6q6K14
$$ plain form
10239 119 96 -47 -14 107 -3 9 3 40 70 22 -116 -78 100 -105 -34 5 -38 7 49 -8 -20 -107 54 -36 92 -37
10265 -37 88 111 -138 -59 -39 -35 -74 -32 9 67 -105 -63 54 33 94 -101 -81 -21 116 40 -25 74 89 67 -15 7 -117
10292 -117 -50 29 26 -58 -78 23 -140 -39 -18 66 34 42 -162 -33 10 118 -71 -21 44 -16 -91 90 -31 116 16
10317 16 -104 0 -110 95 -25 -43 -165 -84 93 -6 -15 128 28 -141 -78 5 87 14 87 -31 -105 40 3 -40
10341 -40 -6 -27 10 -9 -6 80 -62 -81 -25 86 85 -35 102 71 108 -5 -67 9 -11 81 -39 -144 23 33 -7 26 -14
10368 -14 3 73 57 -28 24 42 2 -75 79 -4 18 24 49 35 46 -33 -6 74 65 -12 32 2 -41 127 -16 25 -9 41 -67
10397 -67 -40 120 44 116 -52 0 118 28 -52 34 -116 74 -2 44 86 113 -65 -47 85 105 -127 40 -69 -71 47
10422 47 -52 52 -47 -114 36 -17 -53 -4 38 42 -120 21 -46 76 -104 -25 142 -45 -65 5 28 -21 23 73 -38 39
$$ packed form
10239A19k3j43L3J21j10J2oL7L0m8j38L8J78k05P1L9m3M5M2n7j2q7J61r0J28j29
10265c7J25K3k49P9K0Ml9M2M1N8j72M2J17k1O1j95K0O0J37p6o5R9J5k2q2K2j24
10292a17O7P9lq4k0J01j63J01K1Q4l2Qk04J29M3J08j89N0O5o0p5J81j21J47j00
10317A6j20J04j10K05j20j8j22Q1J77r9rJ43j00j69O3Q3Q2p3P3j18p4J45l7m3
10341d0L4k1L7j9LQ6j42j9N6J11jj20J37l1L7j13o2P6k0R2j20j05J67J0m0L3m0
10368a4J7P0j6q5N2J8m0p7J54q3K2OK5j4J1p9K7Q0rp7M4l0m3J68j43M1l4N0j08
10397f7K7J60p6P2j68N2J18r0q0Q6j50J90p6M6M2K7j78J8J32K0k32J67j09kJ18
10422D7r9J04r9o7J50n3l6M9M2Mj62J41o7J22j80P9J67j87k0P0K3m9M4N0j11P7
$$ plain form
10448 39 47 7 -50 25 25 -37 58 -103 10 -1 9 118 -83 20 -45 -27 -67 29 -116 14 -11 0 -114 80 7 40
10474 40 12 36 -106 25 -40 63 -62 48 -113 11 125 19 37 95 -20 -50 -113 -33 47 -5 -47 -48 -6 -97 37
10499 37 -107 -62 -23 -140 -66 23 32 138 -22 67 -43 1 -26 -60 23 32 -35 -34 7 79 53 148 -23 48 -27 77 25 10
10527 10 -97 55 28 -94 47 -97 24 -59 23 -2 -107 -15 41 -15 -60 -98 28 -37 -23 3 -95 28 -69 -32 108
10552 108 -29 28 129 27 -14 95 -48 58 51 -83 -8 110 -44 -21 101 24 -96 -3 8 -3 103 94 47 86
10576 86 44 -58 -60 -105 -49 47 102 44 -40 -15 87 -42 17 0 7 107 -92 169 53 -73 74 -14 27 -27 -36 -16 -36
10603 -36 32 65 -66 -111 -6 -10 -63 -20 -24 81 13 -33 82 -34 -1 43 -64 25 -24 56 53 11 -4 44 66 35 118 -50
10631 -50 92 13 -12 26 -92 46 32 -64 -71 3 37 82 -35 29 8 -29 -117 -24 30 27 115 112 -35 -78 -17 -8 -40 -24 25
$$ packed form
10448C9Qm0n7P5%o2R5j61J13j1J0J09k01J03o5J8m0R6j45J30k5J1j14J94p3L3
10474D0k8K4j42J31o5J03j25J10j61J24J14j06J8N8j15l0o3Q0Q0n2m2jM2r1J34
10499C7j44M5L9j17P4Q9RJ06j60Q9j10M4k7l4Q3Ro7JM1P2k6R5j71P1p5J04n2j5
10527A0j07J52k7j22J41j44J21q3Q2k5j05R2N6n6m5l8J26o5J4K6r8J23r7L7J40
10552A08j37N7J01j02m1J09j43J06pj34P5J18j54K3J22p7j20R3J1j1J06rm7L9
10576H6m2j02km5N6R6N5n8q4K5J02j29N9j7PJ00j99K61j16j26J47q8M1n4rK0k0
10603c6O8L3j31m5J05mn3M3mJ05o8m6J15j16L3M4j07Q9m9Q0lm2j5M8K2l1Q3j68
10631e0J42p9k5L8j18J38j4r6pP4L4M5j17O4k1l7q8R3N4lQ8lj47m3O1Rl2J6M9
$$ plain form
10660 25 43 -74 -33 -4 49 40 -93 38 55 -42 13 99 21 -60 -56 42 -32 -13 -63 27 23 -70 -28 81 -67 54 100 34
10688 34 -20 -35 -61 -4 -96 23 -58 10 -31 -24 -47 -17 18 -31 -157 5 7 -25 148 -45 40 43 55 112 -103 -35 -11 73
10716 73 10 -5 -95 22 28 -30 60 -55 -35 -59 43 1 -15 -19 -56 96 -36 31 -23 2 137 63 37 -53 60 25 60
10743 60 16 -14 -123 58 -21 33 25 -19 6 41 60 78 -5 135 -29 100 -78 -41 79 8 18 -70 -40 65 27 76
10769 76 48 72 111 31 -22 38 -9 -35 -9 -26 -80 -36 56 18 60 40 40 -26 8 -73 -16 8 30 -117 -102 -138 27 61 137
10798 137 -136 -62 38 -71 -20 46 -27 104 -65 50 -57 -43 77 97 -54 92 35 82 48 91 -48 -41 110 14
10822 14 100 -70 -16 -63 49 -78 102 -93 -36 -5 -62 -42 -215 -12 -13 -32 -39 21 139 -14 24 -8 -1 -18 -101 -115 34
10849 34 -10 85 0 41 -27 20 38 -70 -74 -117 -30 63 -72 63 64 -6 -1 -84 -18 19 35 -12 48 96 20 181 38 -118
$$ packed form
10660B5J8j17M1K9N3rj33J31J7r7N5Q6p8q1MR8p4J9n0R0mr3M2J09j48J21M6o6
10688C4n4j5k6N7r2J19q1O8m1Pk3L0L5m9j26J62Kl2J73j93Q5LJ2N7k15O8K4Q4
10716G3o3j5r0J17On8R0j15K0k4J02m2j6ml7J52j32O7n4K5J35p4k6r0J13l5L5
10743F0m4l0j09J81p9N4qm4K5L5J9J8q3J40j64J29j78L7J20p1J0q8L0J05l8M9
10769G6k8K4L9q0n3O0m7k6K6j7n4M4R2l8M2k0%o6L4q1N7K4K2j47J5l6J65L4P6
10798A37k73P4J00j09N1O6p3J31j69J15j07J4J20K0j51J46n7M7l4M3j39PJ51r6
10822A4Q6j70N4m7J12j27J80j95N7L1n7K0j73K03jj9pO0J18j53L8l2Pj7q3j4J49
10849C4m4R5q5M1o8M7J8j08mm3Q7R3j35J35Jp0Nq3O6L7J6m7O0M8p6J61j43j56
$$ plain form
10877 -118 2 -29 -57 -93 -100 -24 -63 49 -5 67 -7 114 -62 4 -55 -68 13 -76 -36 -56 123 -62 -46 -32 -3 -54 55
10904 55 46 -25 1 -16 5 13 -2 150 40 61 -34 -54 84 -12 85 25 -72 -75 100 -64 69 -8 86 33 -53 28 18 -41
10932 -41 74 5 15 -63 -100 49 -13 -77 -10 95 38 -34 -8 85 -38 -18 -9 73 49 -102 1 179 65 -6 -42 40
10958 40 -8 47 76 -7 56 105 13 64 -59 -98 -21 29 -21 4 132 145 51 48 -3 75 21 -72 -69 -35 59 -103 -82 -12 -47
10987 -47 -61 -50 11 -4 53 7 -120 -79 8 -35 119 -36 -46 -10 -37 -35 23 23 -32 -106 -91 87 9 101 -43 57 10 -95
11015 -95 -126 -65 31 -49 -36 6 74 35 -34 13 -4 -53 -53 0 -24 61 50 40 -12 56 -93 -57 28 -68 -25 -31 -101 135 17
11044 17 15 -73 -72 138 -74 -95 -39 2 74 -29 -84 -63 -129 -84 62 27 -8 -4 -100 -40 -31 52 25 -106 96 -3 30 175
11072 175 -25 54 -31 109 49 -110 10 87 -51 9 55 109 103 45 18 8 -27 -14 -63 -4 61 -90 -106 47 -11 8
$$ packed form
10877a18J20l1k8l6pP6l9J12n4P2p4J21j76O6n9j3Q1q9M0k0J79j85J6J4K9n1J09
10904E5rp1K6j7K1Qj5J52j10K1r5k0J38r6R7o0r7lJ75j64J33p7R4n3q6Q1j0n9
10932d1J15o9J0p8l7J49o2o4O7J05n7p2K6R3j23K0RQ2k4j51J03J78j14p1l6Q2
10958D0m8N5K9q3O3M9r2N1j23l9P7N0n0K5J28J3r4ln1P8n4r3LL4R4j62K1P0l5
10987d7j4J1O1j5N7m6j27M1Q7m3J54j55j0L6k7KN8%n5p4J5J78p8R2j44J00m7j05
11015i5l1O1R6q0J3M2O8l9o9M7j7m9%N3k4Q5j1j0n2O8j49L6Q5r6M3op0K36j18
11044A7kq8JK10k12k1N6M1P2j03n5K1o6M5J46l5l5Mr6O0RQ3k7j31K02r9L3J45
11072A75k00P9q5J40o0j59J20P7j38O0M6N4on8k7j0l5J3m9N9O5j51j6J53n8J9
$$ plain form
11098 8 -37 -16 14 -163 -63 -97 17 61 24 22 4 -5 -93 29 92 -32 102 -119 -52 17 -29 -10 -11 60 -27 2 79 52
11126 52 42 -7 -63 7 -101 -182 -17 -63 -30 32 13 66 21 27 -19 67 168 -157 -62 -24 -86 9 -2 71 27 -1 58 28
11154 28 53 -56 -56 -112 -22 -15 -114 -50 -146 -83 0 -85 4 37 -79 -44 -238 -70 84 -48 16 85 70 51 -20 -79 123
11181 123 40 10 4 -32 -3 26 -30 -79 -21 21 -65 10 -33 -2 -27 -4 -17 -38 -72 19 -113 -56 -21 -27 -20 -22 81 31 -61 -85
11211 -85 104 10 12 133 -107 46 86 19 -19 -141 -54 46 -42 24 24 7 16 34 116 40 100 -26 -68 -24 22 57 -53
11238 -53 -8 17 168 -63 -58 -36 -123 -41 37 28 31 10 -83 -29 48 24 -33 -100 68 83 14 -35 -15 45 -34 81 -33 37 58
11267 58 35 -24 -24 22 130 -28 -34 42 -24 59 -12 29 -126 -68 60 19 72 -14 -63 42 76 23 6 48 8 15 -55 40 149
11296 149 -60 -7 59 -40 18 -36 -46 -16 -46 -26 -67 -19 -2 114 -11 -48 4 -41 -98 -45 38 119 12 47 104 0 50
$$ packed form
11098Hm5K1L0j77J00l4J14M4l7kj8rq8J22O3j24J34k21O7O9m6J9jP1q7K9P7k7
11126E2j0m9n6P0j08q1J65m6L3O2j9N3m5Om6Q6J01l25R5L8o2R5j1P3m4k8N9l0
11154B8K5j09%n6R0Pr9O4r6O3Q3q5Q9L3j16L5j94J68J54j32O4O9j5j9p1n9K02
11181A23q3l0ol6K9K9n6m9N8M2q6P5m3L1k5K3j3k1l4R1j32N7L5oPkJ03n0r2k4
11211h5J89r4KJ21k40J53M0o7l8j22Q7J00q8O6%j7RJ8Q2p6O0j26m2M4M6L5j10
11238e3M5K5J51k31NK2q7Q2P8rLk1r3N4P7k4n7o7J68J5o9m9K0O0p9J15j14P0K1
11267E8k3n9%M6J08j58oP6o6Q3p1M1j55N8J28m1N3q6m9J05L4n3j7M2m0Pp0R5J09
11296A49k09N3O6r9N8n4j0L0l0K0m1M8J7J16j25l7N2m5n7N3Q3Q1j07L5N7j04N0
$$ plain form
11323 50 -42 39 -32 -2 -29 -48 41 137 -25 7 23 -22 41 -56 -25 124 -64 -78 -69 -41 -98 34 18 -99 10 -22 -45
11350 -45 -20 -60 20 -122 -7 40 -47 35 -42 -40 8 -57 38 42 65 7 -1 -54 -62 73 21 -65 23 -5 -46 -19 -28 -66 -62 114 -38
11381 -38 -67 73 91 -62 -13 106 88 -22 87 5 63 -43 121 91 24 -16 -84 -36 126 84 -13 -5 -68 46 82 118
11407 118 -5 -86 106 -18 86 -179 27 -32 -69 121 -85 -47 -62 -43 -13 -11 55 17 -71 90 -76 -95 58 125
11431 125 45 26 53 23 -25 -38 -8 10 54 -86 -33 -118 18 60 140 58 -7 29 49 71 -45 -13 73 10 -126 -32 43
11458 43 58 -37 48 16 -85 145 -137 187 -93 167 59 0 -60 -120 -15 -123 -28 -114 4 -26 34 -20 100 3
11482 3 -68 -55 36 -1 7 -53 -114 -33 2 133 52 -53 -82 -37 -54 -47 -56 2 22 -84 -40 42 -19 -85 21 -18 -6 30 -75
11511 -75 -50 121 -53 -39 90 10 -106 7 -46 29 -44 -30 -31 28 67 -19 9 -105 -114 -107 -104 21 -57 34 -69 -6 -63 -112
$$ packed form
11323E0r2Q1p1L0k7j9Q9R6j62L2J6m5O3r7L1J49j88j4RK8n7J32j6j17J09l2k3
11350d5K5m0Q0j42J15M7q7Q2p7KM8o5R5MK3n8qn3qJ35n2q6Q8k8m1K7rl8MJ76j52
11381c8k9J40J8j53M9J19j8j10J09q2N8j06J64l0o7m0o8M8J62m2r7Qo3J14L6L6
11407A18j23q1J92j24J04k65K06n9l7J90k06L8j5J9L0KO6l8q8J61j66j9J53O7
11431A25q0j9K7l0m8j3L0J8M4j40N3q5J36M2Q0q2o5L6K0K2j16L2Q6o3j36R4P5
11458D3J5r5Q5l2j01K30k82L24k80K60j08n9o0o0J05j08R5q6J18l0O0n4J20r7
11482Cp1J3R1l7Qo0o1Q1L5J31q1j05k9M5j7PrN8K0j06M4Q2o1o6J06l9J2L6j05
11511g5K5J71j74J4J29q0j16J13n3P5p3J4jN9L9q6K8j14rPLJ25p8R1j03O3n7m9
$$ plain form
11539 -112 -2 97 -106 19 -4 -1 23 -16 61 84 18 -23 52 -48 -110 -124 116 -16 61 4 -1 -7 37 -16 23 -114 59
11566 59 103 -26 117 -113 12 27 -1 -17 -56 -32 -132 -41 -7 -30 17 -84 -42 101 37 24 -97 18 48 -33 29
11591 29 88 -93 5 -73 22 -35 -128 -99 -43 -14 28 -5 -96 26 -60 -5 -108 -100 82 16 54 -61 -18 -99 -35 18 22 63
11619 63 30 63 -57 10 -67 -8 -47 -77 -11 -146 -67 26 -62 50 3 -48 -79 32 69 -17 -2 139 30 3 125 60
11645 60 -77 30 -19 99 -106 -110 107 63 -5 -21 21 104 4 75 -100 0 38 33 -30 126 89 -26 94 -40 15
11670 15 -77 -20 1 61 7 61 -24 33 -45 -53 -66 17 -48 -39 53 1 56 -46 24 -56 19 -112 13 -42 65 47 -20 -28 59
11699 59 100 -160 -32 -159 224 -8 143 102 -12 27 -35 -29 -2 -5 43 19 18 29 -48 0 -18 -27 -79 39 -140 26 42
11726 42 -35 67 6 -22 -29 29 -17 3 -77 26 -22 4 -129 38 -27 -85 -65 30 -10 106 11 130 43 19 -4 -44 74
$$ packed form
11539a12J10R9k03J25k3LK4l9P7K3o6m1P5j00o2j4K40j32P7n7noM4n3L9j37J73
11566E9M4j29J43k30J25J5k8j6l9K4j00R1L4k3M7j01M2J43o4j3j21J15L0q1O2
11591B9N9j81R8p8R5n7r3K9N6K9M2l3r1J22q6N5j03QJ82o6L8j15M3q1O4N3MM1
11619F3l3L3j20O7p7N9l9l0O6j35P9R3q8J12m7n1l1J11L7q6J5J41j09k7J22o5
11645F0j37J07m9J18k05mK17m4o8j6M2Q3j00P1j75J00L8no3J56l7j15J20j34N5
11670A5r2N7K1O0n4N4q5N7p8qj3Q3o5RR2n2N5j02P0q0P5j31J25n5J07j8o7qQ7
11699E9M1k60J28j27L83k32J51m1j14L9o2OK7lM8k4jJ1p7M8j8rn2J18j79J66J6
11726D2p7J02o1k8pN8m6K0q0J03m8K6j33J67o5n8K0R5m0J16r5J19q7k4k3m0J18
$$ plain form
11753 74 -8 49 178 -91 -4 -110 13 1 79 3 26 25 -3 8 45 -7 -78 -33 -150 -16 38 -29 -31 40 -110 -79 -15
11780 -15 142 84 -22 38 6 -34 -32 -24 -15 -38 -12 91 38 -36 21 119 95 -46 -60 9 18 53 -62 -49 94 -60 8 -5
11808 -5 27 49 -15 15 11 -35 -27 -34 -64 25 47 -81 -95 -87 74 80 -20 -30 89 -3 -101 29 10 92 -91 -24 -33 16 31 -32
11838 -32 37 112 -33 6 -46 5 -93 -20 8 -55 45 -60 54 0 22 -89 -90 66 -73 5 -46 173 39 -158 44
11863 44 58 4 -56 15 34 24 17 -3 26 -26 -4 -57 112 69 -80 -65 -70 -23 -33 0 -79 -30 129 41 95 113 37 103 -56
11892 -56 152 64 86 52 39 -23 -23 88 61 94 -85 -15 92 -52 53 -60 -53 0 -71 -45 -25 -172 108 99 36 -11 -134
11919 -134 64 17 91 -2 -56 -13 -12 47 10 120 -101 11 -53 7 -7 -25 97 46 -25 -21 130 -37 94 -73 -43 45
11945 45 -51 -128 134 -89 35 17 103 36 -48 33 -42 -10 -93 88 84 -50 41 -25 -10 72 74 -73 25 0 -48 40 18 4
$$ packed form
11753G4q2N7J29k69Q7j06J23j2P8p6K3jk8J1L7n2p1M5j17J34N4o7kP1j50L1O4
11780a5J57n8j06O0l2m0KQRk3K6J03n3p4N7R8k4j41j4O9RL5j15J3J43j54O8j3
11808eL2K2o4L0mm6Qpl0Q9K2j28j4QJ61Oj00j0J19r2r8J30j9Q2j83O7rM9J5o3
11838c2O9P5j45L9n2N1r8P3K8o3J00j05J14n4K2j11jJ56j39P8n1K19j34j97K02
11863D4J4n4o0P1J9j0pk0K9n2K2n3J69m3j49J5nM7j0L3p9M9J59q8N4J8p6O6j59
11892e6K08q8K2l4j3o2%J11k7L3j79P0J07j44J05j13PN3p1K6K0j47K80ro3m7j23
11919a34J98m7P4r3n4M3JN9l7J10k21J12o4O0j4j8J22n1p1MJ51j67J31j67L0Q8
11945D5r6p7K62k23J24j8Q6o7q4Q1p5L2q3J81mj34R1o6J5Q2Kj47R8k5m8Q8k2j4
$$ plain form
11973 4 -24 -150 -59 88 73 32 -142 -30 27 -3 44 90 125 -42 -62 51 -149 -17 -6 -26 -17 -106 -54 -18 36 36 59
12000 59 -59 16 -23 -54 -92 13 23 -53 -28 39 -5 -59 48 42 -93 12 -112 14 -10 -96 39 -54 56 163 -96
12025 -96 5 -162 -170 -66 134 0 -79 19 -5 -86 69 -60 73 21 -29 30 -52 -46 84 51 -22 61 -20 -13 -10 25 43
12052 43 -141 -115 82 5 -73 36 -1 25 25 -174 -110 0 -18 -125 -13 -56 -32 71 -3 35 -59 -149 -53 49 4 -41
12078 -41 -1 -90 -86 -59 -95 31 1 30 -41 65 -51 83 162 96 -6 -162 103 21 -88 66 -63 68 106 88 56
12103 56 -41 -7 73 3 33 69 -62 -23 -38 67 -64 69 -88 52 -37 -19 33 115 23 62 -96 -141 59 130 32 127
12129 127 62 11 -52 5 -67 -100 15 -153 -48 63 40 -145 -81 41 4 -33 -99 -35 48 12 -82 58 -14 -70 115
12154 115 6 -28 0 -70 130 14 41 -67 -16 20 -130 -37 123 20 -15 -6 -49 52 37 48 24 17 -4 -50 -30 -100
$$ packed form
11973Dk8j26R1J47j5m1j74J12N7l0M7M6L5j67k0J13k00J32J1k0Rq9N2L6N4%K3
12000E9j18P5l9l1l8J05J0p6K5O7m4n4J07oj35J05j24J26k4q6J35r3J10J07k59
12025i6J01j67qJ04K00j34p9R8k4q1J55j29J33n2n0N9q2OJ30l3p3Q3q1PLL5J8
12052D3j84K6J97p7p8J09l7K6%j99O4J10j8j07J12m3K4J03p4L8r4r0R6J02m5m5
12078d1M0q9MK7l6J26l0K9p1J06j16J34P9o6j02j56K65q2j09J54j29J31L8j8l2
12103E6r7L4Q0p0L0L6j31L9j5J05j31J33j57J40q9J8N2Q2r2L9j58m5K00P1r8R5
12129A27o5n1o3N7p2l3J15j68J05J11k3j85O4J22l7l7o6O4Q3l6r4J40p2n6J85
12154A15j09l4K8p0K00j16K7j08N1L6j50R3J60j03l5Rm3J01j5J1k4pk1m6K0p0
$$ plain form
12180 -100 -1 38 -22 43 -108 48 10 53 -1 -60 62 -18 -57 112 -5 -31 -23 -39 -66 -30 -32 -121 -33 58 -25 -169 -79
12207 -79 -69 87 -111 -75 -3 5 145 -88 -3 -26 -12 46 47 37 49 -94 -12 -108 42 -40 7 82 -138 -18 -16 -34 40
12234 40 -4 -7 -18 -83 51 -95 116 -29 96 -66 107 22 -44 138 -4 -36 -28 7 -76 -84 -32 -31 -70 -19 -49 -119 -72
12261 -72 27 -78 -13 -2 67 -137 22 -47 22 9 13 -15 -44 -46 36 84 99 73 59 47 74 -15 11 -64 -12 155 -57 -90
12289 -90 -137 -11 7 33 -52 -36 99 -47 -50 -27 -103 38 126 126 10 66 42 63 16 -2 -19 -79 34 91 -47 -37 -131
12316 -131 -103 -10 0 -19 -19 59 -15 43 29 -70 41 -76 -36 -26 19 -110 -26 95 57 -56 15 13 75 -32 -29 -130 -23
12343 -23 41 -31 74 -26 -70 66 -49 9 -40 -178 -25 -16 71 36 -22 -31 142 41 -38 95 -60 -110 176 28 48
12368 48 31 -73 -79 -39 15 18 57 -58 29 -13 -58 -28 -52 47 -76 -34 -58 51 5 26 167 -12 17 44 -16 106 -88
$$ packed form
12180a00R9L9o0O5j51J56l8M3n4n9J22q0l9J69j17k6Qj6k7L6kq9Q8R1q3j44R0
12207g9J0J56j98L6P2QJ40k33Q5k3J4N8Jj0J2j43Q2r6J50q2M7P5k20J20Kj8P4
12234D0m4lj1o5J34j46K11j45J25j62J73q5o6J82j42l2QL5q3qN2Jl9N1l0p0M7
12261g2R9j05O5J1O9k04J59o9O9j3Mk8k9kQ2M8J5k6j4j2K7q9K6p5N2J67k12l3
12289i0m7J26J8K6q5J6J35j46lK3p6J41Q8%j16N6k4K1m7j8j7o0J13N7j38J0r4
12316a31K8R3J0j9%P8p4N8j4r9J11j17M0J0M5j29Q4J21l8j13P1kO2j07Lj01J07
12343b3O4p2J05j00m4J36j15N8m9j38J53RQ7l5n8rJ73j01p9J33j55n0K86j48K0
12368D8j7j04oM0N4LL9j15Q7m2m5L0k4R9j23M2k4J09m6K1J41j79K9K7o0J22j94
$$ plain form
12395 -88 87 -13 69 -23 27 45 100 118 -108 72 44 -25 23 -4 -25 -23 10 -64 -77 30 -74 -8 19 40 147 36
12421 36 45 60 -34 61 -21 -67 -52 2 117 18 43 43 -106 -3 -29 27 6 24 -89 31 76 -3 7 59 -39 49 49 -125
12449 -125 -94 61 77 -12 33 -19 -72 -58 90 4 -14 23 -5 -55 -3 -54 1 -82 -152 -34 -25 31 -80 90 -83 56
12475 56 19 -2 89 80 81 -50 84 84 -118 -146 -47 -3 -33 35 7 74 -126 -44 25 33 19 23 -128 -66 -58 -63 13 -26 52 -25 -4
12506 -4 -59 -42 45 27 -75 -21 1 -40 4 -13 -71 -1 110 20 41 -19 -120 -25 -90 22 10 94 18 -37 -1 39 93 26
12534 26 -47 -20 130 -3 -113 24 18 44 -49 -16 2 -48 -28 8 -23 218 16 50 -39 -101 26 -11 57 -11 30 -17 -13
12561 -13 -10 74 32 55 41 23 -11 2 96 -73 12 55 4 12 -34 17 -109 110 -23 -100 111 32 16 -4 -37 53 -6 34
12589 34 111 32 25 36 -62 -45 47 122 93 99 65 12 -48 60 -44 -107 -107 -4 -42 -115 86 39 8 -50 -68 -59 60 21 -88
$$ packed form
12395h8J75j00Q2r2N0J8N5J8k26J80k8o9M8k7k1KL3p4j3J07j04O6K7K1J07j11
12421C6RJ5r4R5q2m6J5N4J15r9K5%j49J03k6N6k1J8j13J20M5p9J0N2r8Q8%j74
12449a25L1J55J6q9M5n2n3J4J48q6j8L7k8n0N2n1N5q3p0J18RN6j11J70j73J39
12475E6l7k1R1rJj31J34%k02k8R9M4l0O8k8O7k00Q2O9Qj4Mj51O2QnP6l9P8p7K1
12506dn5J7Q7j8j02N4K2m1M4j7n8P0J11r0K1o0j01R5o5J12j2Q4p6n5L6M0N4o7
12534B6p3K7J50j33j10J37oK6r3L3J8n0K0L6l1K41k02L4q9o2J27l7O8o8M1m7M
12561a3LQ4m2K3j4j8l4J3R4j69Q5M3n1Qm6N1j26K19j33p7K11p9j6k0l3R0n9M0
12589C4P7p9pJ1r8J7R2P5k9Ol4n3o0J08j04o3%J03l8p3K01m7l1n8j8RJ19l9j09
$$ plain form
12618 -88 7 93 -90 -19 81 159 26 -68 -88 -35 -37 59 -27 -33 23 -103 -85 -98 53 -122 -57 -67 55 -30 -24 -135 -25
12645 -25 16 29 -14 38 8 135 8 -68 -19 39 19 -43 19 6 1 117 -20 12 38 3 -83 56 11 50 -81 6 -74
12672 -74 88 -28 -75 2 -75 -14 30 103 -76 11 72 -27 -15 -4 28 90 141 73 -8 -81 16 -37 -67 -85 61 -44 114
12699 114 -20 -73 -32 -44 -91 6 0 -30 -32 7 -85 -7 -78 82 42 106 86 -96 71 4 23 -36 -82 74 -36 21 48
12726 48 -93 137 -61 56 -76 50 -10 -111 -31 -70 67 -77 -12 16 30 100 52 104 64 14 31 -84 -67 -9 -1
12751 -1 76 2 42 12 -74 -102 -29 -17 -15 33 45 -102 -78 82 48 139 98 -83 -168 -187 100 24 -24 -47 -14 -98 -28 69 -20
12780 -20 -1 28 50 34 -20 37 1 -103 8 -72 -46 75 74 -45 23 -52 -90 36 -69 -47 -92 -106 46 37 98 -58 17
12807 17 6 -37 -25 -109 48 -101 -35 -86 -63 -101 10 -24 81 -68 -23 -89 112 35 69 29 16 -27 52 -77 3 -8
$$ packed form
12618h8R5Q6j83P1J00P8j33r4k0N3kR6q6oN6j26J8j3J51j75O5j0J22q5Oj11J10
12645b5M1J3m3N2l0J27j27p6M9N8k0o2O2j3nJ16j37L2K6l5q6J39m5L9j31Q7q0
12672g4J62j16m7P7p7O1M4P3j79Q7O1r9J2J1L2O2N1o8q1p3R7n3l0j8J46j05J58
12699A14j34n3M1j2m7R7ol0kL9r2P8p1J60m0O4k0j82J67o7J9n9m6J56j10N7K7
12726D8j41K30j98J17j32J26o0j01Q0l9J37j44O5K8J4P0m8N2m0n0J7j15J7N8Q
12751aP7p4M0l0q6k8P3J2KM8J2j47K4J60l4R1m1j81q5j9K87p6m8k3L3q4P0R7q9
12780b0J9K9K2j6n4N7l6j04J11q0K6J21jj19O8p5l8J26j05K2m5j4J52rO1j56P5
12807A7j1m3J2q4J57j49O6n1K3l8J11l4J05j49M5o6K01p7L4m0j3m3P9j29Q0j1
$$ plain form
12833 -8 23 104 49 91 -27 -63 -96 37 50 -8 36 73 -15 -75 -55 102 -88 -23 -150 24 -126 -134 43 74 -162 -67
12859 -67 79 58 -39 -47 107 16 -48 -71 30 -124 -43 57 -53 -45 -39 -3 154 -115 -63 -49 38 9 40 25 -82 -90 -24
12886 -24 35 8 141 -67 5 44 45 72 -5 64 -6 -31 103 70 -16 6 81 75 -44 -37 160 26 171 -15 55 -91 29
12913 29 -36 50 5 40 24 -46 85 56 1 -17 69 67 -62 -3 50 58 25 -96 49 -80 -86 59 -5 56 29 117 61 49
12941 49 99 19 16 -76 -24 -71 34 -31 -25 22 -37 8 -78 42 127 -25 9 -67 -22 -95 86 -7 91 11 23 38 -88 105
12969 105 10 90 -25 -121 4 125 59 52 62 -16 55 -11 -5 35 -23 -49 12 -97 47 21 22 -88 -21 62 -12 -103 -14 -68
12997 -68 -40 63 24 -24 67 -27 -73 41 43 87 127 -139 -1 15 2 -56 89 123 65 9 117 30 38 -66 25 -53 22
13024 22 73 -34 31 74 29 -67 -95 -92 -1 14 41 56 116 -34 85 -8 -28 52 -46 45 -32 19 16 49 109 -42 30 -30 -13
$$ packed form
12833hL1Q1n5M2j18l6l3J33J3n8M4L7q8o0K0J57j90O5j27J74j50qJ77L1k36R5
12859f7J46k1r7qJ54r1o4k3J01j54Q1J00j10QOL6J57k69N2J4Q7k9L1j5j07qO6
12886b4N9k7J33k08P2L9JK7p7O9p0k5J34l3q6K2P5oj19PJ97j34J45j86P0j46J20
12913B9o5Q6m5L5j6p0J31k9n5j8Q6kj29N9N3Ql3j21J45j29oJ45o4O1k7Q8n6j2
12941D9N0q0lr2N2m7J05o5OM7n9M5q6J20Q5j52L4p6M5p3J81r3R8q0J2J5j26J93
12969A05r5Q0j15r6J25J21o6pJ0p8P1o6OM0n8k6O1j09J44k6Jj10O7Q3p4r1Q9n4
12997f8K8J03l9m8R1r4m6J14KM4M0k66J38J6j3n8J45L4n8n6J08q7Qj04R1p8P5
13024B2N1j07O5M3m5r6k8LR1J5K7J5O0j50J19r3k0Q0r8R1p7N1lL3O0j51P2o0J7
$$ plain form
13053 -13 61 21 73 52 -77 51 34 13 -20 7 24 172 -2 -79 95 -61 -6 -98 -74 99 5 3 69 -57 79 130
13079 130 94 25 -57 -14 -35 -100 -12 44 139 -31 -99 -187 10 -121 22 -194 -39 35 14 -65 52 -25 -35 -3 10 33
13105 33 33 -56 22 85 100 -68 117 174 -39 -2 141 -39 99 51 -27 -29 24 -54 -89 62 18 -124 37 24 -14 0
13131 0 -8 96 46 -26 -8 -36 59 87 27 9 13 30 129 94 45 96 25 -45 141 -9 -17 -27 -78 -127 -25 37 -77 30 102
13160 102 98 -38 45 -27 63 -84 91 16 -17 8 -76 -36 -33 39 -2 44 48 -28 44 16 -134 -45 76 -73 -36 -54 96
13187 96 -58 22 -93 -85 47 52 -130 -56 -79 -42 25 92 6 42 20 62 -26 -87 0 9 -58 -16 -130 104 -115 40 35 10
13215 10 9 8 -120 -128 -14 -82 47 11 50 39 12 -80 79 -72 134 46 -4 44 -2 6 -84 23 -21 24 -35 -52 98 32
13243 32 -22 49 86 10 50 103 96 67 -10 35 165 87 69 5 83 95 -69 -67 -23 37 -95 -17 21 -49 35 -55 -36 138 102
$$ packed form
13053a3P4m0N2k1j29J28j7k1l3K7J7J48j74p7J74j56N5r2K4J73r4kO6j26J36N1
13079A30l6o9q2M3k1o5Q8N6R5j70o8q8J97j31J43k16J55P4k1p9J17p7j0L2J3K3
13105C3%q9P8O3J5j68J85N7k13L7J43j80J38m8p8kN3p8l5J51m4j42J61j3l8J4
13131@qJ04n0p2J8k8R5K8o0j8MJ7R9l5m9N1p1p0J86j50qj0n1m9J02O2j14J07P2
13160A02mj36Q3p2R0j47J75p5l3K5q4M0LP2m1M6Mp6P2k8j50Q9J21j49L7j8J50
13187I6j54Q0j15QJ32Nj82P4k3L7O7O7q6L6k2M2q8o1Q7Ro7M2j14K34k19J55nk5
13215A0jjj28qJ14o8J29l6L9j1k7r2J59j51K06q8n0M8m6Qr0J07m4M5n9j7J50o6
13243C2n4P1L7p6M0N3pk9p7M5J30p8j8o4P8J2j64KM4O0j32P8L8p0Q4r0J9J74l6
$$ plain form
13272 102 -46 78 -39 -92 91 60 -65 -47 -85 25 110 8 129 1 -72 26 -31 93 0 60 19 -73 -36 -59
13296 -59 97 21 76 -63 -14 53 43 32 89 19 -19 123 -53 -43 -65 44 -73 78 17 17 10 18 54 54 10 103 -23 -44
13324 -44 -2 -5 44 24 -3 -29 19 -11 77 61 53 56 -110 -12 137 -32 115 11 -65 -26 59 56 -2 -97 -27 -38 25 14 -60
13353 -60 64 65 6 15 -90 21 135 91 -14 40 83 -55 -8 38 -149 -44 -14 82 -15 -44 -32 90 45 16 69 -3
13379 -3 30 -7 -10 4 141 -97 -6 -127 42 -55 44 -3 -76 -37 -43 39 -76 -100 100 85 -73 90 33 -80 -143 -80 -13
13406 -13 94 27 -37 105 80 -96 -2 -17 -2 29 35 55 96 -35 46 -10 -98 -4 127 7 4 26 1 61 18 -36 -69 -84
13434 -84 -25 66 -22 -33 56 -27 66 -44 -162 79 -67 36 127 -91 25 -5 44 -88 90 132 -27 -74 -25 30 26
13459 26 -12 18 33 27 72 -77 -38 -48 61 -25 17 104 32 -75 22 10 -51 43 123 46 77 -40 -41 106 17 -78 17 102
$$ packed form
13272A02j48J24j17n3J83l1j25J8l8J10Q5j02J21j28p3R8n7J24r3O0m1r2L7k3
13296e9J56p6N5j39M9O7j0j1N7p0l8J42j76J0k2J09j17J51o1%pQL6%m4R3j26k1
13324d4M2lM9k0k7k6M8l0Q8j6qLj66R8J49j69J47j04p6L9Q5ln8r5P0j1O3j1p4
13353f0J24Jn9Rj05J11J14m4j05N4M3j38M7M6j87J05L0R6r7k9J2J22m5k9N3p2
13379cL3l7lJ4J37k38R1j21J69r7R9m7p3L9oQ2j15k4K00j5j58J63n7j13o3O3O7
13406a3J07o7o4J42k5j76R4j5J5L1OK0M1j31Q1n6q8R4J31j20lK2k5O0m3n4l3j5
13434h4N9R1q8j1Q9q3R3j10j18K41j46J03R1k18J16l0M9j32J78M2j59m7M9N5m
13459B6l8L0J5oM5j49L9j0J09q6M2Q7p2j07R7j2o1R4Q0p7L1j17jJ47q9r5R5Q5
$$ plain form
13487 102 -32 -67 -48 -67 0 9 -106 -15 56 5 0 114 -3 -63 -17 53 -70 -38 -17 57 -42 -48 19 8 12 124 -94 -101
13515 -101 -8 1 -75 -31 57 -90 29 -17 174 149 -88 -4 -72 36 -23 -46 45 -36 48 -5 -5 -28 -99 153 -24 -115 80
13542 80 -11 44 45 -19 -21 72 62 99 31 0 -167 -95 61 -26 44 -55 177 1 62 13 113 55 22 -37 57 28 52 91
13570 91 -18 -38 -69 -55 -45 -29 -25 57 56 6 -38 -4 109 -15 20 1 -95 37 35 96 34 -88 8 101 -57 -81 -95 41
13598 41 -3 -28 -2 19 -54 69 9 57 113 45 -12 36 -15 -18 -139 70 -22 -105 93 -84 1 -19 -85 -10 1 -7 -11 -43 47
13627 47 -100 8 70 23 78 -40 44 89 93 -21 -166 32 51 -1 56 56 35 50 -18 67 -116 -38 46 -51 -37 72 -38
13654 -38 94 16 60 32 91 12 -81 51 22 -47 90 16 46 19 41 -25 -37 135 -19 -52 85 -60 5 10 -35 10 -95
13681 -95 58 37 69 25 134 100 -114 40 10 -48 -67 -13 155 50 -13 -119 -83 -27 22 -5 90 1 -95 -55 -66 9
$$ packed form
13487A02j34l5J9j9O7Rj15R1P1n1nJ14j17o0M6P0j23L2K1P4r9oO7j1MJ12k18p
13515a01R3Rp6M4Q8j47J19m6J91k5k37Q4o8J08n9k3R1q1Q4n3%k3p1K52j77r1J95
13542H0r1N5Jo4kR3j0L7o8l1j67P2J56q7P0r9K32j76O1m9J00n8l3n9R4k9K4L9
13570I1j09k0l1J4J0J6MQ2jn0m4L4J13j24L5j9r6J32kO1o2j22R6R3j58k4j4J36
13598D1m4k5K6K1p3J23o0M8N6o8n7M8n1lj21K09r2q3J98j77Q5k0o6P5J1qml2R0
13627D7j47J08O2m7N5j18Q4M5Mj14j45J98J9n2N7%k1J5o8Q5j83P8Q4r7J4J09j10
13654c8J32p8M4k8N9p9r3J32k9o9J37p4L0k7K2o6j2J72j54l3J37j45O5Nm5M5j05
13681i5J53k1L2m4J09l4k14J54l0n8j9N4J68j05o3j06L6N6M9k7R5q9r6M0j1P5
$$ plain form
13707 9 50 -50 -81 -39 -29 80 8 -12 21 83 -30 -123 1 52 -8 3 17 63 38 44 -106 -9 1 284 -58 74 65
13734 65 14 109 -35 135 14 -28 -40 -7 -14 47 -91 -14 54 78 54 -18 -69 -142 -5 -130 -25 -9 -72 -3 -53 29 23
13761 23 -49 24 -65 17 -14 36 -70 -46 -135 -92 -16 -81 16 -93 -52 75 -11 -29 46 69 -57 -29 -60 -104 -52 -57 40 71
13789 71 183 13 -33 6 45 36 -60 -24 -4 95 -28 43 28 -66 39 -19 61 93 -20 -84 71 44 21 92 -63 35 55
13816 55 -6 -43 -5 11 100 -45 104 -63 -23 8 -44 14 -17 1 33 -36 17 -18 0 -37 71 2 -54 -18 58 54 -26 53
13844 53 12 58 69 -45 8 -93 -19 91 -38 56 -48 50 -166 161 52 36 -12 -10 -26 -97 52 62 12 144 33
13869 33 -58 57 29 63 -40 76 22 17 103 125 51 -103 54 -8 5 -17 21 16 31 -4 -128 -45 13 -88 -105 -2 9
13896 9 69 -31 -43 96 -20 28 -6 -145 -28 69 25 -49 -44 87 38 11 -61 -29 -41 77 -30 -54 9 118 6 81
$$ packed form
13707IM1j00l1M2J0J09p2k0L3O2j13r3J24N1o0J1J4M6k5Oj50R7J0K83l42J32r
13734F5n1R5j44J70j21m2j2L3pO1j38P7O8K4k4p2n1p3J37j25J05J6o3O9n0Q2o
13761B3p2P3q9Q2l1N0j06K4q9M3P6o5R7j09M1J27q6j8P5K3j26K8l1m4N2nR7L1
13789G1J12j70m6L9L9rr6L6K0R9j23P1j5r4J05n8Q0L2j13o4J55k7k3P1j55R8K0
13816E5o1l7L8J6Q9j45J49j67M0L1n2N8l1J8L2o9N3l5J8l7J08o9n6L6P6mq0P9
13844E3m1M6J1j14N3j01P4J10j29R4j04R8k16L27j09j6m8Kj6p1J49J0n0J32j11
13869C3r1J15k8L4j03J16n4nQ6K2p4j54J57o2J3k2L8nJ5l5j24Q3N8j01j7J03J1
13896IO0j00j2J39j16M8l4j39J17R7m4p4NJ31m9k7p2L2j2J18j07k4O3J09j12P5
$$ plain form
13922 81 33 18 74 -8 -54 -30 47 -15 -4 26 -19 -28 4 17 89 -72 -38 21 108 -12 -81 -20 105 47 37 32 25 -69 -56 -93
13952 -93 -52 112 -57 -45 -5 -98 23 -72 -55 63 80 -110 -70 47 36 6 -44 -33 -52 30 -84 14 38 -4 76 79 15
13979 15 71 61 0 70 43 36 -112 44 -46 -22 77 18 27 1 22 4 51 -40 -72 -2 -37 89 -50 175 -83 -71 5 -62
14007 -62 -6 25 -11 -84 -29 -82 78 -9 -33 -20 -68 23 -28 8 42 35 -96 75 52 -66 -89 -21 71 29 -110 -92 13
14034 13 -9 -46 73 44 34 -2 -64 167 107 -13 4 83 6 -36 -58 38 75 -33 -14 -76 69 -40 25 78 -109 -24
14060 -24 -36 -13 94 -25 -8 -42 52 -26 -75 28 -75 -20 -37 65 7 -107 14 -147 60 -33 -54 7 -14 -16 21 17
14086 17 -43 -36 14 -82 85 19 52 -102 -9 5 -129 -58 21 9 118 -2 -88 -34 -29 60 15 123 11 48 81 134 -47
14113 -47 -5 -19 46 -53 102 25 -12 -11 35 37 52 67 1 -37 56 -43 46 32 3 58 25 -7 -59 123 -111 -17 0 -76 38
$$ packed form
13922H1m8j5N6q2m6K4P7o2J1L0m5rL2J3P2j61L4N9Q7j20o9O1J25n8j0npr4J3l7
13952i3M1J64j69J2M0r3J21r5J7J18J7j90M0J17j1l0n0J1j9Q2j14R8K4m2Q0Lo4
13979A5N6j0o1P0k7pj48J56r0K4R9n9Rk6K1j8M7r1l2P0l5J26j39K25k58J2P6o7
14007f2N6L1l6p3N5n3J60q7k4J3m8R1n1L6L4pj31J71k3j18k3O8R2m2j39J8J05
14034A3k2l7J19k9j0l6o2K31o0j20J7P9p7m2k2R6L7j08J9o2J45j09O5N3j87Q5
14060b4j2K3J07j19J7l4R4p8m9J03j03N5j7J02n8j14J21j61K07r3k1O1k1kL7m
14086A7o0PN0r6J67o6L3j54R3J4j34P1P9j2J09j20q6N4NQ9m5J08j12L7L3N3j81
14113d7M2j4O5r9J55p7l7JM6KJ5J5o6l8R3r9Q9j4k9N5l3l2n2J82k34R4J7p6J14
$$ plain form
14142 38 -99 -79 -83 17 87 64 -19 34 21 -12 -82 17 -29 -55 -1 -40 27 43 14 -69 -67 -75 -114 -77 77 50 36 36 -90 57
14172 57 -111 -33 -131 14 -151 -113 -64 -113 32 -74 46 -71 -13 31 -27 -2 -3 -78 41 4 61 27 23 13 17 -13 29
14199 29 130 109 27 80 5 -73 62 68 -79 94 -66 33 130 27 -28 145 2 30 -70 -53 25 -53 -201 -57 -10
14224 -10 78 -9 31 -4 111 11 -94 -181 -67 -23 -257 65 -68 13 3 122 124 90 55 0 27 100 -49 -124 3
14249 3 -29 -23 -94 93 -145 -48 15 -53 2 48 9 -36 -6 25 -77 -11 -20 -14 52 87 28 -16 -18 35 51 -7 35 -29 64 43 70
14280 70 16 104 42 -67 -40 -20 -88 -150 47 -7 26 -87 133 -52 -66 125 -79 -38 56 -37 -34 44 -24 1 35 153
14306 153 -71 -8 -9 -26 50 -88 -31 -42 -93 -38 15 66 -16 12 -50 -51 1 73 111 26 -59 140 99 30 40 54 51 81 159
14335 159 -47 -29 -74 -20 -22 -19 -26 14 -59 -26 83 -13 100 -164 -123 -66 -18 83 145 -59 121 -50 125 102 28 -29
$$ packed form
14142C8j37K0mJ00P0k3q3N3j3l3p0R9m6k6N4l9O7J6k9q3Kql9L7J54k7j4%j26J47
14172E7j68P8r8J45j65L8M9m9J45j06J20j17N8M4n8K5jp5J19l7N7l4mj0Ml0M2
14199B9J01k1q2N3p5p8J35Oj47J73j60R9R7j03n5J73j43K8j00J7P8p8j48J44M7
14224a0Q8q7M0l5J15j00j05q7J14M4k34L22j33Q1j0J19Kl4l5n5K7P3j49p5J27
14249Cl2Op1J87k38R7O3o8N5M6l9m5L0L1j02O6rOO6L5n9m4kN3J6n8M2o4R3k1K7
14280G0n4Q8o2j09K7K0o8o2J97n4L3j13K20j85j4J91k04M1R4r3LP8o8K5L4J18
14306A53k24O3jj7P6j38N7j1n1N5N3N1q2K8o2jN2P2L8q5q5J99m1o9J0J4lL0P8
14335A59k06J8m5N4kLpM0p3L3J09r6J13k64M1N7M8J01O2k04J80j71J75k3p4n7
$$ plain form
14361 -29 97 -20 24 72 -25 11 11 62 14 99 39 -6 57 55 130 55 51 -5 0 -22 -72 -81 117 23 -55 94 -39 -48 39 64
14391 64 38 39 -35 95 -111 32 -1 -10 120 16 22 32 83 -85 18 -47 19 -55 44 35 -47 -65 -125 -60 -139 22 -90
14418 -90 119 -105 -9 -61 38 43 -28 -22 21 40 38 66 -81 64 25 -86 -126 -124 -43 98 -9 18 -25 52 16 -100 11
14445 11 -21 -135 38 -82 -111 -124 -104 57 -57 -31 -63 7 16 -94 -118 -40 -27 -11 50 -89 -51 12 73 67 -29 -66 17
14472 17 14 11 -107 -40 76 -109 26 62 144 10 57 -45 -73 61 -145 -2 67 -31 43 -91 -105 70 -46 3 29
14497 29 7 -13 41 -85 37 165 36 10 4 55 40 11 23 -106 -18 29 -10 -181 -35 125 -20 77 11 56 -7 32
14523 32 10 78 11 -82 63 28 -17 28 55 14 74 14 0 32 6 53 -11 -50 97 -82 -25 -56 -12 38 116 -9 67 -127
14551 -127 -58 1 23 -41 30 -53 5 -5 -49 -73 37 -7 -5 4 -1 -56 -139 40 -4 34 20 109 -43 64 -32 -20 -34 -9 46
$$ packed form
14361b9J26j17M4M8r7L6%N1m8Q5o0m5O3kP5p5mn6Nk2n0rJ98r4p8J49j33rQ7K5
14391F4k6Jp4J30k06J43l3rJ30j04OJ0N1j68J03o5O6p4R9rq2j8o0O5p9J61j12
14418i0K09k24R6n2R9Np1OM3J9kK8j47J45l9j11m0KQ1J41j07K7m3P7l6j16J11
14445A1l2j14J73j20k9j3K0J61j14K6l2P0Rj10k4P8J3J6O1j39L8O3O1or6l7Q3
14472A7llj18O7J16j85J35L6Q2j34M7j02k8J34k06J43O9r8P4j34j4J75j16M9K6
14497B9k2k0N4j26J22J28j29k6oN1j5k9J2j29Q8M7l9j71J46J60j45R7o6M5o3L9
14523C2k2O8o7r3J45l5m5M5K7m1O0o0j4L2k6M7o4l9J47j79N7l1M4N0P8j25P6j94
14551a27O9N9K2o4P1q3N8j0m4k4J10m4KRnn5q3J79m4L8j4Q9j52J07r6J2j4K5N5
$$ plain form
14580 46 2 -86 -34 -118 -18 90 -65 36 -13 -87 -21 -42 -51 -152 -15 2 -23 -97 -8 31 114 -171 -8 -33 -127 -74
14606 -74 -29 53 -139 -31 88 51 -85 -53 -15 -78 28 4 -36 155 -116 31 -109 35 -21 -113 -65 -20 -13 -42 9
14631 9 -89 -47 1 78 -6 -119 -79 -5 -210 -62 -71 -29 104 -135 -74 -61 3 -22 65 65 12 22 97 67 111 5 179 67
14659 67 21 -34 -69 14 -115 4 -30 -46 -94 -43 86 80 11 101 52 129 3 15 44 -78 -41 9 17 -32 34 65 35 65
14687 65 -9 -127 110 -23 33 18 87 -20 -105 -95 102 -21 90 69 100 -6 -8 -20 53 64 46 65 50 81 -22 31
14713 31 -40 64 -28 -29 9 -75 -39 26 0 14 -89 -39 98 -81 -36 -41 63 -119 40 89 5 -29 47 -30 27 33 -2 26
14741 26 56 -30 -28 77 -17 -128 -64 26 25 33 -64 2 55 25 30 57 -37 -104 -41 -17 8 -41 -60 -38 -28 28 24 -3 -20 -76 -48
14772 -48 128 12 60 36 71 -34 -12 17 -56 -88 -131 -117 4 19 -2 -56 128 206 96 101 10 -35 70 145 10 43
$$ packed form
14580D6m4q8N2q4J00J08j55J01m9p4O6k1rj01J37J7k5p4Q9L9Q3k85J63k5r4N3
14606g4M5Q2j92J08J19l7j36L2L8o3J06k4m0J91k71J47j40J44n6r2M8M5Pk9N1
14631Ir8M2M8P7q4j13M0P4k05J48rM2J33k39O1J3O4k5Q7%n3J0P5l0M4j06J74j12
14659F7m6n5l5Q3j29J19l4j6m8N1J29oo9R0m9P7j26J2K9j22L7N0Qm9O6L1l0L0
14687F5p4j18K37j33N6j5O9j07q5J0J97j23J11k1L1j06kj2P3J1j8J9j5L1j03N3
14713C1p1J04r2jL8q4L6O5k6J4j03N0J37j79M5nJ04j82J59M9q4l4P6p7N7Ol5K8
14741B6L0q6KJ05r4j11O4R0jQr7O6N3l0NK7r4o7O3K4K5m9j9K2J0N6mk7j7n6K8
14772d8J76j16M8k4L5j05K2K9p3l2m3J4J21J5k1n4J84P8j10Nr1m5J05P5j35L3
$$ plain form
14798 43 19 -37 -87 -48 73 25 32 8 81 170 27 61 27 -23 110 -7 -36 79 66 -57 -16 56 53 17 11 86 -10 -47
14826 -47 -28 11 -6 -88 -53 3 27 -57 -27 -38 -50 58 -43 14 -4 25 -142 -51 47 -51 25 -47 -88 -32 -27 194 2 -75
14854 -75 78 60 9 -55 -68 -71 133 158 -45 17 -16 -79 -96 18 3 -72 -50 83 51 47 4 33 20 -48 85 64 -35 -73
14882 -73 -72 -25 92 19 -115 101 -73 -34 -104 -102 143 -15 -106 -130 243 -132 32 63 -25 -67 -128 -71 0 7 85 -96
14908 -96 18 -32 -52 8 -101 28 -60 -124 -1 -61 4 45 124 80 -88 -41 -114 -69 34 -49 12 103 95 128 95 -28 -54
14935 -54 -95 -22 61 -24 27 -12 26 62 92 -79 35 -44 45 17 20 -83 60 -64 -42 55 -94 120 -132 26 -6 -102
14961 -102 25 74 -71 80 -4 -101 60 -13 92 9 -39 -48 -79 70 -35 53 -41 45 -10 64 29 -8 13 149 -17
14986 -17 61 -5 -45 -31 11 -1 -32 -85 5 -26 -151 -46 23 -38 -46 -55 219 -50 -7 35 -39 -61 -89 -182 59 26 -32 63
$$ packed form
14798D3k4n6n0L9J21m8Pk4P3Q9j43L4l4n0J33j17k9J15j3j23M1P2ll6oP5r6l7
14826d7J9L9j7q2L5N6K4q4L0j1j2J08j01N7j8K9j67R1R8r8P6p2m1N6NK21j92p7
14854g5J53j8n1o4j3lK04K5k03O2l3o3j7J14j5p5K2J33l2mm3K9j3o8J33k1r9l8
14882g3JM7J17p3j34K16j74L9p0KK45j58r1k4L73l75J64L1q8m2o1N7P1PP8j81
14908i6J14n0k0O0j09J29q8o4J23o0O5M1P9m4j68M7p3M5J03q3O1R1qL3l3j23k6
14935e4m1P3Q3q5N1l9L8L6L0j71J14p9Q9k8Lj03J43j24K2R7j49K14k52J58l2r6
14961a02J27M9j45J51q4r7J61p3J05q3m8rl1J49j05Q8r4Q6n5P4l5l7K1J36j66
14986a7P8o6m0J4M2j2l1n3R0l1j25J05O9o1qrK74k69M3M2p4k2k8r3K41l3n8R5
$$ plain form
15014 63 11 38 -117 8 18 -77 33 88 -22 -142 -35 87 15 -87 -91 7 -26 -52 94 22 -12 -32 -86 -23 -18 80
15040 80 145 -18 73 -17 -25 -41 76 25 -102 56 -62 -1 85 -66 -13 -58 -67 -31 -42 -81 -87 19 40 99 62 125 -28
15067 -28 7 49 63 90 -58 27 -56 73 65 -34 -48 7 9 99 63 164 -46 -97 53 -33 22 -48 -8 90 16 -67 -159 -43
15095 -43 43 47 -89 164 -24 -97 32 94 25 22 -76 11 3 33 112 4 -20 42 66 8 -150 45 -16 40 64 87 -82
15122 -82 51 -51 38 31 17 -36 18 42 -101 25 8 131 45 2 -1 -38 33 -138 44 52 69 -56 98 72 -76 -40
15148 -40 14 27 66 45 -56 15 17 33 65 55 -12 -23 20 14 -87 -64 -16 37 28 21 -6 18 36 27 27 20 -72 6 -8 34 81 44
15180 44 -53 -27 -111 1 1 141 13 63 -48 -30 48 -24 157 13 18 4 75 -52 -54 8 -43 -37 32 -26 76 -50 47
15207 47 42 -62 -38 18 -50 51 -90 53 7 -80 21 23 37 -78 -81 10 80 -116 -122 -42 11 -100 -32 81 68 -190 -44
$$ packed form
15014F3n2K7j55J25J0r5J10N5j10j20J07J22p2j02mR8l3k6J46p2l4k0n4O3NR8
15040H0O5j63R1r0qj6J17n1j27J58j18O1Q6j51N3m5rL6j1l9oJ06K1N9l7O3j53
15067b8L5M2J4K7j48Q5q3J29qr9j4N5KR0l6J01k10n1J50q6N5p0M0R8p4q3r2J16
15095d3Q6Mj36K53j88p3J29O2o9lr8Q7qL0P9j08k4O2K4n8j58J95o1N6K4K3j69
15122h2J33j02Q9pj4n3N4K4j43J26j7J23q6m3ll7P1j71J82QJ7j25J54k6j48L6
15148d0N4J3L9k1j01P1KJ6L2j0o7j1M3oj01K3M8N3rpk7K4J8r%pr2P8j4M2M7l7
15180D4r7K6q4J12%J40j28N0j11J8P8p2J81j44Nj4P1j27kO2n1OO9n8J02j26R7
15207D7nj04K4N6o8J01j41J43m6q7J01KJ4j15lR1P0j96oQ0N3j11O8J13j3k58J46
$$ plain form
15234 -44 19 79 24 -18 -51 1 -25 -30 21 34 38 33 -71 52 67 -91 -99 -63 -11 -73 -3 -62 -27 -53 121 32 -5 52 11 92
15264 92 48 -119 -102 -2 -2 1 -28 -28 -7 72 103 51 -11 -39 30 76 67 -29 -54 1 -37 22 -19 62 23 -96 91 -35 -26 8
15294 8 -104 52 -48 -112 126 -155 21 44 -160 -29 67 -55 -46 100 -122 44 -29 41 50 -120 -11 81 -19 41
15318 41 -139 -37 -1 36 -97 3 -97 -98 96 78 -25 -66 184 28 -27 12 76 -9 -42 -45 -68 26 -58 -132 76 -80
15344 -80 134 -71 -146 -4 -37 -12 13 6 49 -37 -143 -70 -117 -56 18 -52 -20 -8 -55 -70 2 -114 -28 -38 -55 -72 -61 3
15372 3 6 49 -80 16 -15 -10 -57 178 -64 77 -1 -58 -7 -61 31 -87 28 -48 5 123 -26 -116 -115 39 -125 -5
15398 -5 58 98 117 0 -77 -13 -21 -41 -93 -63 -168 -13 75 32 5 -4 90 34 -17 15 -14 42 -40 25 22 36 -11 -70 -46 -29
15428 -29 89 -55 -41 33 -139 -43 64 -135 61 18 -130 27 149 1 81 0 70 14 10 -82 -88 -71 -75 -68 42 -81
$$ packed form
15234d4O3O0n5m2l3N2k6nN1J3Mnj04J23J5j58qL6N2o2P0n9L5k6J74q9l7N7m1Q1
15264I2m4j67J7J00%Lk9%K1P9L1n2o2k8O9M6rr6k5N5l8N9m1Q1l9j19J87j26RL4
15294Hj12J56j00o4K38k81J76K3k04J31R6j22RJ46k22J66p3P0Rj70J09R2j00O0
15318D1j80J02L6L7j33J00j00jJ94j8j03m1K50j56n5L9O4q5l3lk3R4q4p4K08j56
15344h0K14k05p5J42l3K5K5pM3q6j06P3m7O1P4p0L2J2m7j5P2j16Q6j0j7j7J1O4
15372CLM3j29R6l1Nm7K35k42J41p8n7N1n4R2j18J15p6N3J18j49r0JJ54j64J20
15398eO3M0J9j17p7O4qk0n2L0j05J55Q8m3k7rR4n6n1L2k9N6q2O5lJ4m7n9K4J7
15428b9J18j44J4P4j72R6J07j99J96m3j48J57J22j48Q0q1P0n6mr2oJ7mPJ10j23
$$ plain form
15454 -81 34 -59 -26 -12 46 -40 55 -2 -82 0 -57 58 81 -44 23 -7 -62 -122 100 37 -9 -98 15 -71 -98 23 0
15481 0 65 -28 111 -60 -53 5 -108 -52 -35 8 -63 4 -7 -75 -10 6 -16 -54 65 -106 -93 66 -114 -88 -51 -5 -57
15508 -57 -113 -109 -22 71 5 -49 -9 196 6 -10 37 -251 -98 27 -97 41 -76 25 28 -19 -9 -6 -66 -72 -74 28 26 133
15536 133 1 46 -85 29 12 37 12 -84 -94 20 147 138 7 20 -89 -27 84 112 -45 63 -1 -52 -24 -81 34
15561 34 -13 16 34 -60 -44 -13 -5 -29 4 -48 -21 75 47 -7 65 9 48 49 -83 31 -114 -114 -3 -70 -198 33 -57 13
15589 13 -117 -14 57 27 23 34 32 43 -16 -64 -72 -89 -14 -107 -24 11 -63 -91 31 -40 25 88 1 15 52 55 105 -75 -152 222
15619 222 -46 -31 2 81 63 -3 36 -109 16 -10 36 6 -46 13 147 -188 149 -14 47 -86 -29 0 -62 108 -8
15644 -8 46 -84 -52 99 36 -89 32 80 47 -44 -27 -12 62 -4 97 -16 6 89 -59 -27 28 18 -6 -86 -49 18 27
$$ packed form
15454h1J15r3L3J4N8q6R5n7q0Q2n7J15K3j25O7l0n5o0K22o3m6q9J13q6k7J21k3
15481@O5r3J39j71PN8j13N6J7M3p1O7j1o8O5J6k2l8J19j71J3J59j80K6L7M6n2
15508e7n6MQ7R3o6n4M0K05j90j6M7k88J53J25j24J38j17J01Lm7J0Lo0okJ02kJ07
15536A33j32M5j31J14j7K5k5r6j0J14J27rj31J3j09O2J11K8j57J08o4n1K8n7J15
15561C4m7K9J8r4J6L1Qk4L3n2K7R6k8n4P2n6L9Jj32J14j45%J11o7j28K31r0P0
15589A3j30J03P1l0mJ1kJ1n9m8qj7P5r3Q3L5p4k8J22p1O5O3q7J4L7LN0j80p7L74
15619B22k68J5L3P9j8o6L9j45J25k6M6l0n2N9J34l35L37j63O1j33N7K9o2J70j16
15644hN4j30L2J51o3j25J21M8l3r1J7J5P4o6J01j13K2Q3j48L2N5j0k4q0L7O7R
$$ plain form
15671 27 -32 -34 67 -16 67 -10 -70 -41 -76 27 -14 34 94 20 47 -158 -48 -59 22 7 -46 112 117 -58 -77 20 30 4
15699 4 -27 69 43 -21 90 -65 -100 -64 -32 82 19 -30 6 -26 59 -43 114 -14 -11 -60 -84 -64 -64 -47 31 -73 8 -56
15727 -56 -132 -38 5 -4 17 -58 -107 -118 -131 108 -91 35 -19 -90 -35 -62 -30 -114 -25 -39 97 37 12 9 35 19 38 62 -51
15756 -51 -91 -13 -95 55 2 96 10 90 27 113 9 -50 -97 88 -33 -23 -7 13 -47 -124 -84 47 54 -22 -173 0 45
15783 45 -62 78 -7 9 114 -20 93 -23 46 -15 52 70 55 28 -45 -145 17 -29 22 -64 16 -35 4 -111 -50
15808 -50 82 49 -32 2 29 -3 -3 -46 42 -25 64 -52 5 -19 6 42 -15 4 -24 35 42 -49 -156 84 -96 22 90 -68
15836 -68 176 -198 -88 5 -100 -46 37 29 -91 55 -108 57 -43 -29 80 27 -34 70 38 -55 18 47 -56 -20
15860 -20 65 28 50 32 2 71 -9 -79 -40 -22 -46 37 52 -14 -22 116 32 -1 -7 13 3 -5 -39 17 -101 42 33 112 8 109
$$ packed form
15671B7n9kJ01q3Q3p7o0K9l5J03m1M8O0p4K7k05J10j1Q1j5n3J58Nj75j9R7J0k6
15699Dl1R6k6o4J11j55l5L6L2J14o3m9L6l2Q5j02J57j28Lm9k4K0%J7P8j04Q1o4
15727e6p6R4M3rK1p5m9j1j3K39j99J26n4p1N5k7L2q4Q9j4J36o0k5lK6j6J9K4j13
15756e1m0P8q2J50n3R4q6Q0o3Q6j04n9m7J85j21J0J6K0o0p7M0J31Pp6j51J73M5
15783D5j07J40q5J6J05j34J13j16O9o1O7J8j5k7p3j00J62m6N1q6Q0n1L9j15O1
15808e0J32l3q1L4K7l2%m3Q8o7Q9j16N7k4K5L6n7J9k8N9Pr1j07K40j80J18O8j58
15836f8K44l74J10R3j05N4Q3qj20J46j63J65j00J4J09n3o1J04l2r3P3K9j03L6
15860b0Q5l7K2j8l0O9q0p0L9J8k4Q3J5o6qJ38q4l3oK0j0ql4N6j18J43rP9j04J01
$$ plain form
15890 109 -49 64 33 -132 -49 16 0 4 95 66 -24 -7 36 60 -35 -46 -54 -63 20 -113 -40 -86 -26 10 56 -66 -107 -8
15918 -8 97 -58 -42 8 10 44 108 91 0 17 47 50 32 -64 114 -36 -12 39 13 -21 80 -42 -3 72 69 20 -32 -44 -80
15947 -80 -36 59 -13 -53 28 64 65 -11 60 -133 117 2 -57 2 -44 0 -59 -88 -7 107 -71 -33 3 -35 -44 -37 -61 24 142
15976 142 126 -114 48 111 13 -28 75 128 22 70 63 -30 -68 -71 -158 -47 -139 2 -24 42 35 119 31 5 30 -26 -56 52
16004 52 -137 165 105 -83 170 -30 64 -105 -15 -148 123 22 26 44 -64 -68 -7 82 37 -42 -14 -43 -81 31 -8
16029 -8 63 61 16 -94 -8 71 -93 -93 -52 47 -11 109 -47 2 -31 -8 -20 -102 -69 45 -90 31 -47 -12 9 0 10 -38
16057 -38 17 109 -14 42 -56 20 3 -87 -8 -89 -161 -4 -155 -72 -86 -31 -26 22 -64 77 -16 15 138 -25 51 -107 61
16084 61 20 -32 -151 14 -24 -18 165 97 73 88 29 26 -35 -90 -55 -17 11 -29 -60 4 11 35 117 21 7 -22 92 55 -31
$$ packed form
15890A09j58J13l1j65Q3O5j6MR1k9r0J7M3K4r5j1qrQ3j33P3m6O0L6M6j22m1R9
15918hJ05j55J6N0KL4O4j7r1J7L0Lj8r6J78j50K4N1k6l4J01j22L9P5lm9n2j2l6
15947h0M4R5p2m0Q1L6Jp6P1j93K50j15n9N9m6M4n9k9Q1J14j78L8L6l8rPk4Q5J18
15976A42j6k40J62O3r8m1J03N3j06M8pr3l8lq7J11r2J41k6O6pQ4q8k6K5n6l0J08
16004E2j89L02o0j88K53k00R4j69R0j33K71j01MJ8j08mO1Q9m5p9K8k9l8J12l9
16029hP1km5j10Q6P9j64%M1R9n8J20j56M9l3K3j2q2L3J14j35J21p8L5K1rJ0m8
16057c8N5R2j23N6r8P6j7r0P9q1p2J57j51Q3j4N5NM8q6J41r3L1J23j63P6j58J68
16084F1m1n2j19J65l8OJ83o8k4J5n9lo1n5L5L8K8m0l1O4PK4Q2r6j4k9J14l7q6
$$ plain form
16113 -31 -95 -73 22 -76 61 100 58 9 2 -48 -128 -27 25 138 -26 -118 56 14 48 -66 -27 -8 24 -80 -126 24
16139 24 36 -130 -15 110 -51 -37 32 -25 68 -77 25 -60 -11 25 -151 -71 3 11 23 36 -21 -87 0 23 -9 51 94
16166 94 -78 31 27 -35 -66 -21 -24 95 124 -33 -13 17 48 13 -8 -24 27 122 50 26 -125 63 -16 17 -15 187 121
16193 121 21 14 -97 27 18 38 27 77 39 41 -101 -10 7 -14 70 -52 -37 -82 -138 -61 35 71 -22 29 -101 -27 80
16220 80 35 -32 118 -19 78 -104 11 85 -71 106 -98 41 -45 -90 -86 -28 -138 -57 -30 -8 23 57 -90 59 -2
16245 -2 1 114 81 -172 -2 8 -143 61 0 -33 -7 102 73 88 -10 21 -25 -91 -66 -29 -33 144 36 75 -71 -154 56
16272 56 -48 -24 15 -54 75 -151 36 -7 35 -22 -2 -42 17 49 -46 106 119 41 15 -34 -18 -30 -27 -36 68 11 -166
16299 -166 -92 -83 -136 18 108 87 -128 60 -74 -48 -90 16 50 -33 89 -21 -47 -30 -49 -105 106 4 65 58 -126
$$ packed form
16113c1o4K2R5r8J37L9m2m9pn0q0J01N2J13j64r2J74m2L4j14L9J9L2j04m6J50
16139B4J2j66J15J25j61J4O9n7R3j45J02q5M9L6j76Q0P4QJ2J3n7o6Q7K3l2O0M3
16166I4j72J09mo2l1M5lJ19K9j57K0L0L1l5k1j6N1R5p2k4j51J88p9L3l2K02o6
16193A21j00pj11J24rK0j1N0l8Kj42R1J7k1Q4j22J5m5n6P7R6L6r3N1j30P4J07
16220H0m5o7J50j37R7j82J15P4j56J77k04J39q6m5MN8j10Q1K7K2L1L4j47J49o1
16245bLJ13l3k53J70J0j51K04o1l3K6J09k9J5r8L1m6o6K5L7mJ77j08L9j46q3K10
16272E6j04K4L9o9J29k26J87m3M2n7K0m0N9L2r5J52J3p8k6m9J6j2LrJ04n7j77
16299a66P4Rn3J54R0k1k15J88j34K6m2J06L4q3J22j10k6J7j9n6K11j02O1pj84
$$ plain form
16324 -126 10 17 -73 -41 3 48 -19 71 -3 -91 -37 31 14 -26 -17 58 46 62 50 -74 -27 23 38 -188 85 -174 30
16351 30 -11 6 102 17 139 -6 22 -12 -17 -64 7 80 -42 53 29 46 97 5 -74 -12 52 -81 -10 32 -1 -88 101 12
16379 12 -75 -45 -19 154
$$ packed form
16324a26J36Pr0L2M4M5o7R0p4q8N4O8j7m0RP5j2J6j2j24M7N0J5k26K73k59K04
16351C0m1J7R6q5J22j45K8l4nm7P1P3j22R5k4J7N1r2p9O2O4j33P1M2l3q7J89q9
16379A2q7L0K6J73
16383A54
$$ Imaginary data points
##PAGE= N=2
##DATA TABLE= (X++(I..I)), XYDATA
$$ plain form
0 0 0 0 0 0 0 0 0 0 0 0 0 0 -27 32 -32 32 -32 64 -64 64 -96 96 -128 160 -161 193 -225 257 -320 353 -416 450
32 450 -514 602 -673 762 -852 961 -1058 1186 -1315 1471 -1630 1798 -1990 2204 -2432 2682
48 2682 -2954 3256 -3584 3953 -4352 4803 -5307 5877 -6524 7268 -8133 9149 -10372 11868
62 11868 -13763 16229 -19608 24527 -32401 47085 -84056 383708 544003 -219080 -408728
73 -408728 -287380 -39221 -108131 228072 488930 331290 -221914 -528379 -164598 157794
83 157794 87441 -10966 41220 175903 -155650 -391198 -137467 267471 310027 -134865 -313734
94 -313734 -119110 -4884 -2697 15656 279046 233626 -219974 -448500 -182267 314793 345142
105 345142 65793 -4915 -834 -89817 -285658 -100242 370171 449695 114315 -250379 -213834
$$ packed form
0@%%%%%%%%%%%%k7N9o4O4o4R6j28J28j60J92k24K88l21L54m18M82n77O73p69Q66
32D50r64J116j275J435j614J813k019K244k501K786l101L428l788M194m636N114
48B682n636O210o840P537q305R155j0110J1184j2401J3792j5401J7282j9521K2240
62A1868k5631K9992l5837M4135n6928P9486j31141M67764J60295p63083j89648
73d08728J21348K48159o8910L36203K60858j57640n53204l06465L63781L22392
83A57794p0353r8407N2186J34683l31553k35548K53731M04938M2556m44892j78869
94c13734J94624J14226K187J8353K63390m5420m53600k28526K66233M97060L0349
105C45142k79349p0708M081q8983j95841J85416M70413P9524l35380l64694L6545
$$ plain form
116 -213834 -62338 -105323 3127 288862 449410 93542 -428157 -420934 -70319 176568
126 176568 115799 66329 163771 10598 -276280 -331057 -12222 253244 61603 -152304 -88790
137 -88790 88352 45477 -138881 -26074 164516 82928 -195815 -250598 78725 269798 159283
148 159283 14441 8977 -916 -213852 -242590 94667 414199 323371 -81177 -235304 -116321
159 -116321 -43089 -45282 46617 271015 228518 -111852 -308982 -170897 76390 74754 515
170 515 84233 120470 -61788 -306861 -210952 117771 214716 45381 -105168 -38020 7523
181 7523 -95947 -87170 80003 174873 -6080 -191262 -56100 167248 170442 -23199 -88874
192 -88874 14367 -2353 -100021 -47398 186751 279049 52535 -163801 -158423 -53234 -37386
$$ packed form
116b13834J51496m2985J08450K85735J60548l55868n21699P223L50615K46887
126A76568o0769m9470R7442j53173k86878n4777L18835K65466j91641k13907O3514
137h8790J77142m2875j84358J12807J90590q1588k78743n4783L29323J91073j10515
148A59283j44842n464r893k12936k8738L37257L19532r0828m04548j54127J18983
159a16321P3232k193R1899K24398m2497l40370j97130J38085K47287j636p4239
170E15Q3718L6237j82258k45073R5909L28723R6945j69335j50549O7148M5543
181G523j03470Q777J67173R4870j80953j85182J35162K23348L194j93641o5675
192h8874J03241j6720r7668N2623K34149R2298k26514k16336N378J05189J5848
$$ plain form
203 -37386 -19428 169033 280713 89392 -232269 -306043 -75731 92400 82586 58229 91587
214 91587 42367 -155560 -220976 -43755 132299 91422 -55429 -40078 45622 2706 -96763
225 -96763 -58420 103356 110244 -51389 -117653 -1949 115217 59545 -18899 10051 23580
236 23580 -57744 -109908 34034 206728 146250 -65733 -170246 -77815 13848 16264 58941
247 58941 140683 113151 -80804 -220502 -130823 31420 88728 61623 76481 79923 -57244
258 -57244 -206451 -167933 37262 159630 87206 -6340 -20429 -22675 -73088 -78657 31663 104314
270 104314 35174 -65718 -39519 67215 68249 -18598 -50201 -1032 16640 -35873 -24911 73155
282 73155 119371 32626 -84255 -90441 -37047 -11271 17315 89962 134395 31526 -134419 -172826
$$ packed form
203c7386J7958J88461J11680j91321l21661p3774K30312J68131r814k4357L3358
214I1587m9220j97927o5416J77221J76054m0877j46851J5351Q5700m2916r9469
225i6763L8343J61776O888j61633o6264J15704J17166n5672p8444K8950J3529
236B3580q1324n2164J43942J72694o0478k11983j04513R2431R1663K416M2677
247E8941Q1742k7532j93955j39698Q9679J62243N7308k7105J4858L442j37167
258e7244j49207L8518K05195J22368p2424r3546j4089k246n0413n569J10320P2651
270A04314o9140j00892K6199J06734J034q6847l1603M9169J7672n2513J0962R8066
282G3155M6216q6745j16881o186N3394K5776K8586P2647M4433j02869j65945l8407
$$ plain form
294 -172826 -56119 73273 97582 71479 45198 -19137 -110763 -135349 -30398 90933 101072
305 101072 36582 -7856 -15668 -49595 -84714 -36132 62113 97725 28785 -40968 -31959 546
317 546 2349 -9467 6669 17907 -14598 -32258 12797 72988 53300 -36761 -85803 -55192 2439
330 2439 34878 53701 69488 35114 -47786 -106381 -77628 7744 65908 80237 65309 19142
342 19142 -57514 -116863 -83371 22372 104460 99500 30518 -33964 -70942 -71755 -30496 32242
354 32242 70805 48690 -2062 -29989 -28268 -18508 -16527 -6074 12016 16847 6733 -3715 2393
367 2393 8720 -2583 -22790 -36442 -26431 3059 39517 61909 43047 -10554 -66513 -78956
379 -78956 -32794 39527 90459 81669 22009 -45113 -76706 -56373 -6627 45743 75712 62674
$$ packed form
294a72826J16707J29392K4309k6103k6281o4335r1626k4586J04951J21331J0139
305A01072o4490m4438p812l3927l5119M8582R8245L5612o8940o9753R009L2505
317E46J803j1816J6136J1238l2505j7660M5055O0191j9688r0061m9042L0611N7631
330B439L2439J8823J5787l4374q2900n8595K8753Q5372N8164J4329j4928m6167
342A9142p6656n9349L3492J05743Q2088m960o8982o4482l6978q13M1259O2738
354C2242L8563k2115n0752k7927J721R760J981J0453J8090M831j0114j0448O108
367B393O327j1303k0207j3652J0011K9490L6458K2392j8862n3601n5959j2443
379g8956M6162P2321N0932q790n9660o7122l1593K0333M9746N2370K9969j3038
$$ plain form
391 62674 10630 -50292 -73487 -45933 3852 43989 55595 37219 -9500 -57820 -64209 -22345
403 -22345 25657 32377 7885 -7928 -7157 -8037 -16287 -14048 -3088 -6323 -16369 -3385 33335 48012
417 48012 14766 -26442 -36329 -23346 -14302 3864 49706 84593 55064 -22860 -73409 -60067
429 -60067 -18169 22173 62794 88361 54275 -35865 -97249 -70149 1050 37847 33835 31715
441 31715 25577 -15720 -66284 -61993 -4625 29294 11106 -7552 5017 8272 -25153 -43008 -6915
454 -6915 30444 10501 -29661 -14865 34683 38989 -5543 -27334 -4167 8370 -6458 6564
466 6564 56657 67488 231 -64729 -46862 12743 33341 24146 40504 57004 7027 -77415
478 -77415 -91534 -18109 45662 43676 26999 30028 4579 -69292 -106584 -42499 46115 54474 4954
$$ packed form
391F2674n2044o0922k3195K7554M9785M0137J1606j8376m6719m8320o389M1864
403b2345M8002O720k4492j5813P71q80q250K239J0960l235j0046J2984L6720J4677
417D8012l3246m1208r887J2983R044J8166M5842L4887k9529p7924n0549J3342
429f0067M1898M0342M0621K5567l4086r0140o1384K7100P1199L6797m012k120
441C1715o138m1297n0564M291N7368L3919j8188j8658J2569L255l3425j7855L6093
454f915L7359j9943m0162J4796M9548M306m4532k1791K3167J2537j4828J3022
466F564N0093J0831o7257o4960J7867N9605K0598r195J6358J6500m9977q4442
478g7415j4119P3425O3771j986j6677L029k5449p3871l7292O4085Q8614Q359m9520
$$ plain form
491 4954 -9631 10470 -8769 -58505 -53717 10913 41720 4992 -15523 24953 50461 1833
503 1833 -50185 -24937 27286 21023 -11323 15211 72263 54921 -28956 -63532 -13962 28250
515 28250 12820 7905 48390 53453 -25253 -91722 -49665 36050 47030 248 -7895 16879 -11909
528 -11909 -78676 -72435 17336 68169 21944 -28947 -13428 2018 -41692 -70991 -8120 72600
540 72600 57118 -16325 -27620 19432 18158 -38450 -43015 27771 66641 23398 -9358 28814
552 28814 52273 -10337 -74602 -36662 46417 54869 8093 9137 46396 16170 -73076 -91757
564 -91757 -7077 57439 28872 -9199 12773 22290 -44378 -100301 -45254 50268 52707 -15202
576 -15202 -29389 14379 9221 -52802 -55851 24983 67716 11442 -39081 -1354 41932 2509
$$ packed form
491D954j4585K0101j9239m9736M788O4630L0807l6728k0515M0476K5508m8628
503A833n2018K5248N2223o263l2346K6534N7052j7342q3877l4576M9570M2212
515B8250j5430m915M0485N063p8706o6469M2057Q5715J0980m6782q143K4774k8788
528a1909o6767O241Q9771N0833m6225n0891J5519J5446m3710k9299O2871Q0720
540G2600j5482p3443j1295M7052j274n6608m565P0786L8870m3243l2756L8172
552B8814K3459o2610o4265L7940Q3079Q452m6776J044L7259l0226q9246j8681
564i1757Q4680O4516k8567l8071K1972R517o6668n5923N5047R5522K439o7909
576a5202j4187M3768n158o2023l049Q0834M2733n6274n0523L7727M3286l9423
$$ plain form
588 2509 -47720 -7047 66489 51845 -20546 -24893 34653 36913 -31754 -48648 25290 71617 21922
601 21922 -28733 -1116 26969 -25962 -80412 -29305 64295 64463 -11954 -38104 -2603 -10543 -71911
614 -71911 -69435 25125 82755 28097 -38463 -22788 8872 -29394 -70997 -17103 71533 65639
626 65639 -12527 -30814 20981 26842 -35662 -50195 24389 73490 25708 -23563 10125 49031
638 49031 853 -63735 -30552 52507 55556 -10209 -23313 24124 20301 -50807 -67359 12627
650 12627 67741 18014 -43980 -24535 12104 -22563 -65939 -17381 66524 55803 -31628 -60965
662 -60965 -9999 11053 -29484 -30701 42594 79360 12667 -55889 -29185 25781 8719 -32644
674 -32644 984 69465 57132 -19845 -38796 14419 28469 -27242 -45567 21497 71193 27257
$$ packed form
588B509n0229M0673P3536j4644p2391m347N9546K260o8667j6894P3938M6327m9695
601B1922n0655K7617K8085n2931n4450N1107R3600J68p6417k6150L5501p940o1368
614g1911K476R4560N7630n4658o6560J5675L1660l8266m1603N3894Q8636n894
626F5639p8166j8287N1795N861o2504j4533P4584M9101m7782m9271L3688L8906
638D9031m8178o4588L3183Q3059L049o5765j3104M7437l823p1108j6552P9986
650A2627N5114m9727o1994J9445L6639l4667m3376M8558Q3905j0721q7431k9337
662f0965N0966K1052m0537j217P3295L6766o6693o8556K6704N4966j7062m1363
674c2644L3628O8481j2333p6977j8951N3215J4050n5711j8325O7064M9696m3936
$$ plain form
686 27257 -29973 -13190 18951 -18714 -69835 -31125 55699 63750 -7129 -40112 -7675 -3164
698 -3164 -52384 -56097 23574 77037 25769 -44746 -34851 7604 -7488 -41175 -3888 65431 53625
711 53625 -26795 -52650 1923 32177 -4523 -20590 30263 60192 5813 -50341 -20618 35951
723 35951 21753 -26942 -11960 44322 38604 -25720 -43622 5158 23495 -22766 -41935 14413
735 14413 58375 16449 -43251 -33557 4233 -11047 -44343 -10755 58949 57327 -16924 -54859
747 -54859 -20750 3544 -20788 -21256 38025 73300 19991 -48685 -39671 8753 10078 -16871 5349
760 5349 56065 44697 -24108 -48490 -1876 27786 -2991 -22739 16476 46730 7198 -41723
772 -41723 -23573 21088 10567 -30407 -18234 33285 34967 -19344 -41439 -4740 15881 -15457
$$ packed form
686B7257n7230J6783L2141l7665n1121L8710Q6824Q051p0879l2983L2437M511
698c164m9220l713P9671N3463n1268p0515R895M2455j5092l3687L7287O9319j1806
711E3625q0420k5855N4573L0254l6700j6067N0853K9929n4379n6154K9723N6569
723C5951j4198m8695J4982N6282n718o4324j7902M8780J8337m6261j9169N6348
735A4413M3962m1926n9700R694L7790j5280l3296L3588O9704j622p4251l7935
747e4859L4109K4294k4332m68N9281L5275n3309o8676R014M8424J325k6949K2220
760E349N0716j1368o8805k4382M6614K9662l0777j9748L9215L0254l9532m8921
772d1723J8150M4661j0521m0974J2173N1519J682n4311k2095L6699K0621l1338
$$ plain form
784 -15457 -29434 15647 50817 12794 -42053 -34311 6892 7439 -17008 2147 48307 39656 -23581
797 -23581 -51922 -13618 19526 4762 -4992 28265 47405 3693 -48313 -35110 12613 19454
809 19454 -5804 1410 35050 26601 -25314 -45104 -7683 20196 -88 -15860 13053 36947
821 36947 5960 -37526 -28824 7801 8815 -15074 -3983 33539 31038 -17407 -41088 -12281 13393
834 13393 238 -8392 20312 39460 5255 -39632 -32289 6869 16243 -998 5346 30699 20664
847 20664 -25303 -42902 -8872 21132 10567 -3218 13535 25618 -3276 -37502 -25728 11496
859 11496 18210 -1818 -467 21740 16973 -19122 -33991 -7098 16417 6310 -4581 12831 26347
872 26347 1793 -31493 -26033 4765 13827 1244 5045 22954 14952 -21364 -37189 -11786 15040
$$ packed form
784a5457j3977M5081L5170l8023n4847P742M1203N47k4447J9155M6160q651o3237
797b3581k8341L8304L3144j4764r754L3257J9140m3712n2006J3203M7723O841
809A9454k5258P214L3640q449n1915j9790L7421K7879k0284j5772K8913K3894
821C6947l0987m3486Q702L6625J014k3889J1091L7522k501m8445k3681K8807K5674
834A3393j3155q630K8704J9148l4205m4887P343L9158R374j7241O344K5353j0035
847B0664m5967j7599L4030L0004j0565j3785J6753J2083k8894l4226J1774L7224
859A1496O714k0028J351K2207m767l6095j4869K6893K3515j0107j0891J7412J3516
872B6347k4554l3286N460L0798R062j2583L801J7909q002l6316j5825K5403K6826
$$ plain form
885 15040 12241 3306 12622 17287 -8034 -35670 -25365 8238 20498 8177 4639 13800 4969
898 4969 -22777 -30545 -4396 20149 15498 3679 8908 13497 -5134 -26119 -17969 8566 17553
911 17553 7682 6107 15248 8367 -16643 -27440 -9401 11255 11537 5798 11034 12394 -7101 -28326
925 -28326 -23374 530 13260 8837 6548 9205 -447 -21031 -26723 -7415 13439 14926 6821 5049
939 5049 2611 -10296 -20552 -10711 10937 19771 12271 4640 3598 -2294 -13026 -13366 2671 17632
953 17632 16883 8097 3517 -188 -10053 -17530 -10451 6545 15781 12542 6257 315 -9839 -21194
967 -21194 -21845 -7310 9893 16112 11920 3782 -6976 -18835 -23820 -14646 3240 16426 17787 10943
981 10943 341 -10666 -17013 -13363 -291 13492 19196 15689 6835 -2924 -8943 -8494 -1933 6808
$$ packed form
885A5040k799q935R316M665k5321k7636J0305L3603J2260j2321l538R161q831
898D969k7746p768K6149K4545m651j1819N229M589j8631k0985Q150K6535Q987
911A7553r871j575R141o881k5010j0797J8039K0656K82n739N236J360j9495k1225
925b8326M952K3904J2730m423k289K657r652k0584n692J9308K0854J487q105j772
939E049k438j2907j0256R841K1648Q834p500p631j042n892j0732l40J6037J4961
953A7632p49q786m580l705r865p477P079J6996R236l239o285n942j0154j1355
967b1194o51J4535J7203O219m192q138j0758j1859m985R174J7886J3186J361o844
981A0943j0602j1007o347L650J3072J3783N704l507q854r759o019M49O561Q741
$$ plain form
995 6808 13283 14273 8681 -673 -7928 -9104 -5665 -515 5211 9310 7638 -1693 -11995 -14862 -10558
1010 -10558 -4635 997 6931 9662 2439 -11819 -19908 -15734 -5401 3253 10342 16030 12926 -2691
1024 -2691 -18256 -18379 -5839 6367 12921 18810 21259 10845 -8876 -18838 -10666 2827 9431 13341
1038 13341 19524 18232 1512 -16974 -18073 -6337 1113 1715 7440 15463 9683 -10528 -22446 -15668
1052 -15668 -5147 -3795 -2266 8094 13363 -560 -19037 -18964 -4821 2016 -722 3722 14078 10143
1066 10143 -8923 -17904 -4686 10896 10379 6035 11587 14849 -288 -17241 -11039 10389 18161
1079 18161 9429 6322 12026 5493 -15641 -23223 -5005 13741 10952 1976 5819 8506 -8931 -29575
1093 -29575 -24011 530 10499 2348 1399 11432 5458 -20054 -32145 -13454 8733 9189 3426 12320
$$ packed form
995F808O475R90n592r354p255j176L439N150N726M099j672r331j0302k867M304
1010a0558N923N632N934K731p223j4258q089M174J0333Q654P089N688l104j5617
1024b691j5565j23J2540J2206O554N889K449j0414j9721r962Q172J3493O604L910
1038A3341O183j292j6720j8486j099J1736P450O02N725Q023n780k0211j1918O778
1052a5668J0521J352J529J0360N269j3923j8477P3J4143O837k738M444J0356l935
1066A0143j9066q981J3218J5582n17m344N552L262j5137j6953O202K1428P772
1079A8161q732l107N704o533k1134p582J8218J8746k789q976L843K687j7437k0644
1093b9575N564K4541R969q151r49J0033n974k5512j2091J8691K2187M56n763Q894
$$ plain form
1107 12320 18930 -9 -24898 -20836 5219 16515 7781 7473 19884 16299 -9622 -22903 -4151
1120 -4151 16564 11888 299 7111 16458 1350 -21387 -16236 8790 14898 -2352 -8584 4831
1133 4831 6255 -15354 -25770 -5260 15296 6385 -10594 -5008 7107 -5117 -25761 -17719 11995
1146 11995 20557 2728 -5423 7410 7916 -15416 -25565 -183 26665 20663 2551 5599 14525
1159 14525 -2220 -26535 -17797 16473 28367 10086 -487 10333 8212 -18671 -31384 -6053
1171 -6053 21648 14859 -4800 -1268 10285 -4849 -30583 -24132 8091 18305 -1700 -10914 5266
1184 5266 9667 -14130 -27869 -5154 19909 11098 -9114 -2494 14979 4890 -19272 -14178 16307
1197 16307 24559 2171 -9081 7599 14306 -7654 -20986 2271 27578 16753 -7932 -6287
$$ packed form
1107A2320O610j8939k4889M062K6055J1296q734l08J2411l585k5921j3281J8752
1120d151K0715m676j1589O812R347j5108k2737N151K5026O108j7250o232J3415
1133D831J424k1609j0416K0510K0556q911j6979N586J2115j2224k0644Q042K9714
1146A1995Q562j7829q151J2833N06k3332j0149K5382K6848o002j8112L048Q926
1159A4525j6745k4315Q738L4270J1894j8281j0573J0820k121k6883j2713K5331
1171f053K7701o789j9659L532J1553j5134k5734O451L2223J0214k0005r214J6180
1184E266M401k3797j3739K2715K5063q811k0212O620J7473j0089k4162N094L0485
1197A6307Q252k2388j1252J6680O707k1960j3332K3257K5307j0825k4685J645
$$ plain form
1209 -6287 9048 -1092 -23852 -16258 17277 26860 1557 -15126 -2829 2546 -18381 -29007 -1687
1222 -1687 27367 17244 -10141 -11184 3575 -5180 -26844 -17610 17991 29367 4202 -12146 1610
1235 1610 9288 -11477 -23835 1145 29033 19269 -6515 -4820 12744 4889 -19493 -15423 15757
1248 15757 25786 2079 -12750 3087 12348 -8726 -24577 -3845 22261 12873 -12483 -10991
1260 -10991 7311 1502 -21745 -17769 13506 23843 -1137 -18293 -4345 6834 -9720 -21218
1272 -21218 1794 28477 17350 -12019 -14413 3954 2305 -15799 -9132 22083 30672 2493 -18040
1285 -18040 -5146 8035 -5801 -16958 4765 29583 17226 -12653 -14836 4218 3004 -16953
1297 -16953 -13366 15716 25120 -270 -18469 -4884 7575 -8130 -22003 -2654 23204 15101
$$ packed form
1209f287J5335j0140k2760P594L3535R583k5303j6683J2297N375k0927j0626K7320
1222a687K9054j0123k7385j043J4759q755k1664R234L5601J1376k5165j6348J3756
1235A610P678k0765j2358K4980K7888r764k5784J695J7564p855k4382M070L1180
1248A5757J0029k3707j4829J5837R261k1074j5851K0732K6106r388k5356J492
1260a0991J8302n809k3247L976L1275J0337k4980j7156J3948J1179j6554j1498
1272b1218K3012K6683j1127k9369k394J8367j649j8104O667L1215Q589k8179k0533
1285a8040J2894J3181j3836j1157K1723K4818j2357k9879k183J9054j214j9957
1297a6953L587K9082R404k5390j8199J3585J2459j5705j3873J9349K5858q103
$$ plain form
1309 15101 -11488 -13190 5068 3144 -17112 -14663 14506 25798 2360 -16248 -4183 8690
1321 8690 -4532 -16794 2161 26656 17008 -11510 -15376 3182 5429 -10901 -8346 17443 25032
1334 25032 -961 -21175 -8877 7438 -1467 -12912 2986 23655 12219 -16037 -18740 1473
1346 1473 5868 -9920 -9250 14385 21875 -1886 -20260 -7751 7917 -1662 -13839 1306 22642
1359 22642 14034 -12105 -15585 2474 5422 -10182 -9131 14748 23303 1051 -18052 -8139 6451
1372 6451 -1482 -12195 2493 22613 13493 -13078 -17621 -64 5522 -7059 -6273 14194 20573
1385 20573 -2026 -20421 -9760 6697 1805 -8304 2982 19676 10470 -14053 -17400 922
1397 922 7605 -4310 -5438 11974 17817 -2204 -18696 -8645 6777 1942 -8350 1463 17542
$$ packed form
1309A5101k6589j702J8258j924k0256K449K9169J1292k3438j8608J2065J2873
1321H690j3222j2262J8955K4495r648k8518l866J8558K247j6330K555K5789P589
1334B5032k5993k0214J2298J6315q905j1445J5898K0669j1436k8256k703K0213
1346A473M395j5788O70K3635P490k3761j8374J2509J5668r579j2177J5145K1336
1359B2642q608k6139l480J8059K948j5604J051K3879Q555k2252j9103R913J4590
1372F451p933j0713J4688K0120r120k6571m543J7557N586j2581P86K0467O379
1385B0573k2599j8395J0661J6457m892j0109J1286J6694r206k4523l347J8322
1397I22O683j1915j128J7412N843k0021j6492J0051J5422m835j0292R813J6079
$$ plain form
1410 17542 10129 -12599 -16336 -70 6186 -4661 -5705 11142 17111 -1623 -17812 -9085 6070
1423 6070 2708 -6005 3056 17188 9176 -12350 -16069 312 8126 -813 -2237 11252 15151 -3065
1437 -3065 -18002 -9070 6843 5343 -3119 3162 14051 6020 -13720 -16754 -1099 7197 -231 -2490
1451 -2490 8617 11948 -4417 -18192 -10365 4436 4160 -2932 2808 13173 6481 -11706 -15316 -1346
1465 -1346 6906 1115 -546 9674 13170 -1395 -14559 -7706 5644 5796 -749 3683 12161 6222
1479 6222 -9889 -12963 -75 7346 1528 -1447 6112 8157 -4345 -15076 -7812 4818 5032 -1743
1493 -1743 248 6376 891 -12257 -13525 -808 7537 3099 -332 4620 5663 -5348 -13987 -6813
1507 -6813 6232 8674 3616 4447 8264 2286 -10044 -11486 237 9153 7082 4327 7281 6467 -4345
$$ packed form
1410A7542p413k2728l737J6266O256j0847j044J6847N969j8734j6189Q727J5155
1423F070l362q713R061J4132q012k1526l719J6381P814q939j424J3489L899j8216
1437c065j4937Q932J5913j500q462O281J0889q031j9740l034J5655Q296p428k259
1451b490J1107L331j6365j3775P827J4801k76p092N740J0365o692j8187l610J3970
1465a346Q252n791j661J0220L496j4565j3164O853J3350J52o545M432Q478n939
1479F222j6111l074J2888P421n818k975P559K045j2502j0731P264J2630K14o775
1493a743J991O128n485j3148j268J2717Q345m438l431M952J043j1011q639P174
1507f813J3045K442n058Q31L817n978j2330j442J1723Q916k071k755K954q14j0812
$$ plain form
1522 -4345 -13075 -7677 3701 6884 3321 3638 5807 137 -10888 -12686 -3696 4118 2788 647 3071
1537 3071 2915 -5335 -12059 -7547 1874 4520 1520 1630 3784 275 -7000 -7369 816 7021 5609 2911
1553 2911 3528 2977 -2642 -6463 -1773 6539 8765 5132 2642 1796 -2201 -7327 -6207 1638 7607 6642
1569 6642 2707 25 -3263 -8536 -10520 -5325 3133 6683 4647 1096 -2236 -6905 -10682 -8824 -1419
1584 -1419 5470 7135 5188 2073 -2037 -6407 -7639 -3348 3348 7807 8271 5980 2328 -1828 -4746
1599 -4746 -3801 534 5276 7489 6466 3052 -956 -3948 -4394 -2173 1229 4001 4178 1348 -3101 -5842
1615 -5842 -5628 -3684 -957 1693 3144 1369 -3224 -7172 -7146 -3789 -338 2648 4957 4940 782 -5142
1631 -5142 -7229 -3986 855 4112 6707 8537 6677 -252 -6219 -5903 -992 2973 5445 8152 9125
$$ packed form
1522d345q730N398J1378L183l563L17K169n670j1025j798Q990P814j330k141K424
1537C071j56q250o724M512R421K646l000J10K154l509p275l69Q185O205j412k698
1553B911O17n51n619l821M690Q312K226l633k490q46l997n126J120P845N969r65
1569F642l935k682l288n273j984N195Q458L550k036l551l332m669l777J858P405
1584a419O889J665j947l115m110m370j232M291O696M459M64k291l652m156k918
1599d746R45M335M742K213j023l414m008k992m46K221L402K772J77k830m449k741
1615e842K14J944K727K650J451j775m593l948K6L357L451K986K309j7m158n924
1631e142k087L243M841L257K595J830j860o929n967L16M911L965K472K707R73
$$ plain form
1646 9125 4092 -4538 -8424 -5526 -903 1184 3364 6870 6220 -1426 -9191 -9470 -4664 -1829 -797
1661 -797 2545 5934 2564 -5809 -9388 -5203 -659 -582 315 4843 6087 -25 -6722 -4871 1596 3399
1677 3399 1694 3457 7206 4366 -3879 -5999 700 5819 4086 2115 4843 5600 -1729 -8929 -5633
1692 -5633 2994 4998 1574 1724 4515 103 -9764 -11997 -3472 4137 2615 103 3231 3902 -4765
1707 -4765 -13088 -9122 1373 4954 1998 3011 6984 3206 -7631 -11114 -2000 6217 4524 2175
1721 2175 6535 8877 456 -9194 -6465 3783 6162 1569 2221 7704 5094 -6030 -10115 -1445 5695
1736 5695 1924 -2621 1922 5617 -2119 -11286 -7734 3329 4919 -1914 -2666 3374 1775 -8367 -10905
1751 -10905 -79 8384 3785 -2503 939 5158 -2203 -10722 -5322 7532 10037 2195 -267 5088
$$ packed form
1646I125n033q630l886K898M623K087K180L506o50p646p765k79M806K835J032
1661g97L342L389l370q373l579M185M544P7Q97M528J244o112o697J851O467J803
1677C399j705J763L749k840q245k120O699N119j733j971K728P57p329p200L296
1692e633Q627K004l424J50K791m412r867k233Q525P609j522k512L128O71q667
1707d765q323L966J0495L581k956J013L973l778j0837l483R114Q217j693k349
1721B175M360K342q421r650K729J0248K379m593O52N483k610j1124m085Q670P140
1736E695l771m545M543L695p736r167L552J1063J590o833p52O040j599j0142k538
1751a0905J0826Q463m599o288L442M219p361q519N400J2854K505p842k462N355
$$ plain form
1765 5088 3281 -7539 -10016 1653 11070 6392 -985 2002 5890 -2054 -12100 -7764 5379 8524
1779 8524 816 -1549 4133 2543 -9152 -13314 -2167 8005 3915 -3280 550 5558 -1886 -12508
1793 -12508 -8451 5159 8456 355 -2091 4473 4152 -6600 -10533 1074 11001 5406 -3237 -11
1807 -11 6241 221 -9553 -5088 8219 10140 -234 -4290 2593 3493 -6336 -9826 1721 11121 4468
1822 4468 -5511 -2780 3872 -1274 -11032 -6830 6882 9575 -667 -5024 1419 2506 -7495 -11242
1836 -11242 634 11517 6286 -3619 -1648 4640 -859 -10714 -6770 7920 11728 1707 -3628 2151
1850 2151 3275 -6402 -10220 1451 12314 6698 -4358 -2981 4049 -106 -9627 -6128 7514 10361
1864 10361 -741 -6315 136 3236 -5222 -9542 1008 10893 4701 -6423 -4336 3914 1008 -8562
$$ packed form
1765E088j807j0820k477J1669R417m678p377K987L888p944j0046M336J3143L145
1779H524p708k365N682j590j1695m162J1147J0172m090p195L830N008p444j0622
1793a2508M057J3610L297q101k446O564l21j0752l933J1607R927n595q643L226
1807a1O252o020r774M465J3307J921j0374m056O883R00r829l490J1547R400o653
1822D468r979K731O652n146r758M202J3712K693j0242m357O443J087j0001l747
1836a1242J1876J0883n231r905J971O288n499r855L944J4690L808j0021n335N779
1850B151J124r677l818J1671J0863n616j1056J377P030m155r521L499J3642K847
1864A0361j1102n574O451L100q458m320J0550R885o192j1124K087Q250k906r570
$$ plain form
1878 -8562 -5877 7172 10215 -438 -6113 642 3809 -4643 -9172 1477 11992 6200 -5026 -3974
1892 -3974 3462 452 -8824 -5710 7990 11468 662 -6387 -990 2369 -4973 -8711 1997 12227
1906 12227 6100 -6038 -5830 2208 784 -7340 -4716 7851 10635 -660 -7642 -1636 3334 -3073
1920 -3073 -7316 1912 11156 5175 -6392 -5815 2985 1949 -6569 -4975 6609 9826 -268 -7169
1934 -7169 -1418 3128 -3358 -7779 1379 10953 5605 -5694 -5805 2098 1250 -6663 -4684 7338 10744
1949 10744 453 -6936 -2256 2464 -2819 -6275 2336 11279 5663 -6097 -6409 1687 2152 -4909 -3703
1964 -3703 6511 9239 -717 -7840 -2569 2806 -1580 -5655 1294 9066 3791 -6905 -6893 1541 2597
1979 2597 -4171 -3889 5409 8208 -913 -7688 -2925 2885 -876 -4370 2153 9750 4912 -5834 -6488
$$ packed form
1878h562K685J3049L043j0653n675O755L167q452m529J0649J0515n792j1226J052
1892c974P436l010r276L114J3700L478j0806p049N397L359p342l738J0708J0230
1906A2227o127j2138K08Q038j424q124K624J2567K784j1295o982O006M970o407
1920c073m243R228R244n981j1567N77Q800j036q518J594J1584L217j0094o901
1934g169N751M546o486m421R158R574n348j1299j11P903q48p913J979J2022L406
1949A0744j0291p389M680M720n283l456Q611Q943n616j1760l12Q096M65p061J206
1964c703J0214K728r956p123N271N375m386m075O949P772n275j0696J2Q434J056
1979B597o768K82R298K799r121o775M763N810l761l494O523P597m838j0746o54
$$ plain form
1994 -6488 1231 2620 -2909 -2130 6709 9396 -60 -7323 -3524 1944 -814 -3805 2563 9324 4389
2009 4389 -6345 -7478 -130 1753 -3409 -3044 4994 7534 -976 -7884 -3982 1330 -1036 -4069 1112
2024 1112 7679 3723 -5583 -6272 1169 3215 -1845 -2311 4655 7249 118 -6015 -2226 3227 1247
2039 1247 -1947 2030 7418 3405 -5439 -6063 1017 3674 -688 -1649 3950 5550 -1655 -7647 -4357
2054 -4357 1499 734 -1938 1312 5853 1514 -7063 -7865 -932 2606 -480 -1021 3939 5656 -1187 -7007
2070 -7007 -4000 1490 1473 -335 3029 7082 3367 -4457 -5637 388 3356 416 -197 4190 5923 89
2086 89 -5215 -3282 1327 1127 -1158 1354 4759 1658 -5139 -6009 -554 2274 -634 -1952 1277 2791
2102 2791 -1910 -5936 -3497 1187 1550 -488 1009 3264 578 -4957 -5084 817 4307 2182 636
$$ packed form
1994f488P719J389n529P79Q839K687r456p263L799N468k758k991O368O761m935
2009D389j0734j133P348J883n162L65Q038K540q510o908L902N312k366l033N181
2024A112O567l956r306o89P441K046n060m66O966K594p131o133L789N453j980
2039A247l194L977N388m013q844o24P080K657m362r61N599J600p205n992L290
2054d357N856p65k672L250M541m339q577q02O933L538l086n41M960J717o843n820
2070g007L007N490j7j808L364M053l715p824j180O025K968k940o13M387J733n834
2086H9n304J933M609k00k285K512L405l101o797q70N455K828k908j318L229J514
2102B791m701m026K439M684L63k038J497K255k686n535j27N901L490k125j546
$$ plain form
2117 636 2735 3371 -1021 -4767 -2288 2398 3546 2319 2906 4007 693 -4897 -5231 -200 3254 2082
2133 2082 679 2097 2026 -2253 -5934 -4373 -338 1137 545 1565 2451 -388 -5036 -5446 -1284 1890
2149 1890 1102 273 1566 2126 -901 -3624 -2281 1089 2327 1839 2351 2810 712 -2570 -2400 1122 3547
2166 3547 2486 1038 1028 990 -971 -2733 -1483 1279 2214 1488 842 115 -2115 -4396 -3796 -355 2460
2183 2460 2091 348 -582 -1252 -3050 -3980 -2527 499 2479 2706 1937 431 -1924 -3787 -2915 276 3408
2200 3408 3789 2801 1669 247 -1217 -2202 -1353 889 2775 3632 2788 1172 -1404 -3051 -2380 -328 1632
2217 1632 2076 1282 -47 -1376 -2088 -2274 -1995 -742 583 1488 805 -1078 -2771 -2912 -1547 171 1613
2234 1613 2011 1110 -544 -1860 -1605 -603 177 1179 2538 3231 1978 -833 -2560 -1750 29 1844
$$ packed form
2117F36K099O36m392l746K479M686J148j227N87J101l314n590l34N031L454j172
2133B082j403J418p1m279l681J561M035J475n92J020Q86k839m648m10M162L174
2149A890p88q29J293N60l027k723J343L370J238m88N12M59k098l282J70L522K425
2166C547j061j448j0l8j961j762J250K762R35p26o46p27k230k281O00L441K815
2183B460l69j743r30o70j798r30J453L026J980K27p69j506k355j863Q72L191L132
2200C408L81r88j132j422j464r85Q49K242J886Q57q44j616k576j647O71K052J960
2217A632M44p94j329j329p12j86K79J253J325R05o83j883j693j41J365J718J442
2234A613L98r01j654j316K55J002P80J002J359O93j253k811j727Q10J779J815
$$ plain form
2250 1844 2852 3410 2228 -599 -2572 -2399 -932 -27 486 1894 2944 1513 -2160 -4335 -3457 -1270
2266 -1270 -30 1044 2312 1809 -976 -3541 -2942 -1022 -501 -349 1400 3268 2256 -1331 -3208 -1651
2282 -1651 477 1056 1394 2801 2684 2 -2200 -1331 931 1054 131 1088 3061 2077 -1649 -3402 -1280
2299 -1280 1041 1138 663 1621 1497 -1697 -4111 -2694 492 993 -320 447 2220 1024 -3070 -4560 -1763
2316 -1763 1474 1470 994 2060 2092 -1237 -4056 -2347 1323 2081 710 1273 3490 2192 -2224 -4136 -1022
2333 -1022 2133 1803 906 2318 2462 -797 -4159 -2484 1386 1586 -457 -23 2588 1699 -2901 -4588
2349 -4588 -1260 1764 1012 -422 1096 1929 -1116 -4290 -2405 1695 2236 -333 -298 2409 1779 -2515
2365 -2515 -4237 -369 3075 1915 89 1145 2100 -831 -4126 -2017 2645 3146 -63 -149 2213 1465
$$ packed form
2250A844J008N58j182k827j973J73J467R05N13J408J050j431l673k175Q78K187
2266a270J240J074J268n03k785k565N99J920N21J52J749J868j012l587j877J557
2282a651K128N79L38J407j17k682k202Q69K262J23r23R57J973r84l726j753K122
2299a280K321R7m75R58j24l194k414J417L186N01j313P67J773j196m094j490K797
2316a763L237mm76J066L2l329k819J709L670P58j371N63K217j298m416j912L114
2333a022L155l30q97J412J44l259l362J675L870K00k043M34K611q89m600j687
2349d588L328L024p52j434J518Q33l045l174J885M100N41k569L5K707o30m294
2365b515j722L868L444j160j826J056R55k931l295K109M662N01l209q6K362p48
$$ plain form
2381 1465 -2997 -4678 -540 3273 2032 -394 620 1686 -1336 -4727 -2572 2457 2890 -405 -842
2396 -842 1910 1558 -3063 -4681 -533 3429 1938 -509 589 2133 -802 -4252 -2241 2735 3226 -188
2412 -188 -783 1961 1907 -2543 -4493 -268 3788 2210 -831 124 1835 -853 -4276 -2277 2804 3510
2428 3510 -304 -1563 1271 1424 -2810 -4418 -48 4069 2211 -1160 -500 1488 -701 -4095 -2224
2443 -2224 3097 3822 -377 -1962 1088 1718 -2333 -4304 -6 4071 2338 -1423 -638 1538 -484 -4094
2459 -4094 -2223 2861 3715 -378 -1989 1039 1581 -2337 -4340 56 4311 2522 -1383 -765 1409 -623
2475 -623 -3803 -1905 3434 3987 -156 -2103 452 1314 -2268 -4016 315 4557 2556 -1670 -1390 978
2491 978 -559 -3653 -1743 3266 3834 -588 -2590 144 1379 -1972 -3672 -21 4083 2254 -1850
$$ packed form
2381A465m462j681M138L813j241k426J014J066l022l391K155N029M33l295m37
2396h42K752l52m621j618M148L962j491k447J098J544k935l450K011M976M91l414
2412a88n95K744n4m450j950M225M056j578l041R55J711k688l423J999N081P06
2428C510l814j259K834J53m234j608M370M117j858l371O60J988k189l394J871
2443b224N321P25m199j585L050O30m051j971M298M077j733l761P85K176k022l610
2459d094J871N084Q54m093j611L028N42l918k003M396M255j789l905O18K174k032
2475f23l180J898N339N53m143j947K555Q62l582j748M331M242k001m226K80K368
2491I78j537l094J910N009N68m422k002K734J235l351j700L651M104j829m104
$$ plain form
2506 -1850 -1375 1194 -48 -3241 -1940 3107 3827 -312 -2252 572 1867 -1451 -3343 315 4478
2521 4478 2508 -1607 -1426 1122 105 -3057 -1470 3279 4009 -543 -2938 -439 1199 -1654 -3249
2536 -3249 547 4112 2140 -2319 -2355 334 -216 -2681 -1407 3127 3802 -609 -3153 -560 1287 -1229
2552 -1229 -2804 481 4318 2572 -1648 -1873 969 466 -2355 -1144 3172 4030 33 -2415 -227 1453
2568 1453 -1099 -2816 213 3952 2277 -1948 -2109 421 27 -2386 -1654 2369 3210 -805 -3069 -937
2584 -937 1028 -904 -2574 215 3436 1892 -2334 -2359 330 722 -1358 -769 2862 3318 -707 -2865
2600 -2865 -513 1689 124 -1486 957 3769 2008 -1840 -2198 229 760 -1320 -704 2517 3088 -602
2616 -602 -3173 -1285 660 -713 -2141 174 3174 1604 -2153 -2703 -421 80 -1701 -1009 2303 2920
$$ packed form
2506a850M75K569j242l193J301N047P20m139j940K824J295l318j892L658M163
2521D478j970m115J81K548j017l162J587M749P30m552k395K499J638k853j595
2536c249L796L565j972m459l6K689n50k465J274M534O75m411k544K593J847k516
2552a229j575L285L837j746m220k25K842n03k821J211M316Q58l997k448K188J680
2568A453k552j717L029L739j675m225j61K530l94k413P32M023Q41m015k264K132
2584i37J965j932j670K789L221j544m226k5K689L92k080N89L631M56m025k158
2600b865K352K202j565j610K443K812j761l848l58K427N31k080O16L221N71l690
2616f02k571J888J945j373j428K315L000j570l757n50K282N01j781O92L312O17
$$ plain form
2632 2920 -299 -2783 -1120 1029 -49 -1463 600 3222 1997 -1564 -1911 484 1190 -510 -421 2203
2648 2203 2778 -361 -2511 -794 1371 376 -1119 413 2381 1070 -2182 -2535 -262 681 -685 -645
2664 -645 1495 1771 -1062 -3221 -1457 718 235 -902 391 2346 1027 -2007 -2466 -169 902 87
2680 87 317 2170 2443 -248 -2362 -1099 1065 689 -124 904 2473 1320 -1478 -2201 -42 813 -118
2697 -118 -93 1502 1780 -584 -2533 -1267 405 263 -881 36 1518 579 -1729 -2041 -337 567 -93
2714 -93 -296 1172 1241 -644 -2047 -726 1046 990 -51 625 1561 589 -1333 -1532 284 1410 875 564
2732 564 1377 1112 -761 -2010 -1027 845 978 374 469 1079 25 -1860 -2166 -579 550 283 253 886
2750 886 567 -1025 -2114 -1296 129 646 216 680 999 319 -1063 -1399 -233 674 803 635 1097 918
$$ packed form
2632B920l219k484J663K149j078j414K063K622j225l561l47K395P06j700Q9K624
2648B203N75l139k150J717K165r95j495J532J968j311l252l53K273R43j366M0
2664f45K140K76k833k159J764K175m83j137J293J955j319l034m59K297J071q15
2680H7K30J853K73k691k114J263K164l76q13J028J569j153k798p23K159Q55r31
2697a18K5J595K78k364j949J266J672j42j144R17J482r39k308l12J704R04o60
2714i3k03J468O9j885j403J321J772n6j041O76R36r72j922j99J816J126n35l11
2732E64Q13k65j873j249R83J872J33o04R5O10j054j885l06J587J129k67l0O33
2750H86l19j592j089Q18J425N17m30M64L19o80j382l36J166R07J29j68M62j79
$$ plain form
2768 918 -228 -1151 -470 728 1076 539 621 820 281 -1020 -1192 -111 936 514 127 335 5 -916 -1541
2787 -1541 -715 389 778 346 2 52 -599 -1279 -1237 -133 816 850 562 383 -104 -862 -1279 -527 672 1187
2807 1187 969 736 436 -251 -900 -701 69 927 1075 830 453 -88 -681 -1003 -663 162 783 762 492 -31
2827 -31 -697 -1056 -978 -414 263 551 441 142 -632 -963 -818 -470 117 534 695 224 -241 -683 -540 -216 239
2848 239 581 883 744 42 -536 -582 -349 34 422 903 1054 466 -401 -911 -638 -295 119 494 807 835 -169
2869 -169 -1033 -1081 -547 -235 159 624 923 437 -628 -1214 -668 -189 9 381 850 988 -10 -921 -839 -195
2889 -195 136 231 713 1026 507 -416 -993 -382 113 152 363 881 850 -70 -1036 -853 43 184 247 355 763
2910 763 319 -832 -1287 -260 254 80 120 699 765 -446 -1319 -764 187 377 36 361 925 345 -898
$$ packed form
2768I18j146r23O81J198L48n37Q2J99n39j301j72J081J047m22l87K08l30r21o25
2787a541Q26J104L89m32l44N0o51o80M2J104R49L4k88j79m87p58m17P52J199N15
2807A187k18k33l00o87o49J99P70Q58J48k45l77n41n93l22L40Q25O21k1k70n23
2827c1o66l59P8N64O77K88j10k99p74l31J45L48N87M17J61m71m65m42J43L24M55
2848B39L42L02j39p02n78m6K33L83L88M81J51n88q67n10K73L43M14L75L13K8j004
2869a69q64m8N34L12L94M65K99m86j065n86N46M79J98L72M69J38r98r11Q2O44
2889a95L31R5M82L13n19r23n77O11M95L9K11N18l1r20r66J83Q96J41O3J08M08
2910G63m44j151m55J027N14j74M0N79O6j211q73N55R51J90l41L25N64n80j243
$$ plain form
2929 -898 -1221 -171 525 290 155 695 854 -226 -1341 -761 350 451 221 192 944 482 -1162 -1426 -170
2948 -170 742 187 -90 615 882 -328 -1337 -803 381 625 -8 129 780 342 -905 -1319 -57 798
2966 798 409 -146 573 802 -248 -1392 -848 598 664 20 -92 896 467 -1060 -1337 70 1009 363 -100
2985 -100 403 791 -278 -1464 -881 672 779 -88 -24 850 551 -1020 -1545 88 1088 432 -371 348
3003 348 932 -212 -1520 -813 850 1007 -6 -274 590 407 -997 -1535 120 1266 454 -388 114 647
3021 647 -290 -1626 -771 862 915 -47 -288 555 401 -965 -1355 113 1203 405 -462 231 810 -156 -1478
3040 -1478 -830 963 1230 -22 -328 590 563 -1030 -1327 173 1339 570 -496 22 790 -193 -1479 -754
3058 -754 872 1118 -185 -565 450 489 -1035 -1402 19 1375 494 -724 -171 724 20 -1311 -740 1017
$$ packed form
2929h98l23J050O96k35j35N40J59j080j115N80J111J01k30k9P52m62j644k64J256
2948a70R12n55k77P05K67j210j009N34J184K44o33J37O51m38j247m14J262Q55
2966G98l89n55P19K29j050j144N44J446O6o44j12R88m29j527k77J407R39o46m63
2985a00N03L88j069j186N83J553J07q67O4Q74k99j571n25J633J000o56q03P19
3003C48N84j144j308P07J663J57j013k68Q64j83j404n38J655J146q12q42N02N33
3021F47r37j336Q55J633N3r62k41Q43j54j366l90J468J090p98q67O93N79r66j322
3040a478O48J793K67j252l06R18k7j593k97J500J166p69j066N18P68r83j286P25
3058g54J626K46j303l80J015L9j524l67J421J356q81j218N53Q95p04j331N71J757
$$ plain form
3076 1017 1181 -97 -633 373 595 -594 -1191 370 1503 530 -461 -272 661 8 -1222 -719 1042
3093 1042 1155 -171 -479 304 286 -740 -1485 29 1430 587 -691 -351 502 -301 -1396 -737 1007 1136
3111 1136 -89 -615 224 365 -655 -1219 119 1615 701 -533 -296 586 241 -978 -569 1039 1160
3128 1160 -103 -844 195 569 -622 -1061 69 1272 586 -759 -562 574 90 -1088 -689 825 1144
3145 1144 -300 -1062 -39 331 -632 -1056 65 1357 584 -710 -534 284 42 -921 -473 1044 1420 24
3163 24 -676 -93 493 -238 -939 242 1416 712 -660 -514 372 163 -817 -493 871 1128 -191 -945 -270
3182 -270 353 -511 -996 15 1122 488 -896 -559 243 223 -767 -557 728 1010 -126 -862 -65 517 -206
3201 -206 -644 170 1205 633 -665 -574 407 378 -550 -530 827 1156 -62 -809 -172 429 -49 -509 186 1071
$$ packed form
3076A017J64j278n36J006K22j189n97J561J133r73r91J89R33o53j230N03J761
3093A042J13j326l08P83j8j026p45J514J401q43j278L40Q53q03j095O59J744J29
3111A136j225n26Q39J41j020n64J338J496r14j234K37Q82l45j219M09J608J21
3128A160j263p41J039L74j191m39J130J203o86j345J97J136m84j178L99J514L19
3145A144j444p62J023L70r63m24J121J292p73j294J76Q18k42r63M48J517L76j396
3163B4p00N83N86p31p01J181J174p04j372J46Q86k09r80L24J364K57j319p54O75
3182b70O23q64m85J011J107o34j384L37Q02k0r90K10J285K82j136p36P97N82p23
3201b06m38Q14J035n72j298R1R81k9r28K0J357L29j218p47O37O01m78m60O95Q85
$$ plain form
3221 1071 384 -826 -749 28 123 -581 -510 683 940 -238 -906 -306 379 -328 -663 184 959 605 -609
3240 -609 -665 148 299 -388 -387 649 1011 137 -639 -151 431 -51 -519 150 977 487 -483 -608 281 278 -384
3261 -384 -357 375 743 -132 -848 -325 397 -128 -413 35 596 399 -709 -669 37 185 -288 -281 570 652 -166
3282 -166 -734 -199 303 103 -226 107 668 420 -575 -586 54 402 -57 -108 497 559 5 -695 -400 256 19
3303 19 -258 -36 533 180 -514 -705 -63 254 -241 -150 364 498 -258 -733 -410 110 52 -293 -17 512 240
3324 240 -378 -461 85 239 -97 70 311 466 -122 -578 -191 147 235 -59 146 465 217 -435 -467 15 224
3345 224 168 -22 275 224 -164 -677 -400 206 147 -10 115 303 185 -302 -512 -98 174 182 117 230 364 -219
3367 -219 -378 -96 82 176 134 145 356 70 -316 -386 -9 235 122 53 171 169 -52 -333 -222 143 58 123 -86
$$ packed form
3221A071o87j210P7P77R5p04P1J193K57j178o68O00O85p07l35Q47P75l54j214
3240f09n6Q13J51o87JJ036L62q74p76M88N82m82m68O69Q27m90r70j25Q89lo62
3261c84K7P32L68q75p16N23P22n25k85M48N61j97j108M0P06J48m73PQ51Q2q18
3282a66n68N35N02k00l29L33N61k48r95j1O40L48m59n1O05O2n54p00K95O56k37
3303A9k77K22N69l53o94j91O42L17m95R1N14J34p56m75L23N20n8l45K76N29k72
3324B40o18q3N46J54l36J67K41J55n88m56L87L38Q8k94K05L19k48o52l2M82K09
3345B24n6j90K97n1l88n13K77O06n9j57J25J88j18m87k10M14K72Qo5J13J34n83
3367b19j59K82J78R4m2J1K11k86l86p0L77K44j13o9J18kk21k81J11L65q5O5k09
$$ plain form
3390 -86 175 -74 -283 -249 -65 194 90 98 164 104 -48 -402 -125 72 148 147 132 88 -118 -163 -290 -32 223 293
3414 293 200 24 -16 -173 -212 -32 93 264 219 55 101 -158 -331 -163 -102 108 54 94 99 -70 -212 -257 -165 96
3438 96 157 207 13 -52 -117 -191 -175 -109 133 165 204 86 -108 -123 -167 26 110 153 226 167 -60 -105 -151 -84 50 42 139
3465 139 246 -19 -103 -207 -205 3 -33 104 77 79 -31 -210 -300 -164 5 116 226 230 116 -11 -114 -72 -5 24
3489 24 93 326 159 -105 -106 -121 -1 31 49 128 242 3 -228 -163 -3 118 -114 41 380 120 -126 -201 90
3512 90 81 27 2 131 138 -81 -235 -249 -91 75 -75 30 338 106 -152 -323 -69 -33 156 -128 128 132 39 -331
3536 -331 -173 -13 4 -137 1 285 129 -151 -345 -132 1 31 -37 80 226 -24 -264 -227 81 123 -111 37
3558 37 210 138 -127 -250 -53 161 85 -164 129 249 -8 -222 -258 56 112 -55 7 254 163 -176 -354 -58
$$ packed form
3390h6K61k49k09L4J84K59j04QO6o0j52l54K77J97P6jj5m4k06m5j27K58K55P0
3414B93r3j76m0j57l9J80J25J71m5j64M6k59j73J68O1K10n4M0Nj69j42m5R2K61
3438I6O1N0j94o5o5p4J6O6K42L2L9j18j94j5m4J93Q4M3P3n9k27m5m6O7J34qR7
3465A39J07k65q4j04KK08l6J37k7Kj10j79r0J36J69J11J10Mj14j27j03M2O7K9
3489B4O9K33j67k64jj5J20L2J8P9J14k39k31O5J60J21k32J55L39k60k46p5K91
3512I0rn4k5J29Pk19j54j4J58J66j50J05L08k32k58j71K54L6J89k84K56Mr3l70
3536c31J58J60J7j41J38K84j56k80j94K13J33L0o8J17J46k50k40L7L08M2k34J48
3558C7J73p2k65j23J97K14p6k49K93J20k57k14l6L14N6j67O2K47r1l39j78K96
$$ plain form
3580 -58 202 18 -91 172 339 24 -365 -334 59 301 -62 -80 183 202 -157 -266 -118 200 83 -93 138
3601 138 245 45 -324 -204 72 194 -33 19 317 255 -56 -456 -116 179 -76 -53 78 253 -91 -351 -277
3622 -277 77 62 -117 -170 103 264 -153 -415 14 250 169 -190 48 145 102 -340 -250 194 200 -3 -123 183 273
3645 273 -193 -425 -65 257 205 -39 9 282 82 -383 -222 52 225 -124 -159 137 141 -38 -465 -126 162 155
3667 155 -187 -44 238 88 -290 -405 91 322 -48 -220 183 247 30 -347 -90 313 236 -41 -82 302 111
3688 111 -223 -321 134 131 -46 -189 118 184 -52 -315 -229 171 243 -110 -65 203 75 -306 -251 47 241 1 -230
3711 -230 -142 116 -56 -405 -46 359 85 -97 -29 181 154 -97 -297 -11 377 179 -116 25 257 23 -323
3732 -323 -240 227 220 -5 -121 267 189 -263 -345 15 333 53 -219 -17 227 -49 -346 -193 136 163 -33 -177
$$ packed form
3580e8K60j84j09K63J67l15l89L1L93K42l63j8K63J9l59j09J48L18j17j76K31
3601A38J07k00l69J20K76J22k27N2K98o2l11m00L40K95k55K3J31J75l44k60P4
3622b77L54j5j79n3K73J61m17k62M29K36q1l59K38R7m3m42R0M44Ok03j20L06R0
3645B73m66k32L60L22n2k44M8K73k00m65J61K74J73l49l5K96Mj79m27L39K88p
3667A55l42J43K82j50l78j15M96K31l70j72M03O4k17l77K57M03p7k77m1L84j91
3688A11l34r8M55lj77j43L07O6k36k63Q6M00P2l53M5K68j28l81N5K98J94k40k31
3711b30Q8K58j72l49L59M05k74j82O8K10k7k51k00K86L88j98k95J41K32k34l46
3732c23Q3M67pk25j16L88p8m52q2L60L18k80k72K02K44k76k97J53L29K7j96j44
$$ plain form
3754 -177 98 198 -265 -320 -13 356 167 -135 -76 225 71 -228 -206 272 274 1 -141 198 331 -197 -184 157
3776 157 240 -16 -124 -15 153 4 -401 -454 120 122 -256 -206 50 187 -265 -358 -106 262 216 -222 31 253
3798 253 31 -280 -195 271 117 -22 -204 177 118 -231 -208 19 422 160 -92 -87 134 28 -249 -202 147 238
3820 238 -49 -131 57 75 -81 -363 -174 201 95 -110 -156 78 71 -342 -181 113 337 9 -124 60 143 -38
3842 -38 -303 -118 288 124 -85 -99 195 124 -93 -241 180 325 73 27 35 130 -91 -286 -142 221 178 -118 -198
3865 -198 86 -47 -204 -231 -21 243 -8 -132 -114 135 -71 -384 -77 203 180 9 -65 -39 24 -156 -165 171 270
3888 270 211 40 -21 180 -42 -130 -97 316 209 -41 -115 29 -17 -255 -199 180 212 193 -9 -159 -138 -87 -241 -64
3912 -64 134 135 -74 -198 26 -5 -109 -158 35 168 125 -125 -117 47 121 -206 -86 276 236 43 -112 27 22 -101
$$ packed form
3754a77K75J00m63n5L07L69j89l02N9L01j54k99K2M78Kk73j42L39J33n28J3L41
3776A57Q3k56j08J09J68j49m05n3N74Kl78N0K56J37m52r3K52L68m6m38K53K22
3798B53k22l11Q5M66j54j39j82L81n9l49K3K27M03k62k52NK21j06k77M7L49R1
3820B38k87q2J88J8j56k82J89L75j06k05m6K34pm13J61K94K24l28j33J84Q3j81
3842c8k65J85M06j64k09j4K94p1k17j48M21J45k52m6QR5k21j95J44L63m3k96q0
3865a98K84j33j57k7K10K64k51j24J8K49k06l13L07K80k3j71p4K6O3j80rL36R9
3888B70n9j71o1K01k22q8L3M13j07k50p4J44m6k38N6L79L2j9k02j50K1N1j54J77
3912f4J98Jk09j24K24l1j04m9J93J33m3k50QJ64P4l27J20L62m0j93j55J39nj23
$$ plain form
3936 -101 -159 99 291 83 -116 -125 -20 -136 -55 -158 122 230 -69 -175 32 18 -148 -176 -11 271 54 -92
3958 -92 -162 -44 -51 -25 51 120 209 -39 -40 -74 -70 -183 -47 120 304 0 -57 -114 -55 -6 -144 -40 75 98 16 -183
3984 -183 -117 -31 -46 -10 33 72 153 -68 -98 -231 -34 -33 15 111 199 -1 -136 65 -47 109 -82 51 85 -17 21
4009 21 -108 -192 -22 -58 26 147 66 -17 -61 -64 -109 -150 -69 76 19 142 -88 -15 -139 -91 53 30 202 153 -43 -51
4035 -51 -53 27 -82 -18 -34 178 188 -14 -219 -95 58 -60 -17 92 52 -70 -118 -175 -24 5 57 50 117 69 -11 -86
4061 -86 -218 -99 19 124 135 40 -48 -46 23 -151 4 75 80 30 24 -93 -96 -127 -74 188 88 150 68 -10 -31 -96 -141 -17
4089 -17 12 55 33 -20 -174 -124 -84 -211 65 61 55 -59 -20 -133 -73 -130 -116 17 147 -60 -31 111 -98 27 29 37 188
4116 188 143 22 -6 -74 -77 -90 -54 82 120 30 -47 6 18 -65 -95 72 189 212 -151 -80 -155 -100 -82 -71 97 155 47
$$ packed form
3936a01n8K58J92k08j99rJ05j16Q1j03K80J08k99j06K07j4j66k8J65K82k17j46
3958i2p0J18pK6P6O9Q9k48jl4Mj13J36J67J84l04n7n7N9M9j38J04J15K3q2j99
3984a83O6Q6j5L6M3L9Q1k21l0j33J97JM8R6Q8k00j35K01j12J56j91J33L4j02L8
4009B1j29q4J70l6Q4J21q1q3m4lm5m1Q1J45n7J23k30P3j24M8J44k3J72m9j96q
4035e1kQ0j09O4j6K12J0k02k05J24J53j18M3J09m0j22m8n7J51K9N2pO7m8q0p5
4061h6j32J19J18J05J1r5q8KO9j74J55P1Nn0oj17ll1N3K62j00O2q2p8k1o5m5J24
4089a7K9M3k2n3j54N0M0j27K76moj14L9j13O0n7J4J33J30k07K9J42k09J25KQJ51
4116A88m5j21k8o8lj3L6J36L8r0p7N3J2q3l0J67J17K3l63P1p5N5J8J1J68N8j08
$$ plain form
4143 47 -169 -92 16 -141 -201 99 120 100 -84 -139 -54 -114 -133 -12 102 181 -27 -123 -121 -8 -87 50 175 165 93
4168 93 -77 -56 -67 -85 -180 -15 133 206 94 -150 -133 -88 -173 -159 -82 232 69 -125 -81 38 -58 -234 -21 88
4192 88 149 -47 -193 -145 -105 -113 -94 111 205 -13 -129 -92 83 68 -12 11 157 169 -39 -119 -29 132 -30 -4 40 338
4218 338 104 -231 -137 -137 -37 -156 3 229 202 -64 -183 -83 -12 -159 -110 130 359 55 -166 -318 149 76
4240 76 -68 113 287 277 -156 -214 -55 154 -135 -52 175 373 113 -389 -160 239 68 -11 -161 259 178 -142
4262 -142 -256 -178 -45 -127 -60 68 262 -69 -302 -248 100 102 11 89 78 225 -19 -303 -31 240 140 -18 79
4285 79 326 59 -159 -237 66 45 -19 -8 289 170 -159 -309 57 199 19 -141 -21 249 -41 -428 -286 -57
4307 -57 89 -94 -6 108 178 -133 -356 -63 58 19 -105 -42 375 141 -141 -305 -25 3 53 17 229 186 -133
$$ packed form
4143D7k16P7J08j57o0L00K1k0j84n5Q5o0j9J21J14P9k08r6KJ13p9J37J25j0p2
4168I3j70K1j1j8r5J65J48P3j12k44J7M5q5J4P7L14j63j94M4J19r6j76K13J09
4192H8O1j96j46M8M0qJ9K05R4k18j16L7J75j5q0K3J46J2k08q0R0J61j62K6M4K98
4218C38k34l35R4%J00j19J59K26k7k66j19J00P1j47M9K40K29l04k21j52M67p3
4240G6j44J81J74j0m33n8J59K09k89Q3K27J98k60n02K29L99j71p9j50M20q1l20
4262a42j14P8J33q2O7J28J94l31k33N4L48Kr1P8j1J47k44k84K72K71j00j58R7
4285G9K47k67k18p8L03k1o4J1K97j19l29j50L66J42j80j60J20K70k90l87J42K29
4307e7J46j83Q8J14P0l11k23K93J21l9j24O3M17k34k82j64K80K8N0l6K12m3l19
$$ plain form
4330 -133 -336 -40 264 9 -163 93 195 74 -291 -244 72 57 -102 -71 57 -13 -162 -390 -92 123 -1
4351 -1 -160 26 293 25 -350 -194 38 164 -81 -127 82 234 -76 -245 -82 205 124 -75 77 295 30
4372 30 -296 -297 -39 210 -11 -88 116 198 -151 -370 -86 171 121 3 100 237 61 -299 -364 141 180 70 -62
4395 -62 8 124 -159 -445 -83 250 99 -118 -41 230 146 -272 -181 166 246 142 -149 154 77 -36 -242 -121
4417 -121 151 101 -72 -78 182 83 -230 -367 63 237 -2 -83 2 133 -159 -378 3 82 60 -119 -100 243 4
4440 4 -265 -317 114 320 14 -105 132 72 -154 -234 -32 178 179 21 -50 128 83 -269 -215 228 346 15 -89
4463 -89 -39 13 -148 -198 -144 168 140 -52 -165 51 -25 -239 -242 -14 323 89 -78 -87 119 -32 -271 28 238 99
4487 99 -172 -39 165 -26 -165 -350 -47 281 216 -96 -98 90 27 -207 11 263 134 -106 -24 144 121 -184
$$ packed form
4330a33k03K96L04k55j72K56J02j21l65M7L16j5j59L1J28p0j49k28K98K15j24
4351aj59J86K67k68l75J56K32J26k45m6K09J52l10j69J63K87q1j99J52K18k65
4372C0l26jK58K49k21p7K04Q2l49k19K84K57n0j18R7J37j76l60o5N05L9j10j32
4395f2P0J16k83k86L62L33j51k17P7K71q4m18R1L47Q0j04k91L03p7j13k06J21
4417a21K72n0j73oK60r9l13j37M30J74k39q1Q5J31k92k19L81P9k2j79J9L43k39
4440Dk69n2M31K06l06j19K37o0k26q0K02K10Jj58p1J78m5l52N4M43J18l31j04
4463h9N0N2j61n0N4L12k8j92j13K16p6k14lK28L37k34j67rK06j51k39K99K10j39
4487I9k71J33K04j91j39j85L03L28o5l12kJ88o3k34K18K52j29k40Q2J68k3l05
$$ plain form
4509 -184 -281 140 358 79 -111 -79 -2 -173 -160 -28 338 256 13 -164 103 110 -207 -267 77 319 38 -315 -84
4532 -84 54 -31 -160 -90 225 260 -97 -223 54 -30 -180 -251 31 222 79 -171 -79 19 -90 -97 1 189 161 52
4556 52 -85 -37 47 -240 -79 89 289 5 -118 -218 -164 -65 15 -48 18 190 -61 -150 -102 -5 -211 -197 -77 236
4580 236 69 8 -215 -30 -58 -191 -85 227 191 6 -110 -34 173 -96 -124 107 261 137 -100 -113 -44 32 -56
4603 -56 25 -2 71 -41 -139 -78 125 -63 -133 161 181 123 -49 -232 -40 -107 -77 -44 136 56 5 -207 -32 -41 -181
4628 -181 -40 -72 255 105 -3 -95 -78 -99 84 86 147 105 -18 -46 -131 -108 4 6 92 53 21 84 -152 -175 -8 19
4654 19 112 56 22 72 -87 -43 36 18 0 82 194 32 -89 -55 -101 -102 61 90 77 90 126 -52 -108 -31 -14 12 65 93
4682 93 38 -15 -232 -47 -5 -21 164 29 53 -47 1 -10 -104 14 129 45 -121 66 -54 -104 -139 -24 6 72 95
$$ packed form
4509a84r7M21K18k79j90L2P7j71J3J32L66q2k43j77K67Pl17o0L44K42k81l53K31
4532h4J38q5j29P0L15L5l57j26K77q4j50p1K82J91j43k50R2R8j09pR8J88k8j09
4556E2j37M8Q4k87J61J68K00k84j23j00N4R9Q0o3O6J72k51q9M8R7k06J4J20L13
4580B36j67o1k23J85k8j33J06L12l6j85j16P6K07k69k8K31J54j24k37j3O9P6q8
4603e6Q1k7P3j12r8O1K03j88p0K94K0n8j72j83J92o7L0L3J80q0n1k12J75rj40
4628a81J41l2L27j50j08r2J7k1J83KO1m2j23k8q5K3J12KQ6l9l2O3k36k3J67K7
4654A9R3n6l4N0j59M4P9j8j8Q2J12j62j21L4m6jJ63K9j3J3L6j78n6P7J7K6N3K8
4682I3n5n3k17J85M2j6J85j35K4j00M8j1r4J18J15q4j66J87j20n0l5J15L0O6K3
$$ plain form
4707 95 -106 32 -129 -84 -130 -130 65 145 95 49 60 -72 -177 -107 138 138 65 35 -19 100 -102 -166 -100 53 93 -25
$$ packed form
4707I5k01J38j61M5m6%J95Q0n0m6J1j32j05P0K45%p3l0n4J19k02o4O6J53M0j18
$$ [...]
16383A22
##END NTUPLES=NMR FID
##END=
