##TITLE=abcd
##JCAMPDX= 6.0         $$ Bruker NMR JCAMP-DX V2.0
##DATA TYPE= NMR SPECTRUM
##DATA CLASS= NTUPLES
##ORIGIN= UXNMR, Bruker Analytische Messtechnik GmbH
##OWNER= root
$$ XWIN-NMR		Version 3.5
$$ Thu Jan 30 10:18:41 2025 Russian Standard Time (UT+4h)  servis@DPX200
##.OBSERVE FREQUENCY= 200.131235884673
##.OBSERVE NUCLEUS= ^1H
##.ACQUISITION MODE= SIMULTANEOUS
##.ACQUISITION SCHEME= undefined
##.AVERAGES= 32
##.DIGITISER RES= 18
##SPECTROMETER/DATA SYSTEM= spect
##.PULSE SEQUENCE= zg
##.SOLVENT NAME= DMSO
##.SHIFT REFERENCE= (INTERNAL, DMSO, 0, 16.4885)
##AUDIT TRAIL= $$ (NUMBER, WHEN, WHO, WHERE, WHAT)
$$ ##TITLE= Audit trail, XWIN-NMR		Version 3.5
$$ ##JCAMPDX= 5.01
$$ ##ORIGIN= Bruker BioSpin GmbH
$$ ##OWNER= servis
$$ F:\spectra/data/av/nmr/H1/1/pdata/1/auditp.txt
$$ ##AUDIT TRAIL=  $$ (NUMBER, WHEN, WHO, WHERE, WHAT)
(   1,<2025-01-30 10:17:13.90 +0400>,<servis>,<DPX200>,
      <created by zg, POWCHK disabled, PULCHK disabled
       configuration hash MD5:
       00 E9 B6 7A A2 85 ED C7 34 08 36 98 17 FE 4E 26
       data hash MD5: 32K
       D4 64 17 7B 47 FB FC 75 64 7F 59 47 D4 D5 F1 88>)
(   2,<2025-01-30 10:17:26.92 +0400>,<servis>,<DPX200>,
      <Start of raw data processing
       efp BC_mod = 2 LB = 0.05 FT_mod = 6 PKNL = 1 PHC0 = -254.3221 PHC1 = -6.298474 SI = 16K 
       data hash MD5: 16K
       72 BE 7F CC E3 CD 21 C4 14 0C 68 B3 FF 96 2F DF>)
(   3,<2025-01-30 10:18:01.12 +0400>,<servis>,<DPX200>,
      <pk PHC0 = -13.36979 PHC1 = 11.40001 
       data hash MD5: 16K
       5E BA CD 56 82 9C F2 57 FA BD 09 CC DF E9 15 F3>)
$$ ##END=
$$ 
$$ hash MD5
$$ 84 88 62 EC 97 AF EF 9F F3 3D 99 EC EA 3D 88 CE
##$RELAX= 
##$RELAX= 
##$RELAX= 
##$RELAX= 
##$RELAX= 
##$RELAX= 
##$RELAX= 
##$RELAX= 
$$ Bruker specific parameters
$$ --------------------------
##$DU= <F:\spectra>
##$EXPNO= 1
##$NAME= <H1>
##$PROCNO= 1
##$TYPE= <nmr>
##$USER= <av>
##$AMP= (0..31)
100 100 100 100 100 100 100 100 100 100 100 100 100 100 100 100 100 100 
100 100 100 100 100 100 100 100 100 100 100 100 100 100 
##$AQSEQ= 0
##$AQ_mod= 1
##$AUNM= <au_zg>
##$AUTOPOS= <>
##$BF1= 200.13
##$BF2= 200.13
##$BF3= 200.13
##$BF4= 200.13
##$BF5= 500.13
##$BF6= 500.13
##$BF7= 500.13
##$BF8= 500.13
##$BYTORDA= 1
##$CFDGTYP= 0
##$CFRGTYP= 5
##$CHEMSTR= <none>
##$CNST= (0..31)
1 1 145 1 1 1 1 1 1 1 1 1 1 1 1 1 1 1 1 1 1 1 1 1 1 1 1 1 1 1 1 1 
##$CPDPRG= <>
##$CPDPRG1= <>
##$CPDPRG2= <>
##$CPDPRG3= <>
##$CPDPRG4= <mlev>
##$CPDPRG5= <mlev>
##$CPDPRG6= <mlev>
##$CPDPRG7= <mlev>
##$CPDPRG8= <mlev>
##$CPDPRGB= <>
##$CPDPRGT= <>
##$D= (0..31)
0 2 0 0 0 0 0 0 0 0.06 0 0 0 0 0 0 0.0002 0 0 0 0 0 0 0 0 0 0 0 0 0 0 
0 
##$DATE= 1738217833
##$DBL= (0..7)
120 120 120 120 120 120 120 120 
##$DBP= (0..7)
150 150 150 150 150 150 150 150 
##$DBP07= 0
##$DBPNAM0= <>
##$DBPNAM1= <>
##$DBPNAM2= <>
##$DBPNAM3= <>
##$DBPNAM4= <>
##$DBPNAM5= <>
##$DBPNAM6= <>
##$DBPNAM7= <>
##$DBPOAL= (0..7)
0.5 0.5 0.5 0.5 0.5 0.5 0.5 0.5 
##$DBPOFFS= (0..7)
0 0 0 0 0 0 0 0 
##$DE= 6
##$DECBNUC= <off>
$$ [...]
##$SUBNAM4= <"">
##$SUBNAM5= <"">
##$SUBNAM6= <"">
##$SUBNAM7= <"">
##$SUBNAM8= <"">
##$SUBNAM9= <"">
##$SW= 20.6817932712277
##$SWIBOX= (0..15)
0 0 3 0 0 0 0 0 0 0 0 0 0 0 0 0 
##$SW_h= 4139.07284768212
##$TD= 32768
##$TD0= 1
##$TE= 0
##$TE2= 300
##$TE3= 300
##$TEG= 300
##$TL= (0..7)
0 120 120 120 120 120 120 120 
##$TP= (0..7)
150 150 150 150 150 150 150 150 
##$TP07= 0
##$TPNAME0= <>
##$TPNAME1= <>
##$TPNAME2= <>
##$TPNAME3= <>
##$TPNAME4= <>
##$TPNAME5= <>
##$TPNAME6= <>
##$TPNAME7= <>
##$TPOAL= (0..7)
0.5 0.5 0.5 0.5 0.5 0.5 0.5 0.5 
##$TPOFFS= (0..7)
0 0 0 0 0 0 0 0 
##$TUNHIN= 0
##$TUNHOUT= 0
##$TUNXOUT= 0
##$USERA1= <user>
##$USERA2= <user>
##$USERA3= <user>
##$USERA4= <user>
##$USERA5= <user>
##$V9= 5
##$VALIST= <valist>
##$VCLIST= <CCCCCCCCCCCCCCC>
##$VD= 0
##$VDLIST= <DDDDDDDDDDDDDDD>
##$VPLIST= <PPPPPPPPPPPPPPP>
##$VTLIST= <TTTTTTTTTTTTTTT>
##$WBST= 1024
##$WBSW= 30
##$XGAIN= (0..3)
0 0 0 0 
##$XL= 0
##$YL= 0
##$YMAX_a= 550336
##$YMIN_a= -528379
##$ZGOPTNS= <>
##$ZL1= 120
##$ZL2= 120
##$ZL3= 120
##$ZL4= 120
##$ABSF1= 0
##$ABSF2= 0
##$ABSG= 0
##$ABSL= 0
##$ALPHA= 0
##$AQORDER= 0
##$ASSFAC= 0
##$ASSFACI= 0
##$ASSFACX= 0
##$ASSWID= 0
##$AUNMP= <proc_1d>
##$AZFE= 0.1
##$AZFW= 0.1
##$BCFW= 0
##$BC_mod= 2
##$BYTORDP= 0
##$COROFFS= 0
##$CY= 18.4799938201904
##$DATMOD= 1
##$DC= 0
##$DFILT= <>
##$DTYPP= 0
##$F1P= 9.9274215381318
##$F2P= -0.165520771350173
##$FCOR= 1
##$FTSIZE= 16384
##$FT_mod= 6
##$GAMMA= 0
##$GB= 0
##$INTBC= 1
##$INTSCL= 4.127829e-11
##$ISEN= 128
##$LB= 0.05
##$LEV0= 0
##$LPBIN= 0
##$MAXI= 10000
##$MC2= 0
##$MEAN= 0
##$ME_mod= 0
##$MI= 50
##$NCOEF= 0
##$NC_proc= -5
##$NLEV= 6
##$NOISF1= 3.799351
##$NOISF2= 2.8
##$NSP= 0
##$NTH_PI= 0
##$NZP= 0
##$OFFSET= 16.48848
##$PC= 4
##$PHC0= -267.6919
##$PHC1= 5.101536
##$PH_mod= 1
##$PKNL= yes
##$PPARMOD= 0
##$PSCAL= 4
##$PSIGN= 0
##$REVERSE= no
##$SF= 200.130005582386
##$SI= 16384
##$SIGF1= 3
##$SIGF2= 2
##$SINO= 400
##$SIOLD= 16384
##$SREGLST= <1H.CDCl3>
##$SSB= 0
##$STSI= 16384
##$STSR= 0
##$SW_p= 4139.07284768211
##$SYMM= 0
##$S_DEV= 0
##$TDeff= 32768
##$TDoff= 0
##$TI= <>
##$TILT= no
##$TM1= 0
##$TM2= 0
##$TOPLEV= 0
##$USERP1= <user>
##$USERP2= <user>
##$USERP3= <user>
##$USERP4= <user>
##$USERP5= <user>
##$WDW= 1
##$XDIM= 16384
##$YMAX_p= 406174461
##$YMIN_p= -509315
$$ End of Bruker specific parameters
$$ ---------------------------------
##NTUPLES= NMR SPECTRUM
##VAR_NAME=  FREQUENCY,     SPECTRUM/REAL,   SPECTRUM/IMAG
##SYMBOL=    X,             R,               I
##VAR_TYPE=  INDEPENDENT,   DEPENDENT,       DEPENDENT
##VAR_FORM=  AFFN,          ASDF,            ASDF
##VAR_DIM=   16384,         16384,           16384
##UNITS=     HZ,            ARBITRARY UNITS, ARBITRARY UNITS
##FACTOR=    0.252644378177508, 1,           1
##FIRST=     3299.83951724647, 0,            0
##LAST=      -839.233330435636, 0,           0
##MIN=       -839.233330435636, -509315,     0
##MAX=       3299.83951724647, 406174461,    0
$$ Real data points
##PAGE= N=1
##DATA TABLE= (X++(R..R)), XYDATA
$$ [...]
9035a25644k9075P7349m8457k2875R4437r4454Q9580n9777M6494N410r3068O2584
9023i7496o2117K4441L1674o0051P6843m8451P0713j43527J22066l1131j6825
9012a33861k6210N5234J9661q6558M0997k9756J06791p2221N1804l5068m1176
9001a50363N8320k0447n8780k4816J43260q2175K420R1894n4343J1842m2416K7815
8989i7789j00421J38214M9435j80545J13101n9696J8510j9065j9909O0850l3769
8978a31084J32307j25083J19100j22258N3291m1022L0180J35208q6285l0511m3871
8967a10028L3418K9945r830K309Q2350o7925J00041o8749l9293P7723j83643R9464
8955e4218O7140k5299r773r051P2135q738m0913R2791q3556K0693L2266P9706
$$ plain form
9035 -125644 -154719 -77370 -125827 -148702 -54265 -148719 -59139 -118916 -72422 -67012 -160080 -97496
9023 -97496 -159613 -135172 -103498 -163549 -86706 -135157 -64444 -207971 -85905 -117036 -133861
9012 -133861 -160071 -104837 -85176 -171734 -130737 -160493 -53702 -125923 -74119 -109187 -150363
9001 -150363 -92043 -112490 -171270 -196086 -52826 -135001 -132581 -40687 -95030 -83188 -125604 -97789
8989 -97789 -198210 -59996 -10561 -191106 -78005 -137701 -119191 -138256 -158165 -97315 -131084
8978 -131084 1223 -123860 -4760 -127018 -73727 -114749 -84569 50639 -35646 -66157 -110028
8967 -110028 -76610 -46665 -56495 -54186 28164 -39761 60280 -8469 -47762 29961 -153682 -54218
8955 -54218 12922 -12377 -22150 -31201 40934 32196 -8717 84074 518 21211 53477 133183
8943A33183n5096J22854r0821J08987j29954m8837J62427J00905M837J9611l7819
8932B90277n5223R1467k28714R0869j07215O2540r4677n955k197J26639j83971
8921a6160J86612J4290j31043L7850m7761L6140m7973R8631Q1410m1062p4077
8910I6857k7150Q0375J6937O140M7989n1745J29200j23601J05353J3176q7686
8899B05845q5679p3661N3934l2620l763K0218q7729L2448N020j4344k3953o0941
8887f5225K8178P076m9146J45473j7073l0423O0376j23318q26L6775m2285Q271
8875d2147O9279J4967j0695K838j10920L7289P1924Q1086j45304L2784K1700P9634
8863A02435q5415J1470J7374M6762j996k0522P383o1030P6290r5288J10728q4174
$$ plain form
8943 133183 78087 200941 110120 219107 89153 40316 202743 303648 308485 328096 290277
8932 290277 235054 326521 97807 188676 81461 144001 49324 43369 41172 167811 -16160
8921 -16160 170452 184742 53699 91549 43788 79928 31955 130586 211996 170934 96857
8910 96857 69707 150082 167019 173159 221148 169403 298603 175002 280355 293531 205845
8899 205845 120166 46505 100439 67819 64056 84274 -3455 28993 34013 19669 -4284 -65225
8887 -65225 -37047 -29971 -79117 66356 49283 18860 79236 -44082 -44908 -8133 -50418 -42147
8875 -42147 27132 42099 31404 34242 -76678 -39389 32535 113621 -31683 1101 22801 102435
8863 102435 17020 28490 45864 92626 90630 70108 77491 16461 92751 -2537 108191 24017
8851B4017r743K701K2070j0821K2338j01521J08770P105K386j08526L6991O7K1581
8838A7415L7622n3976L4308o7083P0246J47075p6702p0188m6630L7340M1905N2137
8826A23469o5362m1593J37043j28517R4837n7471J7968m1761M079L1611P0295
8815A44598o8036K2342q5370J93565m9268r1670K4439j06579Q6801P9058j3067
8804A36813l3474J2665j3438m4561J06048q430m4258M3652L1218j9137K7165j8566
8792A75697q2958O4479N3568k3725M3825K3890l4950J2013p1346k3839m4496L0674
8780A22832O646N3772k7599R1904j44740P5676M6599l0984O1384q1589Q459J4380
8768A96740M0065J45m2315N8038K365q937o1415P4681j37612R7484N1606L5929
$$ plain form
8851 24017 14274 16975 39045 28224 50562 -50959 57811 64916 67302 -41224 -4233 -4166 17415
8838 17415 55037 1061 35369 -31714 38532 185607 108905 38717 -7913 29427 71332 123469
8826 123469 58107 16514 153557 25040 119877 62406 80374 38613 42692 74303 144598
8815 144598 76562 98904 13534 207099 157831 66161 90600 -15979 70822 149880 136813
8804 136813 103339 116004 102566 58005 164053 155623 111365 155017 186235 167098 194263 175697
8792 175697 92739 157218 210786 187061 230886 254776 219826 231839 160493 136654 92158 122832
8780 122832 129478 183250 155651 247555 102815 178491 225090 194106 255490 173901 182360 196740
8768 196740 236805 236950 194635 252673 255038 246101 184686 259367 121755 219239 270845 306774
8756C06774r1949j5249Q5412j3225n1665L3817P9882K3879j95723J53177p4892
8745B40238M009M6240J8523P2417r408j27694Q7593M1085M4144q4704m410J10627
8733D38660l5270m7575O4980m2425O794J3656O9116j46585L8645L8753Q5124j47315
8721C36558J13908o0549O3262M9028j4949p6723R3189o2548j199m5177J22521
8710E17321o1378O3002M110k8349M5058M1004p2749K7568N2438o7953L5980j6293
8698E39759J18655p6116O312k5344Q2018J365j9390M0769l1513R3026k0566P952
8686G16927n3192R4197k8224L853P606J278k7872k5063J60739l1655j7207O4937
8674H66324N0607m1007K5339l7434J73874J3409j0085M1344L0406k4309M8103
$$ plain form
8756 306774 214825 199576 284988 271763 220098 253915 333797 357676 161953 315130 240238
8745 240238 244247 290487 309010 381427 372019 244325 331918 373003 417147 332443 328033 438660
8733 438660 403390 355815 420795 378370 385164 398820 467936 321351 359996 398749 483873 336558
8721 336558 450466 389917 453179 502207 487258 410535 503724 441176 439977 394800 517321
8710 517321 455943 518945 523055 494706 539764 580768 508019 535587 588025 520072 556052 539759
8698 539759 658414 582298 588610 563266 645284 646649 627259 668028 636515 729541 708975 716927
8686 716927 663735 757932 729708 733561 741167 742445 714573 689510 850249 818594 801387 866324
8674 866324 916931 875924 901263 863829 1037703 1051112 1041027 1082371 1112777 1088468 1136571
8663A136571O9789J9225r2900J32225K03596j57248P2752N0930Q1809o7436J12563
8652A561876O6184J15087Q2811K8313M3393J74789J23413m575J04051K05880J04919
8641B606141K9030K01390J69336J58578L20352J17668L09360K81489L07957L29963
8631D831264K31753K10326L06663Q8889J55363J56337K45040J74891K69829M20606
8621G090961L96768M05096N21735P52161O65160P85826P17195Q83586J052301
8612A3270789R89721J221857J454812J762226J912294J955064K289060K798250
8604B7654073L625644N102180P478518R614516R384095N430445Q1855m708974
8596F3662352p696189q276348p147211n356286m320246l234435k722610k126316
$$ plain form
8663 1136571 1206360 1225585 1132685 1264910 1468506 1311258 1384010 1434940 1516749 1449313 1561876
8652 1561876 1628060 1743147 1825958 1854271 1897664 2072453 2195866 2191291 2295342 2501222 2606141
8641 2606141 2635171 2836561 3005897 3164475 3484827 3602495 3911855 4193344 4501301 4831264
8631 4831264 5063017 5273343 5580006 5668895 5824258 5980595 6225635 6400526 6670355 7090961
8621 7090961 7487729 7892825 8414560 9166721 9831881 10617707 11334902 12218488 13270789
8612 13270789 14260510 15482367 16937179 18699405 20611699 22566763 24855823 27654073
8604 27654073 31279717 36381897 43860415 53474931 62859026 68289471 68371326 63662352
8596 63662352 55966163 47689815 40542604 35186318 30866072 27631637 24909027 22782711
8588B2782711j392065j001621p47231m20474k07353j16738R9284L74674N09125
8579A9880312P88135J043889J305907J429373J593942K179816K859547M427005
8571C5507926O495921Q777468Q579298M976877l83777m765391p586961q290789
8563D3310572p240138n514818m413518l427946l143910k391374j932087j507182
8555A3739599j350327j190382q93048q39914o49024o93074o14434n51023m40293
8546F518080l95531l68882l87014l14298l11869l30731k19165k73111j47637k56759
8536C513083o2193j91310k37732j04025j93597j22752j77188l9100j53022j70033
8526B062131J3589P8472j24378j88157n6317m4688P191j15634o312p2975M792
$$ plain form
8588 22782711 21390646 20389025 19641794 19221320 19013967 18897229 18996513 19371187 19880312
8579 19880312 20668447 21712336 23018243 24447616 26041558 28221374 31080921 35507926
8571 35507926 42003847 50781315 59360613 64337490 63953713 59188322 51601361 43310572
8563 43310572 36070434 30555616 26142098 22714152 19570242 17178868 15246781 13739599
8555 13739599 12389272 11198890 10305842 9465928 8816904 8123830 7509396 6958373 6518080
8546 6518080 6122549 5753667 5366653 5052355 4740486 4409755 4190590 3917479 3769842 3513083
8536 3513083 3450890 3259580 3021848 2917823 2724226 2601474 2424286 2385186 2232164 2062131
8526 2062131 2075720 2154192 2029814 1841657 1785340 1740652 1747843 1632209 1625897 1552922 1557714
8515A557714j04907j34330k5059K4745r2655L95k5148m8001O5047j36212j45442
8504I36147J07013r2933J9677j6942o050o1719p3892M6723n3407L8282j14170
8493G28729J3235j800P0438j39442m2946O0075k0699r4904N983O0385n7815n2942
8481E28297l5783N6362j2689r9081N6188m8072N2216k8100n5507L5582p5147K4198
8469C98464k9975Q9300r9762K9710k6064J8457n5824k6948P0124k9525q4181Q3744
8457C37520j29897J5645Q8293o8959L3818N0448j39068Q38j37962J70357k2769
8446A98264K1341j0591r4977L9215J7134K9571r6752m8840N7619R4181j29450
8435G6715N8839M4063m8538n8666q878k0311L9430P1190o3995o748k2748n776
$$ plain form
8515 1557714 1452807 1318477 1293418 1318163 1225508 1225903 1200755 1152754 1217801 1081589 936147
8504 936147 1043160 950227 969904 952962 946912 885193 811301 858024 804617 842899 728729
8493 728729 741964 740164 810602 671160 628214 688289 667590 572686 578669 639054 581239 528297
8481 528297 492514 548876 536187 437106 493294 445222 497438 469338 413831 449413 374266 398464
8469 398464 368489 457789 358027 387737 361673 380130 324306 297358 367482 337957 253776 337520
8457 337520 207623 223268 311561 242602 276420 326868 187800 188638 50676 221033 198264
8446 198264 219605 209014 114037 153252 170386 199957 103205 54365 111984 206165 76715
8435 76715 135554 179617 131079 72413 63535 43224 82654 153844 89849 83101 60353 54577
8423E4577l9468M9528K0789M4103j15278Q8543o8122J36547j26180L0435K3448
8412I8922j8711l2179n1329j937L6539m2130O6843k1120J5167k7305m6509O6242
8400D2493m2757j1632P1225k0139J652k8367l1933J3614M740K4377j01301J26765
8388D8737r2284J31777p4619j6589N5382j00690M5383J01173j66338O4563m303
8377g808K8914p8059L5607R2880j02988O5638q5877M5162l943k179L0954l755
8365A4546L9430m8205q6801J02464j6922p827K6164o9034m3545K0342M8556q5213
8353a06045k334M7126O0625j8421j11017J29362j8431j8360j7781o6481L9969
8342h1788K6441j4161M5981r3557M1051P5650j2166o7465p5027J27972K4889j11040
$$ plain form
8423 54577 15109 64637 85426 129529 14251 102794 34672 171219 45039 75474 98922
8412 98922 80211 48032 -3297 -5234 31305 -10825 56018 34898 50065 22760 -23749 42493
8400 42493 -264 -11896 59329 39190 40842 12475 -19458 -5844 -1104 23273 -78028 48737
8388 48737 -43547 88230 13611 -2978 52404 -48286 -2903 98270 -68068 -3505 -7808
8377 -7808 21106 -56953 -21346 71534 -31454 34184 -51693 -6531 -10474 -12653 18301 14546
8365 14546 53976 5771 -81030 21434 4512 -3315 22849 -46185 -89730 -69388 -20832 -106045
8353 -106045 -108379 -61253 -628 -19049 -130066 -704 -19135 -37495 -55276 -121757 -81788
8342 -81788 -55347 -69508 -23527 -117084 -76033 -383 -12549 -80014 -155041 -27069 -2180 -113220
8330a13220Q2204k26344K01022j4487o412J5942q695l7324R3673n1473n0884n741
8318a21739Q2847m3500r0296P7084j14300J19332L9404l5892o23N0807q0400J4855
8306a02421M9364n0375r6640K29137j14108m7286k1208K1907N0481J7343N2088
8295a1718k6362l5202K2742p3231R2592m6345o1178L4475O75M4358Q3851j29281
8283a04624m3321J03498l9877L4850M648L0895j1544n4232n0880j274J24169o7606
8271g5298J11795n7452l267j7048k1152J66121l6905J11763k5465J1282L6235
8260B00609o3089P4577k0546j1866k7571K1016q5417n0689R860l3635N6876o5033
8248E092l8862Q3299r6141l6856J7432M6657K3312J7668J3579p7985k2981M7579
$$ plain form
8330 -113220 -31016 -257360 -56338 -70825 -77237 -61295 -69990 -107314 -13641 -65114 -115998 -121739
8318 -121739 -38892 -82392 -172688 -95604 -209904 -90572 -51168 -87060 -87683 -36876 -117276 -102421
8306 -102421 -53057 -103432 -200072 29065 -85043 -132329 -153537 -131630 -81149 -63806 -11718
8295 -11718 -38080 -73282 -50540 -123771 -31179 -77524 -138702 -104227 -103552 -59194 24657 -104624
8283 -104624 -147945 -44447 -84324 -49474 -44826 -13931 -25475 -79707 -130587 -131861 -7692 -75298
8271 -75298 36497 -20955 -24222 -41270 -62422 103699 66794 178557 153092 164374 200609
8260 200609 137520 212097 191551 179685 152114 173130 87713 37024 46884 13249 70125 5092
8248 5092 -33770 49529 -46612 -83468 -66036 -19379 3933 21601 35180 -42805 -65786 -18207
8236a8207R9945K6239o9876N4900J08614k8317N0328N6306j23968J2492N3236
8225B21692l4323j3269j03912J25893l9641j65788J26715m5687j7935O9541l1518
8214I1768J5945n8948J30841j49235P2688j44973Q5207q7182o6532J00775M5752
8203C6106m6958q1794p4125n5445J09372R8422j91601o4982K46949L7580m2637
8192b9113M0478j98721K36848j47192j8123k5720J06398j8536j05132N3696J42209
8181C7092j11986J8632K2410J5759k7502n3550J55069j82661J80318K4580m5366
8170C2795k0602l8639P2189k13478N596j5940J29286l8004n542N4172j15045J4497
8158a38715m8959P0495j7753M7616p3894j34953q951j3839M8768J17474N7526
$$ plain form
8236 -18207 81738 107977 38101 93001 201615 173298 223626 279932 155964 168456 221692
8225 221692 187369 174100 70188 196081 156440 -9348 117367 71680 53745 123286 91768
8214 91768 107713 48765 179606 30371 103059 -41914 43293 -43889 -110421 -9646 36106
8203 36106 -10852 -92646 -166771 -222216 -112844 -14422 -206023 -271005 -24056 13524 -29113
8192 -29113 11365 -187356 49492 -97700 -115823 -141543 -35145 -53681 -158813 -105117 37092
8181 37092 -74894 -56262 -33852 -18093 -45595 -99145 55924 -126737 53581 78161 32795
8170 32795 12193 -26446 45743 -167735 -162139 -178079 -48793 -86797 -92339 -38167 -153212 -138715
8158 -138715 -187674 -117179 -134932 -87316 -161210 -296163 -305114 -318953 -270185 -152711 -95185
8147i5185n3905L1753L5064j8378l6787r507j03167L4320p477J1491J94444j11616
8135a28950J08606k3873l695o1897n391K441j629L6286j46630J7891P9674m5332
8123a72499o6522J0446N6882j6903N8668L8459R181j53752O4499J51162m6445
8112f6824n9640j7461K9065k4692m1746J0086m9874R6488m5324j47770J74345
8101a43347K7639m0933N6743k2274q7721P2079R9578q0767N0748p2r5424k1447
8089a85198L3595j8746l0988O0822r571O1807O3k6404k3092j62006J04901L998
8077a90819j5281J01073l326j02K650K6187o6954j4097k4482J12155p5795L1711
8065a17080j31025K2387J23440q6654j0401R6617J37309j21129p5400O1544j03372
$$ plain form
8147 -95185 -149090 -117337 -82273 -100651 -137438 -146945 -250112 -215792 -223269 -211778 -17334 -128950
8135 -128950 -20344 -44217 -47912 -109809 -115200 -112759 -114388 -78102 -224732 -206841 -127167 -172499
8123 -172499 -239021 -228575 -171693 -188596 -129928 -91469 -82288 -236040 -171541 -20379 -66824
8112 -66824 -126464 -143925 -114860 -139552 -181298 -171212 -221086 -124598 -169922 -317692 -143347
8101 -143347 -115708 -156641 -99898 -122172 -209893 -137814 -38236 -119003 -68255 -68327 -163751 -185198
8089 -185198 -151603 -170349 -201337 -140515 -150086 -88279 -88216 -114620 -137712 -299718 -194817 -190819
8077 -190819 -206100 -105027 -108353 -108455 -105805 -79618 -146572 -160669 -185151 -72996 -148791 -117080
8065 -117080 -248105 -225718 -102278 -188932 -199333 -102716 34593 -86536 -161936 -100392 -203764
8054b03764J4895M7200K7413o7405j1081L4095m9484J32107o9603J6542n7638
8043a86723N0564j08842j9892J36113N4107j10874O147N7842O1453l0233q6858
8032a77196P7853k7349l2814J16644j98676N3277J16492r9826J1923P8196l7218
8021a18694p9814N7936j11018J00896l8619M2715q723J510n2268R4093n8127L1620
8009a38493J9636j05336l4518Q9823M5628r1921K1158m7035R6907K479m2406P4156
7997a09922p4071N4111o0063q150J6520o497K2858K1024M071j06127L6600N9256
7985a50390n003p3731R9394O296M4144j26986j6275J80492k09553J56900j30232
7974b24944J51161q0461n9385P7364M585k8368J5672L1758n9306p2791P2542J9814
$$ plain form
8054 -203764 -188869 -141669 -114256 -181661 -192742 -158647 -208131 -76024 -145627 -129085 -186723
8043 -186723 -136159 -245001 -264893 -128780 -74673 -185547 -179400 -121558 -60105 -90338 -177196
8032 -177196 -99343 -126692 -159506 -42862 -241538 -188261 -71769 -171595 -159672 -81476 -118694
8021 -118694 -198508 -140572 -251590 -150694 -189313 -146598 -155321 -153811 -206079 -111986 -170113 -138493
8009 -138493 -118857 -224193 -258711 -168888 -123260 -215181 -194023 -241058 -144151 -141672 -184078 -109922
7997 -109922 -183993 -129882 -189945 -198095 -181575 -188072 -165214 -144190 -140119 -246246 -209646 -150390
7985 -150390 -155393 -229124 -129730 -123434 -79290 -206276 -222551 -42059 -251612 -94712 -224944
7974 -224944 -73783 -154244 -213629 -136265 -131680 -160048 -144376 -112618 -171924 -244715 -172173 -152359
7962a52359r9002J93289j56967o4916N7909l0885J72350j43065J27656q5840l4364
7951b16194J1608J1670K6374q166m792O2917N1946r3468k9619l4262M6191N6111
7939a19684q574m4429O1610n9344M2681L7144o0073r1662n6209J38636p3473N1662
7927a81715k245k4026M7197j22006J22574J9580K0258l6459j3222J5271N1711
7916a03082r8894l4096J4121k6674J46122l1280J7368k6768Q831p2582Q3021j0439
7904a34352j9120J843m9219o3754k6934J28125j9884K3944M5293J1130j10595
7893b13523K2652L4265p6306n1604R8743Q8896k3412p8687J14496j11453j0224
7882b06157R0219j1964j10128P2554l9323n3962J46964K960p7195L2366l5609
$$ plain form
7962 -152359 -251361 -58072 -215039 -279955 -222046 -252931 -80581 -223646 -95990 -181830 -216194
7951 -216194 -204586 -192916 -166542 -174708 -179500 -116583 -64637 -158105 -187724 -221986 -175795 -119684
7939 -119684 -128258 -172687 -111077 -170421 -127740 -90596 -150669 -242331 -298540 -159904 -233377 -181715
7927 -181715 -183960 -207986 -160789 -282795 -160221 -140641 -120383 -156842 -170064 -154793 -103082
7916 -103082 -201976 -236072 -221951 -248625 -102503 -133783 -116415 -143183 -134352 -206934 -123913 -134352
7904 -134352 -153472 -151629 -200848 -264602 -291536 -163411 -183295 -159351 -114058 -102928 -213523
7893 -213523 -190871 -156606 -232912 -284516 -185773 -96877 -120289 -198976 -84480 -195933 -206157
7882 -206157 -115938 -127902 -238030 -165476 -204799 -258761 -111797 -108837 -186032 -153666 -189275
7871a89275k0526R5859R891o7961N4689n8444m353J4121N6634l2404n486p8342
7859b25597J37313J49793l08679J54067n9468J3476m2883J30575l7084p9269K6199
7848a41557M4149l5906l1696J32280j45922p731P0423j5265j28734R1882j0931
7837a79008O2019k9975p4623k9765J21368l9403N1013O1329p0411L8434o4875
7826a53897L3714o6767M6882j3048k4162J13891r7910j16129Q3887L4565Q6995
7815g1979j40228K8481R8601p9267J2065m4718J37044j29109L2303M2473J1893
7804a02441o045O7512j33907M5679j1247R4659j01594m93Q3850r4360M6828l4907
7792a46466k733k6548R421l589O1997R082n9089R7886k3570j36780O8297J29464
$$ plain form
7871 -189275 -209801 -113942 -104051 -172012 -117323 -175767 -180120 -165999 -109365 -141769 -147255 -225597
7859 -225597 -88284 61509 -247170 -93103 -152571 -139095 -181978 -51403 -88487 -167756 -141557
7848 -141557 -97408 -133314 -165010 -32730 -178652 -186383 -115960 -131225 -259959 -168077 -179008
7837 -179008 -116989 -146964 -221587 -251352 -129984 -169387 -118374 -57045 -127456 -89022 -153897
7826 -153897 -120183 -186950 -140068 -153116 -177278 -63387 -161297 -277426 -193539 -158974 -71979
7815 -71979 -212207 -183726 -85125 -164392 -152327 -197045 -60001 -189110 -156807 -114334 -102441
7804 -102441 -108486 -40974 -174881 -129202 -140449 -45790 -147384 -147877 -64027 -158387 -111559 -146466
7792 -146466 -149199 -175747 -166326 -169915 -107918 -98836 -157925 -60039 -83609 -220389 -152092 -22628
7780b2628q2159K3874j6721p0368J05830o6857M8107P0860m1511n9975l8715K7204
7768a23059M3073n1145l2073j9437k1748N1693R620L5926N0716j42735O5299M1070
7756i2800p8809p0771J36916m2843O1891J1351o7774N1324q6060k2674L9878N992
7744a54379l8654k3930J10077l3486j2851j4532J6907N7793j6392j9144J7799
7733a10792p48L4105l0118p8447J60248j77956J25448n6437j5245J09587j71690
7722b12045O0578k2306r5159J29067N0836l4601q7719R1402r032K2268l020r2199
7710b01930L516Q9421m3262p2536P1938M6126M643k2441l7224Q944l9195J06617
7698h5383M1187r9032L9273p3703L6870Q861m7399J0042m7116K1360J27953K234
$$ plain form
7780 -22628 -104787 -80913 -97634 -168002 -62172 -129029 -80922 -10062 -51573 -111548 -150263 -123059
7768 -123059 -79986 -131131 -163204 -182641 -204389 -152696 -143076 -107150 -56434 -199169 -133870 -92800
7756 -92800 -171609 -242380 -105464 -148307 -86416 -75065 -142839 -91515 -177575 -200249 -160371 -154379
7744 -154379 -193033 -216963 -106886 -140372 -153223 -167755 -150848 -93055 -109447 -128591 -110792
7733 -110792 -111540 -77435 -107553 -186000 -25752 -203708 -78260 -134697 -149942 -40355 -212045
7722 -212045 -151467 -173773 -268932 -139865 -89029 -123630 -211349 -119947 -128979 -106711 -109731 -201930
7710 -201930 -198414 -108993 -152255 -224791 -152853 -106727 -102084 -124525 -161749 -152805 -192000 -85383
7698 -85383 -44196 -143228 -103955 -177658 -140788 -131927 -179326 -169284 -216400 -195040 -67087 -64853
7686f4853p0569J8843k231P4021j42483J7759l7707Q2856n5742L3148N6763J9496
7674g0699j17959L6774r6950J7992J54313K0998j22453n0200N153N933k4618R5770
7662a45946m9456N9911J7613R0707o9093j00583P6490q4423m161J26788m0435
7651a22588K3941l9984J5822p0473K4366P2015p2568R4355n2643j7753K7216R6393
7639b1901n0368n0091L7980m1449p2628N9544o3214J10017J9415j37019N3280
7628a56434K0031r8995J41880R6486j35816m0842o1293J99919r6943o2802L8266
7617a56543J1228P6750k5750q3234r386K2196L1942K3036o6426J16522P2749k23634
7605b10550J57640q1805K6663m8847j4111J21731l4809l03601K13771n1381n764
$$ plain form
7686 -64853 -135422 -116579 -118810 -44789 -187272 -169513 -207220 -124364 -180106 -146958 -90195 -70699
7674 -70699 -188658 -151884 -248834 -230842 -76529 -55531 -177984 -228184 -223031 -217098 -241716 -145946
7662 -145946 -195402 -135491 -117878 -27171 -96264 -196847 -120357 -204780 -208941 -82153 -122588
7651 -122588 -98647 -138631 -122809 -193282 -168916 -96901 -169469 -75114 -127757 -145510 -118294 -21901
7639 -21901 -72269 -122360 -84380 -125829 -198457 -138913 -202127 -92110 -72695 -209714 -156434
7628 -156434 -136403 -235398 -93518 2968 -132848 -173690 -234983 -35064 -132007 -194809 -156543
7617 -156543 -145315 -68565 -94315 -177549 -186935 -164739 -132797 -109761 -176187 -59665 13084 -210550
7605 -210550 -52910 -134715 -108052 -156899 -171010 -49279 -84088 -387689 -173918 -225299 -231063
7594b31063Q3522K8669m0452P7002m0959k3162m5919R437K1888K6481p764m3996
7582a86316J07372n2016k5502K3402m3430N5818M5689j1686R991q4225J13246
7571d7657r5208M7224j21553Q3047q0497M3533k3441k0725P2690L2121q5102J5450
7559a80118J2217J6810m6802Q1548o2935R3397k004n5649q5745J65488m2103j3003
7547a18899M4030p7869r2479L6756R7730n0466o8432R0799O7496n5876k0143L7226
7535a10127j5869Q1916n8837O9428p3329p2048j1884K3723K1614m8419l6429Q2311
7523a47950m0118R0887k9655J9064j9575k7625Q6593j2339M034r5400M7367l27
7511a25044k26L2929l1K2278m9447l8872J3452L5340m4246O8855k7405j9894k0446
$$ plain form
7594 -231063 -147541 -118872 -159324 -82322 -123281 -146443 -192362 -182925 -161037 -134556 -142320 -186316
7582 -186316 -78944 -130960 -156462 -133060 -176490 -120672 -74983 -86669 -76678 -160903 -47657
7571 -47657 -142865 -95641 -217194 -134147 -214644 -171111 -194552 -215277 -142587 -110466 -195568 -180118
7559 -180118 -167901 -151091 -197893 -116345 -179280 -85883 -87887 -143536 -229281 -63793 -105896 -118899
7547 -118899 -74869 -152738 -245217 -208461 -110731 -161197 -229629 -138830 -71334 -127210 -147353 -110127
7535 -110127 -125996 -44080 -102917 -33489 -106818 -178866 -190750 -167027 -145413 -193832 -230261 -147950
7523 -147950 -188068 -97181 -126836 -107772 -127347 -154972 -68379 -80718 -76684 -172084 -124717 -125044
7511 -125044 -125270 -92341 -92372 -70094 -119541 -158413 -144961 -109621 -153867 -85012 -112417 -132311 -152757
7498a52757K6311L3387p245L5201k7044m6804k2511o4044N7439P6266O4231j42709
7486a70279R4501r8220J5727R3808q5421Q563J847m690k7104m5287m510Q0028
7474a41037N9024l3548j10808J14348k4186o4359J64517o1724j207k771r7648
7463a99399J40009L3531j64764N6560n358q7337J70897l4162K0567o0538J08789
7452b1205q858p5598K9943o8412M4962l6433m9376Q0982r998l9267L5395N9783
7440e8082r7196O9674r2042O4116Q5656r4387O3883J943p5903O5803p1165J6538
7428a21162n7459O0299j5541l3587J69649j38894k8060J21670j14844P1186j16803
7417b03546J23913L1194n3600L755k6233M4392j00775Q0401k0107l7785Q6963
$$ plain form
7498 -152757 -126446 -93059 -100304 -65103 -92147 -138951 -161462 -225506 -168067 -91801 -27570 -170279
7486 -170279 -75778 -173998 -158271 -64463 -149884 -141321 -139474 -144164 -171268 -216555 -221065 -141037
7474 -141037 -82013 -115561 -226369 -112021 -136207 -200566 -36049 -97773 -98980 -101751 -199399
7463 -199399 -59390 -25859 -190623 -134063 -139421 -226758 -55861 -90023 -69456 -129994 -21205
7452 -21205 -30063 -105661 -75718 -144130 -99168 -135601 -184977 -103995 -113993 -153260 -117865 -58082
7440 -58082 -155278 -85604 -177646 -113530 -27874 -122261 -58378 -56435 -132338 -66535 -137700 -121162
7428 -121162 -178621 -118322 -133863 -167450 2199 -136695 -164755 -43085 -157929 -86743 -203546
7417 -203546 -79633 -48439 -102039 -98284 -124517 -80125 -180900 -100499 -120606 -158391 -71428
7406g1428J8802O4376r5226l5161l5526q4550N3749N588m9872N7101J3873J7517
7394a40757R3709j39394K7246j8456J3204L1745j01516J23469n4019O0147m0557
7383a45179q7791J02202L567m3914r2141O1778J02902r5661L3532P8341r0924
7372a73288J56907j08870j6553O001J4356k3589J0857m5870P6641n0280n0330
7361b04018R3492N7580j2485q7038N8837m8674M7472m8352L3374q649o3944O4717
7349a17688N555O9838j86742O3804O8645M407j15190L5070M9032O7515p0007Q9586
7337c6175j06212L3363l8842l4166N2431N3263j6903r3520L1762p1427O9882N7558
7325i8986j7918K8609l9622J3833o866K5319p9633M5946k8956Q2861q2522k4757
$$ plain form
7406 -71428 -52626 11750 -83476 -118637 -154163 -238713 -184964 -179376 -229248 -172147 -158274 -140757
7394 -140757 -47048 -186442 -159196 -177652 -164448 -132703 -234219 -110750 -164769 -104622 -145179
7383 -145179 -232970 -130768 -127201 -171115 -263256 -201478 -98576 -194237 -160705 -82364 -173288
7372 -173288 -16381 -125251 -141804 -135803 -121447 -145036 -134179 -180049 -103408 -153688 -204018
7361 -204018 -110526 -52946 -65431 -152469 -93632 -142306 -94834 -143186 -109812 -118461 -182405 -117688
7349 -117688 -112133 -42295 -229037 -165233 -96588 -92181 -207371 -172301 -123269 -55754 -125761 -36175
7337 -36175 -142387 -109024 -147866 -182032 -129601 -76338 -93241 -186761 -154999 -226426 -156544 -98986
7325 -98986 -116904 -88295 -127917 -114084 -120950 -95631 -175264 -129318 -158274 -75413 -157935 -182692
7313a82692J09331k4824J9958j08541N6361J5720l2221M3275k9353P7397j42562
7302a98151P4781P8559j34768R2292l3249L774l3468j1261N167L3182P5780m9259
7290i6621O261r428m4291N1437q6049L8343j7860J8000M082O0988r6192l7560
7278b08890J22371O030j08464N8463j1021m1696M4964N3614o3534M007J32585
7267a1571j08131K1125l5727M1559j2512L3086j0068n2563l002J14391o0678p5652
7255a59743m1910J76818n3890o895k1950J11092j75758P1762M0221m1199J5659
7244h5793j9743l6845K3299K7395m4276L5174o3204J01530m767j05840m0531J27650
7232h5951q4909P1275j32068J81920r0438l9764Q8106o0101M212N3587j0792j2452
$$ plain form
7313 -182692 -73361 -98185 -78227 -186768 -130407 -114687 -146908 -103633 -132986 -55589 -198151
7302 -198151 -123370 -44811 -179579 -87287 -120536 -116762 -150230 -161491 -156324 -123142 -47362 -96621
7290 -96621 -90360 -99788 -144079 -92642 -178691 -140348 -158208 -140208 -136126 -75138 -171330 -208890
7278 -208890 -86519 -80489 -188953 -130490 -141511 -183207 -138243 -84629 -148163 -144156 -11571
7267 -11571 -119702 -98577 -134304 -92745 -105257 -72171 -82239 -134802 -137804 -23413 -84091 -159743
7255 -159743 -201653 -24835 -78725 -85620 -107570 3522 -172236 -100474 -60253 -101452 -85793
7244 -85793 -105536 -142381 -119082 -91687 -135963 -100789 -163993 -62463 -67230 -173070 -213601 -85951
7232 -85951 -170860 -99585 -231653 -49733 -140171 -179935 -91829 -151930 -147718 -94131 -104923 -117375
7220a17375Q214r304N8565m6629J6646o9439M1477k6885M2440r8845P4100p072
7208a34107J3814j5091L4358l4699K3763m3518O752Q7541q6425N9420J18931j92911
7196a62172P4545r6522M1446k8282Q2176k4543M8954q6452q512J06254o6205N3944
7184f5369j7254p0878p143J16590j00490k9156J34049q0954K5833j1421n8260
7173a64453j4096Q6061r057k7437P9678p7386K4094K7839l9844L3604L1000M372
7161d5625q6299J3128L4669j7728N6227r4225R3974m2687J8309p0485n4353O6070
7149a29025l7956l3167O3596Q0001l5869m8190j6433O6033k8546l0224j255J5636
7137a35399m5742K4945J33254j34956o942j862O6201j7801j6071k9920N3077m4486
$$ plain form
7220 -117375 -109161 -118465 -59900 -106529 -89883 -159322 -117845 -144730 -102290 -201135 -127035 -134107
7208 -134107 -120293 -135384 -101026 -135725 -111962 -155480 -148728 -61187 -147612 -88192 30739 -162172
7196 -162172 -87627 -184149 -142703 -170985 -88809 -113352 -64398 -150850 -159362 -53108 -119313 -65369
7184 -65369 -82623 -153501 -160644 -44054 -144544 -173700 -39651 -120605 -94772 -106193 -164453
7173 -164453 -178549 -92488 -101545 -128982 -49304 -126690 -102596 -74757 -114601 -80997 -49997 -45625
7161 -45625 -131924 -118796 -84127 -101855 -45628 -139853 -45879 -88566 -70257 -140742 -195095 -129025
7149 -129025 -166981 -200148 -136552 -56551 -92420 -140610 -157043 -91010 -119556 -149780 -151035 -135399
7137 -135399 -181141 -156196 -22942 -157898 -164840 -166702 -100501 -118302 -134373 -164293 -111216 -155702
7125a55702R9741m5344J6067J1138j7216o056O4604q6682J2536K927o3961Q6569
7113h1379M1308k1294r9956J44888j46625J4738L4440R8597k9558j1790j08057
7102a64688P5684o0553J8024J6491L0800m2258k5760J17465j61510Q2618K899
7091a10788p732Q464K8351j6943n7085M9920l5438j405J17790m4629p4101J6885
7079a26711k023K77k1833M5479q457N2524l2499n1748M0476L4183N214Q545j06601
7066a63174q4750J61747n866Q898M6503j05132J13477r3794q3560O5551O8833
7055g1267K4835k0394p140J8679n3817k39p2587P7963l3216K9557O8660j0503
7043d9469l4522j13997J26395N4445k8611j38188J33759j46369J46356Q865P8165
$$ plain form
7125 -155702 -55961 -101305 -85238 -74100 -91316 -97372 -32768 -119450 -106914 -103987 -167948 -81379
7113 -81379 -40071 -61365 -161321 -16433 -163058 -148320 -113880 -15283 -44841 -56631 -164688
7102 -164688 -89004 -149557 -131533 -115042 -84242 -126500 -152260 -34795 -196305 -113687 -110788
7091 -110788 -118520 -110056 -81705 -98648 -155733 -105813 -141251 -142656 -24866 -69495 -143596 -126711
7079 -126711 -128734 -128457 -150290 -104811 -113268 -60744 -93243 -144991 -104515 -70332 -65118 -56573 -163174
7066 -163174 -247924 -86177 -92043 -83145 -36642 -141774 -28297 -122091 -205651 -140100 -71267
7055 -71267 -46432 -66826 -73966 -55287 -109104 -109343 -181930 -103967 -137183 -107626 -38966 -49469
7043 -49469 -83991 -197988 -71593 -17148 -45759 -183947 -50188 -196557 -50201 -41336 36829
7032C6829r9968L6849p731m3176n7420j0753Q673J13337r0225P5179r039p7433
7020a24878O8508j08604O8373J0435L527J29645j52944k1854N1834n4982J407
7009a29533m0324J13120m5027p130k1621L82k001L8709K8797Q8417p4045p8715
6997a28971M6805N7697j49702L5256K243M9635n992j4233R890N4190p0527O7202
6985d6507j15512J20178O4635j15845R8605p72J1262o3448q3546J79786j34256
6974h5420L886j048o8171P2079K8284J4453l1910o3377O0389l7942L6496J6168
6962e6113q4693L9958L5499p3339J54374j45692J5430R5427k3758M3940l7204
6951c6171n1430k7864J9345J3052j6931o1092P6763P8036m0072J9712o9036O2
$$ plain form
7032 36829 -63139 -26290 -34021 -77197 -134617 -145370 -136697 -23360 -113585 -38406 -47445 -124878
7020 -124878 -56370 -164974 -96601 -86166 -82639 47006 -105938 -127792 -75958 -130940 -129533
7009 -129533 -169857 -56737 -101764 -108894 -130515 -130133 -132134 -93425 -64628 23789 -50256 -128971
6997 -128971 -82166 -24469 -174171 -138915 -136672 -87037 -93029 -107262 -97372 -43182 -113709 -46507
6985 -46507 -162019 -41841 22794 -93051 5554 4782 16044 -47404 -130950 48836 -85420
6974 -85420 -81534 -82582 -150753 -78674 -50390 -35937 -67847 -131224 -70835 -108777 -72281 -56113
6962 -56113 -140806 -100848 -65349 -138688 15686 -130006 -114576 -19149 -42907 1033 -36171
6951 -36171 -87601 -115465 -96120 -83068 -99999 -161091 -84328 -6292 -46364 -26652 -95688 -95626
6939i5626P5052r2682M7501L4139j3248o1538L363Q3958o0999K9268n9341J08012
6927b141j8915O6189j15018j3241j9335Q9845K7695K8763j5982n968n1998J8030
6915a2076q8592Q6774p9351Q0223q5150j4878l9849Q6866n1594J28089j10533
6904a00071K2994o4467j6204N5631M7816k0681K0346K6081p7669J3421k3771j7150
6892a33724J30066k4061o0582P8782j17736N7563P144k7547L9622k982m4123L4740
6880f2838n6896M5095J0430j5809P3653l661q8810K4595N1653m2876J0899l1590
6868h6155m6780J4872K88j120J11617o6019m672N3469l7965J07375r5697m5746
6856i6533K6038j9777L0242L4715K1110J6231m0372k0444O086o4899J30630J9528
$$ plain form
6939 -95626 -20574 -113256 -65755 -31616 -44864 -106402 -103039 -19081 -80080 -50812 -110153 -2141
6927 -2141 -21056 45133 -69885 -83126 -102461 -12616 15079 43842 27860 21892 -30106 -12076
6915 -12076 -100668 -13894 -93245 -13022 -98172 -113050 -152899 -66033 -117627 10462 -100071
6904 -100071 -77077 -141544 -157748 -102117 -54301 -74982 -54636 -28555 -106224 -92803 -116574 -133724
6892 -133724 -3658 -27719 -88301 -9519 -127255 -69692 -62548 -90095 -50473 -53455 -97578 -62838
6880 -62838 -119734 -74639 -64209 -80018 -6365 -10026 -98836 -74241 -22588 -65464 -54565 -86155
6868 -86155 -132935 -118063 -117775 -118895 -7278 -73297 -77969 -24500 -62465 44910 -50787 -96533
6856 -96533 -70495 -90272 -60030 -25315 -4205 12026 -28346 -48790 -42704 -107603 23027 42555
6844D2555J5933j01508O0152p3458M6013o0145J6616Q1246L1068n5405o4373M822
6832e6484L0730o3782J04165M6490j16364m1700N0584j3088N2795L2361r3437
6821f7730O9507N6742j02044K4195J5138k5247N617o7748m4176K00619j80126
6810a15253O4047o4872O3242O6016j33874J63414j5597n6511k630p2822R2248
6799a2592k7594K2200K5782j59634K09402m8664k4193N9622p6410J5977N1215
6788C5111j36907J34585o3756L990J25781j23701o9132Q3420J3698j33041J33433
6777C481K1668q8704j16J12513j33779P4946n5169J484M7681M4821p4122J20984
6765G5688j24477J8521M6013L9780j54796L7332L3458M0932P7786j12166q3191
$$ plain form
6844 42555 58488 -43020 17132 -56326 -10313 -70458 -53842 27404 58472 3067 -61306 -56484
6832 -56484 -25754 -89536 14629 61119 -55245 -96945 -46361 -59449 -6654 25707 -67730
6821 -67730 1777 58519 -43525 -19330 -4192 -29439 -23822 -91570 -135746 64873 -115253
6810 -115253 -51206 -116078 -52836 13180 -120694 42720 27123 -29388 -32018 -104840 -12592
6799 -12592 -40186 -17986 7796 -151838 57564 8900 -15293 44329 -32081 -16104 35111
6788 35111 -101796 32789 -30967 -26977 98804 -24897 -94029 -10609 3089 -129952 3481
6777 3481 25149 -63555 -63671 48842 -84937 -9991 -65160 -63676 -15995 28826 -45296 75688
6765 75688 -48789 -30268 15745 55525 -99271 -61939 -28481 12451 90237 -21929 -105120
6754a05120K8524J04623K0635k2029P39p6875N3101l8551J23813j72735Q6823
6743B948R948J2765l1424M9522n7028m2628O6297N3101q9421J32745J2043k9789
6731H9079j4822L3530r0080M120k7862n9231J31884J0616N2932j20695l2119M273
6719a8375J90611j35597r581L6045j3566J0198P4002o4664k4862Q6156q7466m0644
6707B257J8861J3195L0257p470n0955J05242J4918m9794k2236N1938r4401k7235
6695a5423L0871l70Q96M8090m5966p0007R7839K1252n0228J9640L3738m9481M9262
6682G0113P2100p9629M9663n9602o7787M467k0207K4684j8109K3225P1664L5764
6670A06346o174j611Q434p7539P9269j03279P4350N1600p6318N2856j09242O0636
$$ plain form
6754 -105120 -76596 28027 48662 26633 27372 -49503 3598 -34953 88860 -83875 2948
6743 2948 12896 25661 -5763 43759 -13269 -55897 10400 63501 -25920 106825 118868 89079
6731 89079 74257 107787 17707 21827 -6035 -65266 66618 77234 130166 9471 -22648 -18375
6719 -18375 172236 36639 27058 63103 49537 59735 133737 69073 44211 130367 42901 2257
6707 2257 21118 34313 64570 57100 6145 111387 126305 76511 54275 106213 11812 -15423
6695 -15423 15448 15078 15974 64064 18098 -51909 45930 67182 16954 36594 70332 20851 70113
6682 70113 142213 62584 112247 52645 -15142 -10675 -30882 -6198 -24307 -1082 70582 106346
6670 106346 100172 98561 106995 29456 108725 5446 79796 131396 55078 107934 -1308 59328
6658E9328O4817M8010j5301j5545O075j40261J00778N6385k6027o8709K6272Q4195
6646A80017N3466m8669o0521p326J5202L9713k5279j02385j3605J05900j6585
6635A19928k7497J10414q9868L0646n5681J06026j53031P9372M6223K614n8565
6624A10581n7613J69654p4259J5974M4002r069l5589p6584J37686k4543J4643
6613B14883K4637o9572j3875n648J42698l6110j0532J9550R103N1717m9972m1934
6601B34945J14385j44837J8654L3604m8675k4325P4522k9883J2182M1330O3673
6590C45575o0792M8564r8795K2242O1870n1189k597J9901L1178o4241M2065l145
6578B90636l2908L4308j4789K469J329k9862J65948m6334j6692J3970Q529N7809
$$ plain form
6658 59328 124145 172155 156854 141309 147384 7123 107901 164286 138259 69550 95822 180017
6646 180017 233483 184814 124293 116967 132169 171882 146603 44218 30613 136513 119928
6635 119928 92431 202845 112977 143623 87942 193968 40937 120309 166532 169146 110581
6624 110581 52968 222622 148363 164337 208339 199270 163681 87097 224783 200240 214883
6613 214883 239520 169948 156073 150425 293123 257013 246481 266031 275134 326851 276879 234945
6601 234945 349330 204493 223147 256751 208076 183751 258273 228390 240572 281902 345575
6590 345575 284783 333347 234552 256794 318664 267475 264878 284779 315957 251716 293781 290636
6578 290636 257728 292036 277247 279716 281045 251183 417131 370797 354105 368075 376604 434413
6566D34413r5528J03562K4463K865l0900K5124J01094l7571r9619J28035o5206
6555D90732J3409K7343j6671K0205J9460q3132J32398o0682P548J81386r4514
6544F37482J1395L6614j182O8275M2924O4387o6787J16090K01529l5540J41709
6533A216896P2742J36538K19592K75170K83295K72281J0186j23196k90856k77721
6523A794927k52449j49655j57686j33516l9527p1235k3897L526p3681P5438j38057
6512H34188j0063j8904J4166n3060l0529j4988K6342j2747J2728k5284o7032O5029
6500G19846p2604J9266M9496l8662M7186O0313r0515j4582O6502q9377J6412k9557
6488F43724J29842n7684L8733l0927n3918L4952n8673M4588P8021l5235O5643
$$ plain form
6566 434413 338885 442447 466910 469775 438875 463999 565093 527522 427903 555938 490732
6555 490732 504141 531484 514813 535018 554478 471346 603744 543062 550610 731996 637482
6544 637482 648877 685491 684309 752584 795508 859895 793108 909198 1110727 1075187 1216896
6533 1216896 1289638 1426176 1645768 1920938 2204233 2476514 2486700 2363504 2072648 1794927
6523 1794927 1542478 1392823 1235137 1101621 1062094 990859 966962 970488 896807 972245 834188
6512 834188 824125 805221 819387 766327 735798 720810 747152 734405 747133 721849 654817 719846
6500 719846 647242 666508 716004 677342 724528 784841 694326 679744 746246 656869 673281 643724
6488 643724 773566 715882 754615 723688 669770 704722 646049 690637 768658 733423 799066
6477G99066J9170J1857P361j3494j5008j03914J70557m7226k6790P3013J2350
6466H86942j08169J25972j03730K8112J03350n6075R7628j02868K5947J27042
6456A024151k9854j2603J35851j19965J6522k3050R4908Q113n8497L6968l4705
6445A037839N7821M8924O8804j76209J36313k645p980o0527r7989J49003r2045
6434A061309K8979J46154j31738J12217l9819J3045R1242n4268R6853R591p236
6423A326329k7680l2633N5619J27R466K1906J48257j61992K9649L5287J3191K4700
6411A442226N1893J8145Q8444P8274j43263J19270r306M1912r0034P2019N1802
6400A721382l1460j369L390j9450J4781L6389L8962j511O2907l4485O1257N8429
$$ plain form
6477 799066 818236 830093 837454 823960 808952 705038 875595 828369 801579 874592 886942
6466 886942 778773 904745 801015 829127 932477 876402 974030 871162 897109 1024151
6456 1024151 994297 981694 1117545 997580 1014102 991052 1085960 1094073 1035576 1072544 1037839
6445 1037839 1095660 1144584 1213388 1037179 1173492 1170847 1162867 1102340 1004351 1153354 1061309
6434 1061309 1090288 1236442 1104704 1216921 1177102 1190147 1281389 1227121 1323974 1333565 1326329
6423 1326329 1298649 1266016 1321635 1321762 1331228 1353134 1501391 1339399 1369048 1404335 1417526 1442226
6411 1442226 1494119 1512264 1600708 1678982 1535719 1654989 1645683 1687595 1597561 1669580 1721382
6400 1721382 1689922 1688553 1691943 1672493 1687274 1723663 1762625 1761114 1824021 1789536 1850793 1909222
6388A909222q0491P3723n880o6208Q3245J7611R5799M2331o6887L195J4704J33717
6376B154081p6244K1690J36205o9238J20814j36619M8420J8613K1334O1393m3899
6365B256550J65691L4068o5780k4419J5726k2202M2634J19485K4878k4526R7735
6354B619840p4623J01640J02544q3346J3640P8411Q3017j08645Q7771n27L1189
6343B850911J01856M6339K5878N0445J9340K5752J19183L1563P9446J38789k8322
6332C461180M0510J0338O0259R1309N462R5309J38960R6477Q6354N8423J14894
6321D259475P4480Q3363O7383J70761J11537O7794P5472J98919J22569J01966
6311E333719J15114J26537K53846J68782R5167L07598J50399K64163J75119J93294
$$ plain form
6388 1909222 1828731 1902454 1896574 1830366 1913611 1931222 2027021 2069352 2002465 2005660 2020364 2154081
6376 2154081 2077837 2099527 2235732 2166494 2287308 2150689 2199109 2217722 2239056 2300449 2256550
6365 2256550 2422241 2456309 2390529 2366110 2381836 2359634 2402268 2521753 2546631 2522105 2619840
6354 2619840 2545217 2646857 2749401 2666055 2679695 2758106 2841123 2732478 2820249 2819722 2850911
6343 2850911 2952767 2999106 3024984 3075429 3094769 3120521 3239704 3271267 3350713 3489502 3461180
6332 3461180 3501690 3512028 3572287 3663596 3669058 3764367 3903327 3999804 4086158 4144581 4259475
6321 4259475 4333955 4417318 4484701 4655462 4766999 4834793 4910265 5109184 5231753 5333719
6311 5333719 5448833 5575370 5829216 5997998 6093165 6400763 6551162 6815325 6990444 7183738
6301G183738L09717K75710J87988L21985K06602L79373M24894K90707L98087N43120
6291A0521921L94871M62555O39086O87584O88525Q59565Q27207J076403J183370
6282A7341087J565276J711406J942035K029675K048092J734732J933978J548077
6274C1854358Q08964O57398Q32347J250252J844546K148512K439117K809026L081801
6265D7726321L293090L552136M041768M600518N438167O225479P230832Q296602
6257I0404913R423135J0459643J1238606J2801212J6104938K2145277L1744771
6250B04322495M6270941N8630440N0238077K3107386r664577l6932062n1692196
6243B84280504m9479046l9999384l0999507k5399165k1068896j6599027j2751426
$$ plain form
6301 7183738 7493455 7769165 7957153 8279138 8485740 8865113 9290007 9580714 9978801 10521921
6291 10521921 10916792 11379347 12018433 12706017 13394542 14254107 15081314 16157717 17341087
6282 17341087 18906363 20617769 22559804 24589479 26637571 28372303 30306281 31854358
6274 31854358 32663322 33320720 34153067 35403319 37247865 39396377 41835494 44644520 47726321
6265 47726321 51019411 54571547 58613315 63213833 68652000 74877479 82108311 90404913
6257 90404913 99828048 110287691 121526297 134327509 150432447 172577724 204322495
6250 204322495 250593436 309223876 359461953 382569339 372904762 335972700 284280504
6243 284280504 234801458 194802074 163802567 138403402 117334506 100735479 87984053
6236H7984053r967264p955328o764605n513432m768470m242917l784719l098476
6228D1888842k802787k420245k320310k088563j907654j788979j571888j365353
6220B5623063j450297j084812j161078j009484r95320j047595r00964q56129q33675
6211A6283709p73589o67008o89690p03786n35711m51410n53652m99893k52966
6202A1156004m39841k81560l46810k99982k65745k9245l59756j51767j14287k23921
6192H643090j40723k91732j13773k54266j27118j86216k76175k5791l9967j21623
6182G065706j63009j26495l2274j24277M9206j17617k05387n0441o6074j08201
6172F121137q8451r4709j26155j2210r1980p3220k8105J4228j88040j23326J0517
$$ plain form
6236 87984053 78016789 70061461 63296856 57783424 53014954 48772037 44987318 41888842
6228 41888842 39086055 36665810 34345500 32256937 30349283 28560304 26988416 25623063
6220 25623063 24172766 23087954 21926876 20917392 19922072 18874477 17973513 17117384 16283709
6211 16283709 15510120 14843112 14153422 13449636 12913925 12462515 11908863 11408970 11156004
6202 11156004 10716163 10434603 10087793 9787811 9522066 9492821 9133065 8981298 8867011 8643090
6192 8643090 8502367 8210635 8096862 7842596 7715478 7529262 7253087 7227296 7187329 7065706
6182 7065706 6902697 6776202 6743928 6619651 6668857 6551240 6345853 6295412 6229338 6121137
6172 6121137 6032686 5937977 5811822 5799612 5707632 5634412 5606307 5620535 5432495 5309169 5319686
6161E319686n8997j59687m761Q2952j38306l3370M8681J074j19339L5847l4997
6150D938783l0426N8116L9690j20726M8285l5693k5844j16382L5467j4596p4453
6139D702221R7660k50294O1573j8527J6221k4565n1069n0363j07979O0003r586
6128D425295k0497o7738J43990o6559K1323J4311q0647L6497M4709j1473n1214
6117D387997o7648J38379O8381r9117K3432J10572j55314M7733L6096L6193o5899
6106D460805J82109o3153P9236L4353l1426R6390j50342R3812k4398N6501q050
6095D725837J01351j0016j48235J63476l2892l2344J29098k3597O5204O8817J6576
6084E023275m633J6558R522O0401P4601N804J31961J1859j8157J25852p5725Q9205
$$ plain form
6161 5319686 5260689 5101002 5096241 5179193 5040887 5007517 5056198 5057272 4937933 4973780 4938783
6150 4938783 4908357 4966473 5006163 4885437 4933722 4898029 4872185 4755803 4791270 4776674 4702221
6139 4702221 4799881 4549587 4611160 4592633 4608854 4584289 4533220 4482857 4374878 4434881 4425295
6128 4425295 4404798 4337060 4481050 4414491 4435814 4450125 4369478 4405975 4450684 4439211 4387997
6117 4387997 4320349 4458728 4527109 4427992 4451424 4561996 4406682 4454415 4490511 4526704 4460805
6106 4460805 4642914 4579761 4658997 4693350 4661924 4758314 4607972 4701784 4677386 4733887 4725837
6095 4725837 4827188 4817172 4668937 4832413 4799521 4767177 4896275 4872678 4937882 5006699 5023275
6084 5023275 5018642 5035200 5044722 5105123 5179724 5185528 5317489 5329348 5311191 5437043 5361318 5450523
6072E450523J43738k7725J12654L4723J0564j5349K6159J12771J35604j10240
6062E873422J32361m7898j4669J85220P4254J04891J24581j7428k8559J9975J00056
6051F506206J54156L4547J12433J04859n4060J76338J7157J50302N8717J46110
6041G406765l0294O8478J10890J02347L6939M9200J04273J95944J47898p1685
6031H120755K04617J09718R3719K26478J38114R1247K33654J36040J67978K03290
6021I725610K72563K57400J40735L62507K54258L41285K90361P2792J51527J36262
6011A2005300J76834N054L3408J91565J46502J69188K16003J63732L37014J83745
6001A3628345L56500L78685N32705M76573M58259M73697N73238R38519P11648
$$ plain form
6072 5450523 5594261 5566536 5679190 5713913 5724477 5709128 5735287 5848058 5983662 5873422
6062 5873422 6005783 5957885 5943216 6128436 6202690 6307581 6432162 6414734 6386175 6406150 6506206
6051 6506206 6660362 6694909 6807342 6912201 6858141 7034479 7051636 7201938 7260655 7406765
6041 7406765 7376471 7444949 7555839 7658186 7695125 7744325 7848598 8044542 8192440 8120755
6031 8120755 8325372 8435090 8528809 8755287 8893401 8984648 9218302 9354342 9522320 9725610
6021 9725610 9998173 10255573 10396308 10758815 11013073 11354358 11644719 11717511 11869038 12005300
6011 12005300 12182134 12187188 12220596 12412161 12558663 12727851 12943854 13107586 13444600 13628345
6001 13628345 13984845 14363530 14896235 15372808 15831067 16304764 16878002 17816521 18528169
5992A8528169J004849J265338J146316J117924Q89281M64797o3275k55261m28867
5983B3669271m21530m14126j46108l3556J34437L50905K56536N23703O41939P87574
5973B5349045P31654R73874J068419J115820J373370J549095J830755K281616
5965C6273648K876809L125886L271379K699109J630874K04893q49865j686771
5957D7545962j739711j720498j177215q89949l34362j22320K87958N11945P31447
5948D3093257Q99553J188023J450674J605869J694821K042667K219349K696994
5940E6891207L057444L631012M376426M892179N016442M162576K726341J029501
5932H5783128m56888j340699j418571r44435m32446K56468O54056J117809J612272
$$ plain form
5992 18528169 19533018 20798356 21944672 23062596 23951877 24416674 24353399 24098138 23669271
5983 23669271 23247741 22833615 22687507 22653951 22788388 23139293 23395829 23919532 24561471 25349045
5973 25349045 26080699 27054573 28122992 29238812 30612182 32161277 33992032 36273648
5965 36273648 39150457 42276343 45547722 48246831 49877705 50082598 49232733 47545962
5957 47545962 45806251 44085753 42908538 42018589 41684227 41561907 41849865 42361810 43093257
5948 43093257 43992810 45180833 46631507 48237376 49932197 51974864 54194213 56891207
5940 56891207 59948651 63579663 67956089 72848268 77864710 82027286 84753627 85783128
5932 85783128 85326240 83985541 82566970 81622535 81190089 81446557 82100613 83218422 84830694
5923H4830694J814801K214652K498362K931494L206272L456279L923638M223752
5915A09099944M688149N278644N921855O718355P492960Q397090Q447257Q118343
5907A64162597P411228O525090O203525O477949P016594Q155964R389497J0418067
5899B25760511J1607588J2600086J3691231J4383883J5025951J5513691J5566910
5892C24149851J5146316J4319330J2707394J0541064P875114M592215J219885
5885C90551169k221711n529250q600971j1588561j4028643j6065347j7390046
5878C15126640j8161432j8390234j7714530j7093746j6049049j4976723j3947663
5871A98793263j2802832j1923619j0786225j0046372r160549q460183p709829
$$ plain form
5923 84830694 86645495 88860147 91358509 94290003 97496275 100952554 104876192 109099944
5915 109099944 113788093 119066737 124988592 131706947 139199907 147596997 156044254 164162597
5907 164162597 171573825 178098915 184302440 190780389 197796983 205952947 215342444 225760511
5899 225760511 237368099 249968185 263659416 278043299 293069250 308582941 324149851
5892 324149851 339296167 353615497 366322891 376863955 384739069 389331284 390551169
5885 390551169 388329458 382800208 374199237 362610676 348582033 332516686 315126640
5878 315126640 296965208 278574974 260860444 243766698 227717649 212740926 198793263
5871 198793263 185990431 174066812 163280587 153234215 144073666 135613483 127903654
5864A27903654p263869o557488o153895n605402n246854m807788m487532m146647
5856H3634179l791252l560664l499886l254486l144816l022776k788119k647661
5848E7924519k552454k219869k048565k177122j843797j723355j597455j539742
5840D2222160j418903j268040j301550j193667j268603j171026j252570j179474
5832C2168327r63789j018782j105624q45739q67561q02897o96394p17734p04271
5823B4445536p32922n16792n44047p58764n14593n03371n35005n32128l37295
5814A9470619n27244m49322m02840m81879k77205m12562m02902l68842l23854
5805A5823969l39627l03216k77195k55254l05624k65813k60416l83806p7666k85384
$$ plain form
5864 127903654 120639785 114082297 107928402 102323000 97076146 92268358 87780826 83634179
5856 83634179 79842927 76282263 72782377 69527891 66383075 63360299 60572180 57924519
5848 57924519 55372065 53152196 51103631 48926509 47082712 45359357 43761902 42222160
5840 42222160 40803257 39535217 38233667 37040000 35771397 34600371 33347801 32168327
5832 32168327 31204538 30185756 29080132 28234393 27366832 26563935 25867541 25149807 24445536
5823 24445536 23712614 23195822 22651775 21893011 21378418 20875047 20340042 19807914 19470619
5814 19470619 18943375 18494053 18091213 17609334 17332129 16919567 16516665 16147823 15823969
5805 15823969 15484342 15181126 14903931 14648677 14343053 14077240 13816824 13433018 13355352 13069968
5795A3069968j71877l33605r4381l61113k16759k39946k93003q8088k68854j69457
5785A0832885j68555j73846k41947k07402K8871k18034k55189p2779k74397J3181
5775I262788j95181j40920k21389k1094k61950k16577j03193r4134j97707n7382
5765G753261l02822k8668q1134j42108j94974r0046j41421o3746j03808q1214
5755F523320m9653k34296k1371q3345q4738j40861q1472M2575j98071j19949Q150
5744E560289q3106r2206k3505j72479k1939r1438r6993j00907j0565j23419m6569
5733D697163n3146q261p2985l1092m1972j19995m3007N450n7110j50453M5549
5722D170141l5458j01632m5309l125j81634J02111N981o9195o719r9754n5511
$$ plain form
5795 13069968 12898091 12564486 12470105 12108992 11892233 11652287 11359284 11271196 11002342 10832885
5785 10832885 10664330 10490484 10248537 10041135 10070006 9851972 9596783 9524004 9249607 9262788
5775 9262788 9067607 8926687 8705298 8684204 8422254 8205677 8102484 8008350 7810643 7753261
5765 7753261 7450439 7421771 7340637 7198529 7003555 6913509 6772088 6708342 6604534 6523320
5755 6523320 6473667 6239371 6218000 6134655 6049917 5909056 5827584 5870159 5672088 5552139 5560289
5744 5560289 5477183 5384977 5361472 5188993 5167054 5075616 4978623 4877716 4867151 4743732 4697163
5733 4697163 4644017 4635756 4562771 4531679 4489707 4369712 4326705 4332155 4275045 4124592 4170141
5722 4170141 4134683 4033051 3987742 3984617 3802983 3905094 3911075 3841880 3835161 3735407 3679896
5711C679896R915j06644K5020r5789P0459P9637q9083j81269J1616k399j1502
5700C389857l7064j00379N6574K3558j07962p4436l5674l370o3664l690o4842
5689B978908m4760L2853j80749K0247l7716J22027j50123k705k5484p3333R4393
5678B733558k4018n4375L7311l2849M1251q5090o9317K4726J8258j61587O4720
5667B492588p7227K7289k3942o5908n0074J7512j080m9752j3563N1868j49495
5656B158216Q5246p3588N8699M7031n8049n2051r950M9269K5676o1701L2297j33768
5644B067327j1772J5941j55900O4022j34279M9004L0681p5787q00j9082k5671
5633A803684M416l3472j3658M3607m8230n5568K1160L7796m101j9009j9055O8181
$$ plain form
5711 3679896 3689811 3583167 3608187 3512398 3582857 3662494 3573411 3392142 3403758 3401359 3389857
5700 3389857 3352793 3252414 3308988 3332546 3224584 3150148 3114474 3111104 3047440 3043750 2978908
5689 2978908 2934148 2967001 2786252 2806499 2768783 2890810 2740687 2737982 2712498 2639165 2733558
5678 2733558 2709540 2655165 2692476 2659627 2700878 2615788 2546471 2571197 2589455 2427868 2492588
5667 2492588 2415361 2442650 2418708 2352800 2302726 2320238 2319158 2269406 2255843 2307711 2158216
5656 2158216 2243462 2169874 2228573 2275604 2217555 2165504 2155554 2204823 2230499 2168798 2201095 2067327
5644 2067327 2055555 2071496 1915596 1979618 1845339 1894343 1925024 1849237 1848437 1829355 1803684
5633 1803684 1808100 1774628 1760970 1804577 1756347 1700779 1721939 1759735 1755634 1736625 1717570 1785751
5621A785751p9244M3014p9943Q616P3604j26202L8825m1486K3405L743O1852j36597
5609A575338J08622q6008M0973l2543M3758l6643L6894L3060j3460j84297K69962
5598A755656l6603m2329m3769k5267L3919r1110O4043K6971n4953J18640j51788
5587A553410K8110J17504p6076N64K3446L4421m534N3430J5111N3444M5940k0038
5575A824732j05597P1263j30322P2290k6280P8545n1501m3470j00807O9498Q481
5564A666832r9393R037l4494l7389N292q8849O4525n5038k1795j05681J12752
5553A415799j08275J2294n487p0009P5122o4235M375n160k5920O675P3882p3662
5541A235399m2875J2666m9146M4129n165q040P8349n2061o2686K9119Q0085j17235
$$ plain form
5621 1785751 1706507 1749521 1669578 1678194 1751798 1625596 1664421 1622935 1646340 1650083 1711935 1575338
5609 1575338 1683960 1597952 1638925 1606382 1650140 1613497 1650391 1683451 1669991 1485694 1755656
5598 1755656 1719053 1676724 1632955 1607688 1641607 1550497 1614540 1641511 1586558 1705198 1553410
5587 1553410 1581520 1699024 1622948 1623512 1646958 1681379 1676845 1730275 1745386 1798830 1844770 1824732
5575 1824732 1719135 1790398 1660076 1732366 1706086 1784631 1733130 1689660 1588853 1658351 1666832
5564 1666832 1567439 1576476 1541982 1504593 1509885 1421036 1485561 1430523 1408728 1303047 1415799
5553 1415799 1307524 1319818 1314331 1244322 1319444 1255209 1259584 1254424 1228504 1235179 1309061 1235399
5541 1235399 1192524 1205190 1156044 1200173 1195008 1186968 1265317 1213256 1150570 1179689 1259774 1142539
5529A142539n0478K4093J27618j00051p382O5588p2844M5439k5056J1626J6440
5518A177532K2026n3147l4961j7459L7633r868k5534N4667N9505m3881M2894j07745
5506A101662R20J41874j41856Q1125j1487n4768L4224N4539j15693O5952L3505
5495A189997m3819J26030j20079N3095j73407K12776j33609j259P8024j05111
5485A082638N8629j04712J33317j1494K4949l9156K5408q4724O6077m9214J3263
5474A114981P0689q8120m6218J5868L6777q4032J19180N1852l3065J9025p4115
5463A102822J28733o3630k3407j8975k1506Q3064j07480J37908p4659l8525k0611
5452A083734Q7862p2070k8437O5903K8880P612j6314j416J2000j0226k5813J41264
$$ plain form
5529 1142539 1092061 1116154 1243772 1143721 1136339 1201927 1129083 1174522 1149466 1161092 1177532
5518 1177532 1199558 1146411 1111450 1093991 1131624 1121756 1096222 1150889 1210394 1166513 1209407 1101662
5506 1101662 1102582 1244456 1102600 1183725 1172238 1117470 1151694 1206233 1090540 1156492 1189997
5495 1189997 1146178 1272208 1152129 1205224 1031817 1244593 1110984 1109725 1187749 1082638
5485 1082638 1141267 1036555 1169872 1158378 1183327 1144171 1169579 1084855 1150932 1101718 1114981
5474 1114981 1185670 1097550 1051332 1067200 1103977 1019945 1139125 1190977 1157912 1176937 1102822
5463 1102822 1231555 1167925 1144518 1125543 1104037 1187101 1079621 1217529 1142870 1104345 1083734
5452 1083734 1171596 1099526 1071089 1136992 1165872 1173484 1157170 1155754 1167754 1157528 1131715 1272979
5440A272979k46664J41262J17766j07685L7361o5187O5917Q32l7200o368J4152
5429A187165k4369J1819J55357j24029O1792m5982J18185j14235L01J18352o2189
5418A282167o2478L248O5667Q5864r7821K7902l2930k6263K3759P4763l5595q0490
5406A227793j1747J26613K1855R679O6418j16367j5299K8360O8723k9610O8745
5395A445163N4439k1823m3790L5442l377K2145O5514k7859K9312J18871j29632
5384A544405N5997Q1301M9277p7888J41701m8563J4313l2588M2563j5649L6473
5373A791342R6481m5661J01181q8472R1721J17537Q0732J4686l0387J07406P44
5362B237310P7441O7572R6802J42730l5015J55442Q7543L1586J06074O1079L2409
$$ plain form
5440 1272979 1026315 1167577 1285343 1177658 1215019 1149832 1215749 1216581 1179381 1173013 1187165
5429 1187165 1162796 1174615 1329972 1205943 1267735 1221753 1339938 1225703 1226004 1344356 1282167
5418 1282167 1219689 1222937 1288604 1374468 1276647 1304549 1271619 1245356 1269115 1343878 1308283 1227793
5406 1227793 1216046 1342659 1364514 1374193 1440611 1324244 1308945 1337305 1406028 1376418 1445163
5395 1445163 1499602 1477779 1433989 1469431 1466054 1488199 1553713 1525854 1555166 1674037 1544405
5384 1544405 1600402 1681703 1730980 1653092 1794793 1746230 1760543 1727955 1770518 1754869 1791342
5373 1791342 1887823 1842162 1943343 1854871 1946592 2064129 2144861 2159547 2129160 2236566 2237310
5362 2237310 2314751 2382323 2479125 2621855 2586840 2742282 2829825 2861411 2967485 3028564 3060973
5351C060973K82685P3431J41401J82400J84603L07985J24324K56913K39391K35317
5341E089423K82982K07324L90641L28527K78337L75995L54918L83241M63021M68193
5331H622602M07024N99221M75391O55041P19849N74234P19221R43535J072494
5322A4788612J057184J107481J379141J732227J848610K428759K679679K861065
5314B9882758K242742J957293J610154J776580K542444L338246L715949K954466
5306E0020632J602081P09098Q5362P71447J950106L167767K349939K36963j195213
5297E9698182k816636k988345j870431p36713m61690j311824k410626l266170
5289D3835747l799899l176081k486682j738702j897636k229556k459508k646202
$$ plain form
5351 3060973 3343658 3417089 3558490 3740890 3925493 4233478 4357802 4614715 4854106 5089423
5341 5089423 5372405 5579729 5970370 6298897 6577234 6953229 7308147 7691388 8154409 8622602
5331 8622602 9029626 9628847 10104238 10759279 11479128 12053362 12772583 13716118 14788612
5322 14788612 15845796 16953277 18332418 20064645 21913255 24342014 27021693 29882758
5314 29882758 32125500 34082793 35692947 37469527 40011971 43350217 47066166 50020632
5306 50020632 51622713 52331811 52417173 53188620 55138726 58306493 60656432 60893395 59698182
5297 59698182 56881546 53893201 52022770 51286057 50824367 49512543 47101917 43835747
5289 43835747 40035848 36859767 34373085 32634383 30736747 28507191 26047683 23401481
5281B3401481k573906k280916k051952j513694j504786j198663j045142q45065
5273A0387357q31023o34706n61517n16583m68501m13027m23926l72764m20190
5264E745120k40047l08195k37790k78616j43486k75676j52078k12216j55317j40739
5254C600960j61741k9496k16668r1706j36882j08724m4206j30168r3719q3515
5244B504135j45886L0335p5498p1237m2313r5178M0651j42739J8582j08456n4632
5233A857764o207p9759m2152o1148k4798J3054q9202K1056n0223J275p1246l9409
5221A429005n136q2670k5432P109n4104M0440j45545J27888o9413n421m3076p0102
5209A103543j7516O5950q8082K5155j13445L987m7056J14441l0092m6703k3798
$$ plain form
5281 23401481 20827575 18546659 16494707 14981013 13476227 12277564 11232422 10387357
5273 10387357 9556334 8921628 8360111 7843528 7375027 6962000 6538074 6165310 5745120
5264 5745120 5505073 5196878 4959088 4680472 4536986 4261310 4109232 3897016 3741699 3600960
5254 3600960 3439219 3409723 3193055 3101349 2964467 2855743 2811537 2681369 2587650 2504135
5244 2504135 2358249 2388584 2313086 2241849 2199536 2104358 2145009 2002270 2020852 1912396 1857764
5233 1857764 1851557 1771798 1729646 1668498 1643700 1656754 1567552 1588608 1538385 1539660 1468414 1429005
5221 1429005 1423869 1341199 1315767 1322876 1268772 1309212 1163667 1291555 1222142 1216721 1173645 1103543
5209 1103543 1086027 1151977 1063895 1089050 975605 979592 932536 1046977 1016885 970182 946384
5198I46384J0958q1969L807J03181j3295p5265n0210J5314P4412q9325m6962L1055
5186H28085L5696j19179j1027q96l0545J02586j64166O6917N9876j31260O4439
5175G00526J4541j71114J06117l8929P0296p3263J5595m0956k8215O8806j41977
5164D81427M5090J28017q2806j06470N8976m7489M8658n0771K3911o7271M2800
5153D74072k0207J00102m8282r3757N5751J5268m1217M5831j18857M1045P7478
5142D87227o0871j2662q300O69m0194n178N912L2928M4542j53397J10001J7521
5130D18198j05936J01865j3336o6087L8929m342j41O5452q9583J3495j1487n2871
5118B94156L6900K4317K2186M3777l8683p635Q002k4471K0384m6418R3920j07906
$$ plain form
5198 946384 957342 875373 879180 982361 969066 893801 843591 858905 933317 843992 797030 828085
5186 828085 863781 744602 733575 732679 702134 804720 640554 707471 767347 636087 700526
5175 700526 715067 543953 650070 611141 681437 608174 623769 582813 554598 623404 481427
5164 481427 526517 654534 571728 465258 524234 476745 525403 474632 498543 431272 474072
5153 474072 453865 553967 505685 411928 467679 482947 441730 487561 368704 409749 487227
5142 487227 426356 413694 405394 406063 365869 360691 366603 399531 444073 290676 400677 418198
5130 418198 312262 414127 400791 334704 373633 369291 369150 434602 345019 358514 347027 294156
5118 294156 331056 355373 377559 421336 382653 375018 383020 358549 378933 332515 426435 318529
5106C18529P4388q8656L3262k9935K5975J40948m8211m8981Q7702p9744q842J37170
5094E13605j56119M5284J9273J08523j8676k5845K9294L4058J031J09775R9858
5083G60061J8550n4675m6802l8087K6350r6945q8892m7163m7317M0581q7813R378
5071C47226p255l7095K7511m6478O2240j4058k8924L0653p5282J6932M2366L8219
5059C56055k4034j14083J45803k3902l5595j2971Q4803j74807J54183j6827o4558
5048B74067j0415J8766J26119j35046R3937l6846P6610l6035O2064j154O7745
5037D99812n69n8241k5962Q4879L231j6751O0982q5748N069M7106J00802k9443
5025E85167j19776N7217Q650j06178J15564j3043o9115L749p103p649q8621l387
$$ plain form
5106 318529 392917 304261 337523 307588 333563 474511 426300 377319 465021 385277 376435 513605
5094 513605 357486 402770 422043 530566 511890 486045 515339 549397 550428 660203 760061
5083 760061 778611 723936 677134 639047 665397 568452 479560 432397 385080 425661 337848 347226
5071 347226 339971 302876 330387 283909 346149 332091 303167 333820 258538 275470 317836 356055
5059 356055 332021 217938 363741 339839 304244 291273 376076 201269 355452 338625 274067
5048 274067 263652 282418 408537 273491 367428 330582 407192 371157 433221 432067 499812
5037 499812 499243 441002 415040 499919 503150 486399 547381 461633 466702 513808 614610 585167
5025 585167 465391 522608 531258 425080 540644 527601 458486 462235 455132 447483 358862 355475
5013C55475n6765J32796j30403l2654M3109p1776Q198p8584O3001k0475N1509
5002B63431k545O4801q5504o9792J44340j51309J13512r793j1333m5068k21K9170
4990B39689k2312m2945m5957P1292j8844k1751p358P5158p1841n6806P1505M7075
4978B16905j18745J00487j6802O0357k7954r0230P2486O3906p3722l0468q046
4967A48174k5766l337J635N8381Q0530k00567J27466j00456J11717j09633P7387
4956A65531K0497j349k6212p0969J00929L6175j4817n8827K4197q5084Q1235m3348
4944A27958J220J2317N106j2425J3203M4269j15019M6438o2189K1388J27713p8718
4932A31261o4997P3347L2706N1587j3824p7919k3716J20771j02004L2071M052
$$ plain form
5013 355475 298710 431506 301103 268449 311558 239782 247980 169396 232397 211922 263431
5002 263431 260886 325687 240183 170391 314731 163422 276934 267141 255808 210740 210519 239689
4990 239689 217377 174432 128475 199767 180923 159172 151814 226972 155131 98325 169830 216905
4978 216905 98160 198647 181845 242202 214248 124018 196504 260410 186688 156220 148174
4967 148174 122408 119071 120706 179087 259617 59050 186516 86060 197777 88144 165531
4956 165531 186028 184679 158467 87498 188427 224602 209785 150958 175155 90071 171306 127958
4944 127958 129178 141495 146601 134176 147379 191648 76629 123067 60878 82266 209979 131261
4932 131261 66264 139611 172317 223904 210080 132161 108445 229216 127212 159283 163335
4921A63335m637N1302r2855O109J06389j82047R8207n5790J9141j19243R8545
4910H8456m1285O1797k618n1354l0409M9307N7190j5079L5096r2787j2898k6415
4898A9001J07621m621l9232K7471m6023J20110j16211N1383p8429R7481o6845
4887G1706Q3281l1405l6102j5867J50438o3338j70848J00551j4054J66523j41525
4876I9360p305Q5929J8642j591m2490r0084R3730r1508R8676N2245o9304m669
4864A41631J992M2969o8177l7194j087K6768P0260j65o8383L9202P3583j75205
4852D6194J45313L7154j8255q4833P5965q3368M6613N0724m2524J456k5976N9151
4840B07614o4126J05863j4056Q7175o7197J63632r5242k1540N2146n590N0798
$$ plain form
4921 163335 158698 210000 117145 123254 229643 47596 145803 90013 109154 -10089 88456
4910 88456 47171 108968 106350 54996 24587 73894 131084 116005 151101 58314 45416 19001
4898 19001 126622 122001 82769 110240 64217 184327 68116 119499 41070 138551 71706
4887 71706 154987 123582 87480 71613 222051 158713 -12135 88416 74362 240885 99360
4876 99360 92055 177984 196626 195035 152545 62461 156191 64683 163359 215604 146300 141631
4864 141631 143623 186592 118415 81221 80134 106902 177162 176997 108614 147816 221399 46194
4852 46194 191507 228661 210406 125573 201538 118170 164783 215507 172983 174439 148463 207614
4840 207614 143488 249351 235295 322470 255273 418905 323663 302123 354269 348679 399477
4829C99477Q118j2392Q4802j9564M9625R2203j25971P8939j2154K0036L48o9456
4817D94011j22298J4379J54j19970R7987j26656N2971J0053j9037l2581J10953
4806C59966j06803Q1762n3013m4108L6385P027l930m5992O1815k2991M5687q2743
4794B33062l9907J1700M6170l888p6566J22769q9934N4726j8132o1207M0710l9050
4782A80453L9757N2379o172p5627O6010j7780P0393o4305O539R737R4022l0551
4770C24855j10386J21314R130o0230J4549k3952J54385j19692K775m5664L4351
4759C01435M3919m149O9811K4852k25850J39046o0621N6039r7513p4386J17775
4748B90358K6043P4845m1651j43430J26840m3187N5370Q9734p9775k7072j9905
$$ plain form
4829 399477 407595 395203 480005 460441 510066 602269 476298 555237 543083 563119 563467 494011
4817 494011 371713 386092 386246 266276 364263 237607 290578 300631 281594 249013 359966
4806 359966 253163 334925 281912 237804 274189 281216 277286 231294 293109 270118 315805 233062
4794 233062 193155 204855 251025 247137 170571 293340 203406 258132 240000 178793 219503 180453
4782 180453 220210 272589 266417 190790 256800 239020 309413 245108 251647 261384 355406 324855
4770 324855 214469 335783 344913 284683 299232 275280 429665 309973 312748 267084 301435
4759 301435 345354 341205 411016 435868 210018 349064 288443 344482 246969 172583 290358
4748 290358 316401 391246 349595 206165 333005 289818 345188 434922 355147 328075 308170
4737C08170K3401l8178r6485R0586n1610P6624N8718k4016Q475L6966o0726M0331
4725C72256J9327n6224P7575R854q1590R5404p4472n8043P0740M3240j9938J2705
4713D10834N1302j72801J93500p3323Q0168O3572j41736k1836K5573J0226m4534
4702C80945J5027R9128K8189p5467l601L0635k3965L0661J08201k9688q1683L3984
4690E12366P363Q6850k2952l1799P8716n7516J1473j9428Q1520j15402O8622l6734
4678E63079l3397M6616j0680o8728N4776P0922m0625K0972q2341O1427J31r4635
4666D87517J22345O9107p5165n7952L1351P5921m0937m8778Q4810M3249j54655
4655E36813J73791r5095q2225Q1311Q3812O8130q0065N9364K7230q9764Q5732
$$ plain form
4737 308170 331571 293393 196908 287494 235884 312508 371226 347210 355685 392651 331925 372256
4725 372256 391583 335359 412934 422788 341198 436602 362130 304087 374827 418067 398129 410834
4713 410834 462136 289335 482835 409512 489680 553252 411516 389680 415253 425479 380945
4702 380945 395972 495100 523289 447822 444221 474856 450891 481552 589753 560065 478382 512366
4690 512366 519729 606579 583627 551828 630544 573028 584501 565073 646593 531191 599813 563079
4678 563079 529682 576298 565618 496890 551666 622588 581963 602935 520594 582021 582152 487517
4666 487517 609862 678969 603804 545852 577203 653124 612187 563409 648219 691468 536813
4655 536813 710604 615509 533284 614595 698407 766537 686472 745836 773066 683302 769034
4644G69034O3927q0145P6867j6691N9940l8782O4661Q9360n5898j7045J32454
4633A047682j23702N4621M7488k4035p5124J34066M4850L9483N038R6806J2947
4622A260120K0831K6820J31779J22973n0045N1567N5568Q6690J60914J26229L5467
4611B028913J94896J78086K22940L98042M9644J8814q9423j52168j03700j34614
4601B611430j31990j28540m1304n3589j3765Q0546k906j14547k1505M5581Q6479
4590B315890l5456o2187Q4048J7434P9340M5561J78560N7943J93404J71590J57095
4579C203222J723k00592k02103j67229k67274n4760q7689j53437o1022q3243l2961
4568A894635j21113l5964L2077M534n762P105M9372j0206j77237Q6966N5502O9940
$$ plain form
4644 769034 832961 752816 829683 812992 872932 834150 898811 988171 932273 915228 1047682
4633 1047682 923980 978601 1026089 1002054 926930 1060996 1105846 1145329 1150367 1247173 1260120
4622 1260120 1280951 1307771 1439550 1562523 1512478 1564045 1619613 1706303 1867217 1993446 2028913
4611 2028913 2223809 2401895 2624835 3022877 3072521 3091335 3001912 2849744 2746044 2611430
4601 2611430 2479440 2350900 2309596 2256007 2242242 2322788 2319882 2205335 2183830 2229411 2315890
4590 2315890 2280434 2218247 2302295 2319729 2399069 2444630 2623190 2681133 2874537 3046127 3203222
4579 3203222 3204945 3004353 2802250 2635021 2367747 2312987 2225298 2071861 2010839 1927596 1894635
4568 1894635 1773522 1737558 1769635 1774169 1768407 1775512 1824884 1814678 1637441 1724407 1779909 1849849
4556A849849j23699k8430P8026K1882N8238q6159J35334j07053N4458L0451j51965
4545A730932O9237J7114O4168q4736Q5745J8046L2142k2331O1826l760M8084R200
4533B025667L2756P4328j7596Q5295k7191N8213j26135J75779l7747K3007n2689
4522B213687O0758P582Q8619l9424M4106j0908J51645J7670N0203P0051J2084
4511B666073j42083J43533p5447J9026N8175K1611O4752M7278k2143L7755l3984
4500B784546J39956r606O5979l5070J57731J157P1599L6357J33935p3639Q8336
4489C361281n1219R4630l0975P6412n8407q2848J81301n9743j2472J23328k8320
4478C512968K3433j0870J35786J7700P9970L163M9320J0436J81943o655j8997
$$ plain form
4556 1849849 1726150 1697720 1775746 1797628 1855866 1769707 1905041 1797988 1852446 1882897 1730932
4545 1730932 1800169 1817283 1881451 1796715 1882460 1900506 1932648 1910317 1972143 1968383 2016467 2025667
4533 2025667 2058423 2132751 2115155 2200450 2173259 2231472 2105337 2281116 2243369 2266376 2213687
4522 2213687 2274445 2282027 2370646 2331222 2375328 2364420 2516065 2533735 2583938 2653989 2666073
4511 2666073 2523990 2667523 2592076 2611102 2669277 2690888 2755640 2802918 2780775 2818530 2784546
4500 2784546 2924502 2914896 2980875 2945805 3103536 3104693 3176292 3212649 3346584 3272945 3361281
4489 3361281 3310062 3404692 3373717 3450129 3391722 3308874 3490175 3430432 3417960 3541288 3512968
4478 3512968 3536401 3525531 3661317 3679017 3758987 3762150 3811470 3821906 4003849 3997194 3978197
4467C978197Q0414L9496p9707O8949N4561N6872O7686M0565M538J37452o1940
4456D387083J65912P7075O8315K9861J16773o139K1688J8370N4406J93228O6135
4445E192707K8174l1260R7176L5032J22570o5943J91949M3805l7112J55300P9265
4434E811663J76440J33700J19617Q2299J35137R1256Q0687J41165J77555K83753
4424G233272J71607Q2702J64250P7334K91822J46493K11203R6454K02154K48265
4414H925556J62159K58846K85011L41500J58748K43347L55139M23162M33258L70773
4404A1957499M27813N68986M97054M43622O23802O26070N99550O73342Q16787
4395A7234525Q94054R90621J072796J113259J152286J497960J788114K048411
$$ plain form
4467 3978197 4058611 4098107 4018400 4087349 4141910 4198782 4266468 4307033 4311571 4449023 4387083
4456 4387083 4552995 4630070 4698385 4728246 4845019 4838880 4860568 4878938 4933344 5126572 5192707
4445 5192707 5220881 5189621 5286797 5321829 5444399 5378456 5570405 5614210 5577098 5732398 5811663
4434 5811663 5988103 6121803 6241420 6323719 6458856 6550112 6630799 6771964 6949519 7233272
4424 7233272 7404879 7487581 7651831 7729165 8020987 8167480 8378683 8475137 8677291 8925556
4414 8925556 9087715 9346561 9631572 9973072 10131820 10375167 10730306 11153468 11586726 11957499
4404 11957499 12385312 12954298 13451352 13894974 14518776 15144846 15744396 16417738 17234525
4395 17234525 18128579 19119200 20191996 21305255 22457541 23955501 25743615 27792026
4387B7792026K216025K201763K179225K037914K188521J761795J132750J149914
4379D2659933J554245K062125K559409K961269L358704L812305M048266M370821
4371F7387077M921483N585588O462423P484886Q848994R769295J0825855J1948341
4363A33233942J2440754J3853736J7146557K2706521L1273366M3643914N6497256
4356C30796046N1831279K3547136m183547l2534995m4644467m2992535l6093029
4349B45725888k7381823k1808092j7249804j2410315q824780o048681l884688
4342A48117705j645302K93786K369329L863117N576190O709873P700800R643935
4334A82629433J3828020K0092683K9523522M2806850N1910828L7663268R249075
$$ plain form
4387 27792026 30008051 32209814 34389039 36426953 38615474 40377269 41510019 42659933
4379 42659933 44214178 46276303 48835712 51796981 55155685 58967990 63016256 67387077
4371 67387077 72308560 77894148 84356571 91841457 100690451 110459746 121285601 133233942
4363 133233942 145674696 159528432 176674989 199381510 230654876 274298790 330796046
4356 330796046 382627325 406174461 401990914 369455919 324811452 281818917 245725888
4349 245725888 218344065 196535973 179286169 166875854 158051074 152002393 148117705
4342 148117705 146472403 146766189 149135518 152998635 158574825 165284698 172985498 182629433
4334 182629433 196457453 216550136 246073658 288880508 340791336 378454604 387703679
4327C87703679j7120407m1465995m6859266m3347732l5449065k8174505k3481268
4320A51805441j9140337j5000971j2206688j0311899q709119p611863o473954
4313G2350610n796658n015501m423460l644071l312986l019799k759143k545657
4305D1833335k242690k062433j845961j548131j717389j501109j305774j178335
4297B8431513j338659r25211j105335q96862j004740q64725r55224p02499q36778
4288A9801480q59941n64860p92150o04370n68399n17205n61404l14113m51714
4279A4567324l65233m05926k37209k16877j90492l27805j88301j76320l598j79699
4269A2275864J23417j56986p3450k53177k74039l83806l10360k97796k54668j75132
$$ plain form
4327 387703679 370583272 329117277 282258011 238910279 203461214 175286709 151805441
4320 151805441 132665104 117664133 105457445 95145546 86436427 78824564 72350610
4313 72350610 66553952 61538451 57114991 53470920 50157934 47138135 44378992 41833335
4305 41833335 39590645 37528212 35682251 34134120 32416731 30915622 29609848 28431513
4297 28431513 27092854 26167643 25062308 24165446 23160706 22295981 21340757 20638258 19801480
4288 19801480 18941539 18376679 17584529 16980159 16411760 15894555 15333151 15019038 14567324
4279 14567324 14202091 13796165 13558956 13342079 13151587 12823782 12635481 12459161 12455563 12275864
4269 12275864 12399281 12242295 12168845 11915668 11641629 11257823 10947463 10649667 10394999 10219867
4259A0219867l50845j20660j96001k35406k11127K3254k55282j95003j40525r9094
4249H439178N5453j88527j14678j38214J3124P197k1848M8550K83039r4592k06888
4238H081794k22717k66006j93168j84022k40501l03415m6644j41058k05822j61305
4228F117136p4689j43142j38548j07429j48778p6493j52969k15771k7459n8562
4218D973296j41673M2481j89350o3928j26611q3375K0302m446j61364j75839J3761
4207D103254q6532l9731m7021o5809q2478j12388j4721r6522n8469p1507o8279
4196C359797r0030r4436q1957J22474q5185l8312O753j04047L0150j4109O0173
4185C071271l8678j22430l738j00676q7461M9951O8575p7180k9152M8235m0968
$$ plain form
4259 10219867 9869022 9748362 9552361 9316955 9105828 9129082 8873800 8678797 8538272 8439178
4249 8439178 8494631 8306104 8191426 8053212 8066336 8073533 8051685 8100235 8383274 8288682 8081794
4238 8081794 7859077 7593071 7399903 7215881 6975380 6671965 6625321 6484263 6278441 6117136
4228 6117136 6042447 5899305 5760757 5653328 5504550 5428057 5275088 5059317 5031858 4973296
4218 4973296 4831623 4874104 4684754 4620826 4494215 4410840 4431142 4426696 4265332 4089493 4103254
4207 4103254 4016722 3976991 3929970 3864161 3781683 3669295 3654574 3558052 3499583 3428076 3359797
4196 3359797 3269767 3175331 3093374 3215848 3130663 3092351 3099104 2995057 3025207 3011098 3071271
4185 3071271 3032593 2910163 2906425 2805749 2718288 2768239 2836814 2759634 2730482 2778717 2737749
4174B737749k9981j52333J8768l7630l7810m272k1922r538J9275J5409J3196r401
4162B501510n5874N0964K7164k0571j8198Q3722N4968n4905K0655N6070l6564
4151B608941r3439Q7650J4092j28704j9660l8358L2863l8358o9398n3075J6988
4140B319542j03871J2087J57471j42565P1428k7171K8125R3345Q6480m9241n8597
4129B387033n3828O1362o5718m9398N3174M0009m7356Q0388j07800O9679j2019
4118B355526K9719l4168L7996m0886L8850l092L6720N5625K0686N6225P7650n3057
4106B577794J45280l7083L09310K22484K17533J44749n1255q1743j83688j44531
4096C118850k15909j24237j96528K8427k01401N1246j40906q8056R2754q3689
$$ plain form
4174 2737749 2707768 2555435 2574203 2536573 2498763 2494491 2472569 2463031 2482306 2497715 2510911 2501510
4162 2501510 2445636 2496600 2523764 2503193 2484995 2568717 2623685 2568780 2589435 2645505 2608941
4151 2608941 2515502 2603152 2617244 2488540 2468880 2430522 2463385 2425027 2355629 2302554 2319542
4140 2319542 2215671 2227758 2385229 2242664 2314092 2286921 2315046 2408391 2494871 2445630 2387033
4129 2387033 2333205 2394567 2328849 2279451 2332625 2372634 2325278 2405666 2297866 2367545 2355526
4118 2355526 2385245 2351077 2389073 2348187 2387037 2383945 2420665 2476290 2496976 2553201 2630851 2577794
4106 2577794 2723074 2685991 2995301 3217785 3435318 3580067 3528812 3447069 3263381 3118850
4096 3118850 2902941 2778704 2582176 2610603 2409202 2460448 2319542 2231486 2324240 2240551
4086B240551Q554l315K2516L630J78478o6263L1943k0888K70507O8581K17388
4075B951682J93587Q6439R1355j98993j69699l30659j32214k37049j08062k03761
4065A942626r7911r9241J8707p059p5320K5385j52019l8757l6704J6705o1655
4054A434757R06j17589O4471J6091l0389p7293Q0741n9414J21826j71922Q2920
4043A345105k5822o2451O459N247J05987j13565l3189j9671m1662r9777N8344
4032A125005o6375J09624j39787J6725p6009J47395n4779P3050n0925r3876J57525
4021A147573p8992j01955l853L0488P430J12633p0964k855m3583l4853J79449
4010A140518k59700J73326l0660J03103r9088K2838L8142j07333K8919J1165o1047
$$ plain form
4086 2240551 2249105 2245790 2268306 2271936 2450414 2384151 2416094 2395206 2665713 2734294 2951682
4075 2951682 3145269 3231708 3323063 3124070 2954371 2623712 2491498 2254449 2146387 1942626
4065 1942626 1844715 1745474 1764181 1757122 1681802 1707187 1555168 1516411 1479707 1496412 1434757
4054 1434757 1435663 1318074 1382545 1398636 1368247 1290954 1371695 1312281 1434107 1262185 1345105
4043 1345105 1319283 1256832 1263291 1268538 1374525 1260960 1227771 1208100 1166438 1066661 1125005
4032 1125005 1058630 1168254 1028467 1045192 969183 1116578 1061799 1134849 1083924 990048 1147573
4021 1147573 1068581 966626 962773 993261 1000691 1113324 1042360 1039505 995922 961069 1140518
4010 1140518 880818 1054144 1023484 1126587 1027499 1050337 1088479 981146 1010065 1021230 960183
3999I60183M5682j1601j22443M7696J12379j47353J83711p2526k9886M0247j15676
3988H90413P3465q1617J07786l1023j7168j83415J35828l7091R7865l50n7539
3977H97154L8357r373J1843n9391l316m4423N8464j08612Q6997J372j64697J18795
3965H23170p7561L7578q5526J7630N6008j0390k9281j03486Q5966K87L4804n5765
3953F93434l1068j15384J16153j24563O5836j8810p1333L4662P4098n9284O086
3942E69827p8394p4920K0705N5352L3494n7768m1729O8907n477o1472l857j3907
3930D10761L1208j30394J59713m0168n8057J39540q7014j162R4568o5273j4657
3919D39065j201j5390Q813j2253o3274O0575k4901l2416J7349J696K4623n4101
$$ plain form
3999 960183 1005865 994264 871821 919517 1031896 884543 1068254 995728 965842 1006089 890413
3988 890413 963878 882261 990047 959024 941856 758441 894269 857178 955043 954693 897154
3977 897154 935511 926138 937981 878590 875274 830851 889315 780703 867700 869072 704375 823170
3965 823170 745609 783187 697661 715291 771299 760909 731628 628142 714108 714395 749199 693434
3953 693434 662366 546982 663135 538572 604408 585598 514265 548927 623025 563741 569827
3942 569827 491433 416513 437218 492570 526064 468296 426567 495474 489997 428525 424668 410761
3930 410761 441969 311575 471288 431120 373063 512603 425589 424427 518995 453722 439065
3919 439065 437864 422474 431287 419034 355760 416335 391434 359018 376367 378063 402686 348585
3907C48585Q1387j00330M357k9817J32083o2886J2858j3497K6410m0618l9816
3896C18716k8990N3245J2850p8896L9077M5368l8331K2271j16726J76684o2149
3885C43119m1080n8414P5028L8623p4421J0029L1237p5922K3377N5504j21139
3874B05941N566L7208p2922J93929j43571L6973K9670N9927q1623Q5121j44518
3863B11701P9411p8569j8702M6498k3873N9702q0536L4753L8290j04663J16057
3852B80069p5694M5398m8613J65880j25230o1071j812K3954j3903J631l0711K2939
3840A82837k2826o8518J42732o7411K4760M8200k1447n6877Q5161N7029j44541
3829A59099O9758L4078m6259p1362L4747j01199L6859o5527J92678l5638j2966
$$ plain form
3907 348585 429972 329642 333999 304182 436265 373379 386237 372740 399150 358532 318716
3896 318716 289726 342971 355821 276925 316002 361370 323039 345310 228584 405268 343119
3885 343119 302039 243625 318653 357276 282855 292884 324121 248199 271576 327080 205941
3874 205941 211507 248715 175793 369722 226151 263124 292794 352721 271098 356219 211701
3863 211701 291112 212543 193841 240339 216466 276168 195632 230385 268675 164012 280069
3852 280069 204375 249773 201160 367040 241810 180739 178927 202881 188978 190609 159898 182837
3840 182837 160011 91493 234225 166814 191574 239774 218327 161450 246611 303640 159099
3829 159099 228857 262935 216676 145314 180061 78862 115721 50194 242872 207234 194268
3818A94268j3794q8025P8903M497R3970j71280J05690o6660k5723n4822O2416
3807A19440O0067J3517r913L785j2702R5021j54048M6480p1897R2715j00869Q2868
3795A64464n9217K1044L8625q2439N0847j40337J48216N857l4775m8659J56449
3784B20075j35273J4043m127O9087N758O810J4622n0766m6451L3013l8494Q6913
3772A75210r1048L8631l9663k3384J44807j16591N2254n2228J17365j37292P0496
3761A38557l0169L5447j10368J9517Q6483q8453O6286q1320J01034M8353j72125
3750A3242J51417q6008J0898L5504l7531m2584P3965r3359O0206k9407K6974J18522
3738B01839r0080L4869K8670l5156n479j34733L5120J41354j03865j11684R9820
$$ plain form
3818 194268 180474 92449 171352 175849 269819 98539 204229 137569 111846 57024 119440
3807 119440 179507 193024 183111 186896 174194 269215 115167 161647 89750 182465 81596 164464
3795 164464 105247 126291 164916 82477 133324 -7013 141203 147060 112285 63626 220075
3784 220075 84802 98845 94718 163805 169563 176373 190995 140229 93778 126791 88297 175210
3772 175210 84162 122793 83130 59746 204553 87962 140216 87988 205353 68061 138557
3761 138557 108388 143835 33467 52984 139467 51014 117300 35980 137014 185367 13242
3750 13242 164659 78651 89549 125053 87522 44938 118903 25544 85750 56343 83317 201839
3738 201839 111759 146628 175298 140142 134663 -70 35050 176404 72539 -39145 60675
3727F0675j7972N3889p4755J01178r212L1772K9023m7159n8627k2122P8276n1485
3715G3481n2557K012R6985m8742k1265p707j4251J5191r865P4922Q9166j40766
3703E6604k2961j2694J9608l9618L9872k4565k2308M076J17034l4917r1098j6389
3691b7356J01322p6492R4421k165L3401j22762q804O5656J6022j06839P9421O4862
3679A10687J0605j20906Q6993q1673K8998k2353k8624N4578l7078J27380j68706
3668d0099L8102o998q195n5428J31641m4846n0581M8970J07354j00436l0787P8198
3656F6895j00360M7986j1621M6550m5003m1763M1639K4645M5545j22335O0620
3645A2798N3599j11289M0745N0603j8865K4617N8575j38536j9489O6813n251n0802
$$ plain form
3727 60675 42703 96592 21837 123015 113803 145575 174598 127439 68812 46690 124966 73481
3715 73481 20924 22936 119921 71179 49914 42207 27956 43147 33282 108204 197370 56604
3703 56604 33643 20949 40557 939 40811 16246 -6062 -1986 115048 80131 -10967 -27356
3691 -27356 73966 -2526 91895 89730 123131 369 -8435 57221 73243 -33596 45825 110687
3679 110687 121292 386 87379 5706 34704 12351 -16273 38305 1227 128607 -40099
3668 -40099 -1997 -8995 -17190 -72618 59023 14177 -36404 12566 119920 19484 -11303 66895
3656 66895 -33465 14521 2900 49450 4447 -37316 4323 28968 74513 -47822 12798
3645 12798 66397 -44892 -4147 46456 27591 52208 110783 -27753 -47242 19571 14320 -36482
3633c6482q44M1543j5057O0300J4645o8490n0215j0722P6678L3939j44309K01811
3621A02797j22549O4069m5766Q589P2401m2914m8262j2547J4574N5687n8087R2377
3609H0369j03975L1336l6058Q6286k8273j9743L0089n4575M3876l3010j3634j4131
3597c1443O6174k3966m6079m5050J17779k8429j9919k0230p8888J72199j8433
3586D3715p1699J0770J15680q2179J0374m5475K2366M0045j18684N1812M1580
3575A8305K0262L2953q0321M7932j0915n3401k0368R9515j64851N7207J119O3726
3563A1163o7413R1209n5971N0812n7713L9771L9170p828J4579j54075M1706O6250
3551A1660j17875J87140q7690n743L1086m7872N2454J0940J1863j02779J54392
$$ plain form
3633 -36482 -37326 4217 -10840 49460 64105 -4385 -54600 -65322 11356 45295 -99014 102797
3621 102797 -19752 44317 -1449 7140 79541 36627 -11635 -24182 -9608 46079 -12008 80369
3609 80369 -23606 7730 -28328 57958 29685 9942 40031 -14544 29332 -3678 -17312 -31443
3597 -31443 34731 10765 -35314 -80364 37415 8986 -10933 -31163 -110051 62148 43715
3586 43715 -27984 -17214 98466 16287 26661 -18814 3552 43597 -75087 -23275 18305
3575 18305 38567 71520 -8801 39131 28216 -25185 -45553 53962 -110889 -53682 -52563 11163
3563 11163 -56250 34959 -21012 29800 -27913 11858 51028 43200 57779 -96296 -54590 11660
3551 11660 -106215 80925 -6765 -12508 18578 -29294 23160 34100 45963 -56816 97576
3540I7576n9763l9878O0059j10481M9584L7259m9689j7281l8611Q1325J5410M1917
3528F7427j7926O721p3442Q678J4124M2437p2415k3051K4298p088L9254o9598
3516f0581N9631m7539L8634l7981L5742L287j6536K5430J668q1553J13576j42746
3504a08968O6238O0812m2335J8739P176j3121K4447o4430Q9058j40753O9057J4743
3492a9337O996L8515j9015q5685N4133n7603P5447k9472j4900L0968M5973p6889
3480e0869M1429O7954j25642N8130r8035o2063J61050o8713J425L0784k5626J9576
3468e0600J0622q235O7511k7734M9768r9276l8158R2043j5387n0368n934M5192
3456c0556J2810k2613N2918O4106j15975K7260j1048J9777q4328O2435L6058m7980
$$ plain form
3540 97576 37813 -2065 57994 -52487 -2903 34356 -15333 -32614 -71225 10100 25510 67427
3528 67427 49501 56222 -17220 -8542 5582 48019 -24396 -47447 -23149 -30237 9017 -60581
3516 -60581 -950 -48489 -9855 -47836 -12094 -8807 -25343 87 1755 -79798 33778 -108968
3504 -108968 -42730 18082 -24253 -5514 1662 -11459 12988 -51442 37616 -103137 -34080 -19337
3492 -19337 -12341 26174 7159 -78526 -24393 -81996 -6549 -36021 -50921 -19953 26020 -50869
3480 -50869 -9440 58514 -67128 -8998 -107033 -169096 -8046 -76759 -75334 -44550 -70176 -50600
3468 -50600 -39978 -48213 19298 -8436 41332 -57944 -96102 -4059 -19446 -69814 -75748 -30556
3456 -30556 -17746 -40359 12559 76665 -39310 -12050 -23098 -3321 -87649 -25214 10844 -37136
3444c7136n6690P1248o8772P9514l1157P2355j07237L8126n8655O0008j4148k5211
3432g7755L4092r031J4515k6698L2917l373p8746M5308m3944N6530M0068m587
3420b0704M844j17507O4405L0414J0401p2971N5770k1727j0420J03789q3335O1927
3408D886O057j1193m5941j0114M4066p343q1433M5495J06827n5618p7839M9045
3396c3105L1780j23673J07679j4026j0633m4580m0035J64165n9537J0350m6951
3385e8566l687j7435P3992o8372N3077l028j07313J81129j63019M866Q4315j1450
3373c5491m5744L7772L1492j03040O7015r7894J30882P278j4129m6563K0330k1209
3361f9301J6412k1012P2247m5985j5292q6137N4355L5277K5426M975j8575Q8813
$$ plain form
3444 -37136 -93826 -22578 -91350 -11836 -42993 29362 -77875 -39749 -98404 -38396 -52544 -77755
3432 -77755 -43663 -52694 -38179 -64877 -31960 -35333 -114079 -68771 -112715 -56185 -16117 -20704
3420 -20704 -15860 -133367 -68962 -38548 -28147 -101118 -45348 -67075 -77495 26294 -57041 4886
3408 4886 10943 -250 -46191 -56305 -12239 -19582 -101015 -55520 51307 -4311 -82150 -33105
3396 -33105 -1325 -124998 -17319 -31345 -41978 -86558 -126593 37572 -21965 -11615 -58566
3385 -58566 -62253 -79688 -5696 -74068 -20991 -24019 -131332 49797 -113222 -108356 -24041 -35491
3373 -35491 -81235 -43463 -11971 -115011 -47996 -145890 -15008 -7730 -21859 -68422 -48092 -69301
3361 -69301 -52889 -73901 -1654 -47639 -62931 -149068 -94713 -59436 -34010 -29035 -47610 41203
3349D1203n2315o9695K0047J1527n9941k7457N6610K5478l0097K0689N9664m3388
3337d7675p168q1645P4898J9962P8512j93758m529N7743k2497k627Q9235n7149
3325i6698J6710m6529L7052l9991J17462j7784m4988K3471K8467J4260L3892l9298
3313a3974K1107j04878J7592p7736R2941N76p8644J35645j45567Q4232O0589o1643
3301f9760M3126q8935M251P9846j2194o087o6049L4585L5856N9065p4702j17017
3289a78015J20745R2578j34600K1100N4112k9761l9637O264J7426o1603P0441
3278f0950o9573J8394J3191L2234j32745J14321k6369J6133n0978K2912J15935
3267g495j45593J45135p2103N0581J2613J1809p3942l5132Q3026m9723j0295N0258
$$ plain form
3349 41203 -11112 -80807 -60760 -49233 -109174 -136631 -80021 -54543 -84640 -63951 -4287 -47675
3337 -47675 -54843 -136488 -61590 -41628 36884 -156874 -161403 -103660 -126157 -128784 -39549 -96698
3325 -96698 -79988 -126517 -89465 -129456 -11994 -29778 -74766 -51295 -22828 -8568 25324 -13974
3313 -13974 7133 -97745 -80153 -157889 -64948 -64372 -143016 -7371 -152938 -68706 -8117 -69760
3301 -69760 -26634 -115569 -111318 -31472 -43666 -49753 -115802 -81217 -45361 13704 -60998 -178015
3289 -178015 -57270 35308 -99292 -78192 -24080 -53841 -93478 -87214 -69788 -131391 -60950
3278 -60950 -130523 -112129 -98938 -66704 -199449 -85128 -111497 -95364 -146342 -123430 -7495
3267 -7495 -153088 -7953 -80056 -29475 -16862 -5053 -78995 -114127 -31101 -80824 -91119 -40861
3255d0861m9239O9741j80253O5784j4605J39149m4953j06005P8999l990P3535
3244a2698j98010J41504J5017q7388Q2809M2975q2319K5292P1931K2875k02848
3233a80860J63590O973j0033K4558l9236M803j9769j12786M5281J4355O7146O449
3221b9529m5784n514L8649k6570J05549j41221J35500m4415p9962k6719M4727
3210g5289Q4056r9085O740L2084k1874O338K6232m6073K1465o4644P7630Q7469
3198C5049l6936j35081P3316k4387j0522J05089k6498k3703l7735N87p4461L9376
3186a15906K5856l8579N852P3895l2850j28107M0212N0515J07442o2392Q240L5578
3174c0244k8196j03451n679n96R1819Q69M208j54305O0605K5092J1986k3751j8425
$$ plain form
3255 -40861 -90100 -20359 -200612 -134828 -149433 -10284 -55237 -161242 -82243 -86233 -12698
3244 -12698 -210708 -69204 -54187 -141575 -58766 -15791 -98110 -72818 -887 21988 -180860
3233 -180860 -17270 -10297 -20330 4228 -35008 -30205 -49974 -162760 -117479 -103124 -35978 -29529
3221 -29529 -75313 -80827 -42178 -68748 36801 -104420 31080 -13335 -93297 -120016 -75289
3210 -75289 8767 -90318 -83578 -51494 -73368 -67030 -40798 -86871 -65406 -130050 -52420 35049
3198 35049 -1887 -136968 -63652 -88039 -98561 6528 -19970 -43673 -81408 -80821 -155282 -115906
3186 -115906 -90050 -128629 -122777 -48882 -81732 -209839 -169627 -119112 -11670 -74062 -65822 -30244
3174 -30244 -58440 -161891 -167570 -168166 -76347 -75478 -71270 -225575 -164970 -139878 -127892 -151643 -170068
3161a70068J09299j01400J9093j5732q936L8944J12136j55401N8847M0305L1487
3150d1426l5875j06697O9235K7317M8799l337q763o1417l9539L8899o4982R8690
3138g9096K2765q7199M4573J52240j25467r707j0015L8008n3427j0250R272k9237
3126a37540O7629q3142J13801J2983j21628J10376L308m9300J5126k9056J00486
3115C043m5326J0671o5548r424J0246o3005Q4434n1067R3315j0570J4730o6627
3103i5128N0920K8509j55628J31997n6984O3641J9280m5215r3774N0652R1655
3092a0075m7146K864j487r8723J631N4418M830O3986j16041J21627q8296Q7420
3080b4992l5923j25197K1398n2425K19965j6311o5934k7944O1569M6618p2771
$$ plain form
3161 -170068 -60769 -162169 -143076 -158808 -167744 -128800 -16664 -172065 -113218 -72913 -41426
3150 -41426 -77301 -183998 -114763 -87446 -38647 -41984 -50747 -112164 -151703 -112804 -177786 -79096
3138 -79096 -56331 -143530 -98957 53283 -72184 -81891 -91906 -53898 -107325 -117575 -108303 -137540
3126 -137540 -69911 -153053 -39252 -26269 -147897 -37521 -34213 -83513 -68387 -97443 3043
3115 3043 -42283 -31612 -97160 -106584 -96338 -159343 -74909 -125976 -32661 -43231 -28501 -95128
3103 -95128 -44208 -15699 -171327 -39330 -96314 -32673 -13393 -58608 -152382 -101730 -10075
3092 -10075 -57221 -54357 -55844 -154567 -152936 -98518 -93688 -29702 -145743 -24116 -112412 -24992
3080 -24992 -60915 -186112 -164714 -217139 2826 -13485 -79419 -107363 -45794 824 -71947
3069g1947n6074l396O2447l7789R8682o2951J5980l4837M1698j8385m2015J3756
3057i4831q1798J54971n2465P901J4086p5877M7134L812o7054O6951N2515p0011
3045i4666R2014j03089M0031j03040o848O3804L9522J2215m7746P9270J1886j27860
3033a44507N7200j0307L7590M8008j57645l2767J37097k9527L8863K2559n2081
3022h5517j9045p075Q12n7679k555J01757p8222O3502L2966q1049R6740l9593
3010g4958K1535j30514L8898P2539o0058q827k500m879M6020P2221q2333m3035
2998a55891R8775o7015k8572O4162l445q2284R3962J5181o8460k0799Q7000j2819
2986h0205j6903O8140m1548L6966j4679q7233O900R3411j0370l5415J9529m5176
$$ plain form
3069 -71947 -128021 -131417 -68970 -106759 -8077 -71028 -55048 -89885 -48187 -66572 -108587 -94831
3057 -94831 -176629 -21658 -74123 -66222 -52136 -128013 -80879 -77067 -144121 -77170 -24655 -94666
3045 -94666 -2652 -105741 -65710 -168750 -175598 -111794 -72272 -60057 -107803 -28533 -16647 -144507
3033 -144507 -87307 -97614 -60024 -12016 -169661 -202428 -65331 -94858 -55995 -33436 -85517
3022 -85517 -104562 -111637 -110825 -168504 -171059 -69302 -147524 -84022 -51056 -132105 -35365 -74958
3010 -74958 -53423 -183937 -145039 -72500 -132558 -141385 -143885 -148764 -102744 -30523 -112856 -155891
2998 -155891 -57116 -124131 -152703 -88541 -91986 -174270 -80308 -65127 -133587 -154386 -67386 -80205
2986 -80205 -97108 -28968 -70516 -33550 -48229 -135462 -128562 -35151 -45521 -80936 -61407 -106583
2974a06583M2927j7442l8155L6649M0759n1844L2264J9542j12266N7598J3823
2963h2728n6209K0620J2841N3320m5775o636O5633q5215k5387J16899M2110k9181
2951a9708j12319M6068O4593j30096J18937l7768L2930q3012q30o4896J25644
2940f0457p1404k5339P7631p3375R3760J2183k6709J4384l5351q800N2215k632
2928e3894j07100L5560J14823o6770k059J2112o1719J03052j0756k6931J8771
2917d4911j12960j2264j4270J11399m3340N4517j27081M7806K3206L2802l852
2906h8948J7094L2656L7041p5415j7804R4131n0102p8777M0900n217Q3927j82634
2894a93148Q1461K7341N1328N7022j00590N9839j7481m9442l2297j8122n9657
$$ plain form
2974 -106583 -63656 -81098 -119253 -82604 -41845 -93689 -61425 -41883 -154149 -96551 -82728
2963 -82728 -138937 -118317 -105476 -52156 -97931 -104567 -38934 -124149 -149536 -32637 9473 -19708
2951 -19708 -132027 -85959 -21366 -151462 -32525 -70293 -37363 -120375 -121205 -186101 -60457
2940 -60457 -131861 -157200 -79569 -152944 -59184 -47001 -73710 -59326 -94677 -103477 -51262 -53894
2928 -53894 -160994 -125434 -10611 -77381 -79440 -67328 -129047 -25995 -36751 -63682 -44911
2917 -44911 -157871 -170135 -184405 -73006 -116346 -61829 -188910 -141104 -117898 -85096 -88948
2906 -88948 -71854 -39198 -2157 -77572 -95376 -1245 -51347 -130124 -89224 -94441 -10514 -193148
2894 -193148 -111687 -84346 -33018 24004 -76586 -16747 -34228 -83670 -115967 -134089 -193746
2883a93746J72138p1269J5614k1537k0227K6000j8257Q6845r440r3515J15128
2872a2266j06473j6730N0089p1474R9866n4247j9860N7808J1809j2881p121o7712
2860a49192J06532l5556q652m8227k0687J9981K7827j2643q045k987r3023R939
2848b14733R0753L0268j1241j25031J50620k5145o314k422o0128O9884n945J1813
2836i7621L8417l7318P0229j00988J1766L6146m2262l0359N317J00994j5753j4094
2824g5526L5578m6951M0935l0098L8951N0224o3009j17550M3681R307o3764J11707
2812f6515j7254l4564r145M7398M0144o5466Q3904n7449l2096Q859Q6014J2318
2800c852l2339q675K3133r6462N6933Q923K9260n88k8872p6385N3653M3169P445
$$ plain form
2883 -193746 -21608 -92877 -77263 -98800 -119027 -93027 -111284 -24439 -33879 -127394 -12266
2872 -12266 -118739 -135469 -85380 -156854 -56988 -111235 -131095 -73287 -61478 -74359 -81480 -149192
2860 -149192 -42660 -78216 -86868 -135095 -155782 -135801 -107974 -120617 -128662 -131649 -224672 -214733
2848 -214733 -123980 -93712 -104953 -229984 -79364 -104509 -110823 -113245 -173373 -103489 -109434 -97621
2836 -97621 -59204 -96522 -26293 -127281 -115515 -79369 -121631 -151990 -146673 -45679 -61432 -75526
2824 -75526 -39948 -86899 -45964 -76062 -37111 13113 -49896 -167446 -123765 -114458 -178222 -66515
2812 -66515 -83769 -118333 -127478 -80080 -39936 -105402 -21498 -78947 -111043 -102184 -16170 -3852
2800 -3852 -36191 -44866 -21733 -118195 -61262 -52339 -23079 -23667 -52539 -128924 -75271 -32102 -24657
2787b4657j12086Q4002q8121L4796L1990m2136Q266M2530o3936L9123O8478j06727
2775a28478M9884o4441M2569K9263O9401j02154L0467p4859O8371K290RN6947
2763b0731j10578N8388p1627K2470j9439M6575O2287m9672l5636N3558m7069k5097
2751a36571P5025L1044r0848J8979J9621o0124K2325L9842k5058N1266p0410j2182
$$ plain form
2787 -24657 -136743 -52741 -140862 -106066 -74076 -116212 -107946 -65416 -129352 -90229 -21751 -128478
2775 -128478 -78594 -143035 -100466 -71203 -1802 -103956 -73489 -148348 -79977 -77687 -77678 -20731
2763 -20731 -131309 -72921 -144548 -122078 -141517 -94942 -32655 -82327 -117963 -64405 -111474 -136571
2751 -136571 -61546 -30502 -121350 -102371 -82750 -142874 -120549 -80707 -105765 -54499 -124909 -137091
$$ [...]
##END NTUPLES=NMR SPECTRUM
##END=
