##TITLE=abcd
##JCAMPDX= 6.0         $$ Bruker NMR JCAMP-DX V2.0
##DATA TYPE= NMR FID
##DATA CLASS= NTUPLES
##ORIGIN= UXNMR, Bruker Analytische Messtechnik GmbH
##OWNER= root
$$ XWIN-NMR		Version 3.5
$$ Sat Oct 18 14:16:54 2025 Russian Standard Time (UT+4h)  servis@DPX200
##.OBSERVE FREQUENCY= 200.131235884673
##.OBSERVE NUCLEUS= ^1H
##.DELAY= (6, 6)
##.ACQUISITION MODE= SIMULTANEOUS
##.ACQUISITION SCHEME= undefined
##.AVERAGES= 32
##.DIGITISER RES= 18
##SPECTROMETER/DATA SYSTEM= spect
##.PULSE SEQUENCE= zg
##.SOLVENT NAME= CDCl3
##.SHIFT REFERENCE= (INTERNAL, CDCl3, 0, 16.5164)
##AUDIT TRAIL= $$ (NUMBER, WHEN, WHO, WHERE, WHAT)
$$ ##TITLE= Audit trail, XWIN-NMR		Version 3.5
$$ ##JCAMPDX= 5.01
$$ ##ORIGIN= Bruker BioSpin GmbH
$$ ##OWNER= servis
$$ F:\spectra/data/av/nmr/H1/1/audita.txt
$$ ##AUDIT TRAIL=  $$ (NUMBER, WHEN, WHO, WHERE, WHAT)
(   1,<2025-10-16 13:00:53.89 +0400>,<servis>,<DPX200>,
      <created by zg, POWCHK disabled, PULCHK disabled
       configuration hash MD5:
       00 E9 B6 7A A2 85 ED C7 34 08 36 98 17 FE 4E 26
       data hash MD5: 32K
       AB 4C 68 25 49 56 67 0D 70 E9 B3 25 74 93 08 1C>)
$$ ##END=
$$ 
$$ hash MD5
$$ E1 1E 69 74 E4 57 9A 56 2E EF D3 60 1D E7 84 36
##$RELAX= 
##$RELAX= 
##$RELAX= 
##$RELAX= 
##$RELAX= 
##$RELAX= 
##$RELAX= 
##$RELAX= 
$$ Bruker specific parameters
$$ --------------------------
##$DU= <F:\spectra>
##$EXPNO= 1
##$NAME= <H1>
##$PROCNO= 1
##$TYPE= <nmr>
##$USER= <av>
##$AMP= (0..31)
100 100 100 100 100 100 100 100 100 100 100 100 100 100 100 100 100 100 
100 100 100 100 100 100 100 100 100 100 100 100 100 100 
##$AQSEQ= 0
##$AQ_mod= 1
##$AUNM= <au_zg>
##$AUTOPOS= <>
##$BF1= 200.13
##$BF2= 200.13
##$BF3= 200.13
##$BF4= 200.13
##$BF5= 500.13
##$BF6= 500.13
##$BF7= 500.13
##$BF8= 500.13
##$BYTORDA= 1
##$CFDGTYP= 0
##$CFRGTYP= 5
##$CHEMSTR= <none>
##$CNST= (0..31)
1 1 145 1 1 1 1 1 1 1 1 1 1 1 1 1 1 1 1 1 1 1 1 1 1 1 1 1 1 1 1 1 
##$CPDPRG= <>
##$CPDPRG1= <>
##$CPDPRG2= <>
##$CPDPRG3= <>
##$CPDPRG4= <mlev>
##$CPDPRG5= <mlev>
##$CPDPRG6= <mlev>
##$CPDPRG7= <mlev>
##$CPDPRG8= <mlev>
##$CPDPRGB= <>
##$CPDPRGT= <>
##$D= (0..31)
0 2 0 0 0 0 0 0 0 0.06 0 0 0 0 0 0 0.0002 0 0 0 0 0 0 0 0 0 0 0 0 0 0 
0 
##$DATE= 1760605253
##$DBL= (0..7)
120 120 120 120 120 120 120 120 
##$DBP= (0..7)
150 150 150 150 150 150 150 150 
##$DBP07= 0
##$DBPNAM0= <>
##$DBPNAM1= <>
##$DBPNAM2= <>
##$DBPNAM3= <>
##$DBPNAM4= <>
##$DBPNAM5= <>
##$DBPNAM6= <>
##$DBPNAM7= <>
##$DBPOAL= (0..7)
0.5 0.5 0.5 0.5 0.5 0.5 0.5 0.5 
##$DBPOFFS= (0..7)
0 0 0 0 0 0 0 0 
##$DE= 6
##$DECBNUC= <off>
##$DECIM= 32
##$DECNUC= <off>
##$DECSTAT= 4
##$DIGMOD= 1
##$DIGTYP= 9
##$DL= (0..7)
0 120 120 120 120 120 120 120 
##$DP= (0..7)
150 150 150 150 150 150 150 150 
##$DP07= 0
##$DPNAME0= <>
##$DPNAME1= <>
##$DPNAME2= <>
##$DPNAME3= <>
##$DPNAME4= <>
##$DPNAME5= <>
##$DPNAME6= <>
##$DPNAME7= <>
##$DPOAL= (0..7)
0.5 0.5 0.5 0.5 0.5 0.5 0.5 0.5 
##$DPOFFS= (0..7)
0 0 0 0 0 0 0 0 
##$DQDMODE= 0
##$DR= 18
##$DS= 0
##$DSLIST= <SSSSSSSSSSSSSSS>
##$DSPFIRM= 0
$$ [...]
##$SUBNAM0= <"">
##$SUBNAM1= <"">
##$SUBNAM2= <"">
##$SUBNAM3= <"">
##$SUBNAM4= <"">
##$SUBNAM5= <"">
##$SUBNAM6= <"">
##$SUBNAM7= <"">
##$SUBNAM8= <"">
##$SUBNAM9= <"">
##$SW= 20.6817932712277
##$SWIBOX= (0..15)
0 0 3 0 0 0 0 0 0 0 0 0 0 0 0 0 
##$SW_h= 4139.07284768212
##$TD= 32768
##$TD0= 1
##$TE= 0
##$TE2= 300
##$TE3= 300
##$TEG= 300
##$TL= (0..7)
0 120 120 120 120 120 120 120 
##$TP= (0..7)
150 150 150 150 150 150 150 150 
##$TP07= 0
##$TPNAME0= <>
##$TPNAME1= <>
##$TPNAME2= <>
##$TPNAME3= <>
##$TPNAME4= <>
##$TPNAME5= <>
##$TPNAME6= <>
##$TPNAME7= <>
##$TPOAL= (0..7)
0.5 0.5 0.5 0.5 0.5 0.5 0.5 0.5 
##$TPOFFS= (0..7)
0 0 0 0 0 0 0 0 
##$TUNHIN= 0
##$TUNHOUT= 0
##$TUNXOUT= 0
##$USERA1= <user>
##$USERA2= <user>
##$USERA3= <user>
##$USERA4= <user>
##$USERA5= <user>
##$V9= 5
##$VALIST= <valist>
##$VCLIST= <CCCCCCCCCCCCCCC>
##$VD= 0
##$VDLIST= <DDDDDDDDDDDDDDD>
##$VPLIST= <PPPPPPPPPPPPPPP>
##$VTLIST= <TTTTTTTTTTTTTTT>
##$WBST= 1024
##$WBSW= 30
##$XGAIN= (0..3)
0 0 0 0 
##$XL= 0
##$YL= 0
##$YMAX_a= 169575
##$YMIN_a= -122094
##$ZGOPTNS= <>
##$ZL1= 120
##$ZL2= 120
##$ZL3= 120
##$ZL4= 120
##$ABSF1= 10
##$ABSF2= 0
##$ABSG= 5
##$ABSL= 3
##$ALPHA= 0
##$AQORDER= 0
##$ASSFAC= 0
##$ASSFACI= 0
##$ASSFACX= 0
##$ASSWID= 0
##$AUNMP= <proc_1d>
##$AZFE= 0.1
##$AZFW= 0.1
##$BCFW= 1
##$BC_mod= 2
##$BYTORDP= 0
##$COROFFS= 0
##$CY= 19
##$DATMOD= 1
##$DC= 2
##$DFILT= <>
##$DTYPP= 0
##$F1P= 11.0000007629395
##$F2P= -0.999999237060547
##$FCOR= 0.5
##$FTSIZE= 0
##$FT_mod= 4
##$GAMMA= 1
##$GB= 1
##$INTBC= 1
##$INTSCL= 1
##$ISEN= 128
##$LB= 0.05
##$LEV0= 0
##$LPBIN= 0
##$MAXI= 10000
##$MC2= 0
##$MEAN= 0
##$ME_mod= 0
##$MI= 0
##$NCOEF= 0
##$NC_proc= 0
##$NLEV= 6
##$NOISF1= 0
##$NOISF2= 0
##$NSP= 1
##$NTH_PI= 0
##$NZP= 0
##$OFFSET= 16.51637
##$PC= 1
##$PHC0= -271.6701
##$PHC1= 2.101565
##$PH_mod= 0
##$PKNL= yes
##$PPARMOD= 0
##$PSCAL= 4
##$PSIGN= 0
##$REVERSE= no
##$SF= 200.13
##$SI= 16384
##$SIGF1= 0
##$SIGF2= 0
##$SINO= 400
##$SIOLD= 16384
##$SREGLST= <1H.CDCl3>
##$SSB= 0
##$STSI= 0
##$STSR= 0
##$SW_p= 4139.07284768211
##$SYMM= 0
##$S_DEV= 0
##$TDeff= 0
##$TDoff= 0
##$TI= <>
##$TILT= no
##$TM1= 0
##$TM2= 0
##$TOPLEV= 0
##$USERP1= <user>
##$USERP2= <user>
##$USERP3= <user>
##$USERP4= <user>
##$USERP5= <user>
##$WDW= 1
##$XDIM= 8192
##$YMAX_p= 0
##$YMIN_p= 0
$$ End of Bruker specific parameters
$$ ---------------------------------
##NTUPLES= NMR FID
##VAR_NAME=  TIME,          FID/REAL,        FID/IMAG
##SYMBOL=    X,             R,               I
##VAR_TYPE=  INDEPENDENT,   DEPENDENT,       DEPENDENT
##VAR_FORM=  AFFN,          ASDF,            ASDF
##VAR_DIM=   16384,         16384,           16384
##UNITS=     SECONDS,       ARBITRARY UNITS, ARBITRARY UNITS
##FACTOR=    0.0002416,     1,               1
##FIRST=     0,             0,               0
##LAST=      3.9581328,     0,               0
##MIN=       0,             -122094,         0
##MAX=       3.9581328,     169575,          0
$$ Real data points
##PAGE= N=1
##DATA TABLE= (X++(R..R)), XYDATA
0@%%%%%%%%%%%%%%%%%%%%%%%%%%%%%%%%%%%%%%%%JmJ0j9K5l1M0m8N4n6N8o3O7
$$ 0 0 0 0 0 0 0 0 0 0 0 0 0 0 0 0 0 0 0 0 0 0 0 0 0 0 0 0 0 0 0 0 0 0 0 0 0 0 0 0 0 1 -3 7 -12 13 -18 22 -26 28 -28 30 -33 34
53C4p1P7q1Q3q5Q7q5P7n6J6N3j83M27r29K109n750L4474J39378j34096L336R9979
$$ 34 -37 40 -41 42 -43 44 -41 36 -20 -4 49 -134 293 -636 1473 -4277 30197 169575 35479 38815 138794
74A38794m3985L7959m3270j07779K7534j8534m5359J3322n1759J8449O4834r883
$$ 138794 94809 132768 89498 -18281 9253 -9281 -54640 -41318 -93077 -74628 -9794 -19677
86a9677L7441Q420j4557P1193j6236m3908J7388n1951o922K9875q1720j4029N3771
$$ -19677 17764 26184 11627 82820 66584 22676 40064 -11887 -18809 11066 -70654 -84683 -30912
99c0912l1770O585L1900p308L0524R868P827L3393k3015l427K8013j6424r932
$$ -30912 -62682 -56097 -24197 -31505 -981 8887 16714 50107 27092 23665 51678 35254 25322
112B5322r078j4262J4591j5002k1213J5041j1570R91J8091k0065J0795J8146p943
$$ 25322 16244 1982 16573 1571 -19642 -4601 -16171 -15180 2911 -17154 -6359 11787 3844
125C844J2534o510k078J4935k5272k427Q877l6233M944J4850l1187R478J5106
$$ 3844 16378 9868 7790 22725 -2547 -4974 3903 -32330 -27386 -12536 -43723 -34245 -19139
138a9139l242K5886o237N912L8851j7088k986J9185k2397l360j289k3384L188
$$ -19139 -22381 3505 -2732 3180 42031 24943 21957 41142 18745 15385 14096 -9288 -6100
151f100j1473j0211K2828j5447n76L4864j3213N740K3042j7109O412K834j8173
$$ -6100 -17573 -27784 -4956 -20403 -20979 13885 672 6412 29454 12345 18757 21591 3418
164C418M457j4811j3503J2472j7971n446J9672j1498P308J7590o313J5514K750
$$ 3418 7875 -6936 -20439 -7967 -25938 -31384 -11712 -23210 -15902 1688 -4625 10889 13639
177A3639l069J8691j6169o230J7153k2309q737J0205j7530M74M013j1636J3802
$$ 13639 10570 29261 13092 6862 24015 1706 -7031 3174 -14356 -13882 -9869 -21505 -7703
190g703Q32l257J9884p266M586J7029j4131M431L270j4677P909j1486j6953J5978
$$ -7703 -6871 -10128 9756 2490 7076 24105 9974 14405 17675 2998 10907 -579 -17532 -1554
204a554j2681j1926K0173j1669P30K2803r912P535J1694o234J2471o733j0543
$$ -1554 -14235 -26161 -5988 -17657 -16927 5876 -4036 3499 15193 8959 21430 14697 4154
217D154J2492j4696j1730Q779j4841l121Q187r410J1255L572n717K3962k256p322
$$ 4154 16646 1950 -9780 -1001 -15842 -18963 -10776 -20186 -8931 -5359 -11076 12886 10630 3308
231C308J9605p824m986Q033j5616k057K538j6222M402o39j0838J4354j705m410
$$ 3308 22913 15089 10103 18136 2520 463 3001 -13221 -8819 -9458 -20296 -5942 -7647 -12057
245a2057J8187l869J288J2120o800L137m63r053N626r415j1824R342q145o752
$$ -12057 6130 2261 3549 15669 8869 12006 11543 2490 8116 -1299 -13123 -3781 -11926 -18678
259a8678J0141n823N880J0026p252J3715N711q240J1936k685r346O410q220p630
$$ -18678 -8537 -14360 -8480 1546 -5706 8009 13720 5480 17416 14731 5385 11795 3575 -4055
273d055K698r755o61M069o383P322K528j300J3797k273p67R662n638M32rj1339
$$ -4055 -1357 -11112 -11773 -7704 -14087 -6765 -4237 -5537 8260 5987 5220 14882 9244 9676 9667 -1672
289a672L288k953j3236O276q06q848J0672J649q67R524o70O616N054o506M316
$$ -1672 1616 -1337 -14573 -8297 -9103 -17951 -7279 -5630 -6497 3027 2357 8973 14027 7521 11837
304A1837k82p871P86n505o703J984m757q23L863l810P816N387m332J0785J908
$$ 11837 11555 3684 4470 -1035 -7738 -5754 -10511 -11334 -7471 -11281 -3465 1922 -2410 8375 10283
319A0283n006P803k880o482J844n078m408r10o289J613K018m524O356L875p1O964
$$ 10283 5277 13080 10200 3718 5562 484 -3924 -4834 -11123 -9510 -7492 -12016 -5660 -1785 -1856 5108
335E108J070K605L177m272J708j560p701l19k787o713J737j568k809O509L25J676
$$ 5108 6178 8783 11960 7688 9396 7836 135 -184 -2971 -9684 -7947 -9515 -12324 -5815 -5490 -3814
351c814O870R4M603K538l119J806n81m772k570k828l091j952k509J057J901j538
$$ -3814 3056 3150 7753 10291 7172 8978 8397 3625 1055 -1773 -4864 -6816 -9325 -8268 -6367 -7905
367g905N296M464j09M746J435O36K015l659k071p58m934l518j027m001q96K748
$$ -7905 -2609 1855 1746 6492 7927 8563 10578 6919 4848 4090 -844 -4362 -5389 -9390 -10286 -7538
383g538p90J856M084L087K866J515L169K96j630J94k700l177k447k414k383q83
$$ -7538 -8328 -6472 -2388 699 3565 5080 8249 8545 6915 7109 4409 1232 -1215 -3629 -6012 -6895
399f895o13O44K762O83K998M180O70K036K532j123j962n0j977n061j617j659l013
$$ -6895 -7508 -6864 -4102 -3419 -421 3759 4429 6465 8997 7874 5912 5862 3885 -1176 -2793 -4452 -7465
416g465j58p94Q45K724K043K230L262J994J026K180o78j695j274k483j663l111
$$ -7465 -7623 -8417 -7572 -4848 -2805 -575 2687 4681 5707 7887 7209 5514 4240 1757 94 -3017
432c017j707j133j695K485P43k65L815K910J209L009O9q57K746k670l527J41m320
$$ -3017 -4724 -5857 -7552 -5067 -4324 -4589 -774 2136 3345 6354 6423 5566 8312 5642 2115 2256 -2064
449b064k161%l070j07Q41J080K969J276K070L707P69J302J125l186J90j161m679
$$ -2064 -4225 -4225 -7295 -7402 -6561 -5481 -2512 -1236 834 4541 5310 6612 7737 4551 4741 3580 -1099
466a099m1l451k720K930k474q9M805k32K305M807r59J787K278k534N69k284l520
$$ -1099 -1140 -4591 -7311 -4381 -6855 -6944 -2139 -2371 -66 4741 3782 5569 7847 5313 5882 3598 78
483G8K29l997j796Q00k974K036K288n17M076J674N07N075j330j680L345m466k422
$$ 78 307 -3690 -5486 -4686 -7660 -5624 -3336 -3853 223 1897 2404 7479 6149 4469 7814 3348 926
500I26J056o254l87O02l845K299R21l6M453P26J344M148j413O99J790m398N70
$$ 926 1982 -4272 -4659 -4057 -7902 -5603 -4682 -4718 -265 461 1805 5953 4540 5239 7029 2631 3201
517C201j522m799J963l548k102M035k643R45M961j705L181M169k947K844O59m032
$$ 3201 1679 -3120 -1157 -4705 -6807 -2772 -5415 -4470 491 -1214 1967 6136 3189 6033 6692 2660
533B660K632l490l916K034m712p88J913l639K558K262j242M601N78o52N271j947
$$ 2660 5292 1802 -2114 -80 -4792 -5580 -3667 -7306 -4748 -2486 -3728 873 1451 799 6070 4123
549D123j197L572n180j01J255o263J748l71m175M175q47j496N546n41N27M805
$$ 4123 2926 6498 1318 1217 2472 -3791 -2043 -2414 -6589 -2414 -3261 -4757 789 248 775 5580
565E580k176J623K301m181J466j935m329K041m477k429K990l984J477L901k679
$$ 5580 3404 5027 7328 3147 4613 2678 -1651 390 -4087 -6516 -3526 -7510 -6033 -2132 -4811
580d811M361L477k567N299K56l688M194l395l235J988n574k89J386m216K962J339
$$ -4811 -450 3027 460 5759 6015 2327 6521 3126 -109 1879 -3695 -3984 -2598 -6814 -3852 -2513
596b513j359N442K84j60N459k611J87K615n944J042j71o779K499j425m218M754
$$ -2513 -3872 1570 1854 1694 7153 4542 4729 7344 1400 2442 2271 -4508 -2009 -3434 -7652 -2898
612b898j563o55N442j423J612M211l288K267J199m616K775k183l735K848l555
$$ -2898 -4461 -5116 326 -1097 515 4726 1438 3705 4904 288 3063 880 -2855 -7 -3562
627c562n08L210l715K691L003l102M423J064l176N106j388l177L801l755j097
$$ -3562 -4070 -860 -4575 -1884 1119 -1983 2440 3504 328 5434 4046 869 4670 915 -182
642a82K148n567J190J146m191L311L4k115M732p14l12M486k643J004K411m824
$$ -182 1966 -3601 -2411 -1265 -5456 -2145 -2111 -4226 506 -208 -520 3966 1323 2327 4738 -86
658h6K309o87n158L561k222l106M289k670L00N061k871K451L585l246L568N50
$$ -86 2223 1536 -3622 -61 -2283 -5389 -1100 -3770 -3470 1591 -1280 1171 4756 1510 5078 5628
674E628m484L032k493l417K033m460n25K618l749K625J981j943M894O33j859M802
$$ 5628 1144 4176 1683 -1734 299 -4161 -4686 -2068 -5817 -3192 -1211 -3154 1740 2373 514 5316
690E316j942j535L107n195k45J578n818J732P89l573L917p1n56M743j025L67L786
$$ 5316 3374 1839 4946 -249 -494 1084 -4734 -3002 -2213 -5786 -1869 -1940 -2496 2247 1222 1589 5375
707E375k766J163R07m622K099j163m262K752k747j331L740l125Q92L993k645K627
$$ 5375 2609 3772 4679 57 2156 993 -3269 -517 -3264 -4595 -855 -3980 -3088 905 -1740 887
723H87K355l034L501k10l342K916k772j775K271m138L39J720l046K563R72j537
$$ 887 3242 208 3709 3499 157 3073 301 -1474 797 -3341 -3002 -1282 -4328 -1765 -793 -2330
739b330M245l93j058M307k374k97K270m473Q52Q17m679J631j44k671L122j249
$$ -2330 1915 1522 464 4771 2397 2100 4370 -103 749 1566 -3113 -1482 -1626 -4297 -1175 -2424
755b424m19M108j486O05K893k238J755O07l542K007j371k521J942k937m39K848
$$ -2424 -2843 1265 -221 384 3277 1039 2794 3401 -141 1866 495 -2026 -84 -3021 -3460 -612
771f12k633J378K458k099L140J289k582L181o57k249K340k967j098J770l473M60
$$ -612 -3245 -1867 591 -1508 1632 2921 339 3520 2863 614 2954 -13 -1111 659 -2814 -2354
787b354J178k374K452J93r24L343n43n63L156k365M66J360l660J222l2l619K203
$$ -2354 -1176 -3550 -1098 -905 -1829 1514 971 408 3564 1199 1665 3025 -635 587 555 -3064 -861
804h61r72j632K933j234j12L210j291J020K007k195J752j3k592J535j763j587
$$ -861 -1833 -3465 -532 -1766 -1878 1332 41 1061 3068 873 2625 2612 20 1555 -208 -1795
820a795J772k598j95J964j817J697J344j649K875O11j592K515j364j337J883k752
$$ -1795 -23 -2621 -2816 -852 -2669 -972 372 -1277 1598 2209 617 3132 1768 431 2314 -438
836d38m10J090k835Q77O08j622J981k7m15K887o65j79K243j920N74N35k870J158
$$ -438 -848 242 -2593 -1716 -1108 -2730 -749 -776 -1191 1696 1031 852 3095 1175 1749 2284 -586 572
854E72m48k589J712j065r76K438j264M09K237r81J030J443j713J180k38j713J183
$$ 572 124 -2465 -753 -1818 -2794 -356 -1620 -1211 1026 45 1075 2518 805 1985 1747 34 1217
871A217j641j086J136j613M6J019j204J629O80q30K114J06r66J928j293o45J182
$$ 1217 -424 -1510 -374 -1987 -1941 -922 -2126 -497 183 -647 1467 1573 607 2535 1242 597 1779
888A779k338q5L68j838P56J29r86J697K8r9J726l27J28J169j164N63j0j820P77
$$ 1779 -559 -644 -276 -2114 -1358 -1229 -2215 -518 -490 -589 1137 810 938 2107 943 1506 1496 -324 453
907D53q10j445J284j212j34J403q39O34J536q09R59Q85j110R09l57j221R37j427
$$ 453 -357 -1802 -518 -1730 -1864 -461 -1300 -666 870 61 1020 1905 795 1704 1347 126 1063 -364
925c64p46N54j125M15K86o54J189M61k91J538j35k91J191j178o2O73j937K24r1
$$ -364 -1110 -556 -1681 -1266 -980 -1634 -445 16 -275 1263 1128 837 2028 850 788 1461 -476 -252 -343
944c43j205N69k45m31J195l8LJ258k98M09P97q19L61q7j089L08p48p51N77q39
$$ -343 -1548 -979 -1224 -1655 -460 -498 -495 763 465 874 1671 852 1213 1126 37 345 -403 -1154 -577 -1416
964a416K7P21m22M70J044l49Q24M03m90P51n05o79M12q81m91J40q65K58J59l02
$$ -1416 -1389 -668 -1090 -620 424 75 899 1302 812 1563 1058 379 791 -90 -581 -441 -1306 -1048 -889 -1191
984a191P45L11J49Q20k4O6N54n89l9J64j014j6l40p19L59k32k53P75j20M04O25
$$ -1191 -446 -135 14 834 810 876 1430 841 802 966 -48 -64 -404 -1123 -764 -996 -1249 -474 -594 -190 435
1005D35J19J81M41k45K4k57m88j28n44k44J8n25J84M46j23M89N35r1N93J56k57
$$ 435 554 735 1176 931 955 698 210 82 -462 -706 -688 -1213 -1029 -583 -706 -217 318 227 820 976 719
1026G19L93l36l60N1n53l21p2l19j4R0M4J67L67K42M74Q4O8K70l03Ol05n58j6
$$ 719 1112 776 416 467 -86 -407 -479 -798 -812 -722 -678 -511 -144 98 572 656 724 994 691 697 392 -166 -182
1049a82l53l25J26N5j56K95K43J89L62J24L46J89j0j76j39l34j69k66k62j95k3
$$ -182 -535 -860 -734 -679 -835 -540 -297 -108 254 378 724 913 903 727 588 254 85 -181 -443 -638 -661
1070f61p4M1J10K97L14J46L09K28p9J78k01j21k16j91m83q9q4o9L1J69M8M17J99
$$ -661 -735 -694 -584 -287 27 173 482 710 631 809 608 487 271 80 -403 -492 -576 -645 -614 -445 -397 20 219
1093B19J54K00J15rM1j48j82j32n16n7k06j39j16J08O6L27qK71M29k9L08o7k41
$$ 219 373 573 688 679 720 572 390 258 -258 -315 -521 -660 -776 -668 -602 -275 -283 -12 417 388 696 629 388
1116C88Q3o7l32j61k37l36K52j45k33N51k1K26L38J17J35Q0j15O1j28k79j13k08
$$ 388 471 404 72 -89 -326 -662 -410 -555 -788 -237 -258 -32 306 423 558 638 523 584 456 177 64 -144
1138a44k41j17j54J01K00r2L91L0O5L52Q8k58K98n8k20j24k27k37J72n23J85J16
$$ -144 -385 -502 -656 -555 -355 -447 -56 -26 39 391 479 221 519 461 241 117 -110 -347 -175 -698 -513 -397
1160c97R7K01m4J90L91j7N4M9j83J9r4k19j93Jl40J18j56MM64k38N9N09k1R8K69
$$ -397 -300 -99 -143 47 438 421 475 524 341 360 266 47 -146 -145 -485 -367 -523 -519 -55 -293 -234 275 254 352 621
1185F21m31L09q3k68K9k83j86K1k35P9J78k85L99J46o4M67o5r0L71l31j69K20
$$ 621 190 499 416 148 177 -106 -292 -271 -506 -427 -249 -534 -135 11 -53 414 349 259 630 299 130 350
1207C50m09k97L4k29J43N1k72N17j0R4L93j32P5L18k54O5q9m44L0K0l41P8n5j24
$$ 350 -59 -356 -322 -551 -408 -357 -629 -112 -122 -28 365 233 308 626 372 437 348 -96 -66 -46 -387 -309 -364 -488
1231d88M32j68K22K44j35K80qj03J44j06l10J58k56j04M8l44J48J22k20K87K30
$$ -488 -56 -224 -2 242 107 387 379 276 420 314 4 162 -94 -198 -150 -494 -346 -224 -444 -157 73
1252G3j13L51k4j72L09j84n8Pk37Q3N4m49J92L6k52L85j83OL98m6n3L79l14R8
$$ 73 -40 311 287 115 424 240 182 189 -48 35 89 -360 -168 -132 -384 1 -182 -176 222 176 123 502 188 286
1276B86j6l08J49j60k02K52l11j6K14j94L8M08k29K10J90p9l6J25k79J06j62j51
$$ 286 270 -38 111 -49 -251 1 -310 -326 -112 -306 -268 140 -89 121 311 232 196 321 42 148 -14 -165
1298a65J24j73j06J65j50PL44j74K89M9j24K03q1J5%l45J20Rj37l7k6j83K15O9
$$ -165 -41 -214 -320 -155 -305 -298 46 -128 161 210 86 289 208 223 223 -122 -2 7 -130 -167 -193 -376 -161 -92
1322i2r4K63jj3K22j28Q0m4j19pk7j51Oj44o0K16k92L15K78l14P4K08j29J77l0
$$ -92 -186 77 76 63 285 157 237 193 74 67 40 -111 -105 -249 -309 -93 -385 -70 208 -106 -32 176 47 224 194
1347A94j71J26j07n2jj26r4R1j26N1J05j04K56J12j9J84M3k21K47l09j75K77l73
$$ 194 23 149 42 -10 -11 -137 -231 -140 -266 -215 -110 -214 42 154 135 319 362 141 388 79 -96 181 -192
1370a92r2K05k47J35Q8j33L89M9r8J45j03q2K28k68J65q1k28M9j17j46K85j47
$$ -192 -284 -79 -326 -191 -103 -236 153 202 104 249 146 64 292 24 189 108 -120 -71 -188 -334 -49 -196
1392a96q4L06j41J89J88j95J61j1p5J52j24k79K37k94j54K39j79K1K90j89K23
$$ -196 -280 26 -115 74 262 67 228 217 142 294 170 -109 128 -166 -320 -81 -260 -239 51 -138 85
1413H5k0L9J24k2j25J30j20p9J33l02M6K6r7M9M6o6J70j04N5K38j13L5J31k19
$$ 85 65 104 228 206 81 211 91 12 145 -157 -111 -85 -182 -133 -87 -153 17 -87 -32 206 93 128 259 40
1437D0J28M1l49J74j49o0N3j08q5K56n2J06J63j62J82L2k12L64l07j56J73j12
$$ 40 168 209 -140 34 -115 -175 -122 -230 -315 -59 -111 -5 158 -4 178 210 -2 362 55 -101 72 -40
1459d0k26K77j55j36K75j34J43N3p1J75R1k33K27k8j06J36l77P4R8l02K6P7j42
$$ -40 -266 11 -144 -280 -5 -139 4 57 -14 161 252 19 246 218 112 248 -129 -55 43 -259 -233 -156 -298
1482b98K79j38J07J20M0p6K00q4k7Kj75J33j09j82N3O7q8J92j59M0J82n4Q8J00
$$ -298 -19 -157 -50 70 110 34 234 150 123 125 -50 83 -26 -208 -155 -88 -176 16 -143 -103 79 25 113 213
1506B13o2J55J5l57J30j91k5J88l86J49Mk5M6J55M0L4J37j17J51k35J06M6k83
$$ 213 151 306 321 -36 94 -97 -122 66 -320 -171 -167 -192 -146 9 49 83 220 103 254 19 125 171 -112
1529a12Q7m3j98J64K5j54J09K4q5K03QJ45J40k98K13N1l85J77N3k63J67j46k25
$$ -112 -25 -68 -266 -102 -77 -231 -122 -98 -183 20 28 173 313 15 228 279 -106 71 124 -139 28 -118 -343
1552c43K75j46J86J37j17K35o5p0J27L5j64O0Ml42K03j92j2P0k19K80M6r6K67
$$ -343 -68 -214 -28 109 -8 227 162 92 219 254 90 150 154 -188 15 -177 -189 -119 -338 -58 -12 -108 159
1575A59m5lK23j39k2J8k06k8R4l42J39L0j81Q2J68j40K76jJ1K19o7j08K66l46
$$ 159 114 111 334 195 173 191 -15 -43 51 -291 -152 -122 -303 -221 -53 -193 83 82 93 312 245 137 403 57
1599E7L3r6k51J26J1l5O2j80J55O1M1J07J99j32J19O9k76R8j83j7J4k14J10R3
$$ 57 90 -6 -257 -131 -120 -155 -93 -273 -118 -57 -16 91 290 158 277 346 70 168 -15 -32 -18 -232 -122 -29
1623b9l27K86j21J39L3J01OK17k4j51l6j15L8k9j14%r9k7J51J4r8P8J30K9J76
$$ -29 -356 -70 -191 -52 -19 82 88 305 281 130 94 -21 17 -12 -126 -126 -225 -252 -101 -87 -185 -107 23 52 228
1648B28p5O2j2k03J36j86k13K35k17N8R6j06O0J55j9J96R6k30J52L8m2Lk26K5
$$ 228 153 215 203 0 136 -50 -263 -28 -245 -187 -91 -197 -137 18 -1 195 291 61 213 251 209 212 -14 11
1672A1N0l70J7Q3l1L3J02qJ53J9j9J44o3p5J12j05n7M9j94n6M2q1J3R4mR9J74
$$ 11 61 -309 -292 -209 -240 -207 -105 -113 40 59 40 184 121 46 158 53 -4 45 -149 -205 -163 -244 -231 -137 -141 -42 132
1699A32m9J94j11M0Pq9jr9n3j34p4No2J05P7J32J4J00Km9J82o1q7R0j57j55k0
$$ 132 83 277 166 206 213 124 123 24 -29 -163 -237 -232 -294 -189 -112 20 34 134 136 87 269 208 121 211 54 -101 -121
1726a21j64J04k07J22k4J16K00R8J3k3J34p0k2k5l0j29N0j91N6j64O4j5J4O4J39
$$ -121 -285 -181 -388 -266 -290 -174 26 124 137 114 248 178 156 131 101 -28 22 -169 -113 -277 -213 -228 -214 -150 -11
1751a1K34o9J90j9p8J8o1j03k0k49Pk2j37J95M9rK9P6J9J41J38j30N9j75k4n2
$$ -11 223 154 344 325 247 265 204 101 81 -168 -161 -183 -320 -125 -76 -85 -56 20 39 180 318 188 247 72 48 -4
1777dj07m3J4q7r1J48m8J97k08K88K58r1l5j7r2M4J9j81K2j03p6RP1j05J41P3
$$ -4 -111 -154 -140 -227 -318 -170 -218 -21 -229 59 317 226 191 174 82 126 145 -36 -14 -117 -193 -184 -113 -218 -77 -4
1803dP3R2o7J13O9k7p5j04M1k14P8k45j9M3l7P8K7J14J98j22J34Q0r4J66j87j68
$$ -4 69 161 94 207 276 249 174 70 111 -103 -25 -270 -289 -246 -283 -205 -178 -64 134 12 146 226 132 298 111 -57
1829e7l5J24j82M5q6j85K37j4J57l0L0J39J66j29J55n1k9r6k31j6Q8k51J11n4
$$ -57 -92 32 -150 -105 -191 -376 -139 -153 4 -26 4 143 309 180 335 284 255 159 -72 -88 0 -251 -140 -194
1853a94p5K38r8J04J95o7J66J02j37M5k6l34K9j02j02j6l5J33J19j41J09K50k32
$$ -194 -269 -31 -129 -25 170 103 269 371 234 279 253 -81 -52 -154 -256 -272 -307 -174 -55 -196 -87 163 -69
1876f9L18J0k19L00j22k46O8j68j08N8j51M3K58j86L09Mp4K06mp2J26j35qQ0k21
$$ -69 249 259 40 340 218 -28 40 -128 -236 -178 -329 -286 -28 -214 95 99 25 231 227 155 281 146 138 218 -3
1901cj03K0k57K08n8n7R3J07R5K63k65J06L24k82L4o4k72k2l8j60K18j48K7K25
$$ -3 -106 -86 -343 -135 -193 -250 -157 -50 45 308 43 149 473 191 225 161 -111 -133 -171 -331 -113 -261 -234 -9
1925ir6P8rP5J08J11j02J80r6k85J17k13o5J56k34J47P3j54K42K2J7K17j84L4
$$ -9 -105 -27 -36 39 147 258 156 336 240 -45 72 -141 -206 -50 -284 -137 -64 -218 24 46 63 280 96 130
1949A30J97k99J11q8j03o7P8j99J14o0l0L28k61J79J47j27J05J47k89J04R2k67
$$ 130 327 28 139 51 -52 -119 -41 -240 -126 -186 -216 112 -149 30 177 50 155 302 13 117 209 -58
1971e8J37l34m4J77j83J66J44k38L94n4j28K35M9j42J84k43k0Pk51Q7q4n5K57
$$ -58 79 -255 -299 -122 -305 -139 5 -233 161 107 -21 214 263 121 305 62 42 49 -202 -115 -199 -254 3
1994CM5k88K56P8o9L10j42o2K16k38qm5k62K35j46k37L13k12j0K70j14J70J61
$$ 3 48 -240 16 94 25 335 193 131 347 109 101 56 -206 29 -117 -354 -41 -253 -263 7 -107 63 224
2017B24j93K07J28m15J81L6k77J21j11r8J47k04R3J23o9K10L5p4R7J15j22J36
$$ 224 31 238 366 -49 132 168 -109 12 -99 -197 -50 -254 -161 -38 -107 103 138 64 161 276 154 290
2039B90k46N7N2n33K67Oj96K71j20P3K21p2j6J34j07LK31k42J24j30k60O1p4J5
$$ 290 44 101 153 -380 -113 -107 -303 -32 -152 -79 142 70 54 188 81 84 315 73 197 67 -193 -132 -206 -191
2063a91O5j07M4K80j57J19J49j95K95j4l35L18k42m2Q0l00O3L0k53J12K97k25
$$ -191 -126 -233 -189 91 -66 53 202 7 302 288 -47 271 29 -13 67 -233 -170 -140 -393 -281 16 -209
2085b09N05r2j57K13j33mJ76k89P3J1k36J47j28j78K02J5j09L64k10J61O2j17
$$ -209 296 204 47 260 127 123 299 10 83 94 -142 5 -123 -301 -99 -84 -193 171 -39 122 184 67
2107F7J53n1k25J10j8k94K15j29j16K05j69K45O7k44L55K4j92J24k8lJ4p8j43
$$ 67 220 169 -56 54 36 -258 -43 -172 -288 -83 -252 -7 60 -184 171 195 3 127 99 96 110 32 -111
2130a11P6k01J24K20m88L33j32pL80j26K1K43k45J09J15l42K4p6r3J12j08j20
$$ -111 -35 -236 -112 108 -380 -47 -179 -186 194 68 89 332 87 196 311 -31 -7 -83 -176 -64 -172 -292
2152b92K18p1R3K25l40J20K60j92K01o5k37K87j70k64J08j02n3K53j82K2K76k35
$$ -292 -74 -145 -52 173 -167 -47 213 21 222 157 -80 207 37 -227 -119 -221 -274 -21 -203 -181 95 -140
2174a40J44K40k55L09k09J1R3k29R1k45n6J26N9j95K71j0l3K78j83m0K31j37%
$$ -140 4 244 -11 298 89 100 193 -36 55 -190 -246 -120 -61 -256 15 5 -28 250 67 27 258 121 121
2197A21j2j09j3Lk8r6j27k0K55l09K34J54n1J20Q6j04J48n0k50J33j30j15J37
$$ 121 109 0 -13 -10 -38 -134 -261 -281 -26 -335 -101 53 2 122 208 104 252 202 -48 85 -45 -160 -23
2220b3k05M0O7j16K88J5j5L0J83jN6k17P1mk32K8Kk29J70J4k12J90J2J20J57j41
$$ -23 -228 -188 -121 -237 51 66 51 81 264 263 319 102 173 169 -63 -35 -33 -262 -92 -78 -290 -100 -88 32 189 48
2246D8L5J56n9q4J14l21K00j82j52M0n0%J21o8K24rJ0J37M8j30J50j23m7rj23
$$ 48 83 239 180 96 210 -111 89 -93 -245 -205 -255 -255 -134 -202 22 13 23 160 208 78 228 105 58 49 -74
2271g4k4L3p0LN4K6Q2J5oJ30K5l4M1p9j83L7m1L9m7j77J94l4j42K67k18K67M1
$$ -74 -98 -65 -135 -132 -78 -52 30 45 39 169 194 160 201 122 -61 -24 -65 -26 -73 -250 -56 -90 -232 35 -183 84 125
2298A25rl3%j05K33p7k29L9r2p6J1L1N7Q6j29K13J01k8J43j4j90R8n1m1K3k37
$$ 125 116 83 83 -22 211 134 -95 -56 -148 -224 -213 -182 -125 -39 -168 45 146 118 261 247 57 155 104 63 86 -151
2324a51R2O7j44j12J40k3J56M3k8J62o4L8l0n6J7j00j12n4oPJ8m4k5K65j11Q7
$$ -151 -59 8 -136 -248 -108 -131 25 68 40 202 138 176 146 90 107 7 -105 -159 -165 -158 -140 -184 -209 56 -55 32
2350C2J64o8J07j73R7l5k22K6R2k22p0N4L7j3J73r3K11N4M0p1K3nPk1j80P0q6
$$ 32 196 128 235 62 159 124 -98 -72 20 -202 -272 -218 -181 -194 -21 -114 97 151 191 120 143 138 145 124 -56 14 -72
2377g2L7Rq4N1o5M6P8O1P8J10k4j43L8m4lk8k40L5K0j0NJ6N2J32j51J28J23mO1
$$ -72 -35 -26 -110 -59 -124 -78 0 61 139 249 225 82 120 76 73 45 -195 -160 -140 -150 -145 -129 -77 55 -96 32 155 151 212
2406B12p0j0q6J8j24j16k6RN3Q1NK5J39n2J21p3PL2Kq3nmj63O2k43K05r0O4O5
$$ 212 142 132 46 64 -60 -176 -202 -193 -140 -59 -54 -29 110 58 179 106 113 145 147 64 59 55 -108 -46 -289 -84 -174 -110 -45
2435d5JJ41p4P2Q0L3j39J23j48j01j34Q5j07n5J25l0J51j08O0J89p9M1l5O0O6
$$ -45 -44 97 23 95 175 208 69 192 44 -57 -191 -106 -213 -268 -143 -173 -22 -130 -70 119 40 81 46 106 172
2460A72M0j85n4m4K4l1o0J01q5O0J18n1L2J88mq4J9M8q7j15q0N8o1l4m2L7K9J3
$$ 172 212 27 -27 -71 -47 -78 -138 -37 -122 -62 56 5 37 225 221 137 156 204 117 2 -78 -20 -81 -115 -157 -120 -91 -78
2488g8J21qj37K06j4QM0j82J34j81M4j08m9J47r9k8K48jk6R7o4J49j71J11NNk27
$$ -78 43 35 -102 104 90 98 138 -44 90 -91 -47 -155 -204 -57 -156 -184 64 63 37 134 70 219 48 159 164 169 -58
2515e8Q9k67K4J90k16R5N9O5P5k6J21M8p1j18K76j70j57J6j15J6mk25K12N9o5
$$ -58 31 -236 -212 -22 -238 -143 -84 -19 56 30 151 199 128 10 286 116 -41 -25 -140 -124 -128 -353 -141 -82 -147
2540a47K35n9J2O7L5j13J02j46O2j13o9P2l2k4o8O1l8K24j12Q6J28m3R6N3k00
$$ -147 88 29 41 108 143 30 132 -14 48 -65 -134 -62 -94 -118 -186 -125 -163 61 -51 35 163 120 216 269 69
2565F9M7o6j06N9j28n0N5n0P6J91k93L33r6O1M9l2Q2K8j70Q9j94r6q9P4j57L11
$$ 69 116 50 -56 3 -125 -175 -120 -170 -94 97 -196 137 41 102 151 119 201 229 59 148 -46 -142 -231 -157 -314 -3
2591cj03j43K37K1N3J3J57j02O4p4l7j99K5J51l36pK04j5J1J52j67K86m6n3N8
$$ -3 -106 -249 -12 9 62 75 232 130 194 120 83 -116 -91 60 -276 -283 -79 -94 -83 69 -98 188 142 89 147
2616A47Km7R3j81j27J06k40J40n3J5J62o5o8K63L7j43K19m5j21R9k89J21l1k63
$$ 147 149 102 195 14 -113 -7 -247 -107 -160 -145 17 -48 -116 147 184 41 260 215 94 193 -96 25 -6 -269
2640b69J79jl16L12R3j97K71j38J45K02j77J29m0j23P3l9k47O4j9j19J62j02J27
$$ -269 -90 -91 -407 -95 -2 -199 72 -66 79 281 104 233 193 70 143 104 -143 -79 -98 -217 -55 -157 -30
2663c0N4j09L48j16j63K00k0r8J74j67k37J52j21j01J91l38L09J9n8L46j95Q3
$$ -30 24 -85 263 147 -16 184 164 66 240 73 -164 -12 -133 -234 -43 -381 -72 -53 -111 235 40 123
2685A23K3k5K7Rl89J28O9k41K85k88l6J39R6J6J96l0p8K79k09J66K1k90Q6j01
$$ 123 146 121 148 157 -232 -104 -35 -276 9 -279 -315 -176 -80 -64 132 102 24 303 94 260 281 -9 77 -24
2709b4r0J16j67n4J65k32K99J33k80K52J70j90J70j87j06J83j28j46J23k71O0
$$ -24 -114 2 -165 -219 -54 -286 13 146 -134 118 288 98 268 81 -25 158 30 -116 7 -264 -204
2730b04J49k40K59l1j55M54k67J61J36k13Q0N7k45J64j62k41J80n5n1L18k06J20
$$ -204 -55 -295 -36 -67 -222 232 -35 126 262 49 129 186 -59 105 -57 -298 -118 -173 -224 94 -112 8
2752HJ44j49J25J32r7L8l5j14J33k36r6R5n1j46P4o6L05K2j75L36j27kJ35k67
$$ 8 152 3 128 260 163 201 166 52 185 -51 -147 -52 -103 -249 -175 -241 64 86 -89 247 120 118 253 -14
2776a4O3J09l34J23j84MJ8J41j44J84q0L1L19q7p7J67k41J04J33k93J16j69kM4
$$ -14 49 158 -176 -53 -237 -233 -215 -74 -218 -34 -114 -83 236 149 72 239 -2 102 235 -58 58 -111 -113 -69
2800f9k37J01J79j37M1K67j08J68o3j22L28k70q8K18l03j04MQR6K2k02J37J13
$$ -69 -306 -205 -26 -163 -122 145 37 205 142 20 348 78 -10 208 -95 -199 -195 -187 -91 -69 -271 -134 -21
2823b1n6L78j08j12K64l34j1jj77J55j07k20J32J7oJ59o1J30L5N0P6J25j87J62
$$ -21 -77 301 193 81 345 11 0 -1 -178 -23 -130 -350 -218 -201 -207 -48 -109 21 56 106 182 307 120 282
2847B82k08j27J72k60j61L20k53M3J55n0J02P1l2J49p6m2K09k20o7O2k54n8J93
$$ 282 74 -53 119 -141 -302 18 -235 -192 -37 -87 15 86 54 203 127 85 294 74 7 69 -185 -243 -50
2870e0q7m2K9n6J38J40KK17j95N3M0j16l7R7k38Q5n8j57J90j83N4K55j44Q2K02
$$ -50 -137 -179 -150 -206 -68 72 74 291 96 149 189 73 36 133 -105 -20 -78 -235 -45 -228 -174 81 -63 19 221
2895B21j51J52o4j45J64n6k19J96j94q4L0l6Q7P1j90K65K05k22K40l3r7J48k01
$$ 221 70 222 158 13 177 121 -98 98 -96 -180 -150 -186 -99 -28 -218 47 252 30 270 237 140 288 87
2918H7j58J38k09j3m1k19J74J85k54M00k3K3N6l1n7J49j99J23%l00J46j55j0O0
$$ 87 -71 67 -142 -155 -196 -415 -241 -56 -310 90 67 90 146 115 58 207 8 131 131 -169 -23 -178 -188 -128
2942a28j37J62M1M8Q4J26m1j7P9r0J04j41n3j31j01O3k0kPP9q5J15Q0K5J56j20
$$ -128 -265 -103 -62 -14 70 196 155 138 217 127 231 90 37 -94 -195 -132 -152 -154 -147 -68 -153 -38 42 67 223 103
2968A03j3R3k87J62n8j19m4k8j64J21Q2k1K00L3J0R1K0L4nj52N8q5o6m3l8j12
$$ 103 90 183 -104 58 0 -119 -163 -191 -355 -234 -152 -173 27 60 70 161 181 215 210 58 116 31 -35 -78 -116 -228
2994b28R2j07j21L36O6l5M2N0J13J3j57J51n4j30M1j65K1j08r9R1J02K0J57j11
$$ -228 -136 -243 -364 -28 38 3 45 95 208 221 64 215 161 31 72 -93 -72 -180 -279 -188 -86 -66 91 -20
3018b0K5M5O7k8J48k22M6L7k34j18J46j01O4o4O3K3J03J37O2j0m6J05j42m8p7
$$ -20 5 50 117 89 237 15 61 98 -136 -254 -108 -209 -145 -209 -146 -123 -20 117 179 169 123 228 86 38 -39
3043c9l9nj68M0K24j86J39n8J7Q6J85J6k7n7j38M3r8l9O2j03p8p5Q8R4J18j45
$$ -39 -78 -83 -251 -211 13 -173 -34 -92 -75 11 196 212 185 128 -10 33 -65 -104 -42 -145 -223 -298 -210 -116 2 -143
3069a43J49J30Jn6p7J66l5K7q7j13q7L7l8o5K8Q6K0J72n9P2P9j31J49m8O3j52
$$ -143 6 136 137 81 4 170 135 162 75 -38 -125 -88 -126 -191 -163 -77 -57 115 56 128 207 76 225 177 240 88
3095H8k7r7k02J07j36K05j35L0K4K02L6p4J73n1J05j25m3j03m7m7M8j97l0J36
$$ 88 61 -36 -238 -131 -267 -62 -197 -167 -143 59 95 21 194 143 248 123 80 -23 -70 -117 -69 -266 -296 -160
3119a60q5J78R5R9J3P3K6oj35o8P5k21J51j00j08j21J72k1J35k0J33L7k2O1r2
$$ -160 -245 -67 28 127 140 213 239 233 98 30 105 -116 35 -65 -173 -294 -122 -143 -8 -28 105 142 120 181 89
3144H9J54p9k9j42O9r4k77J61o7l0K5R2J60oO9l2J76m8R3j13j88n9p9L2k1q0J30
$$ 89 243 164 135 -7 62 -32 -309 -148 -215 -245 -220 -128 32 26 95 63 239 191 284 171 -17 -76 -155 -123 -144 -224 -94
3171i4r6P4J43p3J29J54q9k6J49j05l3q5j06j0K4o4j28P5j7J60j5P4J93j07J53
$$ -94 -190 -116 27 -46 83 237 148 122 271 166 133 48 -58 -68 -44 -108 -236 -161 -178 -18 -33 41 234 127 280
3196B80K9l28J97j19j71N2k52J34O8j9j03J49o8J97L2n9Q6J47j13J0p1m8k8j43
$$ 280 309 -19 178 59 -112 -60 -312 -178 -110 -129 -232 -83 -151 46 78 19 105 252 139 149 78 30 2 -141
3220a41o2L2J08q4k2q2J76J95j73J18Q1r2J79p4j0lk41P1l2j06Q5k3j89J32P6
$$ -141 -203 -171 -63 -147 -169 -251 -75 120 -53 65 146 54 233 159 149 146 -95 -24 -56 -162 -77 -100 -289 -157 -81
3245h1J57J12j19J39l3J4q2n2n9K6q0j93K00j30j8J12n3O7J82j24J64J5J8n5M6
$$ -81 76 188 69 208 175 189 107 55 -4 22 -58 -251 -51 -181 -199 -87 -140 -73 109 -15 149 164 182 127 173
3270A73j71L6j04j2K2j62J01N2p9R0K55j54J94j29m2J88j06K1j05j44l9J86l30
$$ 173 2 38 -66 -78 -56 -218 -117 -65 -144 -54 201 47 241 112 70 258 152 173 68 -76 -115 71 -259
3293b59J90M1j79J71p2O0K61j24J45m4k11J89j17m9J7j32j92L18k29J4K06j65
$$ -259 -69 -28 -207 -36 -108 -48 213 89 234 190 -21 168 51 2 19 -113 -305 13 -216 -202 4 -161
3315a61J49J50r0J81j13L6J42j63k10J34k27Q3J44l44K88k4j02J86k3j61J90J04
$$ -161 -12 138 48 229 116 152 294 131 -79 55 -172 -89 55 -289 -1 -25 -127 59 36 -125 65 169
3337A69j44P7M2j78N8j26J03m8j85K07j17L6J72j95R5K26k45R1R7j87K44k11o6
$$ 169 25 102 144 -34 24 -102 1 -47 -232 -25 -142 -106 66 -129 -34 192 -53 38 135 -52 192 -19 -85
3360h5O2m8j3rk21J24Q6K1M0J90l5m4J17p3k3j59J66Lj79r0J14j14Q3J1m7P3m6
$$ -85 -23 -71 -84 -93 -314 -190 -104 -83 -43 147 112 68 185 112 89 -70 96 99 -80 -170 -56 -170 -87 -76 -123 -50 -96
3387i6J19J39q1J41P1m30J93K0k58J83k30K9J56k03J69L8QM0J83p2o0R8j00P3
$$ -96 23 162 81 222 293 -137 56 76 -182 1 -229 -200 -44 -247 -78 -40 -32 8 191 119 59 157 57 130
3411A30p3q2q8j12RL75l36J23J07k07J81J61j87K60r5r6J29j82k6O2j50O4mr7
$$ 130 57 -25 -113 -225 -216 159 -177 -54 53 -154 27 188 1 261 166 70 199 17 -9 53 -97 -33 -37 -134
3435a34N5mq1J87j9o9L18k06J11l0o7j06J13j53J08j26j47J53r9L6J27m4J41Q3
$$ -134 -79 -83 -164 23 4 -65 253 47 158 128 61 -45 68 -85 23 -103 -250 -97 -196 -160 -33 -77 64 147
3459A47j02K35k70o9L31m40l4J74j15k9J96j75J57j2m8J78j58Q9J03j47O4J14
$$ 147 45 280 10 -59 272 -168 -202 -28 -143 -172 24 -151 6 -6 -54 124 -34 55 158 11 75 189
3481A89k24O6n7j24k4J19j42J17Kr1K32j58K02o0m2J90j12k58K81j20m1l2N4j53
$$ 189 -35 31 -26 -150 -174 -55 -197 -80 -78 -169 63 -95 107 47 5 195 83 -175 106 -14 -55 -87 -33 -186
3505a86J2Q5nL5m5J91r8M4L0J17j29P6j89Q2m8k56J97J12j27J61j59L0J30J1o7
$$ -186 -174 -89 -94 -59 -104 87 -11 33 63 180 51 127 -62 20 -28 -284 -87 25 -102 59 -100 -70 60 71 4
3530DJ80j62L8J53k36N8k0o0p8L4p8J87n6j56J84r5J65N8k19K76k46R7L5j53o4
$$ 4 184 22 60 213 -23 35 15 -45 -123 -89 -167 20 -36 -192 -8 -103 62 120 -99 177 -69 28 63 -90 -154
3555a54J84j02q9J24k22K40J6n0K27rj05J9R5q7l9o9K7M5k18P2O7r0J27L3j40
$$ -154 30 -72 -161 -37 -259 -19 -3 -53 174 165 60 79 174 87 48 -21 6 51 -167 -95 -28 -118 9 42 -98
3580i8J69Pp8R0K7l3J16k68J21K4j19l9j5K1J17q5mJ26j8k2k7R7j0o1q3J62n7
$$ -98 71 78 0 90 117 84 200 -68 53 77 -42 -81 -96 -75 42 -43 -47 79 61 39 12 109 99 38 -45 117 60
3607F0j27Q0j10KN4K0j4K2JO7PQ6M7j16J68j88j4L1n0j33K0%o4K8J05L8L9N9L3
$$ 60 -67 13 -97 -95 -41 -21 -35 -13 -12 55 62 148 195 79 247 59 45 76 26 -107 -87 -87 -151 -123 -18 20 59 118 151
3636A51J7j33N4j07J8p2J12n9L7q1q3N3J24L2L5m5K7p4k5J19O0j87J02J2j35J23
$$ 151 168 35 89 -18 0 -72 40 -19 18 -63 -146 -93 31 63 98 53 80 6 -19 100 160 -27 75 87 -48 75
3662G5k91K08k8r4J91rm6J66j03J73k9m0j46Pm5n6Q0p5p8J51r7l0K65k27J48j35
$$ 75 -216 -8 -36 -130 61 52 6 172 69 242 213 173 27 34 -11 -67 13 -62 -140 11 -86 -116 149 -78 70 -65
3688f5J23R1o7q8K4Rl8o7j09J17j41Q1Q6M2N2r2N6M6M5n0J06j00l4o8J89j20p2
$$ -65 58 149 82 -6 18 27 -11 -78 -187 -70 -211 -130 -44 -2 50 -42 14 60 105 55 161 61 27 -41 148 28 -44
3715d4QOn6K5M7JM5%M7r6J94p4j86J01N8n0oj3l3j02OK9mJ88m9q3J37l5L0k1j55
$$ -44 -36 -30 -86 -61 -14 -13 32 32 79 -17 177 103 -83 18 76 26 20 7 -26 -128 -122 -93 -97 91 42 -41 96 61 91 70 -85
3746h5M0M2l6l0N3N0j27K9K9K11o7r6lOJ13r7L7m6%j11N8m8j2J41q5o1J47j6r5
$$ -85 -45 -3 -39 -69 -16 34 -93 -64 -35 176 109 13 10 16 129 32 69 23 23 -88 -30 -78 -90 51 -34 -95 52 36 -59
3775e9k6J97Q1j80ko9J97j90M4r1K9k6l4O1L7P0r2o3J82n4M2m6nj03J3J31j57
$$ -59 -85 112 193 13 11 -58 139 -51 -7 -98 -69 -95 -129 -68 -31 39 -53 -116 66 12 54 8 3 -100 -87 44 -113
3802a13J32o7L6l7L6M7P7k0L7m4N7N6j32j6Q8o7j17J7M0p4o1K9J7Q7J8P2p8O1
$$ -113 19 -48 -12 -49 -13 34 111 91 128 84 141 197 65 49 137 70 -47 -30 10 -64 -125 -96 -79 8 26 98 20 81
3830H1n0J09o8l5m5l1r2M3M7j27J22k3r9J01O7K6k2O7m1R6j65K7J35j47o8J69
$$ 81 31 140 72 37 -8 -39 -131 -88 -41 -168 -46 -69 -168 -67 0 26 4 71 30 126 -39 -12 123 -24 -92 77
3856G7j16n9R0N1j1k1J6m1Q7j06J43q4O2j44Q7m9r0P0j39J75p0K1N1m6Q0rO4r3
$$ 77 -39 -98 -8 43 32 11 27 -14 73 -33 110 26 88 -56 31 -18 -108 -38 -177 -2 -72 -51 0 -46 34 25 89 -4
3884dj6m5O9k4j50P3Q7qq3Q8k0l5M0MJ13m0M0kK7j45M7O4j01Q7j09Q1k3r4Q2r6
$$ -4 -20 -65 4 -20 -170 -97 -10 -18 -101 -13 -33 -68 -28 -24 89 49 89 87 114 -31 16 80 -21 66 -43 38 15 -79 3 -93
3914i3QJ84k4o6l7J55j61M3K1r3q9J24j3Qp3l2J37n0n8J01L8O7j30kQ1q3J20j28
$$ -93 -85 99 75 9 -28 127 -34 9 30 -63 -152 -28 -41 -33 -106 -138 -1 -51 -109 -8 30 97 -33 -35 46 -37 83 -45
3942d5J05lj39L9J13j14J37K3k29K01jj90L16j62j03J50p3j7n8q8J00q8P3p0M2
$$ -45 60 57 -82 -43 70 -44 93 116 -113 88 87 -103 213 51 -52 98 25 8 -50 -138 -38 -126 -53 -123 -81
3967h1P2P4KM7o8N9m6j56J16j72K4k4R4k4P7l0qj7R0L5m0R4j42j7J38j49P8j19
$$ -81 -9 65 67 114 46 105 59 -97 19 -153 -129 -153 -59 -83 -6 -36 -44 -61 29 64 24 118 -24 -41 97 -52 26 -93
3995i3K2O3l1L9L0L5j09R4p8M6k8J18j44J35l7M2jj14J27j95oK9o6J43J5j31J61
$$ -93 -71 -8 -39 0 30 65 -44 50 -28 18 -10 108 -36 99 62 104 103 -11 116 -79 -85 -56 -122 21 36 -95 66
4022F6j67Q1qQ9o9kj47J48kp7k4R2J2j12J69j2L0l3L6oo8Q6m2k1J3o1L2J33j98
$$ 66 -101 -20 -28 61 -8 -10 -157 -9 -11 -88 -112 -20 -8 -120 49 37 67 34 70 64 -4 82 40 19 32 -29 3 136 -62
4051f2L7Q0n2l1OJ43j96J98j46J68j52P0j72L4R6m6M3j20M9m1K4R7km7kq6L1J
$$ -62 -25 55 3 -28 -22 121 -75 123 -23 145 -7 63 -109 -75 21 -25 18 -102 -53 -94 -70 27 25 -22 -24 -110 -79 -78
4079g8KJ26o2Pm0o6L0O5K0l5Q0j2K7OK4L8j74P2j63M8M6L6L5Jl0L4j35R0N0R2
$$ -78 -76 50 -12 -5 -45 -111 -81 -16 4 -31 49 37 64 70 94 132 -42 30 -133 -85 -39 -3 32 33 3 37 -98 -8 42 134
4109A34k33J75L3kM7j90j12Q1K9L7p4j73K48k7j21K44j00r9J17o8M4R5k79K69
$$ 134 -99 76 109 107 154 -36 -148 -67 -38 -1 -75 -248 0 -27 -148 96 -4 -103 14 -54 -10 85 -194 75
4133G5kk07L9R8%lO8o0N2j82K08j18kJ84j81J12n6J02k13R0l0o9J17m0M3Q2m2
$$ 75 73 -134 -95 3 3 0 68 8 60 -122 86 -32 -34 150 -31 81 25 127 -86 4 -26 -95 22 -18 25 107 65
4160F5M1q2l5J03j9kr6l2L1mNk5j7l9J31N9kJ3j21o1J24L0j11J45r7k7J4n2l3
$$ 65 106 24 -11 92 73 71 -25 -57 -26 -30 -25 -50 -67 -106 25 84 82 95 -26 -87 37 67 -44 101 4 -23 -9 -61 -94
4189i4J58o4p4J16L3p8J52n6K2j11p3J14P5j18J03r8j63K18k7M5j4q0k2Kpk1M7
$$ -94 64 0 -74 42 75 -3 149 93 115 4 -69 45 120 2 105 7 -156 62 35 80 66 -14 -36 -34 -41 -62 -15
4216a5Q1j74P0J04j22nj1k0J0o5R8J2P1M4j0p9o2KQ0P4k0Mj03l8J47j68M0P0o0
$$ -15 66 -108 -38 66 -56 -61 -72 -92 -82 -147 -49 -37 34 78 68 -11 -73 -71 9 83 63 67 -36 -74 73 -95 -55 15 -45
4245d5j09K32j00R9o6Q5j65J48o9J3Q9k18J13mp5L9R4j29J19m7q8P6j45P0O9J38
$$ -45 -154 78 -22 77 11 96 -69 79 10 23 112 -106 7 3 -72 -33 61 -68 51 4 -84 -8 -153 -83 -14 124
4271A24j25j5k4K5M7j25Q2n2P5n3j17K27J40r7r6J08r2J0P4K1j17p6J8k5J13m4
$$ 124 -1 -16 -40 -15 32 -93 -11 -63 12 -41 -158 69 209 112 16 124 32 42 116 137 20 -56 -38 -63 50 6
4297Fl6J78j47l9J9M9j0M0o7N8N7p0q1j02K12j27J13r8L9O3L0k04J18M3j1r1M
$$ 6 -30 148 1 -38 -19 30 20 60 -7 51 108 38 -43 -145 67 -60 53 -45 -6 57 87 -117 1 44 33 -58 -54
4324e4J47k26O2L4Q3o3l4J32m2N4l6N4N2j64l0LP9K6m9j41M0J75j01l6J1m0M2
$$ -54 93 -133 -71 -37 46 -17 -51 81 39 93 57 111 163 -1 -31 -28 51 77 28 -113 -73 102 1 -35 -24 -64 -22
4351b2K1P9mK6R9j54n4O0j09J15j39L4n5L9J8J5n6L7m4J44J72k89J20L1J3r5O2
$$ -22 -1 78 74 100 199 45 -9 51 -58 57 -82 -48 -103 -64 -46 -31 -87 -50 -94 50 222 -67 53 84 97 2 64
4378F4k55J59R8j11pl4O9J56j91J01j38L06j44j23l1J29Jr4P3j07L5K7N9j19P4
$$ 64 -191 -32 66 -45 -52 -86 -17 139 -52 49 -89 217 73 -50 -81 48 49 -45 28 -79 -44 -17 42 -77 -3
4403ck9j7NK2j9J14L2o7r0L2R2j01j0J95r7j37J88r6L8J4l6k9o8J88j01n5K4j
$$ -3 -32 -49 -44 -22 -41 73 105 38 -52 -20 72 -29 -39 156 59 -78 110 14 52 66 30 1 -67 121 20 -35 -11 -12
4431a2k2j0L0Oq4k3J44j71J10J20j19O0P0j21Lj15K10j04Q8jk5l6k3N3J01j11
$$ -12 -34 -44 -14 -8 -92 -115 29 -142 -32 88 -31 29 99 -22 -19 -134 76 -28 60 59 34 -2 -25 28 129 18
4457A8M1qp4Q5j47nJ1l4J39o7k2R6or0K5L7Q1j0k1Q3m1j18j9J46j29N5m9J30r7
$$ 18 59 51 -23 62 -85 -90 -79 -113 26 -41 -63 33 27 -63 -38 -1 80 70 49 132 91 -27 -46 100 -29 26 -23 107 10
4486A0p4J13k6l5j9J08j17J73j68N4O7K3n3n9k2O2j47J2P7jpJ07j28O7j82J87
$$ 10 -64 49 23 -12 -31 77 -40 133 -35 19 86 109 56 -3 -25 37 -110 -98 -21 -22 -29 78 -50 17 -165 22
4512B2n5J51j03j16J44k0k3j29J40r1kM0P5L6K9J7o9j21K34q1M2j68Q4N0j1p0
$$ 22 -33 118 15 -101 43 23 0 -129 11 -80 -82 -42 33 69 98 115 46 -75 159 78 120 -48 36 86 75 5
4538El3j7J35l4q2L4J37n5K6l2l0j43J58l3p1K9q7L2o5J67j28J01L4n8J11L4j20
$$ 5 -28 -45 90 56 -26 8 145 90 116 84 54 -89 69 36 -35 -6 -93 -61 -126 41 -87 14 48 -10 101 135 15
4565A5L4J7n4M1k6n1K16l00J27L3pRn7N6L9p6M1N8p7M6o1j99L77j75rK3k23J15
$$ 15 49 66 12 53 27 -24 192 -108 19 52 45 54 -3 53 92 16 57 115 38 84 23 -176 201 26 17 40 -183 -68
4593f8n0K9P6m0J54k19J62k0o7R1j60KJ07k0J13o6q2O7J21j24k1Q9n0k6K4R3k20
$$ -68 -118 -89 -13 -53 101 -118 44 24 -43 48 -112 -110 -3 -23 90 24 -58 9 130 6 -15 74 24 -2 22 115 -105
4620a05R9J32n3K0r6p3Q7J6o5l3N1R6n0j6M5j29P1o5J16j39N4L8j49J02Q9j33
$$ -105 -6 126 73 93 -3 -76 11 27 -38 -71 -20 76 26 10 55 -74 -3 -68 48 -91 -37 1 -148 -46 43 -90
4646i0J27j21lK80k06o0J47m3j15J41m0j8k6l4l0k4R2J31j68P1r4P1M7MQ7r0m5
$$ -90 37 -84 -87 193 -13 -73 74 31 -84 57 17 -1 -27 -61 -91 -115 -23 108 -60 11 -83 -12 35 39 126 36 -9
4673iK18j52j02J15j41%o7N4qR7n2L1l9M3J27k33J28l0m1K2O6R1n9n9j69J15q3
$$ -9 209 57 -45 70 -71 -71 -138 -84 -92 5 -47 -16 -55 -12 115 -118 10 -20 -61 -39 27 118 59 0 -169 -54 -137
4700a37M4N6J28m4j01Q9J11j42pm9P7m1K1K5j37LM9O7J17o0j33N1O6K6k3o2K9
$$ -137 -93 -37 91 47 -54 35 146 4 -3 -52 25 -16 5 30 -107 -104 -55 12 129 69 -64 -13 53 79 56 -6 23
4727B3K9j2L7o4rM2r8J5R7j27R1Ro5jm9J45R7k73L8K4q1M0L2K6L6l7n0J12L6k0
$$ 23 52 40 77 13 4 46 -52 -37 60 -67 24 33 -32 -33 -82 63 160 -113 -75 -51 -132 -92 -60 -34 2 -35 -85 27 63 43
4757D3O6L0p7J74j43p7n7J39l6m3J3p9K3Q1k1Q0n0m5L3K9j57J22o6l4P6L6n3k02
$$ 43 109 139 62 236 93 16 -41 98 62 19 32 -47 -24 57 36 116 66 21 54 83 -74 48 -18 -52 24 60 7 -195
4785a95K23q1k6M6m3J45j2J5j27J18j01J32j2j09Q3k23J28%%k9K06l2j01R3q3
$$ -195 28 -53 -79 -33 -76 69 57 72 -55 63 -38 94 82 -27 56 -167 -39 -39 -39 -68 138 106 5 98 15
4810A5J35j28j02J67l5J04j17m1kJ27q7j60J09L6kqN3n1j27O8R3k3nq2P1M4p1
$$ 15 150 22 -80 87 52 156 39 -2 -4 123 36 -124 -15 21 19 11 64 13 -114 -46 47 24 19 -63 8 52 -19
4837a9j3M8j3J4l5n3N6ro4J55l3m1N6n9j37J50j02R3K4P2j14l8R4l3j19K06o4
$$ -19 -32 16 3 17 -18 -71 -15 -24 -88 67 34 -7 49 -10 -147 3 -99 -6 18 90 -24 -62 32 -1 -120 86 22
4864B2j5J11q3J5m1Ol2K3n6M7J87j67l0j3rn7J48o0L5q4J55o5o6l5P2o5K9L8r0
$$ 22 7 118 35 50 9 15 -17 6 -50 -3 184 17 -13 -26 -35 -92 56 -4 31 -53 102 37 -29 -64 8 -57 -28 10 -80
4893h0J13J6j73J91Oj55O4P3k9o6O9N5j86K7J40m4j55K28O5j55N7m8O9j15L6O5
$$ -80 33 49 -124 67 73 -82 -18 55 26 -40 29 84 -102 -75 65 21 -134 94 159 4 61 13 82 -33 3 68
4919F8p4J32j56oO7Lj66k4J69O4n4J8k5o4L9p8M2o4O5J10j36Q3l5L3n8J28j10
$$ 68 -6 126 -30 -36 31 34 -132 -156 13 77 23 41 16 -48 -9 -87 -45 -109 -44 66 -70 13 -22 11 -47 81 -29
4946b9L7j18K80k01J09k08J41j61J61m5J54j45K4J1P6q0N1m1m1N9n5R7n4j1l5
$$ -29 8 -110 170 -31 78 -130 11 -150 11 -34 120 -25 -1 10 86 6 57 16 -25 34 -21 76 22 11 -24
4971b4J4R6j33JM1m0K2l0K0j8N2p1J67m8o2J17j94J5J9L7k2J9j0m5Q2M9r4L2p9
$$ -24 -10 86 -47 -46 -5 -45 -23 -53 -33 -51 1 -70 97 49 -13 104 -90 -75 -56 -19 -41 -22 -32 -77 5 54 -40 -8 -87
5000h7J05L9O3o1L9j25o4J21n0jM9q4J05J36k98J63J9q6L9J4k9m7M9L6Ql2j24
$$ -87 18 57 120 59 98 -27 -91 30 -20 -21 28 -56 49 185 -113 50 69 -17 22 36 7 -40 9 45 53 21 -103
5027a03J69j03Q0j08O9J9q5J00j0q9n6J37k8q8P6P6rpK9o9k1k1M8Q1j6n6L3Q2
$$ -103 66 -37 43 -65 4 23 -62 38 28 -61 -117 20 -8 -96 -20 56 47 40 69 0 -21 -42 6 87 71 15 48 130
5055A30j07j8M1j07K11m0p0K3j74K11r5k6q5J33pK6n0M2j81J81j6j88J54J4p3
$$ 130 23 5 46 -61 150 110 40 63 -111 100 5 -21 -106 27 20 46 -4 38 -143 38 22 -166 -12 2 -71
5080g1P4Lp6Q9pPp0P4j4o6N9n2P6J01j37M8k7K3j51J58p8K6J25o6k9k0L5Lj00
$$ -71 3 6 -70 19 12 19 -51 23 9 -57 2 -50 26 127 -10 38 11 34 -117 41 -37 -11 114 48 19 -1 34 37 -63
5109f3J31Qk4%O5j71J45o3Q7O5k59Q5P5j53K8j8n2Q8N3K4j17J01J0%n9rK6r7N3
$$ -63 68 76 52 52 117 -54 91 28 115 180 -79 6 81 -72 -44 -62 -114 -26 27 51 -66 35 45 45 -14 -23 3 -94 -41
5138d1qJ44n8m9K2L4l3R0q8OK3K6M5r3%J1J5M2k4Kr0j14J53p0J04NOj08J51j00
$$ -41 -49 95 37 -12 10 44 11 101 13 19 42 68 113 20 20 31 46 88 64 66 -24 -138 15 -55 49 54 60 -48 103 3
5168Co0O0L6J8k29J56l4n6qN6P5l6L0j02J4J05j18N3P2Q4j49O0j31J10rr2J33
$$ 3 -57 3 39 57 -172 -16 -50 -106 -114 -58 17 -19 11 -91 -77 28 -90 -37 35 119 -30 30 -101 9 0 -92 41
5195D1l9Q1n1j41Q4Oj2k7N2L8O5j63J19k5pk8J39o1q9K09j75O8j15N1r8O7O1L6
$$ 41 2 83 32 -109 -25 -19 -31 -58 -6 32 97 -66 53 28 21 -7 132 71 -18 191 16 84 -31 20 -78 -11 50 86
5223H6o4Rl9O4m9l3JQ3j53kL8J53j09L3R0k41N1J88j69J00j4l8L0MJ47k04k2j2
$$ 86 22 31 -8 56 7 -26 -25 58 -95 -97 -59 94 -15 18 108 -133 -82 106 -63 37 23 -15 15 19 166 -38 -60 -72
5251g2P7J06n3j42O7L4o1qM7M8r1O1n3K4RO5j02k3O0K8K2l0J7j13J75j2j0M1o5
$$ -72 5 111 58 -84 -17 17 -44 -52 -5 43 -48 13 -40 -16 -7 58 -44 -67 -7 21 43 13 30 -83 92 80 70 111 46
5280D6k9J27q9j0j44N7mj6Q0k6R3o1N6j39J39q0N4pj7Qpr3Q6o9l0mJ29p0J6P1
$$ 46 17 144 55 45 -99 -42 -46 -62 18 -8 85 24 80 -59 80 0 54 47 30 38 31 -62 24 -45 -75 -79 50 -20 -4 67
5310F7oMj33J61k3j49L1n6J00O9j61J1m6K8l5J52j12R0L4j81J43l2Q7j2mk3p0
$$ 67 61 65 -68 93 70 -79 -48 -104 -4 65 -96 -85 -131 -103 -138 14 -98 -8 26 -155 -12 -44 43 31 27 4 -66
5337f6R5N0j11nM5k5J0J30j14J00l1o5o6Q8j35R0%r6J49j22J48M0j55O3L7k3L6
$$ -66 29 79 -32 -37 8 -17 -7 123 9 109 78 13 -53 35 -100 -10 -10 -106 43 -79 69 109 -46 17 54 31 67
5364F7rlNm5k29K76k8j05J57k21N1J64j36J1N0J5pj4Q4K1n3q9J36P7j93j8k3O6
$$ 67 58 55 60 15 -214 62 34 -71 86 -135 -84 80 -56 -45 5 20 13 -1 83 104 51 -38 98 175 -18 -36 -59 7
5392GK08k31Lo4K1J17M0o2J9Mj21rK1J09j05m8R8%n7R5J5m7n3NK6pO5Qo4O2n0
$$ 7 215 -16 -13 -77 -56 61 101 39 58 62 -59 -68 -47 62 -43 -91 7 7 -50 45 60 13 -40 -35 -9 -16 49 57 -7 55 5
5423Ej03q0J64Nk4Q3r1O0k0j99K26M0Omm9r7J11J26q8J4LMk0j05j03R7L8N8J9
$$ 5 -98 -178 -14 -9 -33 50 -41 19 -1 -200 26 66 72 68 19 -78 33 159 71 85 88 92 72 -33 -136 -39 -1 57 76
5452G6j16J70j40J72n0j44M6j9r2J24Rj28M4P6j46M0J08J37j69r8R0OK9l8J26
$$ 76 -40 130 -10 162 112 -32 14 -5 -97 27 36 -92 -48 28 -118 -78 30 167 -2 -100 -10 -4 25 -13 113
5477A13k33R6Pk0P2M9k2j46K8K1j8J12l4q2OQ6MLJ9j06P1j02J35j07j3P4M5r2
$$ 113 -120 -24 -17 -37 35 84 62 -84 -56 -35 -53 59 25 -57 -51 35 39 42 61 -45 26 -76 59 -48 -61 13 58 -34
5505c4Q1o1j46K17r6opj4P7q2OP6q5O5j70K01L6j30J64p9J2k2j5rJ07q9Q1j64
$$ -34 47 -14 -160 57 -39 -45 -52 -66 11 -71 -65 11 -74 -9 -179 22 58 -72 92 13 25 3 -12 -21 86 -3 78 -86
5533h6J65n1r6O2J8q9J22J4j46J39j7Q6J7j13j29M0m1Q1K1p3JL5l0J03p1J52j84
$$ -86 79 28 -68 -6 12 -77 45 59 -87 52 35 121 138 25 -104 -64 -105 -24 -3 -76 -75 -40 -70 33 -38 114 -70
5560g0R1j56J04l9Q6k6o6J47j06N8q8J05j29K8N5M6p3J86m6q9m9N4J07j38J1R
$$ -70 21 -135 -31 -70 16 -10 -76 71 -35 23 -65 40 -89 -61 -6 40 -33 153 107 18 -31 23 130 -8 3 12
5586A2n9q5J63Rj97J36J1r9J65j7N0n8Pm0Kl9K3Rl9K3p2N2J1Pk0q7J67n2R1nr0
$$ 12 -47 -132 31 40 -157 -21 -10 -109 56 39 89 31 38 -2 0 -39 -16 -7 -46 -23 -95 -43 -32 -25 -45 -132 35 -17 74 69 -21
5617b1L1n4K0J21q9J0j38J42N6P5j56L5r7J16L1n0K4k5N7o2l0j29M3J16l4kn3
$$ -21 10 -44 -24 97 8 18 -120 22 78 153 -3 32 -65 51 82 32 56 31 88 26 -4 -133 -90 26 -8 -10 -63
5644f3J28j07J05Lj19N6P7j31J26r1K4r4OjM9l0k5J6N9r9J23O3P3j06j15N7j1
$$ -63 65 -42 63 66 -53 3 80 -51 75 -16 8 -86 -80 -81 -32 -62 -87 -71 -12 -111 12 75 148 42 -73 -16 -27
5671b7l4J88l2r5K8NP0M6j69M9R0r5m2P6q0MN2j03k3R5j14K0oJ25j07P4j09l7
$$ -27 -61 127 95 0 28 33 103 149 -20 29 119 24 -18 58 -22 -18 34 -69 -92 3 -111 -91 -97 28 -79 -5 -114 -151
5699a51K36o8lq3K01j58l5Mk6M0J06M5l07K35m1q1O6j0J49l4j30PJ60l8j77J21
$$ -151 85 17 14 -69 132 -26 -61 -57 -83 -43 63 108 -199 36 -5 -86 -20 -30 119 85 -45 -38 122 84 -93 28
5725B8r4K23j87k3M8m7L4M4N2j0m1o3O2l9J81k04No5J35p3L1nn5K3K1J12j07J4
$$ 28 -66 157 -30 -53 -5 -52 -18 26 78 68 27 -36 26 -13 168 -36 -31 -96 39 -34 -3 -8 -63 -40 -19 93 -14 0
5753@L6o9r3J81Lq0J05k38K2P2J21L3r6J00n1k4j27J52ol2O3j74Q8o0J42N1j48
$$ 0 36 -33 -126 55 58 -22 83 -155 -133 -61 60 93 -3 97 46 22 -105 47 41 9 72 -102 -14 -74 68 119 -29
5780b9Q5JN8o5k6J1M2p1J50j75l2P8j5L7o1q2J04j79J78lL6oq4K3O6p0M2K13k07
$$ -29 56 57 115 50 24 35 77 6 156 -19 -51 27 12 49 -12 -94 10 -169 9 6 42 36 -48 -25 41 -29 13 226 19
5809A9M6j73L6L6J4q4N8O2j31J53J1O3n6n2M2k7o6J08NK6O5j29o3kN1qm5J16M8
$$ 19 65 -108 -72 -36 -22 -106 -48 14 -117 36 47 110 54 2 44 17 -49 59 64 90 155 26 -37 -39 12 4 -41 75 123
5838A23r8N5j03R4J4p6k2J05p1j8Rj13O7Kj6P3o1J26j66J58j33Q6L0k36R9L7O6
$$ 123 25 80 -23 71 85 9 -13 92 21 3 12 -101 -34 -32 -48 25 -36 90 -76 82 -51 35 65 -171 -72 -35 31
5865C1p6J8j2k2R6q8%L7P9M3j12K5m5P2j6M9j9jj14J37r0K0k6p7N3on6L2J4L7
$$ 31 -45 -27 -39 -61 35 -53 -53 -16 63 106 -6 19 -26 46 30 79 60 59 -55 82 -8 12 -14 -91 -38 -44 -100 -68 -54 -17
5895a7M5m3J2Oo1M7m1n2J45o5j37P2M1k9Q8q1O2Q4m9k4N4k6j41J48Kj5nj04r2
$$ -17 28 -15 -3 3 -58 -11 -52 -104 41 -24 -161 -89 -48 -77 11 -70 -8 76 27 3 57 31 -110 38 40 25 20 -84 -176
5924a76K12j07JK2K3K1j20J42n9L5m2LJ0M6j9l6P0r6J13j75J89n8O8j14R9j12
$$ -176 36 -71 -70 -48 -25 -4 -124 18 -41 -6 -48 -45 -35 11 -8 -44 26 -70 43 -132 57 -1 67 -47 52 -60
5950f0jL6J00j32l0M4K1N5j10P1L5l7J04p4m7K8j8K0J4j4J60j83Klm7L9K0kN8
$$ -60 -61 -25 75 -57 -87 -43 -22 33 -77 -6 29 -8 96 22 -25 3 -15 5 19 5 165 -18 -16 -19 -66 -27 -7 -9 49
5979D9j31M1J9n7R7j25J35n6K0k3J13n4n9rK8Ol5q4J31rl4J65j0j40l8L6j9m6
$$ 49 -82 -41 -22 -79 18 -107 28 -28 -8 -31 82 28 -31 -40 -12 -6 -41 -125 6 -3 -37 128 118 -22 -60 -24 -43 -89
6007h9J23km8m9J0o4M2J08P6j60lQ6pQ4j33j62K44l3L6p8N1J3j87R2P5M4k01J00
$$ -89 34 32 -16 -65 -55 -119 -77 31 107 -53 -56 30 23 107 -26 -188 56 23 59 -19 32 45 -142 -50 25 69 -132 -32
6035c2N5L8j01Q6Rq4Q1l9n1r8J27M9r8k1O2o9N4M7p7J56j43N0rqJ69j4n4n9o1
$$ -32 23 61 -40 46 55 -29 52 13 -38 -136 -9 40 -58 -79 -17 -86 -32 15 -62 94 -49 1 -8 -16 153 139 85 26 -35
6064c5K2J00j70J00K2m5l7P9k3j8l3N0K4k9J4n2p1J9N9m2J18q4J03k3j09Q2n2
$$ -35 -13 87 -83 17 39 -6 -43 36 13 -5 -38 12 36 7 21 -31 -102 -83 -24 -66 52 -32 71 48 -61 21 -31
6091c1K5l7P3N2p8j25J15O2P8o6r6M9p0J49j30J58j40L8N8n3r2J62j69Q5L9n2
$$ -31 -6 -43 30 82 4 -121 -6 56 134 68 -28 21 -49 100 -30 128 -12 26 84 31 -61 101 -68 17 56 4
6117DMm5n7J41j8l0J22p9o6j9P0k9m5O6q8M3n3N3O3n6O9k27Q7P0j08J33j9m1O7
$$ 4 8 -37 -94 47 29 -1 121 42 -24 -43 27 -2 -47 19 -69 -26 -79 -26 37 -19 50 -177 -90 -20 -128 5 -14 -55 12
6146A2j0N2r7J45o8p3j8P8j08J04o6O4P1j82K09m9n3J7j1k0n3Q4n8Q9m6r8M2M2
$$ 12 2 54 -43 102 34 -39 -57 21 -87 17 -49 15 86 -96 113 64 11 28 17 -3 -56 28 -30 59 13 -85 -43 -1
6174aK4r0J09o0o0Q0r7N6J20j64J6Q8p6Q6l9J3okL3j7M8l0n8q6J12j8m3o7J12
$$ -1 23 -67 42 -18 -78 2 -95 -39 81 -83 -67 21 -55 31 -8 5 -1 -3 30 13 61 31 -27 -113 -1 -19 -62 -129 -17
6203a7j8M9oJ2l4O5j20J69j18J70k52Q2Q3j06J08p6R5n5k8rK3j34Q7m1J06p1M2
$$ -17 -35 14 8 20 -14 51 -69 100 -18 152 -100 -18 65 -41 67 -9 86 31 3 -6 17 -117 -30 -71 35 -36 6
6230Fm5J28j11O4m7Rl6J4m9P6n1l5M7PPp3J42M0p3J7k4J3m5N5Q7k22J39r6n8L21
$$ 6 -39 89 -22 42 -5 4 -32 -18 -67 9 -42 -77 -30 -23 -16 -89 53 93 20 37 13 26 -19 36 123 -99 40 -56 -114 207
6260B07k12M9r1O3KN1n7mL5m4r5N8K7j5j40R5J95l13J83j09K33j64j90K96m7j64
$$ 207 -5 44 -47 16 18 69 12 8 43 -1 -96 -38 -11 -26 -166 -71 124 -189 -6 -115 118 -46 -236 60 13 -151
6286a51J20m2l8J06K3o6k5J19n8M5j40J25n6j2R8L7L7KL6j12Q4r5j2J10o2k3m9
$$ -151 -31 -73 -111 -5 18 -48 -73 46 -12 33 -107 18 -38 -50 48 85 122 124 160 48 132 37 25 135 73 50 1
6313An3k5Q2m4Q1q9J06q8Q1L1j26P1k8p2jO5j7j07R5M3Q5j42R5K7r7J4J8k9j38
$$ 1 -52 -77 5 -39 42 -47 59 -29 52 83 -43 28 0 -72 -73 -8 -25 -132 -37 6 91 -51 44 71 -26 -12 6 -23 -161
6342a61J49r5J27Q8j16N0m8r3KJ70k37J86N6Po0J8o3J03k0m8j3r6J44j14M4P1
$$ -161 -12 -107 20 108 -8 42 -6 -99 -97 73 -164 22 78 85 25 43 -20 83 63 15 2 -94 50 -64 -20 51
6368E1K3k2k15P8O4lQJ7k8M2j36P2M4k2M8m9n5Q4J9j8Qn0K37k36Q2j24J33o4j1
$$ 51 74 52 -163 -85 -21 -24 -16 1 -27 15 -121 -49 -5 -27 21 -28 -83 1 20 2 10 -40 197 -39 43 -81 52 -12 -23
6397b3j1l8O5j22M6J14j7r5J72p5J39j08K7j9m6L6j14J38q2m6J7q9l0J23Mo0n0
$$ -23 -34 -72 -7 -129 -83 31 14 -81 91 16 155 47 74 55 9 45 -69 69 -13 -59 -42 -131 -161 -38 -34 -94 -144
6424a44J55j1n5P8N4N5n9k7l5N9j67J00M2p7M9Q6j67O3Ql7J40j90K5J1jJ02N3
$$ -144 11 0 -55 23 77 132 73 46 11 70 -97 3 45 -32 17 103 -64 -1 7 -30 110 -80 -55 -44 -45 57 110
6451A10j07jO5j25N2M6Qo9J21q3p1J02k9O5o5j51J77k9l9k3m9J22k0Nn0qq9J59
$$ 110 3 2 67 -58 -6 40 48 -21 100 17 -54 48 19 84 19 -132 45 16 -23 -46 -95 27 7 12 -38 -46 -135 24
6479B4m8n5O8pm8J38j47M1O9P9j16O1j35m7J99j09P9j08L9Om2j9J46k3k7M0r9
$$ 24 -24 -79 -11 -18 -66 72 -75 -34 35 114 -2 59 -76 -123 76 -33 46 -62 -23 -17 -59 -78 68 45 18 58 -41
6506d1L5QQ1p6R2j89l6R0M5on5R7KP4j92q5K12K1j37j04J47l0n6L3P5N7r8K7K5
$$ -41 -6 2 83 7 99 -90 -126 -36 9 3 -52 45 47 121 -71 -156 56 77 -60 -164 -17 -47 -103 -70 5 62 -36 -9 16
6535A6O8p5J4n5Q1j8o3Q4j4K2k5p6k6K4mR5LJ2j34M9k6J09oRj3n6Lq7J37k1p5
$$ 16 84 9 23 -32 49 31 -32 52 38 60 35 -41 -67 -43 -47 48 51 63 -71 -22 -48 61 55 64 51 -5 -2 -89 48 27 -48
6566d8nK3K8j4J10q0L2n7o4J98j93P3p7Q1mp6M7l3m0Q1K4L5k5j1Q2m0n8o5M0K6
$$ -48 -53 -30 -2 -16 94 14 46 -11 -75 123 -70 3 -74 7 3 -73 -26 -59 -99 -18 6 41 16 5 87 47 -11 -76 -36 -10
6596a0l3Q9m3r5k5J21K8j47J86j06J11j8j29O1L5m7K2j52N0J19j57O7L1j9K5Q6
$$ -10 -43 46 3 -92 -117 4 32 -115 71 -35 76 58 -71 -10 25 -22 0 -152 -102 17 -140 -73 -42 -61 -36 50
6622E0o6J5j22R2P3p7r2K65k67K49j57J14j65K06r7k5P8%po6nJ45j14j18nJ11
$$ 50 -16 -1 -123 -31 42 -35 -127 138 -129 120 -37 77 -88 118 21 -4 74 74 67 1 -4 141 27 -91 -96 15
6648A5Jn3M0pJ9p3Q7Q9q2r1J28j95J04p3l0J65mj11pr1J76m5j01J05j24P8J13
$$ 15 16 -37 3 -4 15 -58 29 118 36 -55 73 -122 -18 -91 -121 44 40 -71 -78 -169 7 -38 -139 -34 -158 -80 33
6675C3j16J07L4l7lo1j0R9m4m5N3o3J15k43J67M9Jm0N9p9N1K0k0j69J79n2K5j
$$ 33 -83 24 58 21 18 -43 -53 46 2 -43 10 -53 62 -181 -14 35 36 -4 55 -24 27 47 27 -142 37 -15 10 9
6703IL3m4nl9J0M3j2J12j62Q2k0o4K6QL7j38Q0R9j26P4K8r3R8r2O4Q1n4K2k4p1
$$ 9 42 -2 -7 -46 -36 7 -5 107 -55 27 7 -57 -31 -23 14 -124 -44 55 -71 3 31 -62 36 -56 8 89 35 57 33 -38
6733c8J26j65K99k15N1k0j75J85N6j76O2J01n7Oq0M9j35j1J07M1l8R6k6j17N4
$$ -38 88 -77 222 7 58 38 -137 48 104 -72 -10 91 34 40 -40 9 -126 -137 -30 11 -27 69 43 -74 -20
6758b0q4Rm3J06l4m8Q7J7M0l7Q8Q6j54o6k2J03j10R8n4J37q2jJ05J3j71P1m4J14
$$ -20 -104 -95 -138 -32 -66 -114 -27 -10 30 -7 81 167 13 -53 -75 28 -82 16 -38 99 17 16 121 134 -37 34 -10 104
6786A04M9j29Qj7J32j65M2j05L8Nl0J36JQ7j45n6L9J08K7j89M5m6NK7k6J04p2
$$ 104 153 24 32 15 147 -18 24 -81 -43 -38 -68 68 69 156 11 -45 -6 102 129 -60 -15 -61 -56 -29 -55 49 -23
6813b3M6m3M7N7j61R4n7o6P1L0O0Jjj11j3j09J45L5j9J6K8jK7j3M9L1k22J16j1
$$ -23 23 -20 27 84 -77 17 -40 -106 -35 -5 55 56 55 -56 -69 -178 -33 2 -17 -1 27 26 53 40 89 120 -102 14 3
6842Cl7k9K4J28p0l1r4R2O6k6k0nm3j0k6M4n0N8O4q5J9j07K7P9J70j94N6M3Q3
$$ 3 -34 -63 -39 89 19 -12 -106 -14 52 26 6 1 -42 -52 -78 -34 -84 -26 38 -47 -28 -135 -108 -29 141 -53 3 46 129
6871A29p7k5M7rJ6j01J6n7Q4Lj21j9J08J6rRO5j30O3r3M0N6P9j43L1l1J7Nj0o3
$$ 129 52 27 74 65 81 -20 -4 -61 23 26 -95 -114 -6 10 1 10 75 -55 8 -85 -45 11 90 -53 -22 -53 -36 -31 -41 -104
6901a04K7J15n1NJ5J60j36J27k88J48K2l0r0R5J9k1m4P1k2R8n1J3l5L3j11J32
$$ -104 -77 38 -13 -8 7 167 31 158 -130 18 40 10 -80 15 34 13 -31 40 18 116 65 78 43 76 -35 97
6927I7Kn2Mq3j2K9r6J52q8P2qM7J9K9q8P0j12J83k90J18P3j52j4M7Qj33L41k35
$$ 97 99 47 51 -32 -44 -15 -111 41 -47 25 17 64 83 112 24 94 -18 165 -125 -7 66 -86 -100 -53 -45 -178 163 -72
6955g2J08Kp2L3n1J19o6K2O8m1p3r3j7O9K1n3L2O4KO4rJ4l1Jlj35J27J18j92j2
$$ -72 36 38 -34 -1 -52 67 1 23 91 50 -23 -116 -133 -64 -43 -96 -64 0 2 66 57 71 40 41 38 -97 30 148 -44 -56
6985e6K9L7o8J25p0m7KJ09M7j74M3Q8M6q7J8j09o3K1JrJ16J3k0k2R2M0p6J9J0
$$ -56 -27 10 -58 67 -3 -50 -48 61 108 -66 -23 65 111 24 42 -67 -130 -109 -108 -117 -1 12 -8 -30 62 102 26 45 55
7014E5o1M2j16M9K12q7j42L5J6J19k25J11j4M1k5m8J54j29R8M5j36N1o1j11J89
$$ 55 -6 36 -80 -31 181 94 -48 -13 3 122 -103 8 -6 35 10 -38 116 -13 85 130 -6 45 -16 -127 62
7039F2n4Rk6jnO7p8l3J74q1l6P4q4O0p6r7O8J74j94Q6Ro2J57q4j5M7L1j00N9p0
$$ 62 8 17 -9 -10 -15 52 -26 -59 115 34 -2 72 -12 48 -28 -125 -57 117 -77 9 18 -44 113 29 14 61 92 -8 51 -19
7069a9O1p6K4M3M9q8j7O2k7p2J49J7m2M5j05J47j30n5l7R2K1p1p8O7J4K1N8l6
$$ -19 42 -34 -10 33 82 -6 -23 39 12 -60 89 106 64 109 4 151 21 -34 -71 21 42 -29 -107 -40 -26 -5 53 17
7097A7m6J04k1q4pk9J67m5N3j34J77k42O0l5J06m6K1k2N1j21M2M0n3O1m1J57o8
$$ 17 -29 75 54 -30 -37 -66 101 56 109 -25 152 -90 -30 -65 41 -5 16 -6 45 -76 -34 6 -47 14 -27 130 62
7124F2o5l8j15K53j32j6k8J20rm1J15j96J07q2M8j1L7L0J5j44J31J3j61P0o4J01
$$ 62 -3 -41 -156 97 -35 -51 -79 41 32 -9 106 -90 17 -65 -17 -28 9 39 54 -90 41 54 -107 -37 -101 0
7150@q3J92j14JO3o9O7l7k2M1n4L4j02N2J4o9L1PN7J18kq4J58j53P8j77KO6j35
$$ 0 -83 109 -5 -4 59 -10 57 20 -2 39 -15 19 -83 -31 -17 -86 -55 -48 9 127 125 41 199 46 124 -53 -51 15 -120
7179a20P2O6j26O1l8J13M4o3N0r4K2L9Lj91J83o7j26J06O5Nq1PJ2K11j13j10J07
$$ -120 -48 18 -108 -47 -85 28 72 9 59 -35 -13 26 29 -162 21 -46 -172 -66 -1 4 -77 -70 -58 153 40 -70 37
7206C7M9N2j9k02O2J51r2N1j00L2m4O4k6M6j8m4P3j23J13o5l9O6o8P5M4j39P4
$$ 37 86 138 119 -83 -21 130 38 89 -11 21 -23 41 15 61 43 -1 72 -51 62 -3 -42 24 -44 31 75 -64 10
7233A0Kq6J5R9o8l5J01q5mpK0l2K8L5j12J04l3r5K57n9q2J09q4n5J21l0o5j2Q4
$$ 10 12 -74 -59 40 -28 -63 38 -47 -51 -58 -38 -70 -42 -7 -119 -15 -48 -143 114 55 -27 82 -2 -57 64 34 -31 -43 41
7262D1q9N7J42j24p3J6M6o3L0J37m3j46Q7K9q0o0J45j9o8OM8m0p9J08n4Kj5O9
$$ 41 -48 9 151 27 -46 -30 16 -47 -17 120 77 -69 18 47 -33 -93 52 33 -35 -29 19 -21 -100 8 -46 -44 -59 10
7290A0o9K4P4k6j5o5R3R1j56N4q0P9l1p3R4l2K3n1M9K5n1J92j44P3Rq3k5N5Jp9
$$ 10 -59 -35 39 13 -2 -67 26 117 -39 15 -65 14 -17 -90 4 -28 -5 -56 -7 18 -33 159 15 88 97 14 -11 44 45 -34
7320c4M5J29Jj50o8k1M8O5m6J54j08O9j19j2L5l1R7l3Pj26J47j6Nk1k6M2l5J8
$$ -34 11 140 141 -9 -77 -98 -50 15 -31 123 15 84 -35 -47 -12 -43 54 21 28 -98 49 33 38 17 -9 33 -2 16
7348A6J03j47q1j0J25o4K14j27N9m6j2j15J36K6o9P5q4M7m0m7O7j8M8n0QJ07j04
$$ 16 119 -28 -109 -119 6 -58 156 29 88 42 30 -85 51 77 8 83 -1 46 6 -41 26 8 56 6 14 121 17
7375A7j03K05j43n3O7n1M1o9J12k4J1m4L4q0M2J03j94J05J2K5o2R6r0%j3N6O2
$$ 17 -86 119 -24 -77 -10 -61 -20 -89 23 -1 10 -34 0 -80 -38 65 -129 -24 -12 13 -49 47 -43 -43 -56 0 62
7402F2mj2M7r8J6o2NQ3o6l0Q3q9J14l3Pl6J16j04r4L2J9l4n8J82p3N0m6N5j9j42
$$ 62 58 46 93 -5 11 -51 -46 37 -29 -59 24 -65 49 16 23 -13 103 -1 -95 -63 -44 -78 -136 46 -27 23 -23 32 13 -129
7432a29L9J16l3j5J7j05J58p1M4O6r8m1J6j17J00O9o3O5j04J29m6J7PmN8o2o2
$$ -129 -90 26 -7 -22 -5 -110 48 -23 21 87 -11 -52 -36 -153 -53 16 -47 18 -86 43 -3 14 21 17 75 13 -49
7459d9LJ51j58O4J26k51J05oJ30j29r8J02J02p0r9Q2q8P6P4j04L8o8M1J07o1j7
$$ -49 -46 105 -53 11 137 -114 -9 -15 115 -14 -112 -10 92 22 -77 5 -83 -7 67 -37 1 -67 -26 81 20 3
7485Cl9L0k2Q1k6j8k5O7Q3j12j0K4n4rj07J82r1N5jo8P7K7k8P8q6l8N0k3N7kn9
$$ 3 -36 -6 -28 53 27 9 -16 51 134 22 12 36 -18 -27 -134 48 -43 12 11 -57 20 47 19 97 11 -27 23 0 57 55 -4
7516dPJ4Rk9m8N9K3j42KN2oJ00q9J15Lj83O2j2P7o8R2k9R9n1l4j14L1J10J27j63
$$ -4 3 17 26 -3 -51 8 31 -111 -109 -57 -63 37 -52 63 66 -117 -55 -67 10 -58 34 5 104 53 19 -95 -64 46 173 10
7546A0m1pJ11p3k5q2M9J57j6j0o3P1p1K0j08K21k14J53n9o9J23k64M9J18Lo0m5
$$ 10 -31 -38 73 0 -25 -107 -58 99 83 73 10 81 10 30 -78 143 -71 82 23 -46 77 -187 -138 -20 -17 -77 -122
7573a22J53LM8p1M1n8Nj16J41L0j02N0J18n5J0j57N2K8L9l0L3R5j20J5kn2J17
$$ -122 31 34 82 11 52 -6 -1 -117 24 54 -48 2 120 65 75 -82 -30 -2 37 7 40 135 15 30 28 -24 93
7600I3Mk13J84n0l2j7R2o7kp9O0N4j24J30k0n4P5q7P5r2N8P8o7o1J56k16J56j55
$$ 93 97 -116 68 18 -14 -31 61 -6 -8 -87 -27 27 -97 33 13 -41 34 -53 22 -70 -12 66 -1 -62 94 -122 34 -121
7628a21J43m9n9J70j53R1j32J61j01J64j82j3K01m4n0J8n8J6P3n5R6j14m4L6m
$$ -121 22 -27 -86 84 -69 22 -110 51 -50 114 -68 -81 120 76 26 44 -14 2 75 20 116 2 -42 -6 -10
7653a0j4J26m3k12K23j41R9p6J1L6Ql6J20k4k8L6k09K02rj53N3n3O4q3L4n9J09
$$ -10 -24 102 59 -153 70 -71 28 -48 -37 -1 7 -29 91 67 39 75 -134 68 59 -94 -41 -94 -30 -113 -79 -138 -29
7680b9J0K3L8p1L3m3L7r2J18Pm8K4N2m3r9M9P3L0J3m1l9j0j37J44O3o6m8N7l4
$$ -29 -19 4 42 -29 4 -39 -2 -94 24 31 -17 7 59 16 -83 -34 39 69 82 41 2 -8 -145 -1 62 -4 -52 5 -29
7709b9m4p0J68N9j38o6J78j37O6m5n2L8k3O7M2l8k3P0%Pj8Q5j21K7%Qr5J09o6
$$ -29 -73 -143 25 84 -54 -120 58 -79 -13 -58 -110 -72 -95 -28 14 -24 -47 23 23 30 12 97 -24 3 3 11 -84 25 -41
7738d1J14j36M0J3M3m4o7J01J00j39j9m2L3J04q7J8KJ5j13J59j05O8J7M2L5j27
$$ -41 73 -63 -23 -10 33 -11 -78 23 123 -16 -35 -77 -44 60 -27 -9 -7 8 -105 54 -51 17 34 76 111 -16
7764a6P2l5M5m2l7J9mM7q2R3j15N7J2L3p8Q9j8j64J91R8j71R9L0p3j02M6P6n2
$$ -16 56 21 66 24 -13 6 2 49 -33 60 -55 2 14 47 -31 58 40 -124 67 165 -6 93 123 50 -52 -6 70 18
7792A8P9n6q9OP2p7J10r4J51j83J64j18J72j84j4J04J2q3r8J20llq3Q6k1qk0P3
$$ 18 97 41 -48 -42 30 -47 63 -31 120 -63 101 -17 155 -29 -43 61 73 -10 -108 12 9 6 -77 9 -12 -20 -40 33
7820C3j1k6J7L6m8J1j16J30p5K02k22N2j7J31l3o9j1JO1l4R6j25r1N9O8M2l4n3
$$ 33 22 -4 13 49 1 12 -104 26 -49 153 -69 -17 -34 97 64 -5 -16 -15 46 12 108 -17 -108 -49 19 61 27 -26
7848b6KM6Qo5j8m9R1j24K3J05L0k9l3L2Q7j54J00OK1M3Nl9j04J44l35J92P2Kk7
$$ -26 -24 22 30 -35 -53 -102 -11 -135 -112 -7 23 -6 -39 -7 80 -74 26 32 53 96 101 62 -42 102 -233 -41 31 33 6
7877Fpp3J43n7o9K01k09M8J28q3J9J5j47P2K2j8l7N6o4M6O0o6k2k6LJ03j07L4
$$ 6 -1 -74 69 12 -57 144 -65 -17 111 28 47 62 -85 -13 9 -9 -46 10 -54 -8 52 -14 -36 -62 -59 44 -63 -29
7905b9J42q7r6K2J5R6n6o1J1k9%rJ7P6r3J35j38K4JO6k4L5L7N4r9m4j44R8K04
$$ -29 113 26 -70 -48 -33 63 7 -54 -43 -72 -72 -81 -64 12 -81 54 -84 -60 -59 7 -17 18 55 109 10 -34 -178 -80 124
7934A24q5pJ3N4O6k73J17O5j2m0O4r3M5o9j8N5Q8o5m6k2qL0Q5l3n5K5N6r7LQ0
$$ 124 39 32 45 99 165 -108 9 74 62 22 86 -7 38 -31 -49 6 94 29 -17 -39 -47 -17 68 35 -20 5 61 -36 -33 47
7964D7j16R0k07Q7K03k47J30k2j9J10K0q1M7O3j35M3p6K03j14o8K7J8Q0j69R5
$$ 47 -69 21 -186 -99 104 -143 -13 -35 -54 56 76 -5 42 105 -30 13 -63 140 26 -42 -15 3 83 -86 9
7989IJ4L3q3Q6q7O0m9L8j29J61p6j40J10K1k06J56M6j6p5J49RM8j2l8p1J1lm7
$$ 9 23 56 -27 59 -28 32 -17 21 -108 53 -23 -163 -53 -32 -238 -82 -36 -52 -127 22 31 79 67 29 -42 -31 -34 -81
8017h1J17n4K8k9L4k4K8l5n2K31j41j16J11r3K02r0j6Q5j85K42j71N8j6n7R6q1
$$ -81 36 -18 10 -19 15 -9 19 -16 -68 163 22 -94 17 -76 126 36 20 105 -80 162 -9 49 33 -24 72 -9
8043inm7n6J54j14O2L3o2J19m1kj9l4L4j09J7J87j58P3j7p8l4J13r3J12p6O9j33
$$ -9 -14 -61 -117 37 -77 -15 18 -44 75 34 32 13 -21 13 -96 -79 108 -50 23 6 -72 -106 7 -86 26 -50 19 -114
8071a14J61N9q3Pr3J9Q7R0q1K4q8qk4R0m2KP4j40N1L2p3N3n6o6J68RK4k5j08O
$$ -114 47 106 23 30 -63 -44 43 133 52 76 -12 -20 -44 46 4 6 80 -60 -9 23 -50 3 -53 -119 49 58 82 57 -51 -45
8101d5k4m1L2m2O6N4K2K4p1l9o2J78m2K7M4P8j43m9M5J18k6n9m0J50l2j44q7J80
$$ -45 -69 -110 -78 -120 -54 0 22 46 -25 -64 -126 52 10 37 81 159 16 -33 12 130 104 45 5 155 123 -21 -108 72
8129G2j24N5L7J1k6o2Q5k8J8J07j54J15j8PJ6j51J10n8l1J00o3j6O6r6mP4m9m
$$ 72 -52 3 40 51 25 -37 48 20 38 145 -9 106 88 95 111 -40 70 12 -19 81 18 2 68 -28 -32 42 -7 -11
8157a1j17K7Q9k2L6J1N7o9j1o7O7J0k3N7l5J03j15R6n3M6m0j23J48j52J71j4r0
$$ -11 -128 -101 -12 -34 2 13 70 1 -10 -77 -10 0 -23 34 -1 102 -13 83 30 76 36 -87 61 -91 80 66 -24
8184b4L9O2P8o4q5l2M1Oj6K8K0j7p5N2j63Q1M3K5R5j86J55n7K9l6l2J5o6M7J00
$$ -24 15 77 155 91 6 -26 15 21 5 33 53 36 -39 13 -150 -69 -26 -1 94 -92 63 6 35 -1 -33 -18 -84 -37 63
8213F3l6j38J34k0m7P4o8K05j57j57J27J03j19P8o6p6J58j00J42q5O0r8j64P7
$$ 63 27 -111 23 3 -44 30 -38 167 10 -147 -20 83 -36 42 -24 -100 58 -42 100 15 75 -23 -187 -110
8237a10J03m7k2N4Q7n3l8Lk3r0J18K1Qp3m2j2O7M7LL8o7K6M3j12l9M5O3pk5O1
$$ -110 -7 -54 -76 -22 65 12 -26 -23 -46 -136 -18 3 11 -62 -104 -116 -49 -2 1 39 -28 -2 41 -71 -110 -65 -2 -9 -34 27
8267B7j02m5M2O3o6J37j7K1r8L1L2n5J16J0j66R6JL3k3l1J07p2l7o1J12p6M1K2
$$ 27 -75 -120 -78 -15 -81 56 39 60 -38 -7 25 -30 86 96 -70 26 27 60 37 6 113 41 4 -57 55 -21 20 42
8295D2j42J08m7O9p4J4K0M4k1j01K4O3O4JP1rL1k46J58j7p0K2j00K5k9J55q9n0
$$ 42 -100 8 -39 30 -44 -30 -10 34 13 -88 -64 -1 63 64 135 126 157 -89 69 52 -18 4 -96 -71 -100 55 -34 -84
8323h4J12k7K7Q9j82J72r4M3j35J7R6j33J11j78J24J05j47J78pj53R0k5PJ88q3
$$ -84 28 1 28 117 -65 107 13 56 -79 -62 34 -99 12 -166 -42 63 -84 94 87 -66 24 -1 6 194 111
8348A11k21J16L1j18N2j39J82p0r6P6K6J81j08q6J31n0JJ09j00j42J07O5p2o2
$$ 111 -110 6 37 -81 -29 -168 14 -56 -152 -76 -50 131 23 -63 68 18 19 128 28 -114 -7 58 -14 -76
8372g6J09M8j26K0M5k1P6j09j0M2J3m2J36k33J42j03j8MJN6M6p5k6J27j12J47
$$ -76 33 81 -45 -25 20 -1 75 -34 -44 -2 11 -31 105 -128 14 -89 -107 -103 -102 -46 0 -75 -101 26 -86 61
8398F1Oq2K7j20P2J71j32J4j0q5N6J00j4k6j69J44O4r5J34r0M9n8rn3L2j09J91
$$ 61 67 -15 12 -108 -36 135 3 17 7 -78 -22 78 64 38 -131 13 77 -18 116 26 75 17 8 -45 -13 -122 69
8425F9j1j6o7J0M3J9j05M9J7R6j23j4J8o7M6m4M9k5Q1K5m6j0P0j08N8o7J45O0
$$ 69 58 42 -25 -15 28 47 -58 -9 8 104 -19 -33 -15 -82 -36 -80 -31 -56 25 50 4 -6 64 -44 14 -53 92 152
8453A52j90j22J43J33j54J15Om6R9j54k6O7QL6Lkl7j66K18j93J24N8k7q7J37j71
$$ 152 -38 -160 -17 116 -38 77 83 37 136 -18 -44 23 31 67 70 68 31 -135 83 -110 14 72 45 -42 95 -76
8479g6P3j8l7O3Q4l2j71J15K4On1m4J22m9j05Q6p0rK9m3J23K0Q1p4M6p0q5P0N2
$$ -76 -3 -21 -58 5 89 57 -114 1 25 31 -20 -64 58 9 -96 -10 -80 -89 -60 -103 20 40 121 47 93 23 -62 8 60
8508F0j78J85ko1N0Rp2m8Qj5m8J86O7j56r7K48j69P7rl6K7J2j4J6o8O8q1N2J08
$$ 60 -118 67 65 4 54 63 -9 -57 -49 -64 -112 74 141 -15 -112 136 -33 44 35 -1 26 38 24 40 -28 40 -41 11 119
8537A19o6o2K4q9M3J39j10r9M5L1P1o1KM2j5m5J9M2O4J4j81j2J34jq1J1Jj4M5
$$ 119 53 -9 15 -74 -31 108 -2 -101 -56 -25 46 -15 -13 29 14 -31 -12 30 94 108 -73 -85 49 48 -33 -22 -21 -35 10
8566A0m7p0K3P9Q8j79J61j05R7j8l4M7Nj44N6j04N2j02K01o2l2J79j83J2N9q3
$$ 10 -37 -107 -84 -5 83 -96 65 -40 57 39 5 52 57 -87 -31 -135 -83 -185 16 -46 -78 101 -82 -70 -11 -94
8592i4O3QO6o7P5K2j11jM8j26P4lL6J20j10L6oj0k0n4p0j2J91p5n2J29j08o9P3
$$ -94 -31 -23 43 -24 51 73 -38 -39 9 -117 -43 -46 -10 110 0 36 30 20 0 -54 -124 -136 55 -20 -72 57 -51 -120 -47
8621d7P0R6j61o1n6P5OR6P9q4O1j50N8K0j39J31o4J67p5N3p9l8n5R2l2J4L6j10
$$ -47 23 119 -42 -103 -159 -84 -78 18 97 13 74 -76 -18 2 -137 -6 -70 97 22 75 -4 -42 -97 -5 -37 -23 13 -97
8649i7J15j11J64oj23O2m2j4L8K0M9j03N6J6q6Q4m9P0j03rJ21j41n2kJ45j13L0
$$ -97 18 -93 71 65 -58 4 -38 -52 -14 6 55 -48 8 24 -62 22 -27 43 -60 -69 52 -89 -141 -143 2 -111 -81
8676h1R1j09J35m6J06j19P7r0K5K4K2m7j23LJ14P5m3m6K2P4J0j09J38j20J1Po4
$$ -81 10 -99 36 -10 96 -23 54 -36 -11 13 35 -12 -135 -132 -18 57 14 -32 -10 64 74 -35 103 -17 -6 1 -63
8703f3R6K7mj44J86j64L8J06k27K19J2o2l6k9P9P0o1o3pj14J99l2j67R6k5NJ63
$$ -63 33 60 56 -88 98 -66 -28 78 -149 70 82 20 -16 -45 34 104 43 -20 -27 -141 58 26 -141 -45 -70 -65 98
8730I8k13K2J8J37j36Q5p8o7J71Nm4j41J29m4J16J4J06j20l1oL4k4K2r3M9j08
$$ 98 -115 -93 -75 62 -74 11 -67 -134 37 42 -2 -143 -14 -58 58 72 178 58 27 21 55 31 53 -40 9 -99
8756i9l6Q3L2R8j11N1n3j05J64J04%k05P9j8J9n8J6k7J8R9Nl1p0J11l0k4M9k2
$$ -99 -135 -52 -20 78 -33 18 -35 -140 24 128 128 -77 2 -16 3 -55 -39 -66 -48 51 56 25 -45 66 36 12 61 39
8784C9r3k6J86j87J78j50j2NJ6n3J05p7j6R9m5mJ33Mj13n1J92p8J8M4k13Q5j7
$$ 39 -54 -80 106 -81 97 -53 -65 -60 -44 -97 8 -69 -85 14 -31 -35 98 102 -11 -62 130 52 70 114 -99 -14 -31
8811c1J7L5l8R7q8r7J60nk2p3L8p4N4m7M2J%J4pk5J2q0m1J47KO7j52J47P4j28
$$ -31 -14 21 -17 80 -8 -105 55 50 28 -45 -7 -81 -27 -74 -32 -31 -31 -17 -24 -49 -37 -117 -158 -11 -9 58 -94 53 127 -1
8841aJ01j32L8k2K1J0J0O1q4q0J3P0J1K9ln4N9O4o7L5q2L6l0j9jJ9j9j03J05N9
$$ -1 100 -32 6 -16 5 15 25 86 2 -78 -65 5 16 45 42 -12 47 111 44 79 -3 33 3 -16 -17 2 -17 -120 -15 44
8871D4J40l90J27N3r8J98j15L4k6Qm9QN3q5PK33o7j06P5o9J18j80L6O9kl3P4K
$$ 44 184 -206 -79 -26 -124 74 -41 -7 -33 -25 -74 -66 -13 -98 -91 142 75 -31 44 -25 93 -87 -51 18 16 -17 57 59
8899E9rj35N0QO8k3l6qPl0p4J36o6o6K25j98j6Q5J9l7J75k6k05N5oj2J5L8O1p4
$$ 59 50 -85 -35 -27 41 18 -18 -26 -19 -49 -123 13 -53 -119 106 -92 -108 -23 -4 -41 134 108 -97 -42 -48 -60 -45 -7 54 -20
8929b0J10J6q5nO0j26P3m7p7J89j59k6P4M6K1jq6M6k4L6j4j62R9J02j29P6J06
$$ -20 90 106 21 16 76 -50 23 -24 -101 88 -71 -97 -23 23 44 43 -43 3 -21 15 1 -161 -62 40 -89 -13 93
8956I3j19O9m7J12j56Q1Kl4m2j3N9r0P0JK9k0p6J12Kj6J38j39O7K4j92J01K04
$$ 93 -26 43 -4 108 -48 33 35 1 -41 -54 5 -85 -15 -14 15 -5 -81 31 33 17 155 16 83 107 -85 16 220
8983B20k81Q4J20k11J31p1M2p2n9J42j7K5o4N8m6L9m3N7k75K44j09N6M0K2j45
$$ 220 -61 23 143 -68 63 -8 34 -38 -97 45 28 53 -11 47 1 40 -3 54 -221 23 -86 -30 10 32 -113
9008a13K8Q0k2km3M7O3j97R8J54j7r1j20Q6J17J1j29J46K8o9r0O0Q9l1j08jp6
$$ -113 -85 -5 -27 -29 -72 -25 38 -159 -61 93 76 -15 -135 -49 68 79 -50 96 124 55 -35 25 114 83 -25 -26 -102
9035a02J74mNj23R8o9n9K23k81P5J53j13m0L2p5J15n8J9Q1j3K4k00R5L4k4L9J67
$$ -102 72 68 73 -50 48 -21 -80 143 -138 -63 90 -23 -63 -31 -106 9 -49 -30 51 38 62 -138 -43 -9 -33 6 173
9062A73k88K7P8o7qM0R9j39O4J7%M3j4m5L8P7j39o4J09K0O4k6q8J14J7k10K05
$$ 173 -115 -88 -10 -77 -85 -45 54 -85 -21 -4 -4 39 25 -20 18 95 -44 -108 1 21 85 59 -29 85 102 -108 97
9089I7j87J67L9m0j03M0kr7J31K0j53J22J10k58K43j97J8O7q2J13q9Q9k05k1J20
$$ 97 -90 77 116 76 -27 13 11 -86 45 65 -88 34 144 -114 129 -68 -50 17 -65 48 -41 48 -157 -178 -58
9114e8K8Qj22K41q6j14J63j49J82j72j1J01po7k4J97k31J41K7J5N6o4o7J10j73
$$ -58 -30 -22 -144 97 11 -103 60 -89 93 -79 -90 11 4 -63 -87 110 -121 20 47 62 118 54 -13 97 -76
9139g6J51n8m4J29p2jp2J37r0R1j98J71q5J78k20l4J2K9J61k31J65Q1Mk38J07
$$ -76 75 17 -27 102 30 29 -43 94 4 95 -103 68 -17 161 -59 -93 -81 -52 109 -122 43 124 128 -110 -3
9164cp9M9PJ27j23m6O5R6l6k6n0o8J60Qj36qR2r1r1J59j06K01j33k0M7o8Q4r0
$$ -3 -82 -33 -26 101 -22 -68 -3 93 57 31 -19 -87 73 81 -55 -63 29 -62 -153 6 -100 101 -32 -52 -5 -73 11 -79
9192g9J30j53J65m6n8n2O7l8n8L4R5o4K6j5K3J4pRl0m9j0q0J43J08Mk1k29J09
$$ -79 51 -102 63 17 -41 -93 -26 -64 -122 -88 7 -57 -31 -46 -23 -9 -16 -7 -37 -86 -96 -176 -33 75 79 58 -171 -62
9220f2R6R6j67L8O2j68J18J18n8j03j1j6R7m2M8o3j56J93O7kk9o5J12j44M2j66
$$ -62 34 130 -37 1 63 -105 13 131 73 -30 -41 -57 40 -2 46 -17 -173 20 87 85 56 -9 103 -41 1 -165
9246a65P1L0M6J08j99J0J21j43J76p6RN9r4Q3J8m2j7M6k4p0J16j38J65p8j44K35
$$ -165 -94 -64 -18 90 -109 -99 22 -121 55 -21 -12 47 -47 36 54 12 -5 41 17 -53 63 -75 90 12 -132 103
9272A03o4M3K0q9P1k7n7J5J09o3j26Q9P1r0J02q8j12J46r1K2r4K55p5r4pl7K7
$$ 103 39 82 102 13 84 57 0 15 124 61 -65 24 95 5 107 19 -93 53 -38 -16 -110 145 70 -24 -31 -68 -41
9299d1Q6j13J2J13k4o4Q1Mj14R7j9nj65J77M2o6r6R9p8J37m4l6N0k41L72k52P7
$$ -41 45 -68 -56 57 33 -31 50 54 -60 37 18 13 -152 25 67 1 -95 4 -74 63 19 -17 33 -208 164 -88 -11
9326a1N1r1K6K2j4K3j46J15J34K8j41k5P4l0lk5J2n0k0l9O4R4o1j33J07M6p2J20
$$ -11 40 -51 -25 -3 -17 6 -140 -25 109 137 -4 -29 45 15 12 -13 -1 -51 -71 -110 -46 48 -13 -146 -39 7 -65 55
9354E5j45L6O3k0K0Np2J37O0k26R7K5N2j30N5M6J5j40P1J54k35J01j33Q2L7n7
$$ 55 -90 -54 9 -11 9 14 -58 79 139 -87 10 35 87 -43 12 58 73 -67 4 158 -77 24 -109 -27 10 -47
9380d7k5K04r2j06N9k7k0P2j0n4J7L1O9k30J64K7m6Q7k50J64r7J14j5M5j66J50
$$ -47 -72 132 40 -66 -7 -34 -54 18 8 -46 -29 2 71 -159 5 32 -14 73 -177 -13 -110 4 -11 34 -132 18
9406A8Rro2O7%M5j75J61n3Q0l2j00J16j29J2K1L9J6Jo6M3L6n1rJ1p8K9Q8k5q5
$$ 18 27 18 -44 23 23 68 -107 54 1 81 49 -51 65 -64 -52 -31 8 24 25 -41 2 38 -13 -22 -11 -89 -60 28 3 -82
9436h2Q0p7o8J52m4L3K8J2r2J0jJ01o4L1K9r1O3O0r3L4L7q9j31J60m8N5M3j4j2
$$ -82 -2 -79 -147 5 -39 -6 22 34 -58 -48 -49 52 -12 19 48 -43 20 80 -13 21 58 -31 -162 -2 -50 5 48 34 22
9465B2k7k0pR9j65J82r4n7n5Q6R8o8j5J7Nk7O0plM8m2l7J6o4l8k0J18k4R0p9J4
$$ 22 -5 -25 -32 67 -98 84 -10 -67 -122 -36 62 -6 -21 -4 1 -26 34 27 24 72 30 -7 9 -55 -93 -113 5 -19 71 -8 6
9496Fl6p0N8P6p4%J66j41J6l9M9K5O6k06J02N8n5L9O8o2N2j11J17j18k0J23o0
$$ 6 -30 -100 -42 34 -40 -40 126 -15 1 -38 11 36 102 -104 -2 56 1 40 108 46 98 -13 104 -14 -34 89 29
9523B9M9r5k7j3J21p2n4N4P2j00q1J70r6q8K29k54R4n5J31L7k3r8k3j1J62l6n2
$$ 29 78 -17 -44 -57 64 -8 -62 -8 64 -36 -117 53 -43 -131 98 -156 -62 -117 14 51 28 -70 -93 -104 58 22 -30
9550c0J62k08KO4l8O5M2m7K0J4p8m7J22K7j02O0ll4p4N3J2l3K1L9JK1p1M2l5P4
$$ -30 132 -76 -74 -10 -48 17 59 12 32 46 -32 -79 43 70 -32 28 25 -9 -83 -30 -18 -51 -30 9 10 31 -40 2 -33 41
9580D1K1Mk15J05KJ07M7j09o0K0j5L6R9j50J59k24J08P6j02J11r4Qj6J03j81J04
$$ 41 62 66 -149 -44 -42 65 112 3 -57 -37 -52 -16 83 -67 92 -132 -24 52 -50 61 -33 -25 -41 62 -119 -15
9606a5N0J14q6o3J4Ml3O6o3p8J79j8P9j67j2m6R7p7O3NJ0O6j09OL1q2k2R6j14
$$ -15 35 149 63 0 14 18 -15 51 -12 -90 89 71 150 -17 -29 -75 22 -55 8 13 23 89 -20 -14 17 -65 -87 9 -105
9635a05J96j38m7M2P4m8N4j08R0Q8k9m1jk0n7k0M1M4l0j1P6J09j96QRK5QJ7R3
$$ -105 91 -47 -94 -52 22 -26 28 -80 10 98 69 28 27 7 -50 -70 -29 15 -15 -26 50 159 -37 -29 -20 5 13 30 123
9664A23N0j22oP8p0o7M4L3m2J32j52J25k29P4K8j54O0k9J83j21O0P9j75J93j45
$$ 123 173 51 45 123 53 -14 30 63 21 153 1 126 -103 -29 -1 -155 -95 -124 59 -62 -2 77 -98 95 -50
9689e0J21k30J08M0K0P4q9R2j02lM6j6P8o9P8r9N0j6R8j14q2R4NK5j36J81j51
$$ -50 71 -159 -51 -11 9 83 -6 86 -16 -19 27 11 89 20 98 -1 49 33 131 17 -65 29 34 59 -77 104 -47
9716d7J12j44J88r9j05J09K8qK1o0N5j26L9O1J08k26P3l9J34j07R3j13N8k6Q5
$$ -47 65 -79 109 10 -95 14 42 34 55 -5 50 -76 -37 24 132 -94 -21 -60 74 -33 60 -53 5 -21 64
9741F4n5K5j6M5j1P2j48q5J05O7n9m0J32j77Mn1M3m9Q1P4M3r0L3j13P1KMLO4j07
$$ 64 9 34 18 63 52 124 -24 -109 -4 63 4 -36 96 -81 -77 -128 -85 -134 -53 21 64 -26 7 -106 -35 -33 -29 -26 38 -69
9771f9J18j17k0J39o0m7O0j23R0M3r7O1oN8o4P1l5o2j8m4Q6o5Q3Ppj17J85j2j04
$$ -69 49 -68 -88 51 -9 -56 4 -119 -29 14 -83 -22 -28 30 -34 37 2 -60 -78 -122 -36 -101 -18 -11 -18 -135 50 38 -66
9800f6L04j12r1K1p7J42j32L1j49J67kP6q9p6J17q4j07J38n7K9m5L6P5rnn0m9
$$ -66 238 126 35 56 -21 121 -11 20 -129 38 36 112 23 -53 64 -20 -127 11 -46 -17 -62 -26 49 40 35 -15 -64
9827f4M5koP6j30Q0l0L4K5Qk2N0L2j52M3L6K0l8K6k4J6k4R9k12J30q0J24m6J12
$$ -64 -19 -21 -27 49 -81 -1 -31 3 28 36 14 64 96 -56 -13 23 43 5 31 7 23 -1 98 -114 16 -64 60 14 126
9856A26p9L9n1j29J53j54Q4N9l8o0k3Q3N9l6j11R8m1O5l3p1Q7j13K16j45NQ3o2
$$ 126 47 86 35 -94 59 -95 -11 48 10 -50 -73 10 69 33 -78 20 -21 44 11 -60 27 -86 130 -15 -10 73 11
9883A1R2r7P9Jj47J66n2q6R8o7op6J31K6j12J43j96J44j17O8n7J5jK0m3J0O2m4
$$ 11 103 6 85 86 -61 105 53 -33 65 -2 -8 -84 47 73 -39 104 -92 52 -65 3 -54 -39 -40 -20 -63 -53 9 -35
9911c5J07r4J02n0p3L7o3k1L2L5M1r1K4r8J32LR1m8kJ7r5K2m5Pj7n4K09j83J06
$$ -35 72 -22 80 30 -43 -6 -69 -90 -58 -23 18 -73 -49 -147 -15 -12 79 31 29 46 -49 -27 -72 -65 -82 -136 73 -110 -4
9940dl1pk6O5L5o7K7L1l2j1N5o2Q1Q5j01m7R3j1n1j21O0Q6r7q2J44J28j35j01
$$ -4 -35 -42 -68 -3 32 -35 -8 23 -9 -20 35 -27 54 139 38 -9 84 73 22 -99 -39 47 -50 -132 12 140 5 -96
9968i6N4K7l9p6J20R0o4q2O7mK3P5p7j10l2J56J29j31j28J45jo4L2L4j5J6q4R1
$$ -96 -42 -15 -54 -130 -10 80 16 -66 1 -3 20 95 18 -92 -124 32 161 30 -98 47 46 -18 14 48 33 49 -35 56
9996E6k1N4j37N5l3J9j0jj4n3J5R5O5n8%o1R4o6mp0J20m4PK6p5O0RO3q4Rp8Q4
$$ 56 35 89 -48 7 -26 -7 -17 -18 -32 -85 -70 25 90 32 32 -29 65 -1 -5 -75 45 1 8 34 -41 19 28 91 7 16 -62 22
10028B2p2pl5O8j8N2J3J3n6M3O0r1mQL4Pq2N4Q3m6Q6j59J1m8ML2r7J81j29OJ48
$$ 22 -50 -57 -92 -24 -42 10 23 36 -20 23 83 -8 -12 -4 30 37 -45 9 92 46 132 -27 -16 -64 -60 -28 -125 56 -73 -67 81
10059H1j61Q3o3P1j4Nj2m1J0L5N8l9l8N9O6r1J3qo6p0J95j36J02r8J77j02J8m1
$$ 81 -80 3 -60 11 -3 2 -10 -51 -41 -6 52 13 -25 34 100 9 22 14 -52 -122 73 -63 39 -59 118 16 34 -7
10087gN1j70J18M9m3O3p2j7R9o1K5O8j60J67r3p8k4J11j67J26o4J3J22j06J9R4
$$ -7 44 -126 -8 41 -2 61 -11 -28 71 10 35 103 -57 110 17 -61 -85 26 -141 -15 -79 -66 56 -50 -31 63
10113F3K7l1m8j19J77m3n1q6J20L6j13k5J18j06J14j03J27lj19J38M2k2q6j77
$$ 63 90 59 11 -108 69 26 -25 -111 9 45 -68 -93 25 -81 33 -70 57 54 -65 73 115 93 7 -170
10137a70L27j15qL3l9O1j06O0q6R2l7P3j14L6Mk1m0NJ5P2pr8L1jQ7o1po1Q3m2
$$ -170 157 42 34 67 28 89 -17 43 -43 49 12 85 -29 7 11 -10 -50 -45 -30 42 35 -63 -32 -33 54 -7 -14 -75 8 -34
10167c4Q6j82J61L6j57M4O7l4k4j9Q6J0n8K4p1J40o6N8j48J20Qj35M0J19L5k0
$$ -34 52 -130 31 67 -90 -46 21 -13 -37 -56 30 40 -18 6 -65 75 9 67 -81 39 47 -88 -48 71 106 86
10193H6q9m6K3lL0O5p3J9N5j27j2K7m2L4M9Jm4j33K65j48l6J18N5L2j16o4M0P6
$$ 86 -3 -49 -26 -29 1 66 -7 12 67 -60 -72 -45 -87 -53 -4 -3 -47 -180 85 -63 -99 19 74 106 -10 -74 -34 42
10221D2j28J42o1J4M7L3m3m9J29j11ok5k1P4OoN2m9J9o9j8j5J42k7m1o5jnN7L8
$$ 42 -86 56 -5 9 56 89 46 -3 126 15 9 -16 -37 37 43 37 89 40 59 -10 -28 -43 99 72 31 -34 -35 -40 17 55
10251E5J7j88N7Q6r7J67j40M4Ol6Kl0K8J4oJ52j27k1R9p2rL4m6J04j19N9o7J63
$$ 55 72 -116 -59 27 -70 97 -43 1 7 -29 -27 -57 -29 -15 -21 131 4 -17 82 10 1 35 -11 93 -26 33 -34 129
10279A29j44J10j38L6k8J01l4r5N0m0M2k6J34j53J23Oq1lr4R1Lqj3N6n9m8M0k
$$ 129 -15 95 -43 -7 -35 66 32 -63 -13 -53 -11 -37 97 -56 67 73 -8 -11 -105 -14 -11 -19 -32 24 -35 -83 -43 -45
10307d5N0j7N0J5p1o0KO7L0lJ2r7Q1l7M5N1j21K5P4qoj03J10o0lJ99j61L4K1k52
$$ -45 5 -12 38 53 -18 -78 -76 -9 21 18 30 -67 14 -23 22 73 -48 -23 51 43 37 -66 44 -16 -19 180 19 53 74 -178
10337a78J42O9n8J9Rl2m7R6O2j12J4R6m6j31J00j07P9Oj9L5N8J3q6Qn2R5j20J2
$$ -178 -36 33 -25 -6 3 -29 -76 20 82 -30 -16 80 34 -97 3 -104 -25 -19 -38 -3 55 68 -18 -10 -62 33 -87 -75
10365g5m6J55J1K3n8j4K9p4n1J32J3J20k36M7K02j11k4N7j89J3L8M4k1n3J55j04
$$ -75 -121 34 45 68 10 -4 25 -49 -100 32 45 165 -71 -24 178 67 43 100 -89 -76 -38 6 -15 -68 87 -17
10391a7P9M1k54J52k5K4K1Mj14N6NL5l8L3nN4n3P5q1Ro4J9O0n1R6k1L8j1k0Oj49
$$ -17 62 103 -151 1 -24 0 21 25 -89 -33 -28 7 -31 2 -3 51 -2 73 -8 1 -63 -44 16 -35 61 40 78 67 47 53 -96
10422i6Q2j3L2k2k4jN7J03j11q8J57j2j20m6J10J8k2N9j37P8N6j38J54j35L3j8
$$ -96 -14 -27 5 -17 -41 -42 15 118 7 -81 76 64 -56 -102 8 26 4 63 -74 4 60 -78 76 -59 -26 -44
10448d4M1K4r8J0lN1q8m8P8Q2J20j36n6n1J52L0J6P4k10L7k8L0J38j50O4o7ol3
$$ -44 -3 21 -77 -67 -70 -19 -107 -155 -77 5 125 -11 -67 -118 34 64 80 154 -56 -19 -47 -17 121 -29 35 -32 -38 -71
10476g1J09O0j47J18q2k7Q0o5j3O7Qr0M6K0N0l5M7r2Pn4P6o9P2j7p1M8J9P0j19
$$ -71 38 98 -49 69 -13 -40 40 -25 -38 29 37 -53 -7 13 63 28 75 -17 -10 -64 12 -57 15 -2 -73 -25 -6 64 -55
10505e5M0N8j9j19J70j9Nm3k4j7q8K7J25k2k7Q2j13J03k3m7L3r9R6M1m1pn4K9
$$ -55 -15 43 24 -95 75 56 61 18 -6 -23 -111 -84 41 19 -8 74 -39 64 41 -6 27 -72 24 65 24 17 -37 -8
10533hK4l9N6m1Jrmnn8K04k02j5J10j36J21%j54Q2j8o3J95j23R7j02M4J38j72
$$ -8 16 -23 33 -8 -7 -16 -20 -25 -83 121 -81 -96 14 -122 -1 -1 -155 -73 -91 -154 41 -82 15 -87 -43 95 -77
10560g7J31M7r4l4R5J0j34J6J04p7J17k15J3J71q3Q9j22O3K3Q5k24Q2j04J18J1
$$ -77 54 101 7 -27 68 78 -56 -40 64 -13 104 -111 -98 73 -10 79 -43 20 43 128 -96 -14 -118 0 11
10585A1O0j24J6j7l0O9O2M4j58l4J37j34J37O7j48j5M8LJ29n2j55N6J5L4n2O6
$$ 11 71 -53 -37 -54 -84 -15 47 91 -67 -101 36 -98 39 106 -42 -57 -9 -6 123 71 -84 -28 -13 21 -31 35
10611C5o8Q3p8j1M5j54J36J10K4r1J31r6j10R4m6j12J71r1R9J3j40Pj4J15p4P6
$$ 35 -33 50 -28 -39 6 -148 -12 98 122 31 162 66 -44 50 4 -108 63 -28 71 84 -56 -49 -63 52 -22 54
10637E4K4k2q2P7M4l4j79R8kJ8J16j40P3l6q8l1J04K2n5N3l5n3J70j25L0q0N1
$$ 54 78 56 -26 51 95 61 -118 -20 -22 -4 112 -28 45 9 -79 -110 -6 16 -39 14 -21 -74 96 -29 1 -79 -28
10664b8M8M6p4J0R5k10l1K49r2LJ05j07j33J73l1Kp3M8R5j4p0No3J7J30j28Q5
$$ -28 20 66 -8 2 97 -113 -144 105 13 16 121 14 -119 54 23 25 -48 0 95 81 11 16 -47 -30 100 -28 57
10691E7m9J3j3rQ9m8j47QL2Jk1N7J49j34j16K05K5l4l0L7L8n6L4N4k55J54o5O8
$$ 57 8 21 8 -1 88 40 -107 -99 -67 -66 -87 -30 119 -15 -131 74 99 65 35 72 110 54 88 142 -113 41 -24 44
10719D4J1Pr9nm0R4J33j11l8q5O7M7m2M6r7J11n6m3R2j51J25J7j3k5O1j45R7l
$$ 44 55 62 -37 -42 -82 12 145 34 -4 -89 -22 25 -17 29 -68 43 -13 -56 36 -115 10 27 14 -11 50 -95 2 -1
10747aj13J18rj6Q0j42O6m1J04j23M5j9K9K3L0rP0kL4j65k5Q8m5P3P3k38J01m
$$ -1 -114 4 -5 -21 59 -83 -17 -58 46 -77 -32 -51 -22 1 31 22 92 90 124 -41 -66 22 -23 50 123 -115 -14 -18
10775a8Rj29J79q6P9K8j4j24o7J27Q2O5k03J14j12L2q1K9J10m2R9K0j44O5M8o5
$$ -18 -9 -138 41 -45 34 62 48 -76 -143 -16 66 131 -72 42 -70 -38 -119 -90 20 -22 77 97 -47 18 66 1
10801Ak2m6K28j61l8J15p4l4N3J71k22PN3p4j4O2m5J75j59K1J23r1j03OJ90k34
$$ 1 -21 -67 161 0 -38 77 3 -31 22 193 -29 -22 31 -43 -57 5 -40 135 -24 -3 120 29 -74 -68 122 -112
10827a12N4JO4jm9m7J79p9q6J6O3l1p1j5Q1R0l4k9L8L7j63N0J39j44jP5pR1q7
$$ -112 -58 -57 7 6 -43 -90 89 10 -76 -60 3 -28 -99 -114 -33 57 23 -6 32 69 -94 -44 95 -49 -50 25 18 109 22
10856B2k5J37j18J83j36j7j5p0P8o3k6J08l6Rj9K4l2m0j3M4O2j3J1k9M%k9j05
$$ 22 -3 134 16 199 63 46 31 -39 39 -24 -50 58 22 31 12 36 4 -36 -49 -5 57 44 55 26 30 30 1 -104
10884a04J38mm3jK3Ko7J25j92J84j72lJ76m2j3Q6l7p1M9L9m1J0K3j8n3l4J21m0
$$ -104 34 30 -13 -14 9 11 -56 69 -123 61 -111 -114 62 20 7 93 56 -15 34 73 32 42 65 47 -6 -40 81 41
10912D1Q0j60J8O4m6o0R1j42J42l1j35J16O6n4O8r8j3M5N8k36J31J9l6j5m9J29
$$ 41 121 -39 -21 43 -3 -63 28 -114 28 -3 -138 -22 44 -10 58 -40 -53 -8 50 -186 -55 -36 -72 -87 -136 -7
10938gl1J08j66O8Q9j54J27J10l17J93K1j14J13j28O3O1Nj25J25nM3m0j3j8j97
$$ -7 -38 70 -96 -28 61 -93 34 144 -173 20 41 -73 40 -88 -25 36 41 -84 41 36 79 39 26 8 -189
10963a89J87J02l1j03N4J8n6Ol2O4o0j09J57j2j31J88q3K6m9P1k0L9o5l6J45j13
$$ -189 -2 100 69 -34 20 38 -18 -12 -44 20 -40 -149 8 -4 -135 53 -30 -4 -53 18 -2 37 -28 -64 81 -32
10989c2j08J49j34K3J15l9N4Kk4n7N0J81j83p5K24k02K8q5m7K41k1R4j57M6n6
$$ -32 -140 9 -125 -102 13 -26 28 30 6 -51 -1 180 -3 -78 146 -56 -28 -113 -160 81 60 154 -3 43 -13
11014a3k4O4k5l7OL7m9J1Q8o6j32J22j7k0N2j76J74jp8K3N3J2jj4M0O8n3o6O9
$$ -13 -37 27 2 -35 -29 8 -41 -30 58 -8 -140 -18 -35 -55 -3 -179 -5 -6 -84 -61 -8 4 3 -11 29 97 44 -22 47
11043D7J3M4j40N7p9O8R7j19K5l7K6l2k7r2K13n4O6j27l1J9L6l9M5K5MP2j82J1
$$ 47 60 104 -36 21 -58 10 107 -12 13 -24 2 -30 -57 -149 64 10 76 -51 -82 -63 -27 -66 -21 4 8 80 -102 -91
11071i1J46r8j9J16o8QLl7J05q3j22O5J06q0R2j21J6K3N1r7R5J5qO0r8J4R1n1
$$ -91 55 -43 -62 54 -14 -6 -3 -40 65 -18 -140 -75 31 -49 43 -78 -62 -39 12 -85 10 25 17 77 -21 -7 84 33
11099C3N3q7l3J8J30p2J6j5qK1j85K16j0o3QJ02k04J25m8J10n4l8N2m1j01J11
$$ 33 86 -1 -34 -16 114 42 58 43 35 56 -129 87 77 14 22 124 -80 45 -3 107 53 15 67 26 -75 36
11125C6O3j14R3j34L3M9m4PN7j19O4R7Oj39O7K9j48J00r0J83N1p6o4N1J24j31
$$ 36 99 -15 78 -56 -23 26 -18 -11 46 -73 -9 88 94 -45 22 51 -97 3 -87 96 147 71 7 58 182 51
11151E1j6l1L0j41P9lP8j0j47RP6L5k5J1k5j04J52k7k6J08r6J18j05j07J17j25
$$ 51 35 4 34 -107 -28 -31 47 37 -110 -101 -25 10 -15 -4 -29 -133 19 -8 -34 74 -22 96 -9 -116 1 -124
11177a24O3p6M0PL2P5J02p9j8p8m7J11L8Q5j47m6J43j42J08j07k8L7L9kn3J22
$$ -124 -61 -137 -97 -90 -58 17 119 40 22 -56 -103 8 46 131 -16 -62 81 -61 47 -60 -88 -51 -12 -14 -67 55
11203E5k2q9N5o9J06nj00O2j4J4J6j43J09O5MJ8n0R7k1j77n0Q8J73j21J11k3j00
$$ 55 33 -56 -1 -70 36 31 -69 -7 -21 -7 9 -134 -25 40 44 62 12 109 88 -89 -139 -51 122 1 112 89 -11
11230a1O7p6K7l5O8J6k4p6l2l2R7NM8j52J63Qj18NK5L9n5N3r8Q5Q1K3j19oJ06
$$ -11 56 -20 7 -28 40 56 32 -44 -76 -108 -11 -6 42 -110 53 61 -57 -52 -27 12 -43 10 -88 -3 78 101 -18 -24 82
11259H2j44J09k5j2Ll9j87J45j2kM3P2k0n1P3k7J10r3K9J0m0j40lP9n4N2J27k6
$$ 82 -62 47 22 10 13 -26 -213 -68 -80 -82 -39 33 13 -38 35 8 118 25 54 64 24 -116 -119 -40 -94 -42 85 59
11287E9K5j07q8K44j33L2j26Q6k0R4m4l1J9M5p2O5m3r3P8J36j45J5l8Q0l0N9l1
$$ 59 84 -23 -111 133 0 32 -94 -8 -28 66 22 -9 10 55 -17 48 5 -88 -10 126 -19 -4 -42 38 8 67 36
11314C6r8R8K4k79K70o0j0P1n0OJ7O3j49J9P4j6j3J93k17O7Q0k02O2J8p3J4M7
$$ 36 -62 36 60 -219 51 -9 -19 52 2 8 25 88 -61 -42 32 16 3 196 -21 46 126 -76 -14 4 -69 -55 -8
11341hJ54j24K6j19J23L8l4j20J03j14P8K1O2r4Km6P1KQ4l3j06R6q8M2n4j39K22
$$ -8 146 22 48 -71 52 90 56 -64 39 -75 3 24 86 -8 -6 -52 19 21 105 72 -34 62 -26 16 -38 -177 45
11368D5j29P9%L3NN7o2J6o3Qn4L6l8N2L9m4P6j07K9k1P0n5N0l9J43m1j15J0N6
$$ 45 -84 -5 -5 28 33 90 28 44 -19 -11 -65 -29 -67 -15 24 -20 56 -51 -22 -43 27 -28 22 -17 126 85 -30 -20 36
11397C6m1J31j46N4p4M5j32J52q8J38j44mR1q0R5j34Q0j7rq0njR0j3K36j01n7
$$ 36 -5 126 -20 34 -40 5 -127 25 -63 75 -69 -73 18 -62 33 -101 -21 -38 -47 -127 -132 -133 -43 -56 180 79 22
11424B2lL1n2NJ2q7R7p3J44j51K9J12j10k9J08o5k2K2K8O1j46R3j49Q4M9O7n3
$$ 22 19 50 -2 3 15 -72 25 -48 96 -55 -26 86 -24 -53 55 -10 -32 -10 18 79 -67 26 -123 -39 10 77 24
11451B4N3j09R0j08pJ31j02j5L0o6J33QK3m3%q7Q9k3p9Q5l7L0J08p5L4j74j8L3
$$ 24 77 -32 58 -50 -57 74 -28 -43 -13 -79 54 62 85 42 42 -45 44 21 -58 27 -10 20 128 53 87 -87 -105 -72
11479g2J18K6Mr7r4P2J25j35M1L1m3pJ2O7l4j65R5J84j67O9j4rj0k1m0J00Jr4
$$ -72 46 72 76 -21 -115 -43 82 -53 -12 19 -24 -31 -19 48 14 -151 -56 128 -39 30 16 7 -3 -24 -64 36 37 -57
11507e7M9l0J0l3K3Pj0k3J28l3J21p4r6M5m4QM4L7j45P6M2j16O6j9j13J70p9j3
$$ -57 -8 -38 -28 -61 -38 -31 -41 -64 64 31 152 78 -18 27 -17 -9 35 72 -73 3 45 -71 -5 -24 -137 33 -46 -59
11535e9R4n9P3k8M9r0J16o3m2n9K2O3p3R5No0%mO6O4r4o0k8Q4M9p5L8K8j68L2
$$ -59 35 -24 49 21 70 -20 96 33 -9 -68 -46 17 -56 39 44 -16 -16 -20 46 110 16 -44 -72 12 61 -14 24 52 -116 -84
11565h4J43r3J48k11Q5Rp5J87n1Qn3M7Ql6q1K9J14l5k16O4J80j52j2J09j30N3
$$ -84 59 -34 114 -97 -12 -3 -78 109 58 66 13 60 68 32 -49 -20 94 59 -157 -93 87 -65 -77 32 -98 -45
11591d5j23K69K1k92K84n5j09K0K4m1J11j85J16qJ84k64M9K1n4J45m5l2M4Rj65
$$ -45 -168 101 122 -170 114 59 -50 -30 -6 -47 64 -121 -5 -13 171 -93 -44 -23 -77 68 23 -9 35 44 -121
11616a21J46j9K5p9Q9n2K6J5qo6R2LM1o7p0Q4j22k5M1l7L5O4J4j42K65q6l9pk3
$$ -121 25 6 31 -48 41 -11 15 30 22 -44 48 51 92 25 -45 39 -83 -108 -67 -104 -69 -5 9 -133 132 46 7 0 -23
11645b3j4r1J53j07O5jL1K2p7P8rM3J3j50J62q5Qq5R5k6K1Q3j26o3O0K4q2P9j38
$$ -23 -37 -128 25 -82 -17 -18 13 35 -42 36 27 70 83 -67 95 10 18 -67 28 2 23 106 -20 -83 -23 1 -81 -2 -140
11674a40J53P9q3kk1K10k41O0J54j93n6J43j67N8J15j97J79l9n5R1rq4M5R3j13
$$ -140 13 92 9 7 -14 196 -45 15 169 -24 -80 63 -104 -46 69 -128 51 12 -43 48 39 -45 0 93 -20
11699b0L2l3k0J0lk8M3j6L8rK4l7N2k0j1l4kO5l6n8k8J02p9J6Q2N9j36J09M8j29
$$ -20 12 -21 -41 -31 -34 -62 -19 -35 3 -6 18 -19 33 13 2 -32 -34 31 -5 -63 -91 11 -68 -52 30 89 -47 62 110 -19
11729a9l5O1J32j47l5J86k05MJ3L6q5J49K0j4p9j2J2K1l8p2N0R4J16j85J9KPn1
$$ -19 -54 7 139 -8 -43 143 -62 -58 -45 -9 -94 55 75 61 -18 -30 -18 3 -35 -107 -57 37 153 -32 -13 -11 -4 -55
11757e5QL1L3l6r3J49m3q9J26Q3j21KJ6j20J58j16R6K07j89K7j11l5O7m5K13j05
$$ -55 -47 -16 17 -19 -112 37 -6 -95 31 114 -7 -5 11 -109 49 -67 29 236 47 74 -37 -72 -5 -50 163 58
11783E8n9q1J08m7J9J48k15M2J9O7j00k5J29o2n3O0o2n9J29k7P1o8l7J9O6r9k1
$$ 58 -1 -82 26 -21 -2 146 -69 -27 -8 59 -41 -66 63 1 -52 8 -54 -113 16 -11 60 -8 -45 -26 40 -59 -80
11810h0K7J19r6J0j1J27j02o5J04j4Ml8Q9j30O1K5l8r2J02P5j16l5Q9KP7k2n5
$$ -80 -53 66 -30 -20 -31 96 -6 -71 33 19 23 -15 74 -56 5 30 -8 -100 2 77 -39 -74 15 17 94 72 17
11837A7l2R6M0j69R1k08J45oo6J3J74j06p7Q6j05J32J2o3J16j15P0nK9K2j05O6
$$ 17 -15 81 121 -48 43 -165 -20 -26 -92 -79 95 -11 -88 -2 -107 25 37 -26 90 -25 45 40 69 91 -14 52
11863E2L6q8l3P3j4j3J0k3MJ25n6pp8k8J24l5n5k2m5J7R2o8K3j21J27N5r6J06
$$ 52 88 0 -33 40 26 13 23 0 4 129 73 66 -12 -40 84 49 -6 -28 -73 -56 36 -32 -9 -130 -3 52 -44 62
11891F2j40R0M0j04Q0k21K04P1j63k8O8R4j03L1J3j05K15o2q0L7n3J42j29Mj3
$$ 62 -78 12 52 -52 28 -193 11 82 -81 -109 -41 53 -50 -19 -6 -111 104 42 -38 -1 -54 88 -41 -37 -50
11916e0P3ml2k4J38q0J1L6j38J53m1n0J7qPM1O2m0r1j01J63j53J64NM0j50L8k3
$$ -50 23 19 -13 -37 101 21 32 68 -70 83 42 -8 9 1 8 49 111 71 -20 -121 42 -111 53 58 98 -52 -14 -37
11944c7O8P4j63J30k2qJ0o0l4O4J0r9R5M5qj19n2J69j33O1O6J30j49n6rk5M7N4
$$ -37 31 105 -58 72 50 42 52 -8 -42 22 32 -67 28 73 65 -54 -106 63 -70 -9 57 187 38 -18 -27 -52 -5 49
11972D9j08Q1k9l0J48q1OOl5J20j57P4P7j22R5j38J0k5J2J40j34l5J5Q2Pm1J6
$$ 49 -59 22 -7 -37 111 30 36 42 7 127 -30 44 121 -1 94 -44 -34 -59 -47 93 -41 -76 -61 21 28 -13 3
11999Cj7J9ro1O7M5k5j13L2OQ0o0JM0k6L0j71J74j43J79Qj1K3p4n0qk3P0O2r4
$$ 3 -14 5 -4 -65 2 47 22 -91 -59 -53 27 -33 -32 8 -18 12 -159 15 -128 51 59 48 71 -3 -53 -61 -84 -14 48 -46
12029d6R7q4o5J25j58J04o0P7N3L3j46M4n5O1p6J34r4P5K9o9k6M2K5m3j5P4O5
$$ -46 51 -33 -98 27 -131 -27 -87 -10 43 76 -70 -26 -81 -20 -96 38 -56 19 48 -21 -47 -5 20 -23 -38 36 101
12056A01j07PN8N3o2j13jP7M2K6m1kl1M4K6j16m2M3N2p6q6J67JO8k0q0M9k0M4
$$ 101 -6 1 59 112 50 -63 -64 13 55 81 40 38 7 51 77 -39 -81 -38 14 -62 -148 19 20 88 68 -12 37 17 61
12085F1K1Jj4r3L8k9O6j32L8o8J41j5K5N7pj5J0o1M6j25n0O1J10j04o2J00J6M1
$$ 61 82 83 69 -24 14 -15 51 -81 -43 -111 30 15 40 97 90 75 85 24 70 -55 -105 -44 66 -38 -100 0 16 57
12113E7L3rj36P7l0j11O8P6K8l7K7Pm8O3o8j9O3j13J00KKk6M0k2q7K2QP2R4q8
$$ 57 90 81 -55 22 -8 -119 -51 25 53 16 43 50 2 65 -3 -22 41 -72 28 30 32 6 46 24 -63 -41 -33 39 133 45
12143D5m8N3j79J25q7L6J06m8pm9N4Q6j09Km3J14j8q6O4j13M2k7j1RP4p2L8Nm3
$$ 45 -3 50 -129 -4 -91 -55 51 3 -4 -53 1 87 -22 -20 -63 51 33 -53 11 -102 -60 -87 -98 -89 -15 -87 -49 -44 -87
12172h7J24Mj54J09R5k4j72L2Q1j16P7N9m8K2o4J4R5j62J35k3O7j8jN5j73Q8r
$$ -87 37 41 -113 -4 91 67 -105 -73 8 -108 -31 28 -20 2 -62 -48 47 -115 20 -3 64 46 45 100 -73 15 6
12199FK1j7L7LL1R0j25p5j8K2M8o1Rl1P8p7J16j34n1K82k44P2K4jl2P9l2J0o2
$$ 6 27 10 47 50 81 171 46 -29 -47 -25 23 -38 -29 -60 18 -59 57 -77 -128 154 -90 -18 6 5 -27 52 20 30 -32
12228c2J44p6J0j27P4J3m2P8p8O6m8Kp1K15j53J08k0j11M3N3N1j84J03k8j18M9
$$ -32 112 36 46 -81 -7 6 -36 42 -36 30 -18 -16 -87 128 -25 83 63 -48 -5 48 99 -85 18 -10 -128 -79
12254g9P7n0J57j64J03j5J6k21K45j12M5o7nM6O0k4j39J53O2Q9k40j3O9p6jR3
$$ -79 -2 -52 105 -59 44 29 45 -176 69 -43 2 -65 -70 -24 36 12 -127 26 88 177 -63 -76 -7 -83 -84 9
12280Ij49K47l24K60rRm9j6L3p2m8P0J71o8lj17J10Mj02R2j38P3L6j13P7j1N1
$$ 9 -140 107 -217 43 34 43 -6 -22 11 -61 -109 -39 132 64 61 -56 54 58 -44 48 -90 -17 19 -94 -17 -28 23
12307B3oQ6k13J42j13J05K2j29K2L0P0m1L6p3R9M4j19L5J15k87K06n2o7J13j56
$$ 23 17 103 -110 32 -81 24 46 -83 -61 -31 39 -2 34 -39 60 104 -15 20 135 -152 54 2 -65 48 -108
12332a08J24n8P7Kn8L9j10QK32q8l7r1O2l9M5l8O9K9k64K50o6Rm6J32q1K6n1l7
$$ -108 16 -42 35 37 -21 18 -92 -84 148 60 23 -68 -6 -45 0 -38 31 60 -204 46 -20 -11 -57 75 -6 20 -31 -68
12360f8K0%LJ6N5n7M1O6j25J2N9q3O3M0K4j53J20j34J17k8pJ16j59J34j57J35
$$ -68 -48 -48 -45 -29 26 -31 10 76 -49 -37 22 -61 2 42 66 -87 33 -101 16 -12 -19 97 -62 72 -85 50
12386E0r6q6R6j3j0K1J3l6J44p7J0o8M1K6M1J8r9K4r6Q7rl4J13j9o8m4K2Q0J7
$$ 50 -46 -132 -36 -49 -59 -38 -25 -61 83 6 16 -52 -11 15 56 74 -25 -1 -97 -10 -19 -53 60 41 -27 -71 -49 31 48
12415D8j25J46j19J23r1m5l0N9O6k8l5O2q6K8R2l9l0J8jq7K35j56q8J58p7n6J47
$$ 48 -77 69 -50 73 -18 -63 -93 -34 32 4 -31 31 -55 -27 65 26 -4 14 13 -74 161 5 -83 75 -2 -58 89
12442H9q2m2L7o1l5K2K21j21M2j61J01rl0O9j47M5N1o3Q8J1j13J39J3j96N9O2
$$ 89 7 -35 2 -59 -94 -72 149 28 70 -91 10 1 -29 40 -107 -62 -11 -74 14 25 -88 51 64 -132 -73 -11
12468a1m7j64K70nqn7l5P7q0R8r7M1m1J98j33m5R4n4P4k1l4lj4J35k27O3L5j09
$$ -11 -58 -222 48 43 35 -22 -57 20 -60 38 -59 -18 -59 139 6 -39 55 1 75 54 20 17 3 138 -89 -26 9 -100
12496a00J72j18N5J2L3q5J36j55k6N2j80J42o3P8LNk7Q1n3M9l0%J12n7K8j59J26
$$ -100 72 -46 9 21 54 -31 105 -50 -76 -24 -204 -62 -125 -47 -44 -39 -66 15 -38 11 -19 -19 93 36 64 -95 31
12523C1j26J18m6k5Q4j01J69k00J97M6j76J02n6J2r0L4K0L5k6j9PN8r5J12N1j60
$$ 31 -95 23 -23 -48 36 -65 104 -96 101 147 -29 73 17 29 -61 -27 -7 28 2 -17 -10 48 -47 65 116 -44
12549d4k2l9N6Q3M4o5k5j06O5RO2j9L9l3k9J29j72J7pJ07j9k3JL4o2j07J23Jl0
$$ -44 -66 -105 -49 34 78 13 -12 -118 -53 -44 18 -1 38 5 -24 105 -67 -50 -57 50 31 8 9 43 -19 -126 -3 -2 -32
12578c2L6l9M6j3m3R4J2j9Pj44J9J23pl5q0P6J1kj36J37ln5J7QL3rL1r6P6o6m6
$$ -32 4 -35 11 -2 -45 49 61 42 49 -95 -76 47 40 5 -75 1 12 10 -126 11 8 -47 -30 -22 11 2 33 -63 13 -53 -99
12609i9O8mn6J15n9J80k30P1R7l3j13J46j60P7N1J7Np2L7M8jM0j60K3L2K1Q1j60
$$ -99 -31 -35 -91 24 -35 145 -85 -14 83 50 -63 83 -77 0 51 68 73 1 38 86 85 125 -35 -12 20 41 122 -38
12637c8j17J89KK6r9jR4M7j78K1j5M2n7L0oR3j9MNj80P5K4J10l6j67K79j89N5
$$ -38 -155 34 36 62 -37 -38 56 103 -75 -54 -69 -27 -84 -54 -60 33 14 18 23 -157 -82 -58 52 16 -151 128 -61 -6
12665fJ2m4J8O4o4K5J0qJ4R0j49JM8l4nj01J77k6j5p6J16J14j21j3j19P4n4R3
$$ -6 6 -38 -20 44 -20 5 15 7 21 111 -38 -37 11 -23 -28 -129 48 22 7 -69 47 161 40 27 -92 -18 -72 21
12693B1j59J4J35j6o9M1k9J5Q4J7p8O4n0O5j09r2J64p6l6Q0l7lq3J75Nj2k1k4
$$ 21 -138 -124 11 -5 -74 -33 -62 -47 37 54 -24 40 -10 55 -54 -146 18 -58 -94 -14 -51 -54 -137 38 43 31 10 -14
12721a4p4jN7M5k4L9j14J96o5j84J61p5R9j69N5P6N9p5j03M8N5j06J70k33J96
$$ -14 -88 -89 -32 13 -11 28 -86 110 45 -139 22 -53 46 -123 -68 8 67 -8 -111 -63 -8 -114 56 -177 19
12746A9p0Q0j8p4j6RM1j5M7m5o2Q3j6p8j6J91p1P5o3mqn0K3L6n0J87k00J33Kj33
$$ 19 -51 29 11 -63 -79 -70 -29 -44 3 -42 -104 -21 -37 -115 -131 60 -11 64 1 -3 -11 -61 -38 -2 -52 135 -65 68 70 -63
12776f3M8O0n8L0M8p4M7j34J03m2j28Q4J04k0o6Q9l0R1j53J68j85R8n4p9J04N
$$ -63 -15 45 -13 17 65 -9 38 -96 7 -35 -163 -79 25 5 -61 28 -2 89 -64 104 -81 17 -37 -116 -12 -7
12802gR4j66P5J4o3n9K00j8j12k5M4pL6k6r9J83p6o7J48K4q2Qm2J26k05J35Q2
$$ -7 87 -79 -4 10 -53 -112 88 70 -42 -67 -23 -30 6 -20 -119 64 -12 -79 69 93 11 19 -23 103 -102 33 115
12829A15k25Q3L2O7o2o6l4J39p5J44j71q8M9O6K0J0j2K3k19L8K88j69J30Qj20
$$ 115 -110 -27 5 72 10 -56 -90 49 -26 118 -53 -141 -92 -26 -6 4 -8 15 -204 -166 122 -47 83 91 -29
12854b9j1l3J07j37J03l3oM6p4P0J1m4RK1j2m4J31j60J8J5mpQ8m5L1l3J0P8o0
$$ -29 -40 -73 34 -103 0 -33 -39 7 -67 3 14 -30 -21 0 -12 -56 75 -85 -67 -52 -56 -63 25 -20 11 -22 -12 66 6
12883Fl9m1K5m8J45o2L0jj76J20N0m9k8P4O8k21O4J44J00q2j14N7M4k3k0k3j53
$$ 6 -33 -74 -49 -97 48 -14 16 15 -161 -41 9 -40 -68 6 74 -147 -83 61 161 79 -35 22 66 43 23 0 -153
12910a53J40q2N9K9L7q9M6l4m9J13q1O9J1o8L9k2J28q7m8J36j5m3M2j12O5L8p8
$$ -153 -13 -95 -36 -7 30 -59 -13 -47 -96 17 -64 5 16 -52 -13 -35 93 6 -42 94 79 36 78 -34 31 69 -9
12937ir9J06n8j22J27N8Q4k27N7J09mK3j32P6m0Q4j24M5O6l2L2j05N4l2M5N1k6
$$ -9 -108 -2 -60 -182 -55 3 87 -140 -83 26 22 45 -87 -11 -51 33 -91 -46 20 -12 20 -85 -31 -63 -18 33 7
12964Gj2LJ04j05L1n6O1Kq4Q4n4J23j63q5K03j8k1rP2j59J61r4N1%O6k55J19K3
$$ 7 -5 -2 102 -3 28 -28 33 35 -49 35 -19 104 -59 -144 59 41 20 11 83 -76 85 -9 42 42 108 -147 -28 -5
12992eln9PK4j8J8P4O4r7M4j75J54M5p9N6j01L5J8k4M5l5M6Nj34J47m2P1r6N1
$$ -5 -8 -67 -60 -36 -54 -36 38 102 5 49 -126 28 73 -6 50 -51 -16 2 -22 23 -12 34 39 -95 52 10 81 -15 36
13021C6l3l6j7l1P3J4Kl6o9J36o3o2N0P0n2P1q0R7j38O6o8mJ31r3N8K5O1j75J5
$$ 36 3 -33 -50 -81 -8 6 8 -28 -97 39 -24 -86 -36 34 -18 53 -27 70 -68 -2 -70 -74 57 -36 22 47 108 -67 -52
13050e2r4O4O9j6P1j07J80o5P3j72o2J37j21N1J32r9%oJ2k9O3M1J2k5M5q2o6N0
$$ -52 -146 -82 -13 -29 42 -65 115 50 123 -49 -111 26 -95 -44 88 -11 -11 -17 -5 -34 29 70 82 57 102 20 -46 4
13078Dp2J44m9rqK4o4M5lN3j17P2o7L9L4k7k20J45Q7j59J03m1J45l9O0j25P3k9
$$ 4 -68 76 27 18 10 34 -30 15 12 65 -52 20 -47 -8 26 -1 -221 -76 11 -148 -45 -86 59 20 80 -45 28 -1
13106aj6N2l2k3k5k8%kJ45m8P9m5l2o6n9K7J01q7N1N0m0j91K87j03Q9k70K12j4
$$ -1 -17 35 3 -20 -45 -73 -73 -75 70 22 101 56 24 -42 -101 -74 27 -60 -9 41 1 -190 97 -6 83 -187 25 11
13134A1q2o2J25M9m2p2P2%j23J06L0N8j23k0J00l5o0Qj9J20n6n3k6k4J37rL7m5
$$ 11 -71 -133 -8 41 -1 -73 -1 -1 -124 -18 12 70 -53 -73 27 -8 -68 -60 -79 41 -15 -68 -94 -118 19 10 47 2
13162BJJ6N5M3j00O5l8J0o0J10j80Mj9R2K9r8J5m1J7n7J22k4K7J4L6o9L7j69J64
$$ 2 3 19 74 117 17 82 44 54 -6 104 -76 -72 -91 1 30 -68 -53 -94 -77 -134 -12 -36 -9 5 41 -28 9 -160 4
13191Do0P2p8QJ26l7j44P8P6K4q8M4N6j12R9j05j09J15PlP4M6r3%l2K9M6p8kk7
$$ 4 -56 16 -62 -54 72 35 -109 -31 45 69 -19 25 81 -31 68 -37 -146 -31 -24 -27 47 93 0 0 -32 -3 43 -35 -37 -64
13221f4N7o6J85mj68M9k6Rj02M6O0p2J25m9k1L4j5lj5n6J35j08P6N2j12J24nj22
$$ -64 -7 -73 112 108 -60 -11 -37 -28 -130 -84 -24 -96 29 -20 -41 -7 -22 -25 -40 -96 39 -69 7 59 -53 71 66 -56
13249e6O3o3o1J45O4k9No8M8o5N9o1m8N9o0K22j37O8m7O9q9pOK3j77J05L3p2K2
$$ -56 7 -56 -117 28 92 63 68 0 48 -17 42 -19 -67 -8 -68 154 17 85 38 107 18 11 17 40 -137 -32 1 -71 -49
13278d9J8k6J1P4N2k01LR5J8J55j85K0Jj28J97l1k6q3J82j26L5j01J87j88J34
$$ -49 -31 -57 -46 28 80 -121 -118 -23 -5 150 -35 -15 -14 -142 55 24 -2 -85 97 -29 6 -95 92 -96 38
13303C8m9l8R1L4o3K4k7P9j92J78j28MR5m3M9K2j20o5P8J11j73J0P1p3J44l9o7
$$ 38 -11 -49 42 76 13 37 10 89 -103 75 -53 -49 46 3 52 74 -46 -111 -33 78 -95 -85 -14 -87 57 18 -49
13330d9J6j51J47R0p6L6P7q1P1l4p4J02m2o4lK4n8o4O4M2M8k5j20J51j5l4m8P9
$$ -49 -33 -184 -37 53 -23 13 90 9 80 46 -28 74 32 -32 -35 -11 -69 -133 -69 -27 21 -4 -124 27 12 -22 -70 9
13358IoP3j7j6j03J23j17R5o3l2N8j03K6J7m7N6m9K6K2Kr6J30K9m2M1j34Q3q4
$$ 9 3 76 59 43 -60 63 -54 41 -22 -54 4 -99 -73 -56 -103 -47 -96 -70 -48 -46 -142 -12 17 -25 16 -118 -35 -119
13386a19J51J4o6J6r2O3N5j11K00j19J01k4j57J38J2o5l8l6N9k5L3l5o8R7O1n9
$$ -119 32 46 -20 -4 -96 -33 22 -89 111 -8 93 69 -88 50 62 -3 -41 -77 -18 -43 -10 -45 -113 -16 45 -14
13412a4l9j3J59l3Mj67J40m9j2p4J36M5m1J01j83j03J95j22L7Mj72J95q4J04O
$$ -14 -53 -66 93 60 64 -103 37 -12 -24 -98 38 83 42 143 -40 -143 52 -70 -33 -29 -201 -6 -90 14 20
13437B0KJ8L8o4Q5R2k35J05l5L6P7j08j6q8RJ03r5K2O8j50J29K2K1n6k0q8J45
$$ 20 22 40 78 14 99 191 -44 61 26 62 139 31 15 -73 -64 39 -56 -34 34 -116 13 35 56 0 -20 -108 37
13464C7j07j28K24k6onn7Q1j32J09K7j7K9Kj32Q0J8j31J8J32j07J88j53O3pj32
$$ 37 -70 -198 26 0 -6 -11 -68 13 -119 -10 17 0 29 31 -101 -21 -3 -134 -116 16 -91 97 -56 7 0 -132
13490a32J55l4J16p0l1j57J59J23j92J21k4k3l4K3m5P8N1j39l9K0Q2k8K8J3o7
$$ -132 23 -11 105 35 4 -153 6 129 -63 58 34 11 -23 0 -45 33 84 -55 -94 -74 8 -20 8 21 -46
13515d6K4j26N9M1Qpl0R8l5Q7P5o4o4r5O5rR3m8j34L2rJ68m4L1k27J98M6j43J43
$$ -46 -22 -148 -89 -48 -40 -47 -77 21 -14 73 148 84 20 -75 -10 -19 74 26 -108 -76 -85 83 39 70 -157 41 87 -56 87
13544H7j15q4R8K1j9R8o2opro0k2K2NJ9oJ3L5j22Q2J13j00j10L3J31j08J14r1
$$ 87 -28 -112 -14 7 -12 86 24 18 11 2 -58 -80 -58 -53 -34 -40 -27 8 -114 -32 81 -19 -129 -96 35 -73 41 -50
13572e0P2r1k1K00j04j8l9L7l0L4j02J79m1q7R1p4L5J89j53j3M9o5L5M6r9j90
$$ -50 22 -69 -90 110 6 -12 -51 -14 -44 -10 -112 67 26 -61 30 -44 -9 180 27 14 63 -2 33 79 -20 -210
13598b10L8K50j90J2O2R1Jm2j33l4J59L8L0k03J06k8K9PN4o8N7j27J17l4l0P9
$$ -210 -172 78 -112 -100 -38 53 54 12 -121 -155 4 42 72 -131 -25 -53 -24 -17 37 -31 26 -101 16 -18 -48 31
13624C1L1J8o9pj3M8o6r6j3K13l3p4n0R8r4P0Q3j7qm1N8j02J6M5k1o7K9J0l3m7
$$ 31 62 80 11 4 -9 39 -27 -123 -136 77 44 -30 -80 18 -76 -6 77 60 52 11 69 -33 -17 28 7 -60 -31 -21 -54 -101
13654a01J51k4J3p3R0j03Q2M7K0nq0M2j22Q7l3l8M7j53l4K07k9L7q9J2P2m8k7
$$ -101 50 26 39 -34 56 -47 35 82 102 97 17 59 -63 24 -9 -47 0 -153 -187 20 -9 28 -61 -49 23 -25 -52
13681e2j6J32r8k4J69j60MJ08r2Q2j2r0j1Q4Pj80J06J35m2q8q1N7J92j17M5j23
$$ -52 -68 64 -34 -58 111 -49 -45 63 -29 53 41 -49 -60 24 31 -149 -43 92 50 -38 -119 -62 130 13 58 -65
13707f5Q2l8K4mN9q6O5J20q8M5j94N6m3J30j2j11K2M7k3N7o1j11N7KN6K1p5J8
$$ -65 17 -21 3 -1 58 -28 37 157 69 114 -80 -24 -67 63 51 -60 -38 9 -14 43 -18 -129 -72 -70 -14 7 -68 -50
13735e0J4N7o9N8lj7O5r7R6p7J8R9q1N3r9k6O5k9j14J26J9o2N8n1N1Rj14m2J52
$$ -50 -36 21 -48 10 7 -10 55 -42 54 -23 -5 94 13 66 -33 -59 6 -23 -137 -11 8 -54 4 -47 4 13 -101 -143 9
13764Ir5O3R3j82K6P3Q9o1R5j66l7J00M1n3R7P7k00L6pj27J59Jq9J11j10L7J68
$$ 9 -86 -23 70 -112 -86 -13 76 15 110 -56 -93 7 48 -5 92 169 -31 5 -2 -129 30 31 -58 53 -57 -20 148
13791A48j26j6J2j7k5k5j5Q9J4n8O3m3m2Pj12Q8M3j13J30k6K4J0J9MPj8J7p9J38
$$ 148 22 6 18 1 -24 -49 -64 25 39 -19 44 1 -41 -34 -146 -58 -15 -128 2 -24 0 10 29 33 40 22 39 -40 98
13820I8m6r4Q6k3%m6M9O9r0R6j07J08p8l3j7K3j6RP9m1K3q3J09r4p9P7O0r2qJ09
$$ 98 52 -42 44 21 21 -25 24 93 3 99 -8 100 22 -11 -28 -5 -21 -12 67 26 49 -34 75 -19 -98 -21 39 -53 -61 48
13850D8n0r2J78q4kJ8R2j55J7m3QK8M6m8K8nQ8Q3l0q7q8J14n8M6q4n0J21r2j1
$$ 48 -2 -94 84 0 -2 16 108 -47 -30 -73 -65 -37 9 -39 -11 -16 72 155 125 38 -50 64 6 52 -32 -82 39 -53 -64
13879f4J86k8q3l0j23J02J19k3l5oM0l8Q0q8Nlpk5o8P7K7r0N4R1p4J04n6j25P5
$$ -64 122 94 11 -19 -142 -40 79 56 21 15 55 17 97 9 14 11 4 -21 -89 -12 15 -75 -21 70 -4 100 44 -81 -6
13908fP7j46J18o1K7l3O5K9j75J48J7l0q6m2K79k06L7Mn4p7j2K77k05J30j06M4
$$ -6 71 -75 43 -18 9 -24 41 70 -105 43 60 30 -56 -98 181 -25 12 16 -38 -115 -127 150 -55 75 -31 13
13934A3j9J9j9Ko8J20k17J37N9Pm9o5J04L5j03J1j15J04J2J21N3q6j36N8m9L4
$$ 13 -6 13 -6 -4 -72 48 -169 -32 27 34 -15 -80 24 59 -44 -33 -148 -44 -32 89 142 56 -80 -22 -71 -37
$$ [...]
16383D5
##END NTUPLES=NMR FID
##END=
