##TITLE=abcd
##JCAMPDX= 6.0         $$ Bruker NMR JCAMP-DX V2.0
##DATA TYPE= NMR SPECTRUM
##DATA CLASS= NTUPLES
##ORIGIN= UXNMR, Bruker Analytische Messtechnik GmbH
##OWNER= root
$$ XWIN-NMR		Version 3.5
$$ Thu Oct 16 13:01:22 2025 Russian Standard Time (UT+4h)  servis@DPX200
##.OBSERVE FREQUENCY= 200.131235884673
##.OBSERVE NUCLEUS= ^1H
##.ACQUISITION MODE= SIMULTANEOUS
##.ACQUISITION SCHEME= undefined
##.AVERAGES= 32
##.DIGITISER RES= 18
##SPECTROMETER/DATA SYSTEM= spect
##.PULSE SEQUENCE= zg
##.SOLVENT NAME= CDCl3
##.SHIFT REFERENCE= (INTERNAL, CDCl3, 0, 16.4885)
##AUDIT TRAIL= $$ (NUMBER, WHEN, WHO, WHERE, WHAT)
$$ ##TITLE= Audit trail, XWIN-NMR		Version 3.5
$$ ##JCAMPDX= 5.01
$$ ##ORIGIN= Bruker BioSpin GmbH
$$ ##OWNER= servis
$$ F:\spectra/data/av/nmr/H1/1/pdata/1/auditp.txt
$$ ##AUDIT TRAIL=  $$ (NUMBER, WHEN, WHO, WHERE, WHAT)
(   1,<2025-10-16 13:00:53.89 +0400>,<servis>,<DPX200>,
      <created by zg, POWCHK disabled, PULCHK disabled
       configuration hash MD5:
       00 E9 B6 7A A2 85 ED C7 34 08 36 98 17 FE 4E 26
       data hash MD5: 32K
       AB 4C 68 25 49 56 67 0D 70 E9 B3 25 74 93 08 1C>)
(   2,<2025-10-16 13:00:55.34 +0400>,<servis>,<DPX200>,
      <Start of raw data processing
       efp BC_mod = 2 LB = 0.05 FT_mod = 6 PKNL = 1 PHC0 = -271.6701 PHC1 = 2.101565 SI = 16K 
       data hash MD5: 16K
       6C 6E 49 49 80 F0 7F 28 05 8D 53 95 23 6C 27 BA>)
$$ ##END=
$$ 
$$ hash MD5
$$ 58 8F 8C 66 CC 5C 29 6C 2A 22 E9 9A 52 BD BD F1
##$RELAX= 
##$RELAX= 
##$RELAX= 
##$RELAX= 
##$RELAX= 
##$RELAX= 
##$RELAX= 
##$RELAX= 
$$ Bruker specific parameters
$$ --------------------------
##$DU= <F:\spectra>
##$EXPNO= 1
##$NAME= <H1>
##$PROCNO= 1
##$TYPE= <nmr>
##$USER= <av>
##$AMP= (0..31)
100 100 100 100 100 100 100 100 100 100 100 100 100 100 100 100 100 100 
100 100 100 100 100 100 100 100 100 100 100 100 100 100 
##$AQSEQ= 0
##$AQ_mod= 1
##$AUNM= <au_zg>
##$AUTOPOS= <>
##$BF1= 200.13
##$BF2= 200.13
##$BF3= 200.13
##$BF4= 200.13
##$BF5= 500.13
##$BF6= 500.13
##$BF7= 500.13
##$BF8= 500.13
##$BYTORDA= 1
##$CFDGTYP= 0
##$CFRGTYP= 5
##$CHEMSTR= <none>
##$CNST= (0..31)
1 1 145 1 1 1 1 1 1 1 1 1 1 1 1 1 1 1 1 1 1 1 1 1 1 1 1 1 1 1 1 1 
##$CPDPRG= <>
##$CPDPRG1= <>
##$CPDPRG2= <>
##$CPDPRG3= <>
##$CPDPRG4= <mlev>
##$CPDPRG5= <mlev>
##$CPDPRG6= <mlev>
##$CPDPRG7= <mlev>
##$CPDPRG8= <mlev>
##$CPDPRGB= <>
##$CPDPRGT= <>
##$D= (0..31)
0 2 0 0 0 0 0 0 0 0.06 0 0 0 0 0 0 0.0002 0 0 0 0 0 0 0 0 0 0 0 0 0 0 
0 
##$DATE= 1760605253
##$DBL= (0..7)
120 120 120 120 120 120 120 120 
##$DBP= (0..7)
150 150 150 150 150 150 150 150 
##$DBP07= 0
##$DBPNAM0= <>
##$DBPNAM1= <>
##$DBPNAM2= <>
##$DBPNAM3= <>
##$DBPNAM4= <>
##$DBPNAM5= <>
##$DBPNAM6= <>
##$DBPNAM7= <>
##$DBPOAL= (0..7)
0.5 0.5 0.5 0.5 0.5 0.5 0.5 0.5 
##$DBPOFFS= (0..7)
0 0 0 0 0 0 0 0 
##$DE= 6
##$DECBNUC= <off>
##$DECIM= 32
##$DECNUC= <off>
##$DECSTAT= 4
##$DIGMOD= 1
##$DIGTYP= 9
##$DL= (0..7)
0 120 120 120 120 120 120 120 
##$DP= (0..7)
150 150 150 150 150 150 150 150 
##$DP07= 0
##$DPNAME0= <>
$$ [...]
##$SUBNAM4= <"">
##$SUBNAM5= <"">
##$SUBNAM6= <"">
##$SUBNAM7= <"">
##$SUBNAM8= <"">
##$SUBNAM9= <"">
##$SW= 20.6817932712277
##$SWIBOX= (0..15)
0 0 3 0 0 0 0 0 0 0 0 0 0 0 0 0 
##$SW_h= 4139.07284768212
##$TD= 32768
##$TD0= 1
##$TE= 0
##$TE2= 300
##$TE3= 300
##$TEG= 300
##$TL= (0..7)
0 120 120 120 120 120 120 120 
##$TP= (0..7)
150 150 150 150 150 150 150 150 
##$TP07= 0
##$TPNAME0= <>
##$TPNAME1= <>
##$TPNAME2= <>
##$TPNAME3= <>
##$TPNAME4= <>
##$TPNAME5= <>
##$TPNAME6= <>
##$TPNAME7= <>
##$TPOAL= (0..7)
0.5 0.5 0.5 0.5 0.5 0.5 0.5 0.5 
##$TPOFFS= (0..7)
0 0 0 0 0 0 0 0 
##$TUNHIN= 0
##$TUNHOUT= 0
##$TUNXOUT= 0
##$USERA1= <user>
##$USERA2= <user>
##$USERA3= <user>
##$USERA4= <user>
##$USERA5= <user>
##$V9= 5
##$VALIST= <valist>
##$VCLIST= <CCCCCCCCCCCCCCC>
##$VD= 0
##$VDLIST= <DDDDDDDDDDDDDDD>
##$VPLIST= <PPPPPPPPPPPPPPP>
##$VTLIST= <TTTTTTTTTTTTTTT>
##$WBST= 1024
##$WBSW= 30
##$XGAIN= (0..3)
0 0 0 0 
##$XL= 0
##$YL= 0
##$YMAX_a= 169575
##$YMIN_a= -122094
##$ZGOPTNS= <>
##$ZL1= 120
##$ZL2= 120
##$ZL3= 120
##$ZL4= 120
##$ABSF1= 0
##$ABSF2= 0
##$ABSG= 0
##$ABSL= 0
##$ALPHA= 0
##$AQORDER= 0
##$ASSFAC= 0
##$ASSFACI= 0
##$ASSFACX= 0
##$ASSWID= 0
##$AUNMP= <proc_1d>
##$AZFE= 0.1
##$AZFW= 0.1
##$BCFW= 0
##$BC_mod= 2
##$BYTORDP= 0
##$COROFFS= 0
##$CY= 18.4799938201904
##$DATMOD= 1
##$DC= 0
##$DFILT= <>
##$DTYPP= 0
##$F1P= 9.9274215381318
##$F2P= -0.165520771350173
##$FCOR= 1
##$FTSIZE= 16384
##$FT_mod= 6
##$GAMMA= 0
##$GB= 0
##$INTBC= 1
##$INTSCL= 4.127829e-11
##$ISEN= 128
##$LB= 0.05
##$LEV0= 0
##$LPBIN= 0
##$MAXI= 10000
##$MC2= 0
##$MEAN= 0
##$ME_mod= 0
##$MI= 50
##$NCOEF= 0
##$NC_proc= -7
##$NLEV= 6
##$NOISF1= 3.799351
##$NOISF2= 2.8
##$NSP= 0
##$NTH_PI= 0
##$NZP= 0
##$OFFSET= 16.48848
##$PC= 4
##$PHC0= -271.6701
##$PHC1= 2.101565
##$PH_mod= 1
##$PKNL= yes
##$PPARMOD= 0
##$PSCAL= 4
##$PSIGN= 0
##$REVERSE= no
##$SF= 200.130005582386
##$SI= 16384
##$SIGF1= 3
##$SIGF2= 2
##$SINO= 400
##$SIOLD= 16384
##$SREGLST= <1H.CDCl3>
##$SSB= 0
##$STSI= 16384
##$STSR= 0
##$SW_p= 4139.07284768211
##$SYMM= 0
##$S_DEV= 0
##$TDeff= 32768
##$TDoff= 0
##$TI= <>
##$TILT= no
##$TM1= 0
##$TM2= 0
##$TOPLEV= 0
##$USERP1= <user>
##$USERP2= <user>
##$USERP3= <user>
##$USERP4= <user>
##$USERP5= <user>
##$WDW= 1
##$XDIM= 16384
##$YMAX_p= 289431554
##$YMIN_p= -1183552
$$ End of Bruker specific parameters
$$ ---------------------------------
##NTUPLES= NMR SPECTRUM
##VAR_NAME=  FREQUENCY,     SPECTRUM/REAL,   SPECTRUM/IMAG
##SYMBOL=    X,             R,               I
##VAR_TYPE=  INDEPENDENT,   DEPENDENT,       DEPENDENT
##VAR_FORM=  AFFN,          ASDF,            ASDF
##VAR_DIM=   16384,         16384,           16384
##UNITS=     HZ,            ARBITRARY UNITS, ARBITRARY UNITS
##FACTOR=    0.252644378177508, 1,           1
##FIRST=     3299.83951724647, 0,            0
##LAST=      -839.233330435636, 0,           0
##MIN=       -839.233330435636, -1183552,    0
##MAX=       3299.83951724647, 289431554,    0
$$ Real data points
##PAGE= N=1
##DATA TABLE= (X++(R..R)), XYDATA
$$ [...]
$$ plain form
10263 -36641 -122159 -40674 -157787 159750 317975 186326 -212068 97015 267695 339806
10253 339806 -2862 -27405 179484 153557 218953 67556 -45487 -190889 7976 -22527
10243 -22527 185339 148991 77761 78902 214127 22436 170179 13164 -331656 50414
10233 50414 -176106 227623 244066 78805 -163542 29374 164291 94250 231150 -189365
10223 -189365 -303799 543159 -237298 -218034 97083 -79459 263331 113070 101284 443014
10213 443014 -237588 -29017 -28702 217073 446061 40029 374373 -85234 6661 200861
10203 200861 538140 12332 -57615 -55712 -76010 -130230 -78729 17695 -251055 -10763 414649
10192 414649 182621 3373 -204704 -23674 7069 253469 156633 463207 79700 -301408
$$ packed form
10263c6641q5518Q1485j17113L17537J58225j31649l98394L09083J70680P2111
10253C39806l42668k4543K06889k5927O5396j51397j13043j45402J98865l0503
10243b2527K07866l6348p1230J141J35225j91691J47743j57015l44820L82070
10233E0414k26520M03729J6443j65261k42347J92916J34917p0041J36900m20515
10223a89365j14434Q46958p80457J9264L15117j76542L42790j50261j1786L41730
10213D43014o80602K08571L15K45775K28988m06032L34344m59607R1895J94200
10203B00861L37279n25808o9947J903k0298n4220N1501R6424k68750K40292M25412
10192D14649k32028j79248k08077J81030L0743K46400r6836L06574l83507l81108
$$ plain form
10182 -301408 58223 191 15805 -57034 -221898 -234586 -17882 -186852 47406 352207
10172 352207 433351 -52717 407780 20190 -212865 -17593 -113106 34468 171577 -59558
10162 -59558 -51183 -35357 -216866 57984 -17992 88151 -211686 -93686 239474 73487
10152 73487 262314 -55074 382735 -43656 -25770 159377 -44682 -6038 109112 -114295
10142 -114295 177166 187857 -30833 -105552 -99860 -22548 -15133 -155768 -33800 87702 -40609
10131 -40609 216091 -76993 29160 223035 -6504 -221652 148035 397197 210917 327384
10121 327384 182787 195901 -314469 278934 -227279 -36375 71565 99376 81078 -223866
10111 -223866 -101726 -124693 -80189 132898 146241 -217149 306896 -97699 226015 27291
$$ packed form
10182c01408L59631n8032J5614p2839j64864j2688K16704j68970K34258L04801
10172C52207Q1144m86068M60497l87590k33055J95272r5513J47574J37109k31135
10162e9558Q375J5826j81509K74850p5976J06143k99837J18000L33160j65987
10152G3487J88827l17388M37809m26391J7886J85147k04059L8644J15150k23407
10142a14295K91461J0691k18690p4719N692P7312P415j40635J21968J21502j28311
10131d0609K56700k93084J06153J93875k29539k15148L69687K49162j86280J16467
10121C27384j44597J3114n10370N93403n06213J90904J07940K7811j8298l04944
10111b23866J22140k2967M4504K13087J3343l63390N24045m04595L23714j98724
$$ plain form
10101 27291 128572 114601 270870 42384 -33547 13161 -155473 65568 -71660 -97156
10091 -97156 48404 41434 111341 -182582 184905 158805 14230 34383 -57494 42973 325050
10080 325050 368876 298432 253548 -1876 -262575 -254631 -115861 -234894 -492009 187119
10070 187119 276143 212812 -239656 -48372 -112472 23387 -118610 -136845 36265 108545
10060 108545 -175600 422591 -234535 -174284 -127393 491227 276558 92568 -136084 113779
10050 113779 -440343 -64637 90002 416439 219679 241615 93422 -17209 7090 -5343
10040 -5343 -214678 147823 56187 -124411 346109 463878 -14633 -485133 -10195 -51447
10030 -51447 181654 -421389 -152049 31100 296164 -76270 65708 -346645 -89861 422635
$$ packed form
10101B7291J01281j3971J56269k28486p5931M6708j68634K21041j37228k5496
10091i7156J45560o970O9907k93923L67487k6100j44575K0153r1877J00467K82077
10080C25050M3826p0444m4884k55424k60699P944J38770j19033k57115O79128
10070A87119Q9024o3331m52468J91284o4100J35859j41997j8235J73110P2280
10060A08545k84145N98191o57126O0251M6891O18620k14669j83990k28652K49863
10050A13779n54122L75706J54639L26437j96760K1936j48193j10631K4299j2433
10040e343k09335L62501r1636j80598M70520J17769m78511m70500M74938m1252
10030e1447K33101o03043K69340J83149K65064l72434J41978m12353K56784N12496
$$ plain form
10020 422635 -168783 -163977 336206 -157566 44492 338670 -53142 -107632 193412 16572
10010 16572 3980 -295878 342071 -108093 119684 -198357 169992 -72060 106527 408949
10000 408949 196555 -148541 45781 -230925 -4980 -255278 6104 -95066 568414 85226
9990 85226 209735 -193105 99648 16722 206177 179006 179424 476848 -88575 258361 -73700
9979 -73700 -24959 192861 151594 -67462 -3419 182569 107044 197320 306112 114965 -70594
9968 -70594 245572 57377 -23919 4481 -54533 59716 -2149 72760 -58929 -130824 30664
9957 30664 -18202 -71779 -150947 -42691 79201 157833 35232 68816 276281 -172464 -303681
9946 -303681 406093 396117 166382 510088 429359 -88122 358874 -44044 447896 62721
$$ packed form
10020D22635n91418M806N00183m93772K02058K94178l91812n4490L01044j76840
10010A6572j2592k99858O37949m50164K27777l18041L68349k42052J78587L02422
10000D08949k12394l45096J94322k76706K25945k50298K61382j01170O63480m83188
9990H5226J24509m02840K92753q2926J89455k7171M18K97424n65423L46936l32061
9979g3700M8741K17820m1267k19056O4043J85988p5525R0276J08792j91147j85559
9968g0594L16166j88195q1296K8400n9014J14249o1865P4909j31689p1895J61488
9957C0664m8866n3577p9168J08256J21892P8632j22601L3584K07465m48745j31217
9946c03681P09774r976k29735L43706q0729n17481M46996m02918M91940l85175
$$ plain form
9936 62721 26348 161520 75461 181330 -179777 74400 491696 281511 -239469 443872
9926 443872 -213608 -129346 103221 -17140 -85090 192485 128460 129534 -19477 -204495 234794
9915 234794 -206336 -63748 362752 -53751 2978 -48154 -243732 394917 -47808 103162
9905 103162 13625 134087 -118123 49092 142530 -247788 -30959 276152 44163 4034
9895 4034 -272114 -338080 108996 399136 49467 268969 502533 205068 117108 -207544
9885 -207544 165930 -354004 -118992 -16455 156053 24837 147727 -75910 97192 -417116
9875 -417116 -34345 -107088 247971 32516 -65338 -19880 -68564 166249 35823 154528
9865 154528 90548 103445 241060 2845 -116932 -121267 86036 132019 51928 -186473 109491
$$ packed form
9936F2721l6373J35172q6059J05869l61107K54177M17296k10185n20980O83341
9926D43872o57480Q4262K32567j20361o7950K77575o4025J074j49011j85018M39289
9915B34794m41130J42588M26500m16503N6729n1132j95578O38649m42725J50970
9905A03162q9537J20462k52210J67215R3438l90318K16829L07111k31989m0129
9895D034k76148o5966M47076K90140l49669K19502K33564k97465q7960l24652
9885b07544L73474n19934K35012J02537J72508j31216J22890k23637J73102n14308
9875d17116L82771p2743L55059k15455r7854M5458m8684K34813j30426J18705
9865A54528o3980J2897J37615k38215j19777m335K07303M5983q0091k38401K95964
$$ plain form
9854 109491 160553 480327 106345 44706 -211321 -215275 -249864 16744 -3569 26497 52261
9843 52261 127884 -143972 294096 -308893 59749 315960 -75452 56537 46110 57852
9833 57852 124728 267643 -4028 -347701 -219211 -70673 138338 -16790 261989 500501
9823 500501 31757 -12876 177231 108827 288297 -105247 193065 -116064 150588 174294
9813 174294 102819 -11290 -103708 -100416 253308 265462 231560 -119478 -16961 -15651 -87396
9802 -87396 -131009 -300574 4240 190820 -446777 53435 245141 299634 204784 286628 6404
9791 6404 -253113 437855 642495 -18561 303492 344996 -127752 -227861 -54250 122107
9781 122107 18183 -16726 -38975 -384784 -356823 88351 -75106 325499 -48213 -149932
$$ packed form
9854A09491N1062L19774l73982o1639k56027l954l4589K66608k0313L0066K5764
9843E2261P5623k71856M38068o02989L68642K56211l91412J31989j0427J1742
9833E7852O6876J42915k71671l43673J28490J48538K09011j55128K78779K38512
9823E00501m68744m4633J90107o8404J79470l93544K98312l09129K66652K3706
9813A74294p1475j14109r2418L292L53724J2154l3902l51038J02517J310p1745
9802h7396m3613j69565L04814J86580o37597N00212J91706N4493r4850Q1844k80224
9791F404k59517O90968K04640o61056L22053M1504m72748j00109J73611J76357
9781A22107j03924l4909k2249l45809K7961M45174j63457M00605l73712j01719
$$ plain form
9771 -149932 -107873 -373045 -452962 -29558 -40383 18463 314660 121451 257164 -5128
9761 -5128 32460 -172461 248008 -291246 -187287 349472 372735 136768 -165495 -4018
9751 -4018 113887 169065 -265642 101217 206209 -35419 -38375 -64596 2525 93386 -258215
9740 -258215 137061 -124024 176775 153636 -30397 85135 -110952 -480178 -23077 -43535
9730 -43535 -289122 -276578 181390 82343 178004 -23882 79962 242340 209599 70367 67191
9719 67191 79983 9996 51176 28672 182712 -214362 342628 26098 51335 352143 153684
9708 153684 287288 133229 -197470 15463 -187480 254483 109124 240061 112955 -57601
9698 -57601 94913 -20072 238978 322602 139938 109135 -186502 -340709 175620 217270
$$ packed form
9771a49932M2059k65172p9917M23404j0825N8846K96197j93209J35713k62292
9761e128L7588k04921M20469n39254J03959N36759K3263k35967l02263J61477
9751d018J17905N5178m34707L66859J04992k41628k956k6221O7121R0861l51601
9740b58215L95276k61085L00799k3139j84033J15532j96087l69226M57101k0458
9730d3535k45587J2544M57968r9047R5661k01886J03844J62378l2741j39232l176
9719F7191J2792o9987M1180k2504J54040l97074N56990l16530K5237L00808j98459
9708A53684J33604j54059l30699K12933k02943M41963j45359J30937j27106j70556
9698e7601J52514j14985K59050Q3624j82664l0803k95637j54207N16329M1650
$$ plain form
9688 217270 -83815 130934 -259513 -115603 221222 59709 345530 182807 16020 375411
9678 375411 -32194 -62986 221668 602309 290168 -99208 -219647 299261 417298 313888
9668 313888 -135899 205827 -88646 212987 233428 -257824 -572461 -50733 119358 -109765
9658 -109765 -9231 394683 79254 160946 60439 295149 172969 -116904 -152394 141006
9648 141006 61741 241346 146957 85652 364485 -94607 326180 144051 -190001 -34785
9638 -34785 -62240 220831 68890 -116540 -136061 -112773 -66323 -43232 -60715 251202 -216452
9627 -216452 12534 101025 -11927 78349 4347 346531 28959 177086 307925 7444
9617 7444 97013 -10497 197530 -126145 662329 359859 20254 298147 -54893 -26003
$$ packed form
9688B17270l01085K14749l90447J43910L36825j61513K85821j62723j66787L59391
9678C75411m07605l0792K84654L80641l12141l89376j20439N18908J18037j03410
9668C13888m49787L41726k94473L01633K0441m91252l14637N21728J70091k29123
9658a09765J00534M03914l15429Q1692j00507K34710j22180k89873l5490K93400
9648A41006p9265J79605r4389o1305K78833m59092M20787j82129l34052J55216
9638c4785k7455K83071j51941j85430j9521K3288M6450K3091j7483L11917m67654
9627b16452K28986Q8491j12952R0276p4002L42184l17572J48127J30839l00481
9617G444Q9569j07510K08027l23675P88474l02470l39605K77893l53040K8890
$$ plain form
9607 -26003 -6283 267247 -22545 321094 201900 -59297 627681 151623 180707 113124
9597 113124 9732 319143 -73328 -34306 321719 -16617 94963 49883 242700 165293
9587 165293 -95021 -32759 -182929 20155 289402 -47782 -101691 272152 191718 144043
9577 144043 267609 -60821 -201229 92147 -18584 223534 -37145 32197 649550 85332
9567 85332 349197 386314 234891 192853 255707 -194679 -105757 188826 104826 193678 341902
9556 341902 66014 -70508 -36449 -49349 173762 56648 -188993 -175543 299480 344450
9546 344450 -84312 346640 376208 205744 358709 296208 -29117 223305 42112 -131180
9536 -131180 162718 150187 139931 423098 152114 211593 223904 147965 -68106 -145742 130354
$$ packed form
9607b6003J9720K73530k89792L43639j19194k61197O86978m76058K9084o7583
9597A13124j03392L09411l92471L9022L56025l38336J11580m5080J92817p7407
9587A65293k60314O2262j50170K03084K69247l37184n3909L73843q0434m7675
9577A44043J23566l28430j40408K93376j10731K42118k60679O9342O17353n64218
9567H5332K63865L7117j51423m2038O2854m50386Q8922K94583q4000Q8852J48224
9556C41902k75888j36522L4059j2900K23111j17114k45641J3450M75023M4970
9546C44450m28762M30952K9568j70464J52965o2501l25325K52422j81193j73292
9536a31180K93898j2531j0256K83167k70984N9479J2311p5939k16071p7636K76096
$$ plain form
9525 130354 404397 -72852 236209 -21334 24539 394671 23119 361158 347530 96799
9515 96799 212898 -187144 -74680 -80077 130493 15661 385811 44503 -77918 105877
9505 105877 155294 53473 56195 199895 -133527 23530 610297 224977 47743 144897
9495 144897 -152265 -138535 35052 75608 399399 89503 53634 13781 84246 -131533 128500
9484 128500 -528366 -19873 231714 188746 242924 -15492 72740 200068 183469 222860 432162
9473 432162 291927 73981 -20821 113467 320314 124784 325007 196738 -17582 97827
9463 97827 256469 -68044 -243153 127433 -1001 214895 204181 284302 -167220 258969
9453 258969 -74349 -319166 294567 -25076 127594 -93423 36153 -29401 93702 37242
$$ packed form
9525A30354K74043m77249L09061k57543M5873L70132l71552L38039j3628k50731
9515I6799J16099m00042J12464n397K10570j14832L70150l41308j22421J83795
9505A05877M9417j01821K722J43700l33422J57057N86767l85320j77234R7154
9495A44897k97162J3730J73587M0556L23791l09896l5869l9853P0465k15779K60033
9484A28500o56866N08493K51587m2968N4178k58416Q8232J27328j6599L9391K09302
9473D32162j40235k17946r4802J34288K06847j95530K00223j28269k14320J15409
9463I7827J58642l24513j75109L70586j28434K15896j0714Q0121m51522M26189
9453B58969l33318k44817O13733l19643J52670k21017J29576o5554J23103n6460
$$ plain form
9443 37242 311780 314876 164815 21127 92885 144705 -167742 -197580 -21645 158332 -37482
9432 -37482 -118193 48996 157215 -140356 351109 -286449 307449 -120244 321843 97429
9422 97429 197200 -8174 42356 -272107 156344 131417 96041 126045 410183 -65925 85438
9411 85438 178466 62398 20037 419865 -63468 235535 213108 182358 312680 35458 -74497
9400 -74497 88067 -181441 249993 248859 236204 206996 25474 124872 293528 105947 -29955
9389 -29955 110020 315495 266026 190491 67028 349592 16490 160475 349883 128166
9379 128166 183622 -83173 246998 -143194 13738 106411 -143325 16931 290466 343378
9369 343378 -96661 125075 443014 238169 80935 327706 110881 -64474 161862 547952
$$ packed form
9443C7242K74538L096j50061j43688P1758N1820l12447k9838J75935J79977j95814
9432c7482q0711J67189J08219k97571M91465o37558N93898m27693M42087k24414
9422I7429R9771k05374N0530l14463M28451k4927l5376L0004K84138m76108J51363
9411H5438R3028j16068m2361L99828m83333K99003k2427l0750J30322k77222j09955
9400g4497J62564k69508M31434j134j2655k9208j81522R9398J68656j87581j35902
9389b9955J39975K05475m9469p5535j23463K82564l33102J43985J89408k21717
9379A28166N5456k66795L30171l90192J56932R2673k49736J60256K73535N2912
9369C43378m40039K21736L17939k04845j57234K46771k16825j75355K26336L86090
$$ plain form
9359 547952 -186312 145417 85528 424129 65668 243399 228215 228853 269207 270338 122755
9348 122755 90151 392940 -352394 388932 238236 154700 206481 283267 516683 -52494
9338 -52494 35753 186982 164492 -133418 17237 155850 111052 87513 -152999 220378 155243
9327 155243 184818 234475 672451 29363 114004 219765 -10392 228933 74744 46639
9317 46639 238860 237029 -258585 -240226 203807 189428 404526 331383 -288307 140296 12125
9306 12125 263529 127375 354004 35293 364520 -17825 324215 231988 12177 132795
9296 132795 135562 168190 89703 28012 265376 -77659 -56410 110413 -32746 -40440 -255635
9285 -255635 40517 715435 169163 27006 266137 321022 -48643 251224 163342 214648
$$ packed form
9359E47952p34264L31729n9889L38601l58461J77731j5184O38M0354J131j47583
9348A22755l2604L02789p45334P41326j50696q3536N1781P6786K33416n69177
9338e2494Q8247J51229k2490k97910J50655J38613m4798k3539k40512L73377o5135
9327A55243K9575M9657M37976o43088Q4641J05761k30157K39325j54189k8105
9317D6639J92221j831m95614J8359M44033j4379K15098p3143o19690M28603j28171
9306A2125K51404j36154K26629l18711L29227l82345L42040r2227k19811J20618
9296A32795K767L2628p8487o1691K37364l43035K1249J66823j43159p694k15195
9285b55635K96152O74918n46272j42157K39131N4885l69665K99867q7882N1306
$$ plain form
9275 214648 160301 359262 31738 241226 585752 330318 108856 221466 260040 58545
9265 58545 130859 81868 19906 34904 108429 46067 184514 -64120 -141587 -274589 31508
9254 31508 263447 199940 139237 339512 542756 62024 -62796 -329595 115584 299815
9244 299815 -192190 79102 4073 171663 524935 205827 121146 -311432 205633 55434
9234 55434 98698 217997 318397 233860 237507 277957 82425 61621 -361058 150436 312225
9223 312225 411267 250092 157032 14912 113103 -140318 104036 293046 402912 -286629
9213 -286629 158499 110814 236221 -552631 250930 64768 105065 -202156 114478 -51561
9203 -51561 -99251 154298 745583 242715 262953 139022 15023 101554 -18462 99035
$$ packed form
9275B14648n4347J98961l27524K09488L44526k55434k21462J12610L8574k01495
9265E8545P2314m8991o1962J4998P3525o2362J38447k48634p7467j33002L06097
9254C1508K31939o3507o0703K00275K03244m80732j24820k66799M45179J84231
9244B99815m92005K71292p5029J67590L53272l19108q4681m32578N17065j50199
9234E5434M3264J19299J00400q4537L647M0450j95532k0804m22679N11494J61789
9223C12225R9042j61175r3060j42120R8191k53421K44354J89010J09866o89541
9213b86629M45128m7685J25407p88852Q03561j86162M0297l07221L16634j66039
9203e1561m7690K53549N91285n02868K0238j23931j23999Q6531j20016J17497
$$ plain form
9193 99035 -253668 52399 -195142 -54012 106383 231766 -112206 -115355 -71303 70646
9183 70646 41856 361711 98707 -294352 -275119 -188072 207118 322554 56846 -32422 -498709
9172 -498709 135849 -171988 15899 309145 -96584 367439 361034 -81127 -50553 -7060
9162 -7060 480053 143699 551861 -18942 32284 -183376 -191687 -306429 -44378 -122739 128859
9151 128859 307700 -10740 463971 106377 -329065 -99027 228347 94263 144870 398411
9141 398411 99633 178321 204864 235433 28494 60385 436051 231042 152929 186105 274097
9130 274097 -24894 -46191 438446 281162 129473 252322 200373 40126 146957 167996
9120 167996 11827 235804 -386307 -367893 191084 20723 -38390 -32712 375202 87011
$$ packed form
9193I9035l52703L06067k47541J41130J60395J25383l43972l149M4052J41949
9183G0646k8790L19855k63004l93059J9233Q7047L95190J15436k65708q9268m66287
9172d98709O34558l07837J87887K93246m05729M64023o405m42161L0574M3493
9162g060M87113l36354M08162n70803N1226k15660q311j14742K62051p8361K51598
9151A28859J78841l18440M74711l57594m35442K30038L27374j34084N0607K53541
9141C98411k98778P8688K6543L0569k06939L1891L75666k05009p8113L3176Q7992
9130B74097k98991k1297M84637j57284j51689J22849n1949j60247J06831K1039
9120A67996j56169K23977o22111J8414N58977j70361n9113N678M07914k88191
$$ plain form
9110 87011 -16687 196382 398344 506412 485726 359386 4861 281875 43433 89164
9100 89164 615455 143701 110932 236829 54620 462258 248708 567075 155677 271824
9090 271824 -41261 132639 533643 -128078 569610 414780 125962 48860 377032 465653
9080 465653 508747 455835 316320 413218 174129 48154 232463 44018 293749 102458
9070 102458 42722 -117444 13618 258485 708382 4548 -59015 -48141 454878 92159
9060 92159 -44343 -187985 331316 424769 97348 218850 159567 -292583 163473 487621
9050 487621 296388 549951 241708 423656 207682 375586 -17151 397703 -101389 248428
9040 248428 197619 137245 -94638 37619 24854 -306064 96923 196784 196151 312487 142419
$$ packed form
9110H7011j03698K13069K01962J08068k0686j26340l54525K77014k38442M5731
9100H9164N26291m71754l2769J25897j82209M07638k13550L18367m11398J16147
9090B71824l13085J73900M01004o61721O97688j54830k88818p7102L28172Q8621
9080D65653M3094n2912j39515R6898k39089j25975J84309j88445K49731j91291
9070A02458n9736j60166J31062K44867M49897p03834o3563J0874N03019l62719
9060I2159j36502j43642N19301R3453l27421J21502n9283m52150M56056L24148
9050D87621j91233K53563l08243J81948k15974J67904l92737M14854m99092L49817
9040B48428n0809o0374k31883J32257j2765l30918M02987R9861o33J16336j70068
$$ plain form
9029 142419 42035 375679 244284 437922 327815 241036 313806 477621 396801 122900
9019 122900 239818 181901 124953 135867 631911 650695 438388 20732 -88004 674238
9009 674238 324512 74117 86231 341939 502772 13800 364423 -22039 118339 229502
8999 229502 310280 437982 349478 79145 -102274 66484 139627 433153 129346 135717 287939
8988 287939 146159 472964 186340 281622 99926 341893 397414 595174 30670 536555
8978 536555 55766 265905 34215 115617 295896 -53606 21367 545089 136670 -128944
8968 -128944 111080 341271 74039 80788 270960 122418 267219 257730 247751 362224 -79362
8957 -79362 368012 422001 156942 -30569 81953 42484 368180 223020 160202 -55300
$$ packed form
9029A42419j00384L33644j31395J93638j10107q6779P2770J63815q0820k73901
9019A22900J16918n7917n6948J0914M96044J8784k12307m17656j08736P62242
9009F74238l49726k50395J2114K55708J60833m88972L50623l86462J40378J11163
8999B29502Q0778J27702q8504k70333j81419J68758P3143K93526l03807O371J52222
8988B87939j41780L26805k86624R5282j81696K41967N5521J97760n64504N05885
8978E36555m80789K10139k31690Q1402J80279l49502P4973N23722m08419k65614
8968a28944K40024K30191k67232O749J90172j48542J44801r489r979J14473m41586
8957g9362M47374N3989k65059j87511J12522l9469L25696j45160o2818k15502
$$ plain form
8947 -55300 -137883 498814 331989 152171 111412 364445 161820 119430 101011 142811 128424
8936 128424 211937 211170 118879 165672 -34235 37703 132945 124660 322933 325336 384725 522902
8924 522902 113135 -105847 611246 231805 -49519 -76247 287962 187479 57207 85470
8914 85470 169240 -7560 -42886 -87517 560294 497500 301516 -35201 138679 413074 176836
8903 176836 -78512 232053 449339 497341 -51562 -1586 55458 265072 20952 303252
8893 303252 204885 151858 -64480 287841 -93241 351090 389157 13416 112621 20044 279366
8882 279366 -130170 367850 158569 147771 219379 84749 284796 805898 2572 -73141
8872 -73141 58898 145236 20238 60597 384913 118638 411078 -88067 286353 546471
$$ packed form
8947e5300q2583O36697j66825j79818m0759K53033k02625m2390j8419M1800j4387
8936A28424Q3513p67r2291M6793j99907P1938R5242q285J98273K403N9389J38177
8924E22902m09767k18982P17093l79441k81324k6728L64209j00483j30272K8263
8914H5470Q3770j76800l5326m4631O47811o2794j95984l36717J73880K74395k36238
8903A76836k55348L10565K17286M8002n48903M9976N7044K09614k44120K82300
8893C03252r8367n3027k16338L52321l81082M44331L8067l75741R9205r2577K59322
8882B79366m09536M98020k09281j0798P1608j34630K00047N21102q03326p5713
8872g3141J32039Q6338j24998M0359L24316k66275K92440m99145L74420K60118
$$ plain form
8862 546471 57713 271698 610490 -99120 -132834 -88763 86295 201852 149720 149114 252308
8851 252308 17181 -11654 -30933 469328 359343 91595 300647 610314 286840 138471
8841 138471 157993 62806 -142263 249861 509037 36924 166679 146588 66364 300817
8831 300817 637254 568301 116859 45761 162215 52031 211523 30265 200126 170234
8821 170234 40141 135690 178580 213654 407645 621245 -75080 396271 192622 -18267
8811 -18267 278164 385461 242979 265533 -94427 177665 159744 376166 152144 70158
8801 70158 337567 -12838 343368 357698 248365 186027 74162 463883 300935 384049
8791 384049 187949 154013 397354 254510 364133 881860 187224 84526 339487 327943
$$ packed form
8862E46471m88758K13985L38792p09610l3714M4071J75058J15557n2132o06J03194
8851B52308k35127k8835j9279N00261j09985k67748K09052L09667l23474j48369
8841A38471J9522r5187k05069L92124K59176m72113J29755k0091q0224K34453
8831C00817L36437o8953m51442p1098J16454j10184J59492j81258J69861k9892
8821A70234j30093R5549M2890L5074J93991K13600o96325M71351k03649k10889
8811a8267K96431J07297j42482K2554l59960K72092j7921K16422k24022q1986
8801G0158K67409l50405L56206J4330j09333o2338j11865L89721j62948Q3114
8791C84049j96100l3936K43341j42844J09623N17727o94636j02698K54961j1544
$$ plain form
8781 327943 117324 329301 124056 207488 -79939 271681 432359 450279 67320 312801
8771 312801 394220 201453 115474 210795 593306 241727 112135 239823 450392 99565
8761 99565 166769 290166 -217520 179437 181226 340267 173125 295923 -183157 303983
8751 303983 -86374 507433 362050 197979 125281 423846 42164 236321 369098 291071
8741 291071 372675 272808 292151 246761 280302 438977 75586 138628 157081 504591 340461
8730 340461 423905 575683 81025 418412 331516 166566 372996 51032 269722 183740
8720 183740 179456 265790 -13030 -9527 63616 378317 380172 244154 70785 226880 321956
8709 321956 242354 303482 349072 -5573 64182 121332 418080 232514 134699 -13080 252086
$$ packed form
8781C27943k10619K11977k05245Q3432k87427L51620J60678J7920l82959K45481
8771C12801Q1419j92767q5979R5321L82511l51579j29592J27688K10569l50827
8761I9565O7204J23397n07686L96957J789J59041j67142J22798m79080M87140
8751C03983l90357N93807j45383j64071p2698K98565l81682J94157J32777p8027
8741B91071Q1604r9867J9343m5390L3541J58675l63391O3042J8453L47510j64130
8730C40461Q3444J51778m94658L37387q6896j64950K06430l21964K18690q5982
8720A83740m284Q6334k78820L503P3143L14701J855j36018j73369J56095R5076
8709C21956p9602O1128M5590l54645O9755N7150K96748j85566r7815j47779K65166
$$ plain form
8698 252086 158311 333605 58965 63607 270244 321804 375396 426668 271239 298421 137333
8687 137333 250655 88138 415735 404470 93362 131575 187150 251012 1973 369369
8677 369369 33718 145679 72482 353549 649176 101019 47820 228814 172976 100053
8667 100053 452188 138852 491385 163946 362713 418210 -112332 131937 397748 192055
8657 192055 -223698 683762 360444 364453 309473 196979 496272 160093 81624 -204864
8647 -204864 470478 399670 572600 472297 49509 381798 694890 79956 347996 223536
8637 223536 21344 324957 381439 441683 -18792 490869 439995 66377 129991 18177
8627 18177 602110 267538 223223 246537 403278 543909 198251 487896 56472 269329
$$ packed form
8698B52086r3775J75294k74640M642K06637N1560N3592N1272j55429K7182j61088
8687A37333J13322j62517L27597j1265l11108L8213N5575O3862k49039L67396
8677C69369l35651J11961p3197K81067K95627n48157n3199J80994n5838p2923
8667A00053L52135l13336L52533l27439J98767N5497n30542K44269K65811k05693
8657A92055m15753R07460l23318M009n4980j12494K99293l36179p8469k86488
8647b04864O75342p0808J72930j00303m22788L32289L13092o14934K68040j24460
8637B23536k02192L03613N6482O0244m60475N09661n0874l73618O3614j11814
8627A8177N83933l34572m4315K3314J56741J40631l45658K89645m31424K12857
$$ plain form
8617 269329 259765 233913 -114399 431823 270715 139600 -2384 337546 449041 71896
8607 71896 446158 744175 332304 287746 16218 429032 263177 395510 403839 559112
8597 559112 -14501 -173550 99874 36378 193423 32670 301433 -69630 345495 498974
8587 498974 464304 223577 544976 342795 42317 188922 187523 257602 24825 47263 210103
8576 210103 336554 73218 206207 -402299 281754 40945 263787 470612 327590 12411
8566 12411 285105 193545 195403 421852 663566 269322 479136 465701 57035 377209 47696
8555 47696 145887 224451 331121 -11624 535430 85356 140275 445715 203870 124584 243865
8544 243865 363641 452855 174577 209075 315060 166074 474293 406151 167725 459354
$$ packed form
8617B69329r564k5852l48312N46222j61108j31115j41984L39930J11495l77145
8607G1896L74262K98017m11871m4558k71528M12814j65855J32333Q329J55273
8597E59112n73613j59049K73424o3496J57045j60753K68763l71063M15125J53479
8587D98974l4670k40727L21399k02181l00478J46605j399P0079k32777K2438J62840
8576B10103J26451k63336J32989o08506O84053k40809K22842K06825j43022l15179
8566A2411K72694r1560J858K26449K41714l94244K09814j3435m08666L20174l29513
8555D7696R8191P8564J06670l42745N47054m50074N4919L05440k41845p9286J19281
8544B43865J19776Q9214k78278L4498J05985j48986L08219o8142k38426K91629
$$ plain form
8534 459354 -1183552 924409 136565 144025 568010 264419 371556 693633 156425 229481
8524 229481 346799 503172 -45365 140962 586537 539955 245200 132584 332633 196413
8514 196413 285818 191936 764845 485011 205275 695860 606357 21214 311323 -3920
8504 -3920 288584 22476 243960 329396 276467 238124 378581 240263 311427 451363 337330
8493 337330 319793 299327 508725 433058 175633 326352 438029 375787 294711 641587 233186
8482 233186 424134 577568 610076 231335 469774 263046 275321 568847 538574 333265
8472 333265 65222 374307 334245 215997 235299 56394 331097 346712 473467 335624
8462 335624 489957 208506 219737 218445 374953 204538 93089 429816 44444 310358
$$ packed form
8534D59354j642906K107961p87844P460M23985l03591J07137L22077n37208P3056
8524B29481J17318J56373n48537J86327M45575m6582k94755j12616K00049j36220
8514A96413Q9405r3882N72909k79834k79736M90585q9503n85143K90109l15243
8504c920K92504k66108K21484Q5436n2929l8343J40457j38318P1164J39936j14033
8493C37330j7537k0466K09398p5667k57425J50719J11677o2242q1076L46876m08401
8482B33186J90948J53434L2508l78741K38439k06728J2275K93526l0273k05309
8472C33265k68043L09085m0062j18248J9302j78905K74703J5615J26755j37843
8462C35624J54333k81451J1231j292J56508j70415j11449L36727l85372K65914
$$ plain form
8452 310358 358005 209988 343275 558612 -115508 264184 332332 343045 247803 555810
8442 555810 442032 350122 486451 279900 425590 519169 380633 349498 -140869 345991
8432 345991 550528 180768 450561 109483 319865 135934 209635 642608 365915 718822
8422 718822 361109 426538 253003 480805 284177 568834 416324 181163 431105 261269
8412 261269 185487 325392 357587 557178 465451 153544 310136 382931 492683 283599
8402 283599 368373 618620 403036 426188 376328 599068 392222 813089 65529 549305
8392 549305 233943 510470 -260624 134681 137295 584895 316218 253943 675 519009
8382 519009 347664 381462 329197 547897 570862 573879 336728 312231 658007 543668 551015
$$ packed form
8452C10358M7647j48017J33287K15337o74120L79692O8148J0713r5242L08007
8442E55810j13778r1910J36329k06551J45690R3579j38536l1135m90367M86860
8432C45991K04537l69760K69793l41078K10382j83931P3701M32973k76693L52907
8422G18822l57713O5429j73535K27802j96628K84657j52510k35161K49942j69836
8412B61269p5782J39905L2195J99591r1727l11907J56592P2795J09752k09084
8402B83599Q4774K50247k15584K3152m9860K22740k06846M20867p47560M83776
8392E49305l15362K76527p71094L95305K614M47600k68677o2275k53268N18334
8382E19009j71345L3798n2265K18700K2965L017k37151k4497L45776j14339P347
$$ plain form
8371 551015 208050 400676 262244 475433 476555 576283 552171 542981 435120 333862 231794
8360 231794 255899 327162 183549 301412 563822 584365 348369 316364 458123 266731
8350 266731 544645 455849 234120 798890 397073 176023 442673 797838 38004 545926
8340 545926 909823 99492 562987 627739 442687 226147 646886 320309 292736 506950
8330 506950 143346 415743 275439 786227 884 455781 22357 517826 424355 280035
8320 280035 245846 459165 401553 586224 172900 549574 487011 741009 32843 549232
8310 549232 22114 350626 231336 396142 709476 79567 327330 146944 517277 505476
8300 505476 470633 329257 201873 574960 557621 267378 627241 394044 320341 521967
$$ packed form
8371E51015l42965J92626j38432K13189J122R9728k4112r190j07861j01258j02068
8360B31794K4105P1263j43613J17863K62410K0543k35996l2005J41759j91392
8350B66731K77914q8796k21729N64770m01817k21050K66650L55165p59834N07922
8340E45926L63897q10331M63495O4752j85052k16540M20739l26577k7573K14214
8330E06950l63604K72397j40304N10788p85343M54897m33424M95469r3471j44320
8320B80035l4189K13319n7612J84671m13324L76674o2563K53998p08166N16389
8310E49232n27118L28512j19290J64806L13334o29909K47763j80386L70333j1801
8300E05476l4843j41376j27384L73087j7339k90243L59863k33197p3703K01626
$$ plain form
8290 521967 -224307 608263 461641 954304 407072 369599 132452 571361 620021 361945
8280 361945 392092 687119 573626 444174 484631 782386 440518 718369 469985 551355
8270 551355 339946 66250 294194 658734 633023 687817 449317 781356 282808 342449
8260 342449 825450 652495 432144 826769 283302 847962 575948 420571 414241 468887
8250 468887 577642 494004 746392 520648 750716 295801 622258 565424 649389 884277
8240 884277 976115 699888 1022668 802320 1029646 899355 758951 1181231 1621011 1369609
8230 1369609 958556 1425299 1459845 1667145 1909717 2119419 2102271 2486800 2521327 2451969
8220 2451969 1923040 1973613 2409762 2279616 1752902 1985290 1660954 1627691 1281218 1224888
$$ packed form
8290E21967p46274Q32570j46622M92663n47232l7473k37147M38909M8660k58076
8280C61945L0147K95027j13493j29452M0457K97755l41868K77851k48384Q1370
8270E51355k11409k73696K27944L64540k5711N4794k38500L32039m98548N9641
8260C42449M83001j72955k20351L94625n43467N64660k72014j55377o330N4646
8250D68887J08755q3638K52388k25744K30068m54915L26457n6834Q3965K34888
8240H84277R1838k76227L22780k20348K27326j30291j40404M22280M39780k51402
8230A369609m11053M66743L4546K07300K42572K09702j7148L84529L4527o9358
8220B451969n28929N0573M36149j30146n26714K32388l24336l3263l46473n6330
$$ plain form
8210 1224888 1175870 1012513 869328 878908 687170 973722 765470 1023024 880085 987759
8200 987759 992234 636324 1002938 236347 445491 932387 310720 420768 5433005 1435576
8190 1435576 674821 727322 472805 949128 517889 724509 484798 595369 825891 798129
8180 798129 421706 658475 393845 827002 469477 836204 407855 846568 503863 476169
8170 476169 518783 799924 925971 731692 873394 545454 720155 774647 367720 455551
8160 455551 502096 805620 535142 316049 700544 876103 484465 523422 564379 999866
8150 999866 688945 971348 609513 670358 710906 749323 298542 805043 482693 314643
8140 314643 782317 509604 281922 927138 785982 897769 335563 792926 570408 549689
$$ packed form
8210A224888m9018j63357j43185R580j91738K86552k08252K57554j42939J07674
8200I87759M475l55910L66614p66591K09144M86896o21667J10048N012237l997429
8190A435576p60755N2501k54517M76323m31239K06620k39711J10571K30522k7762
8180G98129l76423K36769k64630M33157l57525L66727m28349M38713l42705k7694
8170D76169M2614K81141J26047j94279J41702l27940J74701N4492m06927Q7831
8160D55551M6545L03524k70478k19093L84495J75559l91638L8957M0957M35487
8150I99866l10921K82403l61835O0845M0548L8417m50781N06501l22350j68050
8140C14643M67674k72713k27682O45216j41156J11787n62206M57363k22518k0719
$$ plain form
8130 549689 355255 704305 508615 301461 942975 829550 535403 441846 852751 1000887
8120 1000887 477084 511399 871718 1213603 727293 548545 450327 643295 361378 650736
8110 650736 461967 246874 842416 359816 929937 432074 641357 1057564 571884 426724
8100 426724 726952 774594 751878 515721 774700 550992 751733 809389 574703 743494
8090 743494 1021290 312718 1189647 749921 654885 414499 813418 876166 289699 743763
8080 743763 675815 857832 835953 498977 758767 491817 834295 596021 661536 608220
8070 608220 733170 1019391 910870 728221 687462 726690 928616 1236593 1025104 1100585
8060 1100585 576540 738900 1220996 740436 774558 1271315 620878 957608 1068407 715866
$$ packed form
8130E49689j94434L49050j95690k07154O41514j13425k94147r3557M10905J48136
8120A000887n23803L4315L60319L41885m86310j78748r8218J92968k81917K89358
8110F50736j88769k15093N95542m82600N70121m97863K09283M16207m85680j45160
8100D26724L00228M7642k2716k36157K58979k23708K00741N7656k34686J68791
8090G43494K77796p08572Q76929m39726r5036k40386L98919O2748n86467M54064
8080G43763o7948J82017k1879l36976K59790k66950L42478k38274O5515n3316
8070F08220J24950K86221j08521j82649m0759L9228K01926L07977k11489P5481
8060A100585n24045J62360M82096m80560L4122M96757o50437L36730J10799l52541
$$ plain form
8050 715866 1116797 656359 807429 1096374 960908 523718 1252417 982413 861986 776111
8040 776111 853543 1286722 973167 1205920 921938 1007766 965949 1018308 867764 675018
8030 675018 874297 1041534 924804 976141 832960 841793 956773 570660 699409 841875
8020 841875 477924 1164488 769446 918864 837662 1026908 877897 899371 951867 975875
8010 975875 863504 760342 1141110 960317 1055417 1047258 1025661 809927 1055986 874523
8000 874523 1176909 957766 868844 1244324 1357681 970184 1010106 1341111 950895 919620
7990 919620 1069803 912458 833813 1288294 1036106 704655 1392841 695949 710935 963579
7980 963579 1093346 1011220 894571 871787 1113999 1241364 728200 854390 1008851 1093262
$$ packed form
8050G15866M00931m60438J51070K88945j35466m37190P28699k70004j20427q5875
8040G76111P7432M33179l13555K32753k83982Q5828m1817N2359j50544j92746
8030F75018J99279J67237j16730N1337j43181Q833J14980l86113J28749J42466
8020H41875l63951O86564l95042J49418q1202J89246j49011K1474N2496K4008
8010I75875j12371j03162L80768j80793R5100q159k1597k15734K46059j81463
8000H74523L02386k19143q8922L75480J13357l87497L9922L31005l90216l1275
7990I19620J50183j57345p8645M54481k52188l31451O88186o96892J4986K52644
7980I63579J29767q2126j16649k2784K42212J27365n13164J26190J54461Q4411
$$ plain form
7970 1093262 828853 918554 1198637 972840 872475 949001 883080 996768 1152086 1147073
7960 1147073 889845 1118301 1156994 1237667 1189210 1087741 1436184 1088504 1236692 830149
7950 830149 1382309 1217727 1138393 1407809 1182372 768090 971726 1096744 1296746 1216309
7940 1216309 980425 1392859 883566 1183558 1057589 1314504 1140247 793418 1332339 1107924
7930 1107924 1314467 1150558 1304691 1119204 1134317 1146348 1331199 1547662 1058115 1575041
7920 1575041 1227225 1418318 1227271 1185543 1404089 1419162 1507808 1217650 1433349 1415116
7910 1415116 1000514 1148398 1373959 1380788 1055584 1475308 1223276 1385534 1552404 1316944
7900 1316944 1420554 1544402 1441834 1627248 1303401 1601596 1228477 1814507 1394642 1563966
$$ packed form
7970A093262k64409Q9701K80083k25797j00365P6526o5921J13688J55318n013
7960A147073k57228K28456L8693Q0673m8457j01469L48443l47680J48188m06543
7950H30149N52160j64582p9334K69416k25437m14282K03636J25018K00002q0437
7940A216309k35884M12434n09293K99992j25969K56915j74257l46829N38921k24415
7930A107924K06543j63909J54133j85487J5113J2031J84851K16463m89547N16926
7920A575041l47816J91093j91047m1728K18546J5073Q8646k90158K15699j8233
7910A415116m14602J47884K25561O829l25204M19724k52032J62258J66870k35460
7900A316944J03610J23848j02568J85414l23847K98195l73119N86030m19865J69324
$$ plain form
7890 1563966 1473515 1672584 1261838 1182374 1436560 1555090 1598512 1307806 1846557 1659450
7880 1659450 1474667 1973511 1822597 1873998 2002577 2033728 1739096 1831769 1616732 1796580
7870 1796580 2045332 1498014 1703993 1759152 1844044 1596475 2220905 2015528 1781632 1999312
7860 1999312 2115398 2437967 2275397 2072287 2200213 2133763 1976576 2122918 1809449 1149013
7850 1149013 6351359 4257821 3333239 2628023 3024989 2942247 2822957 2977848 2937258 3234581
7840 3234581 2693994 2689586 2895083 2890026 3056372 3178022 3132004 3424974 3529142 3365273
7830 3365273 3395262 3645008 3846266 3713914 3539366 4125900 4464489 4285015 4399588 4877512
7820 4877512 4921161 4753614 5117134 4973642 5246714 5471229 5982932 6451597 6208501 6808540
$$ packed form
7890A563966r0451J99069m10746p9464K54186J18530M3422k90706N38751j87107
7880A659450j84783M98844j50914N1401J28579L1151k94632R2673k15037J79848
7870A796580K48752n47318K05979N5159Q4892k47569O24430k05377k33896K17680
7860A999312J16086L22569j62570k03110J27926o6450j57187J46342l13469o60436
7850A149013N202346k093538r24582p05216L96966q2742j19290J54891m0590K97323
7840C234581n40587m408K05497n057J66346J21650m6018K92970J04168j63869
7830C365273K9989K49746K01258j32352j74548N86534L38589j79474J14573M77924
7820D877512M3649j67547L63520j43492K73072K24515N11703M68665k43096O00039
$$ plain form
7810 6808540 7105530 6944629 7590697 8231067 8488784 9077937 9629027 10098868 10776541 11130891
7800 11130891 12302153 12774345 13297203 13934858 15078716 16086035 16900481 17991104 18892370
7791 18892370 20132316 21496984 22907509 23977659 25241717 26064735 27352340 28816187
7783 28816187 29927312 31324009 32060568 33219910 34082041 34281743 34634115 35230463 35311025
7774 35311025 35329315 35324103 35363790 34827656 34644890 34320059 34284346 33970434 34204879 34337980
7764 34337980 34477332 34959120 35684846 36287846 37048346 38307141 39536463 40590876 41710089
7755 41710089 42864067 43870409 45297152 45985688 47142527 47334962 47694505 47987036 47965486
7746 47965486 48348330 47478093 47254301 46672156 46502543 45129656 44564083 44326187 43505255
$$ packed form
7810F808540K96990j60901O46068O40370K57717N89153N51090M69841O77673L54350
7800A1130891J171262M72192N22858O37655J143858J007319Q14446J090623R01266
7791A8892370J239946J364668J410525J070150J264058Q23018J287605J463847
7783B8816187J111125J396697P36559J159342Q62131J99702L52372N96348Q0562
7774C5311025J8290n212L9687n36134j82766l24831l5713l13912K34445J33101
7764C4337980J39352M81788P25726O03000P60500J258795J229322J054413J119213
7755D1710089J153978J006342J426743O88536J156839J92435L59543K92531k1550
7746D7965486L82844q70237k23792n82145j69613j372887n65573k37896q20932
$$ plain form
7737 43505255 42542425 42082666 41596924 41845871 41599680 42180319 42415130 42706111 43712570
7728 43712570 44067360 44985591 45163192 46113910 46143990 46767756 46758843 46926496 46510641 46251206
7718 46251206 45250598 45199000 43511702 42926864 42448525 41647559 40802065 40128031 39606347
7709 39606347 38865238 38854867 38601164 38461659 38557839 38488555 38299645 38684637 39398134 40406178
7699 40406178 40244418 40806902 42024780 42226940 42872210 42839044 42722932 42802988 43032250 42332177
7689 42332177 42232367 41552931 41211371 40520924 40145596 38938115 38263624 37532894 37037082
7680 37037082 36204779 35688969 34882982 33194106 32285588 31812988 30493818 29389946 28731253
7671 28731253 27744770 26591405 25706428 24961136 23944296 23700135 22756376 22322835 21780051
$$ packed form
7737D3505255r62830m59759m85742K48947k46191N80639K34811K90981J006459
7728D3712570L54790R18231J77601R50718L0080O23766q913J67653m15855k59435
7718D6251206j000608n1598j687298n84838m78339q00966q45494o74034n21684
7709C9606347p41109j0371k53703j39505R6180o9284j88910L84992P13497J008044
7699D0406178j61760N62484J217878K02160O45270l3166j16112Q0056K29262p00073
7689D2332177r9810o79436l41560o90447l75328j207481o74491p30730m95812
7680C7037082q32303n15810q05987j688876r08518m72600j319170j103872o58693
7671B8731253r86483j153365q84977p45292j016840k44161r43759m33541n42784
$$ plain form
7662 21780051 20594404 20865574 20062912 19691976 18630287 18379763 17987896 17709679 17004146
7653 17004146 16870773 16136529 15786212 15662495 14716604 15016525 14375862 14086185 13921644
7644 13921644 13465524 13066945 13206239 11972496 11894226 11408238 11174102 10880712 10425049
7635 10425049 10335017 9734578 9855586 9297297 9297526 8838487 8769386 8535189 8253988 8243698
7625 8243698 8103605 7671599 7690925 7632590 7483413 6835388 7045242 6676170 6511860 6407512
7615 6407512 6517851 6151668 6368759 6217415 5858281 5944277 5527262 5752145 5447587 5694498
7605 5694498 5519770 5592696 5253506 4918957 5433761 5024103 5414754 4420160 5141917 4859831
7595 4859831 4957988 5031921 4638463 4518913 4434921 4617874 4393191 4055825 4491701 4301684
$$ packed form
7662B1780051j185647K71170q02662l70936j061689k50524l91867k78217p05533
7653A7004146j33373p34244l50317j23717r45891K99921o40663k89677j64541
7644A3921644m56120l98579J39294j233743p8270m85988k34136k93390m55663
7635A0425049r0032o00439J21008n58289K29m59039o9101k34197k81201j0290
7625H243698j40093m32006J9326n8335j49177o48025K09854l69072j64310j04348
7615F407512J10339l66183K17091j51344l59134Q5996m17015K24883l04558K46911
7605E694498j74728P2926l39190l34549N14804m09658L90651r94594P21757k82086
7595D859831R8157P3933l93458j19550q3992J82953k24683l37366M35876j90017
$$ plain form
7585 4301684 4496515 4430700 4377276 4278195 4350717 4007231 4304606 4247070 4116333 3953525
7575 3953525 4129831 4014096 4025395 4442201 3939443 3954483 3718054 3599202 3649626 4121994
7565 4121994 3648173 3661321 3513888 3779183 3865058 3974439 3676665 3832328 3932423 3529460
7555 3529460 3642541 3596400 3520945 3569424 4015808 3630478 2986825 3423996 3529029 3687484
7545 3687484 3574948 3304239 3488625 3902994 3703021 3785533 3364929 3624975 3441720 3409033
7535 3409033 3673163 3372565 3548376 3437740 3729488 3828828 3774224 3476485 3343470 3264086
7525 3264086 3998396 3666433 3581176 3812568 3450896 3552549 3607442 3726096 3487518 3737183
7515 3737183 3477190 3636191 3368716 3595195 3874413 3458254 3416696 3138762 3465590 3684005
$$ packed form
7585D301684J94831o5815n3424r9081P2522l43486K97375n7536j30737j62808
7575C953525J76306j15735J1299M16806n02758J5040k36429j18852N0424M72368
7565D121994m73821J3148j47433K65295Q5875J09381k97774J55663J00095m02963
7555C529460J13081m6141p5455M8479M46384l85330o43653M37171J05033J58455
7545C687484j12536k70709J84386M14369j99973Q2512m20604K60046j83255l2687
7535C409033K64130l00598J75811j10636K91748R9340n4604k97739j33015p9384
7525C264086P34310l31963q5257K31392l61672J01653N4893J18654k38578K49665
7515C737183k59993J59001k67475K26479K79218m16159m1558k77934L26828K18415
$$ plain form
7505 3684005 3552621 3859089 3856165 4079144 3558614 4063131 4182886 4228749 4066506 3739624
7495 3739624 3922909 3997241 4160978 3919574 3890576 4023298 3998813 4023918 3897423 3798227
7485 3798227 3790946 4226304 4319442 4085435 3971719 4386053 4184315 3906263 4440722 4507311
7475 4507311 4305697 4361835 4485485 4562502 4863369 4696816 5152767 4563036 4852111 4619284
7465 4619284 5148106 4837361 5060472 5410788 5419259 5296008 5527791 5488865 5256238 4999901
7455 4999901 5721296 5957425 5549214 5769692 5824928 5876343 5905424 6042043 5904530 6283540
7445 6283540 6507651 6415210 6839921 6803086 6651115 6710865 7143618 7118344 7699443 7512657
7435 7512657 7496968 8234710 8043738 8525667 8678257 9350114 9136419 9404621 9799565 10253441
$$ packed form
7505C684005j31384L06468k924K22979n20530N04517J19755M5863j62243l26882
7495C739624J83285P4332J63737k41404k8998J32722k4485K5105j26495r9196
7485C798227p281M35358R3138k34007j13716M14334k01738k78052N34459O6589
7475D507311k01614N6138J23650P7017L00867j66553M55951n89731K89075k32827
7465D619284N28822l10745K23111L50316Q471j23251K31783l8926k32627k56337
7455D999901P21395K36129m08211K20478N5236N1415K9081J36619j37513L79010
7445F283540K24111r2441M24711l6835j51971N9750M32753k5274N81099j86786
7435G512657j5689P37742j90972M81929J52590O71857k13695K68202L94944M53876
$$ plain form
7425 10253441 10647966 10354818 11016925 11089510 11568730 11445362 11269245 11782114 12107312 12352536
7415 12352536 12153491 12659318 12579682 12464419 12973404 13134092 13149920 13510852 13733390 14211074
7405 14211074 14738458 15351484 15802858 16552300 16963164 17767595 18424744 19420770 20191551
7396 20191551 20996827 22294439 22965730 23754549 23962513 24233197 24166550 24500004 24678954
7387 24678954 24576813 24477269 24048043 24078541 23749522 23420727 23555087 23573610 23524274 23327511
7377 23327511 24480942 24849218 24998210 25485765 25957138 27156022 27644842 28561619 29213062
7368 29213062 29901378 30444942 31781781 32446667 32958445 33187704 33991638 33632327 33509164
7359 33509164 33274511 33196662 32922714 32207661 31739432 31015533 30538507 29600663 29230683 29313576
$$ packed form
7425A0253441L94525k93148O62107P2585M79220j23368j76117N12869L25198K45224
7415A2352536j99045N05827p9636j15263N08985J60688J5828L60932K22538M77684
7405A4211074N27384O13026M51374P49442M10864Q04431O57149R96026P70781
7396B0191551Q05276J297612O71291P88819K07964K70684o6647L33454J78950
7387B4678954j02141r9544m29226L0498l29019l28795J34360J8523m9336j96763
7377B3327511J153431L68276J48992M87555M71373J198884M88820R16777O51443
7368B9213062O88316N43564J336839O64886N11778K29259Q03934l59311j23163
7359C3509164k34653p7849k73948p15053m68229p23899m77026r37844l69980Q2893
$$ plain form
7349 29313576 28738177 28852212 28520842 29125633 28835681 28947558 29818993 30417243 30541214
7340 30541214 31142181 31332597 32437871 32621938 33416873 33414481 33650105 33591584 33887755 34147900
7330 34147900 34101097 33927262 34436423 34742387 35095107 34971008 35137478 35897385 36075745 36596785
7320 36596785 36709760 36948314 37408923 37355695 37681793 37531924 37970649 38068531 38163305 38947614
7310 38947614 39051289 39458062 39833988 40224418 41615774 42501443 43531807 45237527 46638297
7301 46638297 48008059 49914771 51083495 53125828 55016667 56413278 58671843 60738784
7293 60738784 62104784 63343860 65566463 66741324 68253519 69738673 70765662 71883189
7285 71883189 73338311 75144760 76523108 78381613 80915063 83122313 86042888 89573217
$$ packed form
7349B9313576n75399J14035l31370O04791k89952J11877Q71435N98250J23971
7340C0541214O00967J90416J105274J84067P94935k392K35624n8521K96171K60145
7330C4147900m6803j73835N09161L05964L52720j24099J66470P59907J78360N21040
7320C6596785J12975K38554M60609n3228L26098j49869M38725R7882R4774P84309
7310C8947614J03675M06773L75926L90430J391356Q85669J030364J705720J400770
7301D6638297J369762J906712J168724K042333J890839J396611K258565K066941
7293F0738784J366000J239076K222603J174861J512195J485154J026989J117527
7285G1883189J455122J806449J378348J858505K533450K207250K920575L530329
$$ plain form
7277 89573217 93660466 99290248 104798956 112028289 120678597 131026123 144165646 162230077
7269 162230077 186738079 206413998 226913863 246853848 265890526 282387579 289431554
7262 289431554 284363765 276675533 273437684 276317401 270782656 258015929 236572299 219929708
7254 219929708 204889390 191448626 179465169 168799818 159300119 150826579 143396450
7247 143396450 137012442 130493289 125251569 120528109 116535358 112633696 108659077 105496739
7239 105496739 102143640 99603693 97180033 95054189 92501893 89875521 87847951 86480605
7231 86480605 85381957 83544225 82752569 81603205 80953648 80290708 79845175 79018312 78601225
7222 78601225 78615417 78156285 78170120 77723776 77002063 76837827 76584307 76020135 75734443 74617026
$$ packed form
7277H9573217M087249N629782N508708P229333Q650308J0347526J3139523J8064431
7269A62230077K4508002J9675919K0499865J9939985J9036678J6497053P043975
7262B89431554n067789p688232l237849K879717n534745j2766727k1443630j6642591
7254B19929708j5040318j3440764j1983457j0665351r499699q473540p430129
7247A43396450o384008o519153n241720m723460l992751l901662l974619l162338
7239A05496739l353099k539947k423660k125844k552296k626372k027570j367346
7231H6480605j098648j837732p91656j149364o49557o62940m45533q26863m17087
7222G8601225J4192m59132J3835m46344p21713j64236k53520n64172k85692j117417
$$ plain form
7212 74617026 73776487 72940574 72361324 72213472 71225147 70395741 69853213 69070372 68515139
7203 68515139 67997868 67694038 66770103 66165890 65539377 65157709 64317225 63768768 63418651
7194 63418651 62734000 62361409 61953201 61552649 61037013 60882218 60389758 59644448 59480811
7185 59480811 59181258 58699848 58139303 58067346 57648713 56919936 56401401 56259594 55620700 55170701
7175 55170701 54273005 53467691 52954556 51977775 51274619 50743725 50009921 49511266 49175419
7166 49175419 48748992 47963818 47269629 47441195 46921952 46953248 46834382 46527191 46069818 46125054
7156 46125054 45753522 45264317 45319397 45273735 45114248 45783844 45509070 45504778 45502987 45347431
7146 45347431 45788233 46061276 46107332 46162907 46641926 47206349 47339824 47576484 47786840 47736486
$$ packed form
7212G4617026q40539q35913n79250j47852r88325q29406n42528p82841n55233
7203F8515139n17271l03830r23935o04213o26513l81668q40484n48457l50117
7194F3418651o84651l72591m08208m00552n15636j54795m92460p45310j63637
7185E9480811k99553m81410n60545p1957m18633p28777n18535j41807o38894m49999
7175E5170701q97696q05314n13135r76781p03156n30894p33804m98655l35847
7166D9175419m26427p85174o94189J71566n19243L1296j18866l07191m57373N5236
7156D6125054l71532m89205N5080m5662j59487O69596k74774m292j791j55556
7146D5347431M40802K73043M6056N5575M79019N64423J33475K36660K10356n0354
$$ plain form
7136 47736486 47826599 47692288 47359916 46999661 46642875 45839188 45819991 44589055 44241143 43621166
7126 43621166 43483913 42705747 42234233 42270436 42000201 42162311 42543373 42553648 43005211 43339808
7116 43339808 44151069 45056789 46106923 46829264 48023708 48971923 50432828 51162113 52153732
7107 52153732 53006398 53619887 53838838 54210059 54191971 53734692 53393153 52709775 51852729 51202477
7097 51202477 49817086 49389093 48647213 48113398 47085338 47086625 46587969 46517957 46299228 46443486
7087 46443486 46711419 47409990 47762872 49053310 49602920 50398618 51143492 52089994 53139343
7078 53139343 54033593 53950385 54844530 55098628 54955042 54909203 54222030 54053528 53286694 53176346
7068 53176346 51934770 51586021 50345067 50011342 49605373 49241175 48694507 48581788 47788774
$$ packed form
7136D7736486R0113j34311l32372l60255l56786q03687j9197j230936l47912o19977
7126D3621166j37253p78166m71514L6203k70235J62110L81062J0275M51563L34597
7116D3339808Q11261R05720J050134P22341J194444R48215J460905P29285R91619
7107E2153732Q52666O13489K18951L71221j8088m57279l41539o83378q57046o50252
7097E1202477j385391m27993p41880n33815j028060J287m98656p0012k18729J44258
7087D6443486K67933O98571L52882J290438N49610P95698P44874R46502J049349
7078E3139343Q94250q3208Q94145K54098j43586m5839o87173j68502p66834j10348
7068E3176346j241576l48749j240954l33725m05969l64198n46668j12719p93014
$$ plain form
7059 47788774 47922306 47673441 48159740 48333855 48345194 48614723 49522415 49653743 50220857 50044846
7049 50044846 50482426 50441608 49986081 49636235 49476091 48959289 47984604 47402120 46803378 45997102
7039 45997102 44985989 44443450 43620896 43131493 42169392 41058647 40624311 40356746 39545414
7030 39545414 39128945 38001925 37951419 37685438 37337852 37080149 36377962 36294970 35834095 35399460
7020 35399460 35213848 34507740 33769909 33060326 32475997 32319622 31191186 29967185 29305797
7011 29305797 28940830 28145337 26920663 25980703 25724674 25296639 24078176 23607953 23477353
7002 23477353 22514533 22247152 21618262 21057988 20697001 20353312 19588959 19440529 18304505
6993 18304505 18222703 17651813 17751576 16880235 16468903 15930384 15867161 15220699 14711573 14220804
$$ packed form
7059D7788774J33532k48865M86299J74115J1339K69529R07692J31328N67114j76011
7049E0044846M37580m0818m55527l49846j60144n16802r74685n82484n98742q06276
7039D5997102j011113n42539q22554m89403r62101j110745m34336k67565q11332
7030C9545414m16469j127020n0506k65981l47586k57703p02187q2992m60875m34635
7020C5399460j85612p06108p37831p09583n84329j56375j128436j224001o61388
7011B9305797l64967p95493j224674r39960k56029m28035j218463m70223j30600
7002B3477353r62820k67381o28890n60274l60987l43689p64353j48430j136024
6993A8304505q1802n70890R9763q71341m11332n38519o3223o46462n09126m90769
$$ plain form
6983 14220804 14269815 14011400 13680471 13286065 12681310 13105199 12712935 12158096 11893035 11787905
6973 11787905 11593386 10764402 11018293 10535302 10367716 10089106 9828077 9602244 9526649 9539204
6963 9539204 8888301 9170276 8697057 8773073 8569513 8591138 8037091 8066141 8089514 7835517
6953 7835517 7587108 7282715 7317391 7275606 7609686 6906714 7176650 7010226 6786725 6851131
6943 6851131 6448464 6336401 6344833 6696475 6323323 5831261 6128193 6117600 6344671 5926711
6933 5926711 5990564 5789516 5441907 5459471 5746260 5770443 5630818 5288278 5377408 5324354
6923 5324354 5247002 5222644 4965529 5022610 5243456 4786643 4661489 4443152 4708652 4669686
6913 4669686 4470773 4498404 4439722 4560612 4737895 4249223 4575977 4533289 4177074 3888559
$$ packed form
6983A4220804M9011k58415l30929l94406o04755M23889l92264n54839k65061j05130
6973A1787905j94519q28984K53891m82991j67586k78610k61029k25833p5595J2555
6963I539204o50903K81975m73219P6016k03560K1625n54047K9050K3373k53997
6953G835517k48409l04393L4676m1785L34080p02972K69936j66424k23501O4406
6943F851131m02667j12063Q432L51642l73152m92062K96932j0593K27071m17960
6933E926711O3853k01048l47609J7564K86789K4183j39625l42540Q9130n3054
6923E324354p7352k4358k57115N7081K20846m56813j25154k18337K65500l8966
6913D669686j98913K7631n8682J20890J77283m88672L26754m2688l56215k88515
$$ plain form
6903 3888559 4136918 4209956 4174811 3891825 4043486 3825372 3640907 3955243 3878203 3407676
6893 3407676 4059094 3745260 3324213 3818422 3441512 3296909 2970862 3376478 3669145 3391448
6883 3391448 3269379 2997666 3415148 2822244 2562614 3234976 3341927 3208550 3341745 2985828
6873 2985828 3141800 2747489 3262748 3011623 2872953 2803042 2833287 2467084 2888618 2321419
6863 2321419 2846527 2753058 2735810 2877206 2556156 2766985 2549565 2501382 2928158 3097880
6853 3097880 3004440 3075047 3600578 3814769 4256355 4186633 3944235 4596606 4749888 4823488
6843 4823488 4408186 4133462 4446885 3923673 4157450 4345148 3828615 3644018 3484386 3053074
6833 3053074 2639798 2783398 2847395 2521525 2361125 2296979 2687841 2281436 2288118 2406124
$$ packed form
6903C888559K48359P3038l5145k82986J51661k18114j84465L14336p7040m70527
6893C407676O51418l13834m21047M94209l76910j44603l26047M05616K92667k77697
6883C391448j22069k71713M17482n92904k59630O72362J06951j33377J33195l55917
6873B985828J55972l94311N15259k51125j38670o9911L0245l66203M21534n67199
6863B321419N25108r3469j7248J41396l21050K10829k17420m8183M26776J69722
6853C097880r3440P0607N25531K14191M41586o9722k42398O52371J53282P3600
6843D823488m15302k74724L13423n23212K33777J87698n16533j84597j59632m31312
6833C053074m13276J43600O3997l25870j60400o4146L90862m06405O682J18006
$$ plain form
6823 2406124 2093036 2286739 1931060 1766928 1717188 2035929 1692640 1947918 1483763 2062563
6813 2062563 1676123 1757179 1545392 1502443 2011212 1582665 1506802 1616484 1298583 1430980
6803 1430980 1367021 1408647 1440365 1482022 1173020 1457320 1313570 1250417 1391328 1613916
6793 1613916 1342214 1325511 1368393 1444549 1390493 1322096 1011357 980677 1612242 1565696 1246910
6782 1246910 1033226 1001835 1379794 1234567 1117477 1468501 1152034 1144161 1119345 1264795
6772 1264795 803159 1218459 1114970 1187129 1155626 931451 1487541 1032084 996957 970365
6762 970365 1342842 1152906 1347440 1306397 1427830 954113 1008787 976966 768331 1296758
6752 1296758 673681 1094122 1094245 972434 1101530 927095 1171306 858596 1125905 1069346
$$ packed form
6823B406124l13088J93703l55679j64132m9740L18741l43289K55278m64155N78800
6813B062563l86440Q1056k11787m2949N08769m28547p5863J09682l17901J32397
6803A430980o3959M1626L1718M1657l09002K84300j43750o3153J40911K22588
6793A613916k71702j6703M2882P6156n4056o8397l10739l0680O31565m6546l18786
6782A246910k13684l1391L77959j45227j17090L51024l16467p873k4816J45450
6772A264795m61636M15300j03489P2159l1503k24175N56090m55457l5127k6592
6762I70365L72477j89936J94534m1043J21433m73717N4674l1821k08635N28427
6752A296758o23077M20441J23j21811J29096j74435K44211l12710K67309n6559
$$ plain form
6742 1069346 1297646 931879 921200 561973 1097422 998622 866271 853793 526550 827863
6732 827863 1326350 1065011 976702 815793 964859 771408 802841 1035063 898648 1111822
6722 1111822 1047455 956360 922535 597556 950790 836195 976350 525797 926313 674786
6712 674786 848757 957494 679997 775649 332651 839744 956858 938979 1002342 676214
6702 676214 682351 643220 799180 553734 625705 637884 572376 797245 810071 579003 653751
6691 653751 550674 425409 646217 450742 768146 223933 655155 256381 623567 764067
6681 764067 346677 506351 443744 260546 541790 666720 703929 380578 519330 674034
6671 674034 333560 287641 249234 318700 238858 586560 116230 503635 505657 701355 541227
$$ packed form
6742A069346K28300l65767j0679l59227N35449r8800j32351j2478l27243L01313
6732H27863M98487k61339q8309j60909J49066j93451L1433K32222j36415K13174
6722A111822o4367r1095l3825l24979L53234j14595J40155m50553M00516k51527
6712F74786J73971J08737k77497R5652m42998N07093J17114j7879O3363l26128
6702F76214O137l9131J55960k45446P1971J2179o5508K24869J2826k31068P4748
6691F53751j03077j25265K20808j95475L17404n44213M31222l98774L67186J40500
6681G64067m17390J59674o2607j83198K81244J24930L7209l23351J38752J54704
6671F74034l40474m5919l8407O9466p9842L47702m70330L87405K022J95698j60128
$$ plain form
6660 541227 143400 69509 434738 527000 512988 434869 293584 413604 -50205 239917
6650 239917 338070 376531 522231 302536 438101 300704 534794 680594 409335 606347
6640 606347 340715 607832 180826 257367 412114 563108 330061 669368 161946 285204
6630 285204 226913 190863 569437 130999 253593 308289 258700 101527 35455 275560 601849
6619 601849 491591 270408 551053 522885 424664 400635 392301 220641 247852 248434 111303
6608 111303 424512 674307 321435 104437 139801 248864 110488 323158 232997 243591
6598 243591 413670 701183 368905 -96958 635957 177153 31756 478122 732785 539135
6588 539135 350959 156211 106756 311927 541184 373314 337140 372709 78335 -87569
$$ packed form
6660E41227l97827p3891L65229R2262j4012p8119j41285J20020m63809K90122
6650B39917R8153L8461J45700k19695J35565j37397K34090J45800k71259J97012
6640F06347k65632K67117m27006P6541J54747J50994k33047L39307n07422J23258
6630B85204n8291l6050L78574m38438J22594N4696m9589j57173o6072K40105L26289
6619F01849j10258k21183K80645k8168r8221k4029q334j71660K7211N82j37131
6608A11303L13209K49795l52872k16998L5364J09063j38376K12670r0161J0594
6598B43591J70079K87513l32278m65863P32915m58804j45397M46366K54663j93650
6588E39135j88176j94748m9455K05171K29257j67870l6174L5569k94374j65904
$$ plain form
6578 -87569 157484 205925 -23037 284987 425034 125898 422709 -1095 222873 155578
6568 155578 159370 353870 194195 -46989 319028 336817 -226051 382167 20245 296630
6558 296630 524084 115573 44649 251443 304421 332590 423721 59339 -183622 125678
6548 125678 -57788 269044 -72578 563234 475184 410362 325577 291788 519236 189620
6538 189620 306887 259750 -55125 -58750 99733 224017 271565 343290 186390 66237 343599
6527 343599 262346 444753 193241 44013 471612 446376 351451 127471 153558 32100
6517 32100 163835 252370 415626 245396 354733 -41993 -6218 130232 241845 381658
6507 381658 293454 -44472 382050 73894 558720 -38197 525695 280903 237365 246557
$$ packed form
6578h7569K45053M8441k28962L08024J40047k99136K96811m23804K23968o7295
6568A55578L792J94500j59675k41184L66017J7789n62868O08218l61922K76385
6558B96630K27454m08511p0924K06794N2978K8169R1131l64382k42961L09300
6548A25678j83466L26832l41622O35812q8050o4822q4785l3789K27448l29616
6538A89620J17267m7137l14875l625J58483J24284M7548P1725j56900j20153K77362
6527C43599q1253J82407k51512j49228M27599k5236r4925k23980K6087j21458
6517C2100J31735Q8535J63256j70230J09337l96726L5775J36450J11613J39813
6507C81658q8204l37926M26522l08156M84826n96917N63892k44792m3538R192
$$ plain form
6497 246557 108878 250476 211445 33664 174722 315590 186979 149781 10057 159136
6487 159136 191602 508810 182361 201112 429573 429304 379356 262849 357631 439573 331230
6476 331230 405753 -64626 307012 229994 188174 375558 -87316 385322 355608 430896 104253
6465 104253 254242 -281654 133975 248667 213040 342402 702542 287924 303449 219536
6455 219536 377909 269379 174921 692811 153081 110055 323170 317856 12506 70535 204260
6444 204260 222901 515630 296148 338228 434498 164930 373069 288872 122154 516015
6434 516015 286704 386281 62123 372374 207142 149329 571094 213102 151610 278315
6424 278315 365545 307701 398453 450095 498137 784417 745520 411574 522163 571166 423488
$$ packed form
6497B46557j37679J41598l9031j77781J41058J40868j28611l7198j39724J49079
6487A59136L2466L17208l26449J8751K28461k69m9948j16507R4782Q1942j08343
6476C31230P4523m70379L71638p7018m1820J87384m62874M72638k9714P5288l26643
6465A04253J49989n35896M15629J14692l5627J29362L60140m14618J5525q3913
6455B19536J58373j08530r4458N17890n39730m3026K13115n314l05350N8029J33725
6444B04260J8641K92729k19482M2080R6270k69568K08139q4197j66718L93861
6434E16015k29311R9577l24158L10251j65232n7813M21765l57992o1492J26705
6424B78315Q7230n7844R0752N1642M8042K86280l8897l33946J10589M9003j47678
$$ plain form
6413 423488 -75265 626684 149945 281907 219988 891732 431239 402547 2661 661037
6403 661037 540148 295851 436529 368028 610212 423370 372587 220249 334299 334777 223118
6392 223118 534834 -47427 392671 341401 450104 628248 394588 140584 273404 313885
6382 313885 520155 403064 393404 408267 816072 661733 327640 705799 544753 395178
6372 395178 389518 831037 585370 393065 482562 215264 459747 108640 -51878 135493
6362 135493 492304 433670 539017 1050307 -27129 151280 155913 -446286 157285 516683
6352 516683 131644 194966 342626 259206 123634 145788 471800 485656 247400 248234 74079
6341 74079 349527 183854 389069 330255 221417 75846 204218 124256 75373 213991
$$ packed form
6413D23488m98753P01949m76739J31962o1919O71744m60493k8692l99886O58376
6403F61037j20889k44297J40678o8501K42184j86842n0783j52338J14050M78j11659
6392B23118L11716n82261M40098n1270J08703J78144k33660k54004J32820M0481
6382C13885K06270j17091r660J4863M07805j54339l34093L78159j61046j49575
6372C95178n660M41519k45667j92305Q9497k67298K44483l51107j60518J87371
6362A35493L56811n8634J05347N11290j077436J78409M633o02199O03571L59398
6352E16683l85039O3322J47660q3420j35572K2154L26012J3856k38256Q34j74155
6341G4079K75448j65673K05215n8814j08838j45571J28372p9962m8883J38618
$$ plain form
6331 213991 57611 187832 -124135 422547 225041 -180565 178006 195011 211362 27301
6321 27301 284774 123098 698766 175634 134474 198265 3665 313069 235973 48307
6311 48307 204597 193688 430616 19805 503961 310398 407865 118512 -114726 -131426
6301 -131426 246889 180922 447710 249308 420992 158398 8643 289827 452610 4253
6291 4253 246934 315896 138441 680641 455825 -115460 533160 272653 339546 -17795
6281 -17795 415921 552258 281250 100610 -136506 -44677 -723587 403794 207966 173338
6271 173338 495763 114632 27382 264204 -216185 127976 238220 389928 78551 339536
6261 339536 491266 180365 323591 347000 500737 396145 275231 395633 139204 271124
$$ packed form
6331B13991j56380J30221l11967N46682j97506m05606L58571J7005J6351j84061
6321B7301K57473j61676N75668n23132m1160O3791j94600L09404p7096j87666
6311D8307J56290j0909K36928m10811M84156j93563R7467k89353k33238j6700
6301a31426L78315o5967K66788j98402J71684k62594j49755K81184J62783m48357
6291D253K42681O8962j77455N42200k24816n71285O48620k60507O6893l57341
6281a7795M33716J36337k71008j80640k37116R1829o78910J127381j95828l4628
6271A73338L22425l81131q7250K36822m80389L44161J10244J51708l11377K60985
6261C39536J51730l10901J43226K3409J53737j04592j20914J20402k56429J31920
$$ plain form
6251 271124 57334 -81994 364517 501685 17593 209620 -5325 -2278 10266 160741
6241 160741 296140 -54783 171951 139935 389688 506208 312317 -16175 195140 147414
6231 147414 424152 429708 33971 349245 292097 123174 154811 -65121 96689 231945
6221 231945 -193411 86844 270835 -63123 102635 -32755 339956 180756 -266591 369715
6211 369715 -84786 -109459 482127 303954 487007 450361 154173 203006 43933 -153047
6201 -153047 45838 188072 40537 208111 -84525 382751 -223104 247750 -193691 259919
6191 259919 -45738 229050 343780 52658 200997 466029 294735 188035 577629 349246
6181 349246 420138 247695 40086 -91078 149803 261812 593582 174553 140171 442123
$$ packed form
6251B71124k13790j39328M46511J37168m84092J92027k14945L047J2544J50475
6241A60741J35399l50923K26734l2016K49753J16520j93891l28492K11315m7726
6231A47414K76738N556l95737L15274n7148j68923L1637k19932J61810J35256
6221B31945m25356K80255J83991l33958J65758j35390L72711j59200m47347O36306
6211C69715m54501k4673N91586j78173J83053l6646k96188M8833j59073j96980
6201a53047J98885J42234j47535J67574k92636M67276o05855M70854m41441M53610
6191B59919l05657K74788J14730k91122J48339K65032j71294j06700L89594k28383
6181C49246P0892j72443k07609j31164K40881J12009L31770m19029l4382L01952
$$ plain form
6171 442123 -113385 248146 476337 311475 185479 68685 382358 152374 4210 408914
6161 408914 362480 28207 492737 -57591 -209806 93227 285993 144997 138201 288070
6151 288070 474905 16367 522790 113452 507785 339244 239617 -150352 -72319 468603
6141 468603 272276 212704 41313 361119 333206 350318 -215335 398126 517739 -373622
6131 -373622 436440 339363 203742 -98824 139991 237971 90691 132371 251566 -211681
6121 -211681 75700 167857 207543 245386 74020 290835 16284 372299 279463 530823
6111 530823 260299 111899 157371 45263 360457 12582 532419 387010 350312 199958
6101 199958 33542 525437 -100499 471063 397684 504299 236759 512906 76237 316757
$$ packed form
6171D42123n55508L61531K28191j64862j25996j16794L13673k29984j48164M04704
6161D08914m6434l34273M64530n50328j52215L03033J92766j40996o796J49869
6151B88070J86835m58538N06423m09338L94333j68541r9627l89969P8033N40922
6141D68603j96327n9572j71391L19806k7913J7112n65653O13461J19613q91361
6131c73622Q10062r7077j35621l02566K38815R7980j47280M1680J19195m63247
6121b11681K87381R2157L9686L7843j71366K16815k74551L56015r2836K51360
6111E30823k70524j48400M5472j12108L15194l47875N19837j45409l6698j50354
6101A99958j66416M91895o25936N71562p3379J06615k67540K76147m36669K40520
$$ plain form
6091 316757 210179 -314307 46033 507714 321150 360734 414996 437100 268612 329814
6081 329814 45271 323019 151978 652740 74547 409486 238878 69619 130418 102900
6071 102900 132195 269098 124699 -138298 314597 216494 -29250 125954 181430 381355
6061 381355 527140 -18420 95289 110562 219197 11827 246102 197637 37861 198202
6051 198202 333907 421692 -140342 -68329 -76522 149103 655055 307267 195498 522479
6041 522479 21131 469910 268341 443455 456699 366724 127982 428921 142429 367060
6031 367060 273531 130324 349283 -13220 343853 167874 377884 435056 64470 148995
6021 148995 365901 299274 67480 219170 -89735 -111834 326272 89170 445682 241480
$$ packed form
6091C16757j06578n24486L60340M61681j86564L9584N4262K2104j68488O1202
6081C29814k84543K77748j71041N00762n78193L34939j70608j69259O0799k7518
6071A02900K9295J36903j44399k62997M52895r8103k45744J55204N5476J99925
6061C81355J45785n45560J13709J5273J08635k07370K34275m8465j59776J60341
6051A98202J35705Q7785n62034P2013q193K25625N05952l47788j11769L26981
6041E22479n01348M48779k01569J75114J3244q9975k38742L00939k86492K24631
6031C67060r3529j43207K18959l62503L57073j75979K10010N7172l70586Q4525
6021A48995K16906o6627k31794J51690l08905k2099M38106k37102L56512k04202
$$ plain form
6011 241480 -69650 367905 561452 367000 388454 173202 91216 703249 292153 160962
6001 160962 64496 232692 358726 566721 -13726 348461 46230 140637 87488 362214
5991 362214 547541 568712 192118 6059 470082 580764 289030 383730 -54533 -147658
5981 -147658 325272 -61942 195463 425208 96898 425286 280566 179102 358568 355854
5971 355854 19594 483230 492147 377194 -32166 395052 442331 154757 375898 86466
5961 86466 53641 547658 152198 509590 134357 185888 160527 -29535 197777 -50393
5951 -50393 203496 511503 372544 232365 398855 -42899 567930 327292 6685 250722
5941 250722 366445 491504 456117 298102 270873 230345 304265 166340 232079 238585 453213
$$ packed form
6011B41480l11130M37555J93547j94452K1454k15252q1986O12033m11096j31191
6001A60962r6466J68196J26034K07995n80447L62187l02231R4407n3149K74726
5991C62214J85327K1171l76594j86059M64023J10682k91734R4700m38263r3125
5981a47658M72930l87214K57405K29745l28310L28388j44720j01464J79466k714
5971C55854l36260M63636Q917j14953m09360M27218M7279k87574K21141k89432
5961H6466l2825M94017l95460L57392l75233N1531k5361j90062K27312k48170
5951e0393K53889L08007j38959j40179J66490m41754O10829k40638l20607K44037
5941B50722J15723J25059l5387j58015k7229m0528P3920j37925O5739O506K14628
$$ plain form
5930 453213 162694 702162 335029 92776 15506 -370426 138086 395375 324289 962047
5920 962047 695886 355753 241651 450750 597839 -29618 382083 148679 426240 196697
5910 196697 372361 369307 347350 537668 305043 371969 166779 192606 480360 -43108 486
5899 486 172657 44747 -133444 198149 154498 -14607 295872 183520 136277 207754 298524
5888 298524 73517 266446 340833 406938 140408 181721 217133 305105 5666 497402 481790
5877 481790 -129500 239338 247888 269335 397895 480114 359299 182075 272880 133422 -61148
5866 -61148 57202 484843 546333 235331 211400 533487 618696 -76905 466232 194152
5856 194152 56771 297670 86028 458364 444393 140057 496672 528415 747126 248171
$$ packed form
5930D53213k90519N39468l67133k42253p7270l85932N08512K57289p1086O37758
5920I62047k66161l40133j14102K09099J47089o27457M11701k33404K77561k29543
5910A96697J75664l054k1957J90318k32625O6926k05190K5827K87754n23468M3594
5899D86J72171j27910j78191L31593m3651j69105L10479j12352m7243P1477R0770
5888B98524k25007J92929P4387O6105k66530M1313L5412Q7972k99439M91736j5612
5877D81790o11290L68838Q550K1447J28560Q2219j20815j77224R0805j39458j94570
5866f1148J18350M27641O1490l11002k3931L22087Q5209o95601N43137k72080
5856A94152j37381K40899k11642L72336j3971l04336L56615L1743K18711m98955
$$ plain form
5846 248171 250000 278632 301204 411254 427456 59721 129725 435697 4368 100863 281823
5835 281823 372421 566986 222682 508162 548220 69389 307103 383615 487029 213289
5825 213289 483018 469986 322114 198499 -144132 -16647 412135 308373 -48203 125014
5815 125014 450588 116986 217003 137537 -269807 272943 255184 170728 363933 220201
5805 220201 563577 377510 272932 -63755 126693 470025 472075 434365 394660 109913
5795 109913 120860 275509 432866 653952 379710 142752 -172208 616467 563228 701840
5785 701840 363838 395228 639553 58873 436932 399511 185648 391193 407393 439452
5775 439452 317530 246246 460818 474233 211297 49829 434893 -249368 245090 229963
$$ packed form
5846B48171J829K8632K2572J10050J6202l67735P0004L05972m31329R6495J80960
5835B81823R0598J94565l44304K85480M0058m78831K37714P6512J03414k73740
5825B13289K69729j3032j47872j23615l42631J27485M28782j03762l56576J73217
5815A25014L25574l33602J00017p9466m07344N42750j7759q4456J93205j43732
5805B20201L43376j86067j04578l36687J90448L43332K050l7710l9705k84747
5795A09913J0947J54649J57357K21086k74242k36958l14960P88675n3239J38612
5785G01840l38002L1390K44325n80680L78059l7421k13863K05545J6200L2059
5775D39452j21922p1284K14572J3415k62936j61468L85064o84261M94458j5127
$$ plain form
5765 229963 302606 281460 510596 591656 380836 416743 398136 267938 399087 573441 520569
5754 520569 18557 275080 414935 261940 40644 340739 582847 568095 192065 258579
5744 258579 460160 460569 501863 374429 -86911 294629 243064 462323 342681 330898 304061
5733 304061 472307 410108 210888 385136 401848 441777 463140 225385 257148 164236 225985
5722 225985 414606 621936 457004 132180 637408 327333 475987 486392 466198 2610
5712 2610 309559 527867 572465 741434 37485 424669 447793 238775 307581 321601 237581
5701 237581 190784 97368 544670 342696 348012 204504 318641 694240 114924 359449
5691 359449 151142 272269 590740 546206 325867 82296 388188 420757 489723 525607
$$ packed form
5765B29963P2643k1146K29136Q1060k10820L5907j8607j30198J31149J74354n2872
5754E20569n02012K56523J39855j52995k21296L00095K42108j4752l76030O6514
5744B58579K01581M09M1294j27434m61340L81540n1565K19259j19642j1783k6837
5733C04061J68246o2199j99220J74248J6712L9929K1363k37755L1763r2912O1749
5722B25985J88621K07330j64932l24824N05228l10075J48654J0405k0194m63588
5712B610L06949K18308M4598J68969p03949L87184K3124k09018O8806J4020q4020
5701B37581m6797r3416M47302k01974N316j43508J14137L75599n79316K44525
5691C59449k08307J21127L18471m4534k20339k43571L05892L2569O8966L5884
$$ plain form
5681 525607 262390 441458 357970 509941 146480 246211 471788 477935 274259 461545
5671 461545 670746 750542 210035 955 225254 290871 270051 147072 70252 594909
5661 594909 648695 464591 848701 293896 222502 259558 581992 270500 661776 8030
5651 8030 104972 505399 382685 460749 665988 350545 654366 490236 407910 247373 145923
5640 145923 371225 375119 118475 394622 800765 497252 673648 103057 569956 21905
5630 21905 527117 321451 470763 235558 360678 -17554 369794 431371 581712 108024
5620 108024 -61023 520425 637072 494352 736923 629218 530272 597746 353797 390801
5610 390801 801177 580025 612188 469653 767949 768036 -57943 54705 121210 572217 437003
$$ packed form
5681E25607k63217J79068q3488J51971l63461R9731K25577O147k03676J87286
5671D61545K09201P9796n40507k09080K24299O5617k0820j22979p6820N24657
5661E94909N3786j84104L84110n54805p1394L7056L22434l11492L91276o53746
5651H030R6942M00427j22714P8064K05239l15443L03821j64130q2326j60537j01450
5640A45923K25302L894k56644K76147M06143l03513J76396n70591M66899n48051
5630B1905N05212k05666J49312k35205J25120l78232L87348O1577J50341m73688
5620A08024j69047N81448J16647j42720K42571j07705r8946O7474k43949L7004
5610C90801M10376k21152L2163j42535K98296Q7q25979J12648O6505M51007j35214
$$ plain form
5599 437003 443906 650413 373829 375382 140194 298564 378953 72267 577911 187982 161488
5588 161488 752017 592142 385434 647982 411461 353412 347145 182792 546443 626608
5578 626608 881338 180271 161736 82919 521776 353432 38040 697837 622265 531121
5568 531121 354022 480461 439138 238287 555225 624206 413613 598579 716469 734329
5558 734329 656341 249402 489297 521754 309746 529770 246357 717033 384127 158077
5548 158077 384964 500162 446262 657451 484085 413822 641199 345891 375148 592960
5538 592960 241650 694818 23718 526481 203510 632261 408069 458230 498260 430532
5528 430532 259494 353940 449181 349128 945881 458682 509877 323259 604337 10584
$$ packed form
5599D37003O903K06507k76584J553k35188J58370Q0389l06686N05644l89929k6494
5588A61488N90529j59875k06708K62548k36521n8049o267j64353L63651Q0165
5578F26608K54730p01067j8535p8817M38857j68344l15392O59797p5572r1144
5568E31121j77099J26439m1323k00851L16938O8981k10593J84966J17890J7860
5558G34329p7988m06939K39895L2457k12008K20024k83413M70676l32906k26050
5548A58077K26887J15198n3900K11189j73366p0263K27377k95308K9257K17812
5538E92960l51310M53168o71100N02763l22971M28751k24192N0161M0030o7728
5528D30532j71038R4446R5241j00053N96753m87199N1195j86618K81078n93753
$$ plain form
5518 10584 1045491 454978 294099 610753 585946 459009 501255 585282 579057 793796 541498
5507 541498 631342 520804 571612 521127 226271 510160 863887 488721 662424 781394
5497 781394 266341 362654 836076 646263 584585 611264 408246 469958 500756 608188 926214
5486 926214 611989 738089 979544 473985 664356 991056 342892 576514 572760 464700
5476 464700 537296 921957 606116 929332 626636 723850 531365 734088 561934 944741
5466 944741 644221 840922 610499 530608 727099 876710 710070 547624 974471 589668
5456 589668 777079 410375 599281 355938 770813 329779 262693 451193 538388 715128
5446 715128 666541 548042 659895 697497 857929 741340 681407 846942 385577 286025
$$ packed form
5518A0584J034907n90513j60879L16654k4807j26937M2246Q4027o225K14739k52298
5507E41498Q9844j10538N0808n0485k94856K83889L53727l75166J73703J18970
5497G81394n15053R6313M73422j89813o1678K6679k03018O1712L0798J07432L18026
5486I26214l14225J26100K41455n05559J90371L26700o48164K33622l754j08060
5476D64700P2596L84661l15841L23216l02696R7214j92485K02723j72154L82807
5466I44741l00520J96701k30423p9891J96491J49611j66640j62446M26847l84803
5456E89668J87411l66704J88906k43343M14875m41034o7086J88500Q7195J76740
5446G15128m8587j18499J11853L7602J60432j16589n9933J65535m61365r9552
$$ plain form
5436 286025 775346 986883 542796 307429 902009 877564 561835 526031 280129 626807
5426 626807 528332 778360 615033 316080 535945 521843 409312 504531 724710 335798
5416 335798 636445 421791 304956 390205 347234 473996 523582 378022 556779 768800
5406 768800 546186 275046 375685 985522 470791 724785 541164 564534 395886 247146
5396 247146 532026 575517 656024 571210 261446 548763 311191 493500 831885 564434
5386 564434 237315 509621 664193 597268 470460 381043 196376 559706 278725 546658
5376 546658 463228 350415 339754 431293 535404 57878 568917 544683 391835 676804
5366 676804 587733 369127 840764 931414 596990 623256 603526 587998 530075 468453 182468
$$ packed form
5436B86025M89321K11537m44087k35367N94580k4445l15729l5804k45902L46678
5426F26807r8475K50028j63327k98953K19865j4102j12531R5219K20179l88912
5416C35798L00647k14654j16835Q5249m2971J26762M9586j45560J78757K12021
5406G68800k22614k71140J00639O09837n14731K53994j83621K3370j68648j48740
5396B47146K84880M3491Q0507q4814l09764K87317k37572J82309L38385k67451
5386E64434l27119K72306J54572o6925j26808q9417j84667L63330k80981K67933
5376E46658q3430j12813j0661R1539J04111m77526N11039k4234j52848K84969
5366F76804q9071k18606M71637R0650l34424K6266j9730j5528n7923o1622k85985
$$ plain form
5355 182468 409147 638601 279793 170839 413886 611212 817675 661803 1114555 734120
5345 734120 756973 639429 802795 706775 991302 530158 427214 607176 754323 572879
5335 572879 557336 481744 873655 317032 489515 818628 420620 818730 554366 550213
5325 550213 720458 683437 559025 906502 797794 592986 621450 1054327 842058 212991
5315 212991 502451 498718 575141 567275 880970 383067 486154 382483 352153 734038 780055
5304 780055 716966 361785 529386 577355 331616 498596 630788 502884 333481 854529
5294 854529 461066 1118172 731019 401103 448003 671458 697847 816053 994463 670846
5284 670846 849751 596795 680081 626483 485236 808362 888606 909210 891127 688393 870582
$$ packed form
5355A82468K26679K29454l58808j08954K43047J97326K06463j55872M52752l80435
5345G34120K2853j17544J63366r6020K84527m61144j02944J79962J47147j81444
5335E72879j5543p5592L91911n56623J72483L29113l98008L98110k64364m153
5325E50213J70245l7021j24412L47477j08708k04808K8464M32877k12269o29067
5315B12991K89460l733P6423p866L13695m97903J03087j03671l0330L81885M6017
5304G80055o3089l55181J67601M7969k45739J66980J32192j27904j69403N21048
5294H54529l93463O57106l87153l29916M6900K23455K6389J18206J78410l23617
5284F70846J78905k52956Q3286n3598j41247L23126Q0244K0604j8083k02734J82189
$$ plain form
5273 870582 1040671 582939 465467 637408 790682 694316 827916 391649 608850 492958
5263 492958 407464 420900 1041271 839542 927412 602669 811248 833083 655577 892290
5253 892290 698980 849109 613303 1207686 1054162 663116 569993 751425 821228 1307481
5243 1307481 955118 736166 481530 687740 634494 633196 1002136 871649 864556 870013 753742
5232 753742 840475 534074 748683 747055 521566 799052 588527 725729 504840 626285
5222 626285 822546 707861 856325 1022923 1064233 931611 808372 694155 928881 843944
5212 843944 819880 1062857 983273 661313 879606 556871 1109873 867359 697537 691551
5202 691551 809699 878460 1049325 771831 1109970 1039595 688951 1172848 918609 1103606
$$ packed form
5273H70582J70089m57732j17472J71941J53274r6366J33600m36267K17201j15892
5263D92958q5494J3436O20371k01729Q7870l24743K08579K1835j77506K36713
5253H92290j93310J50129k35806N94383j53524l91046r3123J81432O9803M86253
5243A307481l52363k18952k54636K06210n3246j298L68940j30487p093N457j16271
5232G53742Q6733l06401K14609j628k25489K77486k10525J37202k20889J21445
5222F26285J96261j14685J48464J66598M1310j32622j23239j14217K34726q4937
5212H43944k4064K42977p9584l21960K18293l22735N53002k42514j69822n986
5202F91551J18148O8761J70865k77494L38139p0375l50644M83897k54239J84997
$$ plain form
5192 1103606 367690 901921 934706 819735 952907 999736 735084 647385 968292 1293151
5182 1293151 1084854 846026 1291319 911831 882034 1412556 1126314 1187868 1137876 1332656
5172 1332656 965693 1286442 810484 907404 1097602 971387 1092066 846656 872323 1239919
5162 1239919 1027284 966702 1034714 1073045 1055238 1291881 1377300 1285537 1308285 1384175 1119564
5151 1119564 1103160 1401751 1389514 1360661 1423091 1804919 1029787 1271255 1874094 1585055
5141 1585055 1448086 1453380 1334976 1443178 1328609 1663681 1591749 1297755 1314837 1812984
5131 1812984 1659259 1272752 1475613 1803917 1735934 1882831 1777052 1704440 1476264 1347174
5121 1347174 1641314 1489577 1633976 2103507 1963850 1864954 2058765 1586754 2053325 1911424
$$ packed form
5192A103606p35916N34231L2785j14971J33172M6829k64652q7699L20907L24859
5182A293151k08297k38828M45293l79488k9797N30522k86242O1554m9992J94780
5172A332656l66963L20749m75958R6920J90198j26215J20679k45410K5667L67596
5162A239919k12635o0582O8012L8331j7807K36643Q5419r1763K2748P5890k64611
5151A119564j6404K98591j2237k8853O2430L81828p75132K41468O02839k89039
5141A585055j36969N294j18404J08202j14569L35072p1932k93994J7082M98147
5131A812984j53725l86507K02861L28304o7983J46897j05779p2612k28176j29090
5121A347174K94140j51737J44399M69531j39657r8896J93811m72011M66571j41901
$$ plain form
5111 1911424 1820969 2260347 2316464 1969194 2297325 1841286 2115130 2457388 2364794 2268000
5101 2268000 2423584 2312944 2497238 2365169 2253731 2524383 2621501 2466697 2713291 2805201
5091 2805201 2373647 2612764 2742441 2816550 3386171 3206810 3098381 2892196 3288506 3182530
5081 3182530 3262413 3393479 3546014 3144113 3354814 3403908 3688674 3643855 3464649 3721302
5071 3721302 3880788 3991624 3683716 4082002 3876369 4437544 4551924 4713307 4627368 4952325
5061 4952325 4643214 4816166 4904360 5016112 4917039 5126600 5284023 5292540 5341533 5298231 5153146
5050 5153146 5674313 6013567 5938053 6151468 6012364 6067197 6161116 6116524 6679996 6463455
5040 6463455 6791242 7125976 6716747 6689921 6833074 6899011 6527175 7067150 6822711 6952437
$$ packed form
5111A911424r0455M39378N6117l47270L28131m56039K73844L42258r2594r6794
5101B268000J55584j10640J84294j32069j11438K70652R7118j54804K46594R1910
5091B805201m31554K39117J29677P4109N69621j79361j08429k06185L96310j05976
5081C182530P9883J31066J52535m01901K10701M9094K84766m4819j79206K56653
5071C721302J59486J10836l07908L98286k05633N61175J14380J61383q5939L24957
5061D952325l09111J72952Q8194J11752r9073K09561J57423Q517M8993m3302j45085
5050E153146N21167L39254p5514K13415j39104N4833R3919m4592N63472k16541
5040F463455L27787L34734m09229k6826J43153O5937l71836N39975k44439J29726
$$ plain form
5030 6952437 6926649 7022050 7148116 7015969 7146445 7000169 7435787 7340537 7643527 7596798
5020 7596798 8105222 8048448 7997991 8020088 8404998 8503949 8581078 8689470 8768403 9266499 9487263
5009 9487263 9807264 9906325 10275173 10521835 10696405 10950749 11128188 11550058 11532311 11585376
4999 11585376 11473735 12115970 11837486 12058281 11574453 12006085 12098586 12257418 12234877 12260872
4989 12260872 12052305 12444721 12026870 12249167 12591425 12612539 12455578 12843907 12593229 13034164
4979 13034164 12581036 12629907 12661005 12684470 12808625 12896736 12809039 12441336 12772819 12982739
4969 12982739 12552261 13163853 12798495 13295077 13151776 13332565 13531883 13191117 13464354
4960 13464354 13813471 14071299 14231672 14431072 14199650 14144378 14106929 14269502 14994870 14897282
$$ packed form
5030F952437k5788R5401J26066j32147J30476j46276M35618r5250L02990m6729
5020G596798N08424n6774n0457K2097L84910R8951P7129J08392P8933M98096K20764
5009I487263L20001R9061L68848K46662J74570K54344J77439M21870j7747N3065
4999A1585376j11641O42235k78484K20795m83828M31632R2501J58832k2541K5995
4989A2260872k08567L92416m17851K22297L42258K1114j56961L88329k50678M40935
4979A3034164m53128M8871L1098K3465J24155Q8111q7697l67703L31483K09920
4969A2982739m30478O11592l65358M96582j43301J80789J99318l40766K73237
4960A3464354L49117K57828J60373J99400k31422n5272l7449J62573P25368r7588
$$ plain form
4950 14897282 15047682 15187521 14547986 14671137 14753136 15148259 14746300 14743294 15217264 14954272
4940 14954272 14729310 14952903 15125555 15184530 15317863 15398332 15423986 15864188 16042145 16320873
4930 16320873 16453033 16148870 16798588 16928695 17040485 17267114 17585954 17793314 17556900
4921 17556900 18218926 18371434 18561896 18438799 18382793 18924931 18788938 18781348 19264209 19453730
4911 19453730 19310379 19396632 19643083 19754851 20173590 19748905 20303494 20115677 20768825 20514027
4901 20514027 20712117 21177818 21284921 21373496 21423823 21628045 21367064 21668078 21753808 21321711
4891 21321711 22150670 21631452 21982270 22139971 21686182 21628582 21605446 21137082 21647284 21375010
4881 21375010 22326727 21995393 22236342 22668766 23133941 23733378 23871502 24525462 24973808
$$ packed form
4950A4897282J50400J39839o39535J23151Q1999L95123m01959l006M73970k62992
4940A4954272k24962K23593J72652N8975J33333Q0469K5654M40202J77957K78728
4930A6320873J32160l04163O49718J30107J11790K26629L18840K07360k36414
4921A7556900O62026J52508J90462j23097n6006N42138j35993p590M82861J89521
4911A9453730j43351Q6253K46451J11768M18739m24685N54589j87817O53148k54798
4901B0514027J98090M65701J07103Q8575N0327K04222k60981L01014Q5730m32097
4891B1321711Q28959n19218L50818J57701m53789n7600k3136m68364N10202k72274
4881B1375010R51717l31334K40949M32424M65175N99437J38124O53960M48346
$$ plain form
4872 24973808 25404667 25830733 26236428 26106583 26360103 26449740 26917314 26836634 26877997 26901930
4862 26901930 26449689 26456866 26612780 26330886 26095714 26159779 26243791 25700080 26020565 25808627
4852 25808627 26424890 26157385 26153171 25918379 25968543 26064498 26473926 26352216 26383282 26656066
4842 26656066 26572826 26492137 26667700 27115711 26992976 26888243 27501741 27193207 27698453 27905052
4832 27905052 27579483 27972465 28273666 28238564 28413378 28329296 28424817 27855525 27726040 27674278
4822 27674278 27735638 27004906 26938401 26826337 26341039 26296671 25800559 25451551 25281237 25412261
4812 25412261 25613980 25039926 24957101 25092935 24695699 24983886 25085729 25211202 24963801 24801298
4802 24801298 25197855 25353003 25203212 25998538 25629456 25722711 26286110 26370085 26850076 26959608
$$ packed form
4872B4973808M30859M26066M05695j29845K53520Q9637M67574q0680M1363K3933
4862B6901930m52241P177J55914k81894k35172O4065Q4012n43711L20485k11938
4852B5808627O16263k67505m214k34792N0164R5955M09428j21710L1066K72784
4842B6656066q3240q0689J75563M48011j22735j04733O13498l08534N05246K06599
4832B7905052l25569L92982L01201l5102J74814q4082R5521n69292j29485n1762
4822B7674278O1360p30732o6505j12064m85298m4368m96112l49008j70314J31024
4812B5412261K01719n74054q2825J35834l97236K88187J01843J25473k47401j62503
4802B4801298L96557J55148j49791P95326l69082R3255N63399Q3975M79991J09532
$$ plain form
4792 26959608 27387517 27226035 27756851 27201869 27939260 28147906 28695527 28575689 28862497
4783 28862497 28545555 28583143 28637331 28622487 28850865 28722345 28847389 28184723 28317088 28248481
4773 28248481 28031764 27193705 27252051 27188373 27095810 26957412 26550075 26241988 26047018 25506983
4763 25506983 25363301 25263838 25059405 24496211 24218502 23927533 23074238 22655000 22445608 22302468
4753 22302468 21798664 21684386 21410406 20944303 20753881 20867835 20213330 19906274 19661654
4744 19661654 19614581 19422373 19059427 18717366 18592406 18409407 17940360 17760002 17961838 17454442
4734 17454442 17156002 17070677 17182631 16520051 16366195 16242334 15879741 15607958 15428550 15194350
4724 15194350 15258207 15147969 14874564 14826056 15122643 14658981 14439130 14678206 14238347 14036296
$$ packed form
4792B6959608M27909j61482N30816n54982P37391K08646N47621j19838K86808
4783B8862497l16942L7588N4188j4844K28378j28520J25044o62666J32365o8607
4773B8248481k16717q38059N8346o3678r2563j38398m07337l08087j94970n40035
4763B5506983j43682r9463k04433n63194k77709k90969q53295m19238k09392j43140
4753B2302468n03804j14278k73980m66103j90422J13954o54505l07056k44620
4744A9661654m7073j92208l62946l42061j24960j82999m69047j80358K01836n07396
4734A7454442k98440q5325J11954o62580j53856j23861l62593k71783j79408k34200
4724A5194350O3857j10238k73405m8508K96587m63662k19851K39076m39859k02051
$$ plain form
4714 14036296 14165609 13837157 13635180 13696451 13760296 13776487 14134745 13861973 13847044 14109335
4704 14109335 13904377 14109727 14159872 13515970 14165520 13963574 14064034 13347661 13881678 13931411
4694 13931411 13354529 14195947 13786669 13975720 13894383 14148699 13908239 14043284 13756599 13643112
4684 13643112 13821471 14465475 14019091 14044371 14277864 14101555 14268338 13878852 14006085 14282225
4674 14282225 14284986 14004170 14648152 14171382 14573908 14466391 14547510 14757320 14381631 14813155
4664 14813155 14436063 15161993 15044000 15217556 14982631 14679159 14816249 15196975 14928552
4655 14928552 14768110 15340838 15179658 14739557 14187173 14640999 14866632 14766368 15416358
4646 15416358 15067543 15184434 14808285 15054974 15135539 14933747 14767576 14638963 15180384 14848451
$$ packed form
4714A4036296J29313l28452k01977O1271O3845J6191L58258k72772j4929K62291
4704A4109335k04958K05350N0145o43902O49550k01946J00460p16373N34017M9733
4694A3931411n76882Q41418m09278J89051q1337K54316k40460J35045k86685j13487
4684A3643112J78359O44004m46384K5280K33493j76309J66783l89486J27233K76140
4674A4282225K761k80816O43982m76770M02526j07517Q1119K09810l75689M31524
4664A4813155l77092P25930j17993J73556k34925l03472J37090L80726k68423
4655A4928552j60442N72728j61180m40101n52384M53826K25633j00264O49990
4646A5416358l48815J16891l76149K46689Q0565k01792j66171j28613N41421l31933
$$ plain form
4636 14848451 15041352 14949001 15119401 15034249 15284862 14848397 14658662 14918639 14823074 14842320
4626 14842320 14818083 14694418 14637599 14772916 14649693 14641029 14695048 14680427 14992695 14790713
4616 14790713 14686631 15066723 14962952 14738989 14787952 14348085 14626114 14424709 14228220 14343293
4606 14343293 14129093 14119698 14445384 13963525 13736713 14025918 14395259 14484466 13701689 14201650
4596 14201650 13717715 13904268 13492294 13895407 13943438 14023303 13755692 14116918 13823167 13605772
4586 13605772 13664789 13746228 13945682 13993174 13346308 14132485 13833172 14055353 13746623 13998777
4576 13998777 13752284 13958087 13982892 14431518 14330590 14801350 14526884 14282759 14866833 14948207
4566 14948207 14831612 14950908 15220837 14897190 14861407 14849748 15147101 15023681 14874736 14927015
$$ packed form
4636A4848451J92901r2351J70400q5152K50613m36465j89735K59977r5565J9246
4626A4842320k4237j23665n6819J35317j23223q664N4019j4621L12268k01982
4616A4790713j04082L80092j03771k23963M8963m39867K78029k01405j96489J15073
4606A4343293k14200r395L25686m81859k26812K89205L69341Q9207p82777M99961
4596A4201650m83935J86553m11974M03113M8031P9865k67611L61226k93751k17395
4586A3605772N9017Q1439J99454M7492o46866P86177k99313K22181l08730K52154
4576A3998777k46493K05803K4805M48626j00928M70760k74466k44125N84074Q1374
4566A4948207j16595J19296K69929l23647l5783j1659K97353j23420j48945N2279
$$ plain form
4556 14927015 14848441 14156334 14631309 14435058 14413806 14499570 14554837 14852025 14994416 15072380
4546 15072380 15181262 15519015 15461924 15889461 15734603 15261341 15104565 15100142 14889182 15061732
4536 15061732 14468162 14417852 14325754 14464011 14057543 13868542 13801237 13572883 13714766 13817891
4526 13817891 14282877 14400238 14550945 14827387 14703511 15401701 15327953 15405847 15551667 15408274
4516 15408274 15168357 14947838 14754193 14592810 14128306 13598914 13574460 12894250 13000773 12474013
4506 12474013 12510199 12112880 12136414 11885099 12062045 12084142 12107341 11891736 12406572 12306916
4496 12306916 12427546 12278418 12459544 12346133 11939675 11800990 11956885 11461347 11025455
4487 11025455 11097907 10437153 10366847 9750701 9830351 10054121 9407237 9556756 9159464 9296553
$$ packed form
4556A4927015p8574o92107M74975j96251k1252Q5764N5267K97188J42391P7964
4546A5072380J08882L37753n7091M27537j54858m73262j56776m423k10960J72550
4536A5061732n93570n0310r2098J38257m06468j89001o7305k28354J41883J03125
4526A3817891M64986J17361J50707K76442j23876O98190p3748P7894J45820j43393
4516A5408274k39917k20519j93645j61383m64504n29392k4454o80210J06523n26760
4506A2474013L6186l97319K3534k51315J76946K2097K3199k15605N14836r9656
4496A2306916J20630j49128J81126j13411m06458j38685J55895m95538m35892
4487A1025455P2452o60754p0306o16146P9650K23770o46884J49519l97292J37089
$$ plain form
4477 9296553 8898404 9280738 9096931 9158901 8945004 8938040 9043848 8908019 9268128 8955225
4467 8955225 8926973 8615895 8232974 8770352 8264904 8330519 8007022 7481848 7858614 7503952
4457 7503952 7955253 7605099 7763098 7755744 7557561 7562406 7311933 7340342 7452202 7654351
4447 7654351 7296725 7524246 7294367 7166090 7525406 7016506 7558623 7448077 7555787 7372354
4437 7372354 7186694 7444804 7648168 7459876 7406605 7189230 7281574 7505570 7256044 7023479
4427 7023479 7187857 7316986 7455047 7133789 7399383 7176649 7285524 7523375 7121762 7153963
4417 7153963 7412659 7173476 7277191 7452123 7009022 7222252 7239594 7079935 7368499 7951200
4407 7951200 7410929 7387901 7427587 7472294 7555407 7455391 7595212 7142640 7524051 7442927
$$ packed form
4477I296553l98149L82334j83807O1970k13897o964J05808j35829L60109l12903
4467H955225k8252l11078l82921N37378n05448O5615l23497n25174L76766l54662
4457G503952M51301l50154J57999p354j98183M845k50473K8409J11860K02149
4447G654351l57626K27521k29879j28277L59316n08900N42117j10546J07710j83433
4437G372354j85660K58110K03364j88292n3271k17375R2344K23996k49526k32565
4427G023479J64378J29129J38061l21258K65594k22734J08875K37851m01613L2201
4417G153963K58696k39183J03715J74932m43101K13230J7342j59659K88564N82701
4407G951200n40271k3028L9686M4707Q3113j00016J39821m52572L81411q1124
$$ plain form
4397 7442927 7893579 7471541 7339495 7721669 7625321 7858107 7692899 7592434 7675883 7884569
4387 7884569 7435335 7673527 7774925 7587980 7830359 7648579 7655732 7414781 7513395 7751158
4377 7751158 7842928 8109852 7778095 7891943 7612557 7542484 7847289 8028219 8231349 8037055
4367 8037055 8081680 8074236 7720591 7746677 7549493 7570097 7271668 7584672 7647787 7454677 7360887
4356 7360887 7366694 7474423 6887030 7701074 7261456 7213449 7159309 7158669 6972753 7303622 7029934
4345 7029934 6881522 6921206 6835808 7157152 7244253 6964036 6280372 6646371 6963091 6543254
4335 6543254 6285080 6624566 6468177 6575717 6364366 6669642 6493282 6522337 6482941 6674925
4325 6674925 6619505 6392805 6158453 6136031 6158633 6075915 5896272 6399278 6211376 6376917
$$ packed form
4397G442927M50652m22038j32046L82174r6348K32786j65208j00465Q3449K08686
4387G884569m49234K38192J01398j86945K42379j81780P153k40951R8614K37763
4377G751158R1770K66924l31757J13848k79386p0073L04805J80930K03130j94294
4367H037055M4625p444l53645K6086j97184K0604k98429L13004O3115j93110r3790
4356G360887N807J07729n87393Q14044m39618m8007n4140o40j85916L30869k73688
4345G029934j48412L9684q5398L21344Q7101k80217o83664L65999L16720m19837
4335F543254k58174L39486j56389J07540k11351L05276j76360K9055l9396J91984
4325F674925n5420k26700k34352k2422K2602q2718j79643N03006j87902J65541
$$ plain form
4315 6376917 6078980 6592044 6225872 6072582 6489945 6579536 6678613 6525509 6530253 6916276
4305 6916276 6855792 6909141 6962071 6797863 7132782 6970568 7216740 7226555 7050903 7241436
4295 7241436 7058171 7589159 7174703 7289690 7395388 7175272 7324688 7242329 7255337 7607323
4285 7607323 7105758 7375980 7326818 7232428 7560396 7572365 7376241 6924089 7015450 7160162
4275 7160162 7356794 6828013 7152054 7201079 7282570 7435429 7277200 7187374 7060334 7569423
4265 7569423 7316608 7995273 7909574 8105109 8246548 8524580 9034015 9313015 9489407 9480259
$$ packed form
4315F376917k97937N13064l66172j53290M17363Q9591R9077j53104M744L86023
4305F916276o0484N3349N2930j64208L34919j62214K46172R815j75652J90533
4295G241436j83265N30988m14456J14987J05698k20116J49416q2359J3008L51986
4285G607323n01565K70222m9162r4390L27968J1969j96124m52152R1361J44712
4275G160162J96632n28781L24041M9025Q1491J52859j58229q9826j27040N09089
4265G569423k52815O78665q5699J95535J41439K78032N09435K79000J76392r148
$$ [...]
##END NTUPLES=NMR SPECTRUM
##END=
