##TITLE=1Hres-test
##JCAMPDX= 6.0         $$ Bruker NMR JCAMP-DX V2.0
##DATA TYPE= NMR FID
##DATA CLASS= NTUPLES
##ORIGIN= UXNMR, Bruker Analytische Messtechnik GmbH
##OWNER= root
$$ XWIN-NMR		Version 3.5
$$ Fri Aug 14 17:05:42 2015 Russian Standard Time (UT+4h)  servis@DPX200
##.OBSERVE FREQUENCY= 200.13155
##.OBSERVE NUCLEUS= ^1H
##.DELAY= (6, 6)
##.ACQUISITION MODE= SIMULTANEOUS
##.ACQUISITION SCHEME= undefined
##.AVERAGES= 1
##.DIGITISER RES= 19
##SPECTROMETER/DATA SYSTEM= spect
##.PULSE SEQUENCE= zg30
##.SOLVENT NAME= Acetone
##.SHIFT REFERENCE= (INTERNAL, Acetone, 0, 10.5024)
##AUDIT TRAIL= $$ (NUMBER, WHEN, WHO, WHERE, WHAT)
$$ ##TITLE= Audit trail, XWIN-NMR		Version 3.5
$$ ##JCAMPDX= 5.01
$$ ##ORIGIN= Bruker BioSpin GmbH
$$ ##OWNER= servis
$$ F:/spectra/data/test/nmr/1Hres-test/1/audita.txt
$$ ##AUDIT TRAIL=  $$ (NUMBER, WHEN, WHO, WHERE, WHAT)
(   1,<2015-08-14 17:04:24.29 +0400>,<servis>,<DPX200>,
      <created by zg, POWCHK disabled, PULCHK disabled
       configuration hash MD5:
       00 E9 B6 7A A2 85 ED C7 34 08 36 98 17 FE 4E 26
       data hash MD5: 32K
       72 BE 01 21 2C 26 A0 97 1F 1B 52 78 91 F5 90 3B>)
$$ ##END=
$$ 
$$ hash MD5
$$ BC BC 48 63 52 E8 6B D8 B5 30 5F 57 DC A8 E2 7D
##$RELAX= 
##$RELAX= 
##$RELAX= 
##$RELAX= 
##$RELAX= 
$$ Bruker specific parameters
$$ --------------------------
##$DU= <F:/spectra>
##$EXPNO= 1
##$NAME= <1Hres-test>
##$PROCNO= 1
##$TYPE= <nmr>
##$USER= <test>
##$AMP= (0..31)
100 100 100 100 100 100 100 100 100 100 100 100 100 100 100 100 100 100 
100 100 100 100 100 100 100 100 100 100 100 100 100 100 
##$AQSEQ= 0
##$AQ_mod= 1
##$AUNM= <au_zg>
##$AUTOPOS= <>
##$BF1= 200.13
##$BF2= 200.13
##$BF3= 200.13
##$BF4= 200.13
##$BF5= 200.13
##$BF6= 200.13
##$BF7= 200.13
##$BF8= 200.13
##$BYTORDA= 1
##$CFDGTYP= 0
##$CFRGTYP= 5
##$CHEMSTR= <none>
##$CNST= (0..31)
1 1 145 1 1 1 1 1 1 1 1 1 1 1 1 1 1 1 1 1 1 1 1 1 1 1 1 1 1 1 1 1 
##$CPDPRG= <>
##$CPDPRG1= <>
##$CPDPRG2= <>
##$CPDPRG3= <>
##$CPDPRG4= <mlev>
##$CPDPRG5= <mlev>
##$CPDPRG6= <mlev>
##$CPDPRG7= <mlev>
##$CPDPRG8= <mlev>
##$CPDPRGB= <>
##$CPDPRGT= <>
##$D= (0..31)
0 2 0 0 0 0 0 0 0 0 0 0.03 0 0 0 0 0 0 0 0 0 0 0 0 0 0 0 0 0 0 0 0 
##$DATE= 1439557463
##$DBL= (0..7)
120 120 120 120 120 120 120 120 
##$DBP= (0..7)
150 150 150 150 150 150 150 150 
##$DBP07= 0
##$DBPNAM0= <>
##$DBPNAM1= <>
##$DBPNAM2= <>
##$DBPNAM3= <>
##$DBPNAM4= <>
##$DBPNAM5= <>
##$DBPNAM6= <>
##$DBPNAM7= <>
##$DBPOAL= (0..7)
0.5 0.5 0.5 0.5 0.5 0.5 0.5 0.5 
##$DBPOFFS= (0..7)
0 0 0 0 0 0 0 0 
##$DE= 6
##$DECBNUC= <off>
##$DECIM= 128
##$DECNUC= <off>
##$DECSTAT= 4
##$DIGMOD= 1
##$DIGTYP= 9
##$DL= (0..7)
0 120 120 120 120 120 120 120 
##$DP= (0..7)
150 150 150 150 150 150 150 150 
##$DP07= 0
##$DPNAME0= <>
##$DPNAME1= <>
##$DPNAME2= <>
##$DPNAME3= <>
##$DPNAME4= <>
##$DPNAME5= <>
##$DPNAME6= <>
##$DPNAME7= <>
##$DPOAL= (0..7)
0.5 0.5 0.5 0.5 0.5 0.5 0.5 0.5 
##$DPOFFS= (0..7)
0 0 0 0 0 0 0 0 
##$DQDMODE= 0
##$DR= 19
##$DS= 0
##$DSLIST= <SSSSSSSSSSSSSSS>
##$DSPFIRM= 0
##$DSPFVS= 10
$$ [...]
##$SUBNAM1= <"">
##$SUBNAM2= <"">
##$SUBNAM3= <"">
##$SUBNAM4= <"">
##$SUBNAM5= <"">
##$SUBNAM6= <"">
##$SUBNAM7= <"">
##$SUBNAM8= <"">
##$SUBNAM9= <"">
##$SW= 5.00472096529788
##$SWIBOX= (0..15)
0 0 2 0 0 0 0 0 0 0 0 0 0 0 0 0 
##$SW_h= 1001.60256410256
##$TD= 32768
##$TD0= 1
##$TE= 0
##$TE2= 300
##$TE3= 300
##$TEG= 300
##$TL= (0..7)
0 120 120 120 120 120 120 120 
##$TP= (0..7)
150 150 150 150 150 150 150 150 
##$TP07= 0
##$TPNAME0= <>
##$TPNAME1= <>
##$TPNAME2= <>
##$TPNAME3= <>
##$TPNAME4= <>
##$TPNAME5= <>
##$TPNAME6= <>
##$TPNAME7= <>
##$TPOAL= (0..7)
0.5 0.5 0.5 0.5 0.5 0.5 0.5 0.5 
##$TPOFFS= (0..7)
0 0 0 0 0 0 0 0 
##$TUNHIN= 0
##$TUNHOUT= 0
##$TUNXOUT= 0
##$USERA1= <user>
##$USERA2= <user>
##$USERA3= <user>
##$USERA4= <user>
##$USERA5= <user>
##$V9= 5
##$VALIST= <valist>
##$VCLIST= <CCCCCCCCCCCCCCC>
##$VD= 0
##$VDLIST= <DDDDDDDDDDDDDDD>
##$VPLIST= <PPPPPPPPPPPPPPP>
##$VTLIST= <TTTTTTTTTTTTTTT>
##$WBST= 1024
##$WBSW= 8
##$XGAIN= (0..3)
0 0 0 0 
##$XL= 0
##$YL= 0
##$YMAX_a= 44349
##$YMIN_a= -42768
##$ZGOPTNS= <>
##$ZL1= 120
##$ZL2= 120
##$ZL3= 120
##$ZL4= 120
##$ABSF1= 10
##$ABSF2= 0
##$ABSG= 5
##$ABSL= 3
##$ALPHA= 0
##$AQORDER= 0
##$ASSFAC= 0
##$ASSFACI= 0
##$ASSFACX= 0
##$ASSWID= 0
##$AUNMP= <proc_1d>
##$AZFE= 0.1
##$AZFW= 0.1
##$BCFW= 1
##$BC_mod= 2
##$BYTORDP= 1
##$COROFFS= 0
##$CY= 136.235626220703
##$DATMOD= 1
##$DC= 2
##$DFILT= <>
##$DTYPP= 0
##$F1P= 8.20375801971597
##$F2P= 7.80423333774224
##$FCOR= 0.5
##$FTSIZE= 0
##$FT_mod= 4
##$GAMMA= 1
##$GB= 0.1
##$INTBC= 1
##$INTSCL= 1
##$ISEN= 128
##$LB= 0
##$LEV0= 0
##$LPBIN= 0
##$MAXI= 14.97735
##$MC2= 0
##$MEAN= 0
##$ME_mod= 0
##$MI= 2.093299
##$NCOEF= 0
##$NC_proc= 0
##$NLEV= 6
##$NOISF1= 8.587773
##$NOISF2= 6.764455
##$NSP= 1
##$NTH_PI= 0
##$NZP= 0
##$OFFSET= 10.50238
##$PC= 1
##$PHC0= -85.57392
##$PHC1= -29.45794
##$PH_mod= 0
##$PKNL= yes
##$PPARMOD= 0
##$PSCAL= 0
##$PSIGN= 0
##$REVERSE= no
##$SF= 200.13
##$SI= 32768
##$SIGF1= 3
##$SIGF2= 2
##$SINO= 400
##$SIOLD= 32768
##$SREGLST= <1H.CDCl3>
##$SSB= 0
##$STSI= 0
##$STSR= 0
##$SW_p= 3810.97560975609
##$SYMM= 0
##$S_DEV= 0
##$TDeff= 0
##$TDoff= 0
##$TI= <>
##$TILT= no
##$TM1= 0
##$TM2= 0
##$TOPLEV= 0
##$USERP1= <user>
##$USERP2= <user>
##$USERP3= <user>
##$USERP4= <user>
##$USERP5= <user>
##$WDW= 1
##$XDIM= 8192
##$YMAX_p= 0
##$YMIN_p= 0
$$ End of Bruker specific parameters
$$ ---------------------------------
##NTUPLES= NMR FID
##VAR_NAME=  TIME,          FID/REAL,        FID/IMAG
##SYMBOL=    X,             R,               I
##VAR_TYPE=  INDEPENDENT,   DEPENDENT,       DEPENDENT
##VAR_FORM=  AFFN,          ASDF,            ASDF
##VAR_DIM=   16384,         16384,           16384
##UNITS=     SECONDS,       ARBITRARY UNITS, ARBITRARY UNITS
##FACTOR=    0.000998400000000004, 1,        1
##FIRST=     0,             0,               0
##LAST=      16.3567872000001, 0,            0
##MIN=       0,             -42768,          0
##MAX=       16.3567872000001, 44349,        0
$$ Real data points
##PAGE= N=1
##DATA TABLE= (X++(R..R)), XYDATA
0@%%%%%%%%%%%%%%%%%%%JjJkKkKkKlMmNoOpQqRj1J2j3J5j7J8k0K2k4K7k9L2l6
51a9M0m4M8n3N9o6P4q3R4j08J25j47J78k22K89m04O36j271N417L5572M234l671
73D0678p761j1338j3886j4783j3939j1619p417k703K471P268J0853J3146J4350
86E320J3869J1423Q234L440j540o282j0182j2491j3649j3492j2007q586m510L64
100d0089N381Q903J1916J3408J3520J1927R595N064K62l980q254j1183j2932j3311
114i773j2385r848n548j509L120P576J0313J2592J2992J2245J0041O887K400k226
128C6877o382r740j2046j2710j2474j0696p178l543J264N749R335J1314J2691
141B461J2389J0480P899M263l31m914q162j1094j2440j2090j0988q439m962l93
$$ plain form
0 0 0 0 0 0 0 0 0 0 0 0 0 0 0 0 0 0 0 0 0 1 0 1 -1 1 -1 1 -1 1 -2 2 -2 3 -3 3 -4 4 -4 5 -6 6 -7 8 -9 9 -11 11 -13 14 -15 17 -19
51 -19 21 -23 25 -28 31 -35 39 -44 50 -58 67 -80 98 -124 165 -239 397 -874 4543 40115 44349 40678
73 40678 32917 21579 7693 -7090 -21029 -32648 -40065 -42768 -40297 -33029 -22176 -9030 5320
86 5320 19189 30612 38846 42286 40746 34464 24282 11791 -1858 -15350 -27357 -35943 -40453 -40089
100 -40089 -34708 -25805 -13889 -481 13039 24966 34561 39625 39887 35907 27653 16470 3538 -9773
114 -9773 -22158 -32006 -37554 -39063 -35943 -28367 -18054 -5462 7530 19775 29816 36703 39103 36877
128 36877 30495 20755 8709 -4001 -16475 -27171 -34349 -37892 -36628 -30879 -21544 -10230 2461
141 2461 14850 25330 33229 37492 37161 32247 24085 12991 551 -11539 -22527 -30966 -35928 -36321
155c6321L894P719J0178J1965J2387J0885R218N490J282k986o772r836j1479j2213
169f589j1132r369o405j979J951O167R400J1031J1811J1528R264P056K757j281
183C4210n373q345j0855j1672j1191r600p602l772N93M304P979J0432J1414J1216
197A1738J0212P452M625N9l380p528r531j1220j1188j0199q254m912j069K654
211c0541O534R217J0764J1391J0246Q188N989J769k055o138q664j0459j1001j0264
225a5024q930n952k403J182N216Q039J0163J0679J0762Q893O270L628q20m441
239B7262p186j0002j0769j0473r285o703l957j77L716P090R282J0537J0520R082
253A8937P207M649P15k812o286q750j0387j0498r451p485n110j363K127N473Q160
$$ plain form
155 -36321 -32427 -24708 -14530 -2565 9822 20707 29925 35415 36697 33711 26939 17103 5624 -6589
169 -6589 -17721 -27090 -33495 -35474 -33523 -27356 -17956 -6925 4886 16414 25678 32734 35491 34210
183 34210 28837 20492 9637 -2035 -13226 -22826 -30428 -34200 -33607 -29303 -21324 -10892 522 11738
197 11738 21950 29402 34027 34086 30706 23178 13647 2427 -8761 -18960 -27214 -32126 -33195 -30541
211 -30541 -24007 -14790 -4026 7365 17611 25799 31788 33557 31502 25364 16700 6241 -4760 -15024
225 -15024 -23954 -29906 -32309 -31127 -25911 -17872 -7709 2970 13732 22625 28895 32523 31703 27262
239 27262 20076 10074 -695 -11168 -20453 -27156 -31113 -31290 -27574 -20484 -11202 -665 9855 18937
253 18937 26144 30793 31508 28696 22410 13660 3273 -7225 -16676 -24161 -29271 -30634 -28507 -23034 -14874
268a4874R895J0681R639Q007N418K157j378m755p630j0147j0159r866p929n921
282b6862k979O79M166P223R095J0345R664Q887O171L263J77l536o512q957r925
297H99j0112q696o646l664o61K629N895Q652R910R851R002O673M254J626k335
312B7277n044q402r263r626r293p399m693j976J415M460P462Q989R902R471P689
327B0969N086K405o08l971o930q828r637r423p984n763k697L87L137O313Q478
342i066R331R414Q116O217L385K74k433n583q268r290r118q525o570l896j146
357b7158K064N341P485R123R329Q336P089M067J550j476m657o887q477r442q660
372a2373p043m888j982Q55L683O489Q596Q886R203P262M946K713l58l424n792
$$ plain form
268 -14874 -4979 5702 15341 23348 28766 30923 29545 24790 17160 7013 -3146 -13012 -20941 -26862
282 -26862 -29841 -29162 -24996 -17773 -8678 1667 11331 20218 26389 29652 29829 26293 19781 10824 899
297 899 -9213 -17909 -24555 -28219 -28880 -26251 -20356 -11704 -1794 8057 17059 23732 27986 29612 27277
312 27277 22233 13831 4568 -5058 -14351 -21750 -26443 -28419 -27004 -22544 -15082 -6093 3809 13280 20969
327 20969 26055 28460 27852 23881 16951 8123 -1514 -10937 -18921 -24684 -27381 -26994 -23857 -17544 -9066
342 -9066 265 9679 17795 24012 27397 27671 25238 19655 11387 2097 -7021 -15546 -22116 -26012 -27158
357 -27158 -25094 -19753 -12268 -3145 6184 14520 21609 25676 27226 25750 21093 14206 5729 -3713 -12373
372 -12373 -19416 -24304 -26286 -25431 -21748 -15259 -6663 2223 11426 18688 23634 26347 25989 22565 16773
387A6773p921r109q746p760n629k902k80K860N319P653Q758Q968Q109N632L505
402B5230O16j979n004p181q519q911p963o562l626j287J791M419O608Q240Q926
417D798Q289O322M494J699j455l699o312p967q620q299o714m912k058N00L363
432b0571N673P586Q670Q396P226M983K776j00k979n185p172q572q292p615n594
447b0770k534m03K385M809O743P911Q192P634N910L467J097k027m100o113q060
462D141q219p768o217m179j250J386L760N955P476Q314P896O347M562J809j221
477B2792l080n523p087p832q114o784m920k375M86K595N207O888P586P959P048
492A4846N606K488J85k369m607o444p764p755p189n392l357o90J800M379N994
$$ plain form
387 16773 8852 -257 -9003 -16763 -22392 -25294 -25574 -22714 -17395 -9742 -984 7984 16093 21725 25230
402 25230 25846 23867 18863 11682 3163 -5748 -13711 -20273 -23899 -25186 -23395 -18976 -12368 -4128 4798
417 4798 13087 19409 23903 25602 24147 20448 14136 6169 -2451 -10750 -17464 -22376 -24434 -23934 -20571
432 -20571 -14898 -7312 1358 9754 16980 21963 24739 24639 21660 16475 9303 731 -7561 -15176 -20770
447 -20770 -23304 -23707 -21322 -16513 -9770 -1859 6333 13967 19877 23344 24441 22414 18314 12201 4141
462 4141 -4078 -11846 -18063 -22242 -23492 -22106 -18346 -12391 -4915 3399 11295 17642 22204 24013 22792
477 22792 19712 14189 7102 -730 -8844 -15628 -20548 -22923 -22437 -19842 -14635 -7747 -161 7798 14846
492 14846 20452 22940 23125 20756 16149 9705 1941 -5814 -13003 -18395 -21752 -22442 -20642 -16263 -10269
507a0269P228P792P590N695L716R37j344l175n845p086p907p236o050m213j890
522b2057R34L257N337O606P526P789O146M551K176k08l127m520o837p087p451
537f965o485n163k771j92K674M256O146P408P256O682N219L336M97j752m209n633
553A0304o960p002p442n636l192j345J516L560N443O476P434P015N575M042J673
568B1461p13l040n181o681p039o951n968m571k010P35K498M933N897O921P183
583G474O340M576K507J32k475m380n931o653o839o624m971k889o62J935L972N618
599h870O614O950O475N133L712P13j377l468n623o228o830o682n303l834j442
614b0060J089L337N149N629O925O701N532M221J731n26k736m705n917o416o656
$$ plain form
507 -10269 -3041 4751 12341 18036 21752 22689 21345 18170 12325 5239 -2668 -9904 -15954 -20167 -22057
522 -22057 -21123 -17866 -12529 -5923 1603 9392 15538 20089 22265 22057 18930 14410 7573 486 -6965
537 -6965 -13450 -18613 -21384 -21576 -18902 -14646 -8500 -1092 6164 12846 18065 21401 21898 20146 15937 10304
553 10304 3344 -3658 -11100 -16736 -19928 -21273 -19757 -16197 -10754 -4278 3156 10171 15746 19788 21461
568 21461 20748 17708 12527 5846 -1193 -8144 -14112 -18683 -20693 -19958 -17460 -12527 -6630 291 7474
583 7474 13814 18390 20897 21029 18554 14174 8243 1590 -5249 -11873 -16844 -19733 -20395 -18460 -14488 -8870
599 -8870 -2256 4694 11169 16302 20014 20727 19350 15882 10259 4031 -2799 -9481 -14784 -18618 -20060
614 -20060 -18971 -15634 -10485 -4856 2069 8770 14302 18523 20254 19728 16992 12287 6370 -46 -6702
629f702n916m431k263R0K569L994N907O443O372O421M141K983L64j969l940n636
645H427o215o631n907n130k977o68J701L475N179N913O794O023M996L403J196
660A9579j263l071n063o011o260o101n186l656j660M01L041M819N709O179O228
675G685N435L899K036k11k547m424n401o041o222n599m189k333n4J892L972N073
691g029O215O221N777M310K710N60j576l855m751o291o288n535m324l160q79J163
707a6732L001N140N713N865N817M829L415J206p18k764m557n449o295n813m717
722a2059l545j989M52K208M364N339N707O284M984L916K242q1k188l652n167n989
738H26n645n220m200k432l68J460L359N363N572N549N496M350K774Q73j059l369
$$ plain form
629 -6702 -12618 -17049 -19312 -19222 -16653 -12659 -6752 -309 6063 12484 16625 19608 19972 18003 14063 8427
645 8427 2212 -4419 -10326 -15456 -18433 -19101 -17400 -13925 -8746 -2833 3961 9984 14980 18383 19579
660 19579 18316 15245 10182 4171 -2089 -8190 -13376 -17032 -18692 -18291 -15250 -10431 -4722 1457 7685
675 7685 13120 17019 19055 18844 16297 11873 6472 431 -5791 -11390 -15579 -17912 -17966 -16074 -12102 -7029
691 -7029 -814 5407 11184 15494 18204 18764 17188 13333 8582 2291 -3997 -9532 -13856 -17016 -17895 -16732
707 -16732 -13731 -8591 -2878 2987 8804 13633 17048 18254 17536 14772 10215 4766 -1529 -7342 -12059
722 -12059 -15604 -17593 -17141 -14933 -10569 -5230 477 6761 11745 15661 17903 17822 15634 11982 6815 826
738 826 -4819 -10039 -14239 -16671 -17039 -15579 -12220 -6857 -1285 4264 9760 14110 16884 17757 16698 13329
754A3329m664n629n926n231m377l156j149O68K818M284N532N657N615M547L240
769A5558J815m06k535m041n217n823n307m835l624j982K54J978L528N089N487
784f1N407N074L875K190N20j629l313m695n503n575n131m011k561p78J230K909
800a2052M578N540N396M912M266K874J185q34k774l834n467n598m775m701l076
815a4360j466N38J771M025N153N275N483M346L522J734J47k077l293m746n525
830E27n514m417l671k001l11J503L151M520N313N123N130L500K459N75p69k971
846A2147m457n143n192n037m060k662p37Q61K521M051M977N017N192M225K574
861A4277J174l10k318l632m850n239n172l917l275j666L17J515L654M534N342
$$ plain form
754 13329 8665 3036 -2890 -8121 -12498 -15654 -16803 -16135 -13317 -9033 -3501 2156 7771 12318 15558
769 15558 17373 16967 14432 10391 5174 -649 -5956 -10791 -14415 -16397 -16143 -14165 -10637 -5548 -61
784 -61 5346 10420 14295 16485 17005 15376 12063 7368 1865 -3710 -8841 -12852 -15413 -16191 -14961 -12052
800 -12052 -7474 -1934 3462 8374 12640 15514 16699 15865 13091 9257 3790 -1808 -6583 -11284 -14360
815 -14360 -15826 -15288 -13517 -9492 -4339 936 6419 10765 14287 16021 16168 14091 10798 6052 527
830 527 -4987 -9404 -13075 -15076 -15387 -13884 -10733 -6213 -900 4223 9353 12853 15312 15887 15118 12147
846 12147 7690 2547 -2645 -7682 -11742 -14404 -15141 -14280 -11759 -7708 -2731 2286 7478 11703 14277
861 14277 15451 15141 12823 9191 4341 -898 -6070 -9987 -13262 -14928 -14611 -13096 -9442 -4908 434
876D34N074M630K973J926J30j557l084m474m932n084m695l405k100n30J417K952
892a0325M025M655N259M710L549K466N19n03k663m012m846m953m911l649k603
907a3282j089O19K168L701M455N192M770M026L024J144l19j760l297m549m949
922a46m851m263l035j507K2J305L216M233M779M845M455L130K050J7j097k555
938A0598m176m807m948m459l210k172o32J139K327L769M446M890M632L456K254
953A3107J241p38k148l361m495m748m675l974k545j330N94J832L222M167M645
968G94M662M020L018J367k57j428k763m150m519m778m074l167j521k72J269K636
984i163L709M667M662L970L730J777L46r67k479l689m305m727m345l576j999p70
$$ plain form
876 434 5508 10138 13111 15037 15167 13610 10526 6052 1120 -3964 -8659 -12064 -14164 -14694 -13277 -10325
892 -10325 -6300 -1645 3614 8324 11873 14339 14858 14355 11692 7680 2834 -2119 -7030 -10679 -13282
907 -13282 -14371 -13752 -11584 -7883 -3428 1764 6534 10560 13584 14728 14409 12649 9352 4803 -146
922 -146 -4997 -9260 -12295 -13802 -13780 -12475 -9259 -5026 -247 4598 9053 12183 14233 14250 13153 10598
938 10598 6422 1615 -3333 -7792 -11002 -13174 -13806 -12667 -10340 -6571 -2125 2765 7397 10853 13107
953 13107 14348 13610 11462 8101 3606 -1142 -5817 -9791 -12336 -13666 -13072 -11240 -8018 -3851 794
968 794 5456 9476 12494 13861 13604 12176 9413 5263 744 -4034 -8108 -11275 -12796 -13068 -11799 -9163
984 -9163 -5454 -787 3875 7845 11575 13352 13698 12731 10252 6563 2258 -2469 -6814 -10390 -12389 -13159
1000a3159J022K098L357M283M419M310L710K585J052m77k161l052m033m591m205
1015d842l740k799j301J47J634K988L705M772M316L758L068J488j5j593k659l461
1031E466m284m299m084l401j767k08J149K373L649M132M241M289L211K022N30
1046A3019p53k050l279m322m347m003l607k170p22O11J727L191L930M233M102
1061E560L636K523J067l35j509k949l489m434m193l979k422j629J26J724K513
1076g790L291M117M435L638L086J647J41q96k700l339l962m483l464l261j873
1091a1413o96R88K273L115M117L723L982L610K125Q48p30k054l013l448m257l948
1107d778l383k378j125J35J763K932L453L854M175L489K581J367J20j480k517
$$ plain form
1000 -13159 -12137 -10039 -6682 -2399 2020 6330 10040 12625 13677 13200 11039 7987 3954 -637 -4842
1015 -4842 -8582 -11381 -12682 -12535 -10901 -7913 -4208 564 4880 8638 11706 13194 13179 11586 8927 5466
1031 5466 1182 -3117 -7201 -10602 -12369 -12577 -11428 -9055 -5406 -1274 2967 7256 10467 12489 13019
1046 13019 12266 10216 6937 2615 -1732 -5735 -9342 -11512 -12234 -11623 -9896 -6705 -2775 1458 5560
1061 5560 9196 11719 12786 12451 10942 7993 4504 70 -4123 -8102 -10524 -12153 -12027 -10303 -7790
1076 -7790 -4499 -382 4053 7691 10777 12424 12565 11669 8969 5630 1668 -2815 -6279 -9540 -11413
1091 -11413 -12109 -11121 -8848 -5733 -1616 2107 6089 9699 11824 12672 11942 9888 6875 3427 -830 -4778
1107 -4778 -8161 -10539 -11664 -11529 -9766 -6834 -3381 473 4648 8137 10718 12085 12205 10725 8208
1122H208l528l696m392l341k843j606l52J256K338L364L777L998L565K901J898
1137A1547M41p43k097l128l827l719l774l351j994q77M54K167K811L801L984L485
1153E180L336K413R79m11j519k797l403l908l691l544k517j093K21J227K345L601
1169c581L644L821L187K894J443J49q46k509l040l572m112l424k809j698o31R28
1185a0156K248K935L768L718L709K629J865Q49m67k066k647l609l795l531l231
1200g781k165q68L52J580L114K984L676L757L027K128J499j4j625k586l311l422
1216C45l753l035k335j594l09J127K533L164L419L491L529K581J364P32r69k096
1232H194l098l305l432l602k865j873o20O96K070K640L406L762L205K759K402
$$ plain form
1122 8208 4680 984 -3408 -6749 -9592 -11198 -11550 -10294 -7956 -4592 -815 3183 6748 9649 11547
1137 11547 11988 11245 9148 6020 2193 -1526 -5300 -8651 -10645 -11522 -11068 -8901 -6090 -2289 1695 5180
1153 5180 8516 10929 11908 11497 9978 7181 3778 -130 -3821 -7365 -9882 -10975 -10754 -9527 -7182 -3581
1169 -3581 63 3884 7071 9965 11408 11557 10711 8202 5162 1590 -2522 -5946 -8755 -10453 -11084 -10156
1185 -10156 -7908 -4973 -1205 2513 6222 8851 10716 11565 11098 9032 6385 2776 -1019 -4550 -7781
1200 -7781 -9946 -10814 -10462 -8882 -5768 -2784 892 4649 7676 9804 11303 11289 9664 7078 3767 345
1216 345 -3408 -6443 -8778 -10372 -10681 -9554 -7021 -3857 -438 3053 6582 9163 10527 11259 10290 8194
1232 8194 5096 1791 -1641 -5243 -8108 -9981 -10601 -9905 -7835 -5195 -1789 1973 5178 7937 10339
1247A0339O51l85j663k624l334l603l344k873k313q74QJ163K570L033L689L589
1263D029K592K703J065L66r75k337k925l653l506k942k420j611n27P77K364K840
1279d160L164L424L215K634J925L50m85j595l025l353l390l249k785j654j076
1294a0060M98J443K744L091L614L155K786K117Q65j62j157k411l139l419l153
1309c188k862k257j136k30J085K058K893L516L243L090K388J411J30o17j889k925
1325D710l248l466k874k709j454n67M68J974K417L212L549L125K367J734Q02l85
1341I655j249k479l197l368l155k622k039q74K89J453J852L078L408L240K487
1356F479K171J366k88p79k346k863l051l402k777k339j192l69R17J787K804L339
$$ plain form
1247 10339 10990 10605 8942 6318 2984 -619 -3963 -6836 -9149 -10023 -10015 -8852 -6282 -3249 440 4029
1263 4029 6621 9324 10389 10755 9780 7443 4518 865 -2641 -5583 -8003 -9614 -10141 -9364 -7000 -4160
1279 -4160 -996 2428 5643 8277 10202 10552 10067 8472 5447 2094 -1296 -4545 -7330 -8984 -10060
1294 -10060 -9562 -8119 -5375 -2284 1330 4485 7271 9388 10253 10091 8934 6523 3384 -35 -3188
1309 -3188 -6050 -8307 -9443 -9673 -8588 -6530 -3637 -121 3122 6212 8600 10011 10141 9524 7635 4710
1325 4710 1462 -2004 -4878 -7587 -9041 -9608 -9140 -7166 -4749 -1537 2012 5137 7504 9238 10040 9655
1341 9655 8406 5927 2730 -638 -3793 -6415 -8454 -9328 -9039 -7586 -5734 -2656 752 3992 6479
1356 6479 8650 10016 9728 8949 6603 3740 689 -2713 -5490 -7829 -9021 -9390 -8473 -6686 -3882 -543
1372e43L099L029K317J476M55p24j754k357l092l355l179k384j569n43M18J553
1388g153K264L123L157K928K772J628R67n65q80k159k936l214l147k865j922p64
1404h766k6R47K116K530L466L127K635K243R32J96p74j594l010k938l104k749
1420d769k394j244n31Q75J421K529K808L350K787K471J535L07j71j247k298l004
1436B425l035l369k263j831n61N47J081J817K843L311L110K261J849J207l60q93
1452H139j981k951k864l157k672j784j220J9P42J826K448L015L029K754K207J213
1468H763K49n68j439k818k603k941k778k334j618k93N07J253K237K797L160K625
1484D199K652J329Q03m04j226k134k672k721l203k381j755o99J38J126J803K600
$$ plain form
1372 -543 2556 5585 7902 9378 9833 9109 7355 4998 1906 -1449 -4628 -7012 -8581 -9124 -8706 -7153
1388 -7153 -4889 -1766 1391 4319 7091 8719 9686 9121 8241 6082 3146 -68 -3215 -6080 -8002 -8766
1404 -8766 -8792 -7845 -5729 -3199 267 3394 6029 8272 9204 9400 8626 7032 4022 1084 -2020 -4769
1420 -4769 -7163 -8407 -8938 -8063 -6642 -4113 -1305 2045 4832 7303 8838 9145 8974 7727 5429 2425
1436 2425 -610 -3979 -6242 -8073 -8634 -8087 -7006 -5189 -2346 965 4075 6336 8185 9392 9032 8139
1452 8139 6158 3207 343 -2814 -5486 -7270 -8490 -8471 -7729 -5903 -3455 -440 2589 5343 7550 8763
1468 8763 9012 8444 7005 4187 1584 -1357 -4135 -6469 -8087 -8380 -7873 -6620 -4383 -1586 1574 4199
1484 4199 6851 8180 8983 8579 7353 5219 2547 -174 -3377 -5758 -7513 -8212 -8074 -6948 -5145 -2545
1500b545K952K767K454K148R15k13q06j667k484k779k837k553k220j137J22M89
1516g394J521K362K638L021K755K146J346K73k59j896k054k646k982k646k346
1531f161j279m32k8J491J922K579L019K718K410J494R40l92j079j868k477k683
1547A74k800k582j669q51j9P62J933K043L023K752K426J896J280L1p15j643k172
1564C869k524l025k687j674j376l91O03J402K196K731K716K321K393J268M71k44
1580H049j663j714k314k833k545k184j786p60L15J092J740K451K598K753K339
1595E538J765J006l04q77j542k413k635k581k393j800j092k33J122J143K117K613
1611e66K786K309K162J090K68l62j475k228k175k876k485k143j373m03L93J344
$$ plain form
1500 -2545 407 3174 5628 7776 8691 8478 7672 6005 3521 742 -2095 -4648 -6868 -8005 -7883 -7394
1516 -7394 -5873 -3511 -873 2148 4903 7049 8395 8668 8409 6513 4459 1813 -1169 -3815 -6161
1531 -6161 -7440 -7872 -7900 -6409 -4487 -1908 1111 3829 6239 7733 8673 8281 7202 5334 2857 174
1547 174 -2626 -5208 -6877 -7728 -7747 -6985 -5052 -3009 14 2766 5192 7088 8368 8399 7684 6041 3869
1564 3869 1345 -1680 -4367 -6041 -7417 -7808 -7205 -5803 -3607 -876 1840 4161 6554 7822 8293 8049
1580 8049 6386 4672 2358 -475 -3020 -5204 -6990 -7750 -7435 -6343 -4603 -2152 446 3199 5538
1595 5538 7303 8309 8005 7128 5586 3173 538 -2043 -4436 -6236 -7328 -7561 -6439 -5296 -3179 -566
1611 -566 2220 4529 6691 7781 8049 7687 6212 3984 1809 -1067 -3552 -5695 -7068 -7471 -7078 -5734
1627e734J831K535K448K484K138J760P78n84r80j835k249k557k459k412j773o38
1643g247P5R79J481K195K390K566K321K071R19K67r12j444k219k416k651k429
1659d054j652j388k7O25J302K014K216K613K245K054J210O24n30r93j867k411
1675A981k455k657j909j256q57L01J033J784K333K448K207K212J724P97j70q41
1691F675j772k068k379k477k273j613q49j38O81J242K392K361K378K401J756R81
1707G298K00m57j387k051k307k480k267j891j252l49N83J144J994K145K454K210
1723C587J956J335P32m23q97k043k086k280k682j563j803n07O4R07J591J879K831
1740E98K187K265J196R65M36j011j599k235k196k515k001j596r53k13Q06J193
$$ plain form
1627 -5734 -3903 -1368 1080 3564 5702 7462 8240 7656 6676 4841 2592 35 -2424 -4836 -6609 -7247
1643 -7247 -7172 -6193 -4712 -2517 -127 2439 4760 6831 7750 8017 7105 5661 3442 1026 -1625 -4054
1659 -4054 -5706 -7094 -7121 -6496 -5194 -3180 -964 1649 3894 5948 7158 7782 7252 6259 4392 1981
1675 1981 -474 -3131 -5040 -6296 -7153 -6852 -5819 -4035 -1702 746 2953 5165 6889 7686 7516 6675
1691 6675 4903 2835 456 -2021 -4294 -5907 -6756 -6894 -6213 -4971 -2579 -218 2160 4561 6317 7298
1707 7298 7498 7041 5654 3603 1296 -1184 -3451 -5342 -6594 -6943 -6360 -5216 -3222 -1077 1377 3587
1723 3587 5543 6878 7610 7187 6290 4247 2161 -119 -2801 -4364 -6167 -6674 -6610 -5703 -4112 -2233 598
1740 598 2785 5050 6246 7211 7647 6636 5037 2802 606 -1909 -3910 -5506 -6459 -6672 -5866 -4673
1756d673J991K449K193K211J634J184M10m25j429j665k435k489k019j533j498
1771f094m33K91R37J692K477K023K132K141J326L76J79p17j680k159k561k016
1787b086k017j329j022N5Q63J371J951K336K200K005J580J014J95n29j398j969
1803C220k186k685j533j703j161l16N26J250J884K091J924K302J944P54N92k67
1819F636j035j648k274k205k045j800j269o01P6Q83J854J956K083K382J700J498
1835F191N92J00p25j487k126j925k278k116j199j297O3P18J472J775K121K202
1851B081J751J756J128j2n46j200j664k154k153j877j783r29n35M87J043J261
1867c346K366J778K355J741J263L80r3o71j569k213k264k238j707j099o39J44
$$ plain form
1756 -4673 -2682 -233 1960 4171 5805 6989 7399 6974 5545 3880 1445 -1044 -3063 -4596 -6094
1771 -6094 -6527 -6236 -5299 -3607 -1130 893 3025 5166 6492 6868 7047 6330 4650 2491 -70 -2086
1787 -2086 -4103 -5432 -6454 -6399 -5536 -4165 -2214 122 2322 4327 5907 6921 7116 6587 5189 3220
1803 3220 1034 -1651 -3184 -4887 -6048 -6364 -5838 -4588 -2704 -613 1311 3613 5557 6311 6903 6636
1819 6636 5601 3953 1679 -526 -2571 -4371 -5640 -6241 -6165 -5282 -3428 -1472 611 2993 4693 6191
1835 6191 6783 6883 6158 4671 2545 620 -1658 -3774 -4973 -6270 -6207 -5489 -4017 -2242 -121 2081
1851 2081 3832 5588 6716 6704 6158 4958 3294 1140 -1013 -2890 -4673 -5602 -6137 -5650 -4607 -3346
1867 -3346 -980 798 3153 4894 6157 6537 6444 5773 4204 1991 -273 -2511 -4218 -5317 -5956 -5812
1883e812P83J411J912J991K194J830J270P16K95o37j281j940j835k525j699j319
1899d646j283K09K72J186J957K036J999J899J535J165K38m93r15j808k027k207
1915h83j981j519j022n25M54Q76J508J731K495J889J477J200N96j49o42j569j868
1932B068j933k231j624j242p35k6Q53J055J844K143J928J881J427Q79J60n38j399
1949D510j617j954k055k117j384r15J1M06Q36J746J930K008J896J427R98N46m47
1966E825q91j462j827j941k243j556j090l37k1J015J360J978J836J961J403J646
1982E656L08K07p30j256j826j928j985j707j395p48p7M73J391J398J860K172K024
1999C837J170R45J07n42q21j667j918j758k029j401q95m23J67J125J584J620K139
$$ plain form
1883 -5812 -5029 -3618 -1706 285 2479 4309 5579 6295 6590 5953 4672 2732 897 -1628 -3327 -4646
1899 -4646 -5929 -5720 -5448 -4262 -2305 -269 1730 3629 5164 6329 6567 6074 5159 3351 1324 -883
1915 -883 -2864 -4383 -5405 -5930 -5476 -4600 -3092 -1361 1134 3023 4500 5700 6296 6147 5505 3936 2068
1932 2068 135 -2096 -3720 -4962 -5697 -5723 -4870 -3815 -1971 172 2100 3981 5408 6287 6447 5909 4510
1949 4510 2893 939 -1116 -3233 -4617 -5532 -5521 -5115 -4279 -2533 -603 1405 3301 4728 5726 6272 5825
1966 5825 4934 3472 1645 -296 -2539 -4095 -5185 -5522 -5543 -4528 -3168 -1190 646 2607 4010 5656
1982 5656 5964 6171 5441 4185 2359 431 -1554 -3261 -4656 -5404 -5481 -5008 -3617 -2219 -359 1813 3837
1999 3837 5007 5952 6059 5517 4696 3029 1111 -647 -2676 -4077 -4972 -5395 -5228 -4103 -2519 -899 1240
2016A240J534J645J084O00k99q06j358j770j826j940j526j140q52J11P22J337
2032c244J728J632J966J928J111O91M2o80q08j880j798j969j611j385q78N1L66
2049d738J000J595J586K095J613J590P42L50m13r30j248j721j971j848j526j137
2065d961l51L26P21J454J969J578J724J812R62O77l95n91j138j629j982j679j627
2082c130j224p15j35O19J102J496K103J682J630J626M57L78q08r41j359j735j854
2099h08j843j391q76k91N50P04J704J626J919J589J355J225M28m99r83j186j752
2116A471j647j612j544j106n00P0P05J047J975J592J879J263J231Q87m7p70j141
2133C753j626j842j514j571j503n23p7N67P73J584J628J868J979R19J048K78o63
$$ plain form
2016 1240 2774 4419 5503 6103 5804 4998 3640 1870 44 -1896 -3422 -4562 -5414 -5303 -4581 -3244
2032 -3244 -1516 116 2082 4010 5121 5812 5854 5174 4366 2486 688 -1281 -2892 -4277 -5155 -5104 -4738
2049 -4738 -3738 -2143 -557 1538 3151 4741 5483 5833 5420 4490 3242 1521 -450 -2298 -3824 -4961
2065 -4961 -5312 -4986 -4265 -2811 -842 736 2460 4272 5234 5911 5516 4925 3787 2158 176 -1503 -3130
2082 -3130 -4354 -5069 -5204 -4585 -3483 -1987 116 1798 3428 5054 5511 5889 5081 4140 2781 1046 -808
2099 -808 -2651 -4042 -4918 -5209 -4659 -3955 -2251 -625 1294 2883 4238 5463 5891 5392 4409 3223 1471
2116 1471 -176 -1788 -3332 -4438 -4938 -4868 -4163 -3116 -1141 451 2330 3593 4824 5711 5664 4894 3753
2133 3753 2127 285 -1229 -2800 -4303 -4826 -4903 -4336 -3563 -1979 -351 1517 3496 4415 5463 5741 5078
2150E078q32j310j650j756j728j316j197k80L10J035J280J634J555J628J481J009
2166D941N17l23o37j061j596j680j845j359j289m19j55P33J216J343J854J638
2182A878J468J297O74L7m83j151j409j526j885j373j295p45k01J41J238J400J499
2199d36J659J686J204R03K89l16p63j304j621j599j541j254j121m96N3P95J249
2216b613J605J684J463J606R95N02r8l77j321j413j587j638j680j044m16l31M12
2233d251J192J582J540J545J464J210R50J38m85r18j538j590j414j486j414q23
2249d298j85K5Q63J592J543J442J319J311R53N30k5q18j286j242j518j677j456
2266b927j089l45j92O67J163J486J362J884J347Q24Q58J52n74j034j305j635j602
$$ plain form
2150 5078 4246 2936 1286 -470 -2198 -3514 -4711 -4991 -4681 -3646 -2366 -732 823 2451 3932 4941
2166 4941 5458 5135 4498 3437 1841 161 -1684 -3043 -4332 -4751 -4906 -4173 -2957 -1614 240 1878
2182 1878 3346 4643 5317 5354 4871 3720 2311 785 -1100 -2473 -3768 -4513 -4714 -4573 -3335 -1935 -436
2199 -436 1223 2909 4113 5016 5305 4989 4226 2922 1301 -298 -1839 -3093 -4214 -4710 -4657 -3862 -2613
2216 -2613 -1008 676 2139 3745 4740 5242 5144 4767 3446 2033 446 -1192 -2872 -3916 -4332 -4663 -4251
2233 -4251 -3059 -1477 63 1608 3072 4282 5232 5370 4885 3967 2429 839 -575 -2061 -3475 -4298
2249 -4298 -4483 -4458 -3595 -2003 -460 982 2301 3612 4565 5095 5070 4252 2966 1724 206 -1471 -2927
2266 -2927 -4016 -4361 -4553 -3886 -2723 -1237 125 2009 3356 4180 5038 5190 4616 3582 2277 642 -960
2283i60j532j021j012M1L91R95J396J281J650J765Q73P69M21k09q64j379j538
2300A067j577j220j519p67k29K50O02J022J484J564J492J350Q22N18m5n16r64
2317C334j553j669j454j142j104n71k73P17R28J282J815J085J679J219M53M7k30
2334D563j023j197j410j762j290j202o96m60M82Q51J389J224J505J602J047J018
2350D641J45o6o98j198j549j447j289j371r41n59K03N74R23J636J483J336J406
2367C229Q52P16P9p67q70j216j559j466j356j212l60l13M12J168R98J483J435
2384A253J489J023Q41J61j77r94j134j310j551j372j203q69k40K69O68R60J510
2401f76J434J459J131Q74P05l05q95p86j372j524j161j595o60p48N2N80R21J377
$$ plain form
2283 -960 -2492 -3513 -4525 -4484 -4093 -3098 -1702 -421 1229 2994 3867 4636 5057 4848 3984 2605 1067
2300 1067 -510 -1730 -3249 -4016 -4245 -3995 -3393 -2371 -887 677 2169 3519 4341 4859 4814 4298 3334
2317 3334 1781 112 -1342 -2484 -3588 -4159 -4432 -3715 -2787 -1505 310 1395 3074 4293 4746 4793 4563
2334 4563 3540 2343 933 -829 -2119 -3321 -4017 -4477 -3995 -3144 -1755 -531 974 2576 3623 4641
2350 4641 4786 4720 4022 2824 1275 -172 -1461 -2832 -3773 -4332 -4129 -3555 -2632 -996 487 1823 3229
2367 3229 4081 4797 4876 4109 3239 2023 464 -1002 -2358 -3570 -3930 -4243 -3831 -2663 -1665 -182 1253
2384 1253 2742 3765 4606 4767 4590 3596 2462 1152 -399 -1771 -2974 -3843 -4083 -3814 -3146 -2186 -676
2401 -676 758 2217 3348 4222 4927 4622 3727 2941 1569 45 -1116 -2711 -3371 -4119 -4067 -3487 -2566 -1189
2419a189J518J222J660M47P95J41l89j016j007j498j768j119q97m66n19N73M95
2436c017J199J463J737J310R46Q11K39j69q53j074j601j247j461j147p17m74K72
2453c783P26R30J414J678J230J004J057L62j65n81r66j111j544j363j366r05m64
2470c847p2N05Q39J053J498J697J150O94Q87K1n11n26r90j770j541j119r81o31
2488c644j70K68P87Q52J483J432J217J214P51K26L5q60j136j186j295j302j459
2505b787p16k55R1L40J046J496J180J473R52R58M90J2l72p77j191j592j031j446
2523b129q29o57j11J86Q24J204J437J400J294R27N89J66j71o96j019j371j514
2540d70j195j224k77m51J23P85Q45J010J619J358J076O95J48j04k47q63j322j411
$$ plain form
2419 -1189 329 1551 3211 3658 4453 4594 4205 3189 2182 684 -1084 -2203 -3100 -3566 -4085 -3512 -3017
2436 -3017 -1818 -355 1382 2692 3638 4449 4688 4519 3666 2592 991 -256 -1717 -2864 -3581 -4055 -3783
2453 -3783 -3057 -2127 -713 965 2195 3199 4256 4618 4453 3872 2906 1795 251 -1112 -2478 -3383 -3847
2470 -3847 -3919 -3414 -2575 -1522 -24 1673 2823 3517 4404 4425 3914 3388 2398 628 -913 -2032 -3013 -3644
2488 -3644 -3814 -3546 -2759 -1907 -424 1008 2225 3439 4190 4416 4451 3591 2455 1269 -26 -1328 -2787
2505 -2787 -3503 -3758 -3667 -3327 -2281 -785 395 1868 2820 3778 4268 4280 3908 3131 1940 348 -683 -2129
2523 -2129 -2958 -3615 -3726 -3540 -2716 -1512 -75 1325 2619 3546 4135 4301 4130 3434 2415 1044 -470
2540 -470 -1665 -2889 -3166 -3617 -3494 -2709 -1864 -854 765 2123 3199 3894 4042 3938 3691 2828 1506 95
2558I5j079j096j150m02nM35Q44J284J236J267J261R04N81k58p8q51j052j083
2576H53j620j061q23q98m9N16N21Q23J370J267J555Q59O70K35j62m16j365j204
2594A071j227j158j128o19o26L63M56O65J312J238J356J212R10L41j51n16p30
2611B769r46j448j088j308r77l41n9K22P46J036J255J331J120Q31P42L51n28o24
2629C084q59j179j331j332q39o62l33M31M35P93J182J224J217J243O52K80j24
2646C882n45p64j183j247j112j265q69l09m9O61P36J081J155J257R09J077N33
2663C948Q1n84o06r02j265j002j343q95r52J31M05L69J238J181J252R80J012Q65
2681C913j10l33m04q75j158j057j222j140o65k80K18M95R22R02J278J105J092
$$ plain form
2558 95 -984 -2080 -3230 -3632 -3637 -3202 -2358 -1074 162 1429 2690 3594 4175 3917 3839 2988 1936 853
2576 853 -767 -1828 -2651 -3549 -3598 -3082 -2561 -1738 -368 899 2454 3313 3983 4218 4056 3640 2275 1071
2594 1071 -156 -1314 -2442 -3061 -3687 -3324 -2868 -2203 -891 347 1703 2915 3825 4166 4015 3499 2769
2611 2769 1823 375 -713 -2021 -2998 -3339 -3398 -3176 -2430 -1394 -139 1192 2312 3143 3885 4236 3708 3084
2629 3084 2225 1046 -285 -1617 -2456 -3118 -3451 -3020 -2585 -1792 -610 614 1831 3074 3726 4006 3882
2646 3882 3337 2573 1390 143 -969 -2234 -3103 -3412 -3461 -2800 -2064 -983 172 1429 2338 3415 3948
2663 3948 4029 3445 2839 1937 672 -330 -1673 -2568 -3520 -3389 -2984 -2615 -1377 -196 1056 2036 3048 3913
2681 3913 3803 3470 3066 2191 1033 -24 -1246 -2386 -3051 -3331 -3113 -2618 -1696 -794 484 1589 2681
2698B681R06L57j42o24o88r76j210j259j119q54j99r2L24Q87R72J170J195R53
2716B282J113L67J5l68n09r77r88j550j031o86p15k14L85N09N77J594J137Q59
2734A800J000P83J03l6n66q69j154j191j047q44q19k48p5L29J186O67J510J073
2752A602Q98P58N49r2n23o83j059j109j006j281p58l34n9L23P42J007J033J198
2770A206J036Q61N03K23m66o84q71j157q67j170r58m53l83M27M67O97J235J124
2788G70R06Q24P89N26j09o11o31j534o49j357o67r39m08J11K44J029R97R68J143
2807A402R50P03O63k74k2p85p98j223j315q03r72l85j74K05P23P98J311P29J225
2826A958Q18O56J97j77o14r29q31j137j001j091m74m83J99N17R03J016R58J153
$$ plain form
2698 2681 3587 3944 3802 3178 2490 1514 304 -955 -2074 -2928 -3127 -3219 -2895 -2008 -1036 134 1329 2282
2716 2282 3395 3762 3777 3409 2900 1923 935 -615 -1646 -2332 -3047 -3261 -2876 -2367 -1790 -196 941 1800
2734 1800 2800 3583 3686 3650 3084 2215 1061 -130 -1177 -2021 -2840 -3088 -3163 -2834 -1648 -981 529 1602
2752 1602 2500 3258 3807 3715 3192 2509 1450 341 -665 -1946 -2704 -3038 -3097 -2774 -2032 -1025 8 1206
2770 1206 2242 3103 3606 3829 3363 2679 1808 651 -216 -1386 -2344 -2797 -3180 -2753 -2286 -1589 -354 770
2788 770 1676 2500 3289 3815 3706 3095 2464 930 281 -1076 -1743 -2682 -3090 -2979 -2735 -1706 -709 259 1402
2807 1402 2352 3055 3718 3444 3422 2637 1839 616 -699 -1502 -2474 -2859 -3033 -2828 -2105 -1307 4 733 1958
2826 1958 2776 3432 3629 3452 2838 1909 1078 -59 -1060 -2151 -2625 -3108 -2909 -2392 -1489 -473 485 1638
2844A638R89N26J30K10m19n52r31j221j185r19o69k16k02K81P12P36J079R92J298
2863B277P89L67O0k34o51p38j141r41j227o34q16R0j3N79J004R19J292Q04Q72
2882B658P71m1r3n08p29j057r01j090q82o61k73K11K82O23J241N70J318R18P22
2901C079L73R4l97p03r65j102j020p78q31l71l36L60M61J023J070J012P99P17
2919B485P48Q6j54m19q36j024r83j068n69o35l97J25L85J062P51J179P92Q50O92
2938C070L50j73m22o50q65j391p45q03p46j10j17K63M44J228R93R51M32R71K96
2957B976J10j94m03q16j026j293p51n52o25NJ34M51P84J056Q05R48P58P07K6o7
2977C033k64o97j106q42j185o29o36l7j42M15M59J091R79Q50P81P16L51n1m95
$$ plain form
2844 1638 2627 3153 3283 3493 3074 2522 1591 370 -815 -1734 -2403 -2619 -2821 -2540 -1828 -1092 -13 979 2277
2863 2277 3066 3433 3493 3259 2608 1870 729 -212 -1439 -2073 -2889 -2799 -2812 -2233 -1229 -310 982 1786 2658
2882 2658 3429 3388 3295 2787 2058 1001 100 -990 -1872 -2533 -2806 -2595 -2313 -1690 -449 121 1439 2357 3079
2901 3079 3452 3546 3149 2446 1481 379 -641 -1419 -2250 -2621 -2957 -2597 -2136 -1113 -43 969 1768 2485
2919 2485 3233 3319 3165 2746 1910 886 -97 -1165 -1734 -2369 -2766 -2641 -2256 -1194 -443 736 1528 2378 3070
2938 3070 3420 3247 2825 2175 1310 -81 -826 -1629 -2375 -2485 -2602 -2339 -1895 -667 326 1277 1709 2680 2976
2957 2976 3086 2892 2489 1673 647 -646 -1397 -1949 -2574 -2569 -2435 -1984 -1200 -144 661 1609 2367 3074 3100 3033
2977 3033 2769 2072 966 124 -1061 -1690 -2326 -2363 -2505 -2090 -1631 -540 439 1289 2070 2786 3137 3086 2591
2996B591m60p50j075r00j022m19n63J28K44N26R26Q08J035R85N34L08K33l11l23
3015B495q13j115r65q19m47p42j47J54L79Q01R10Q67J169O97M29J50j66p9q55
3034A903r22p90r73q67l51n14lP23L53P33J142Q83Q41O49M65o5m27m24r25q55
3054E76j079r35l58m93k12K71O54N43R81Q91J031M90O66J05j53n86m10j280r03
3073b01o98q77l54l13J51L54P86P47J120O69P74P82K35k95k11o35p70j117r89
3092h42n14m99n23M6K18P23P91O65R13J189K10K23L13k14l13r62q23r61p00p07
3112a767k36m05J63N40O23R75P06R56Q19L43K52J6n60n20q82j063q21o37o14o7
3132b179l0K90O62P91Q29Q78P87N36M29k74k53p31m87r65o49j132l14j90j84K48
$$ plain form
2996 2591 2131 1381 306 -594 -1616 -2035 -2598 -2470 -2226 -1700 -774 34 1069 2054 2588 2896 3129 2818 2495
3015 2495 1682 567 -398 -1217 -1664 -2406 -2553 -2399 -2020 -1219 -309 558 1727 2424 2853 3003 2837 2758 1903
3034 1903 981 191 -782 -1649 -2000 -2514 -2517 -1794 -1441 -708 434 1317 2158 2807 3272 3207 2780 2356 1431 576
3054 576 -503 -1438 -1796 -2289 -2501 -2230 -1576 -1033 -52 839 1870 2360 3026 3131 2978 2392 1982 702 -201
3073 -201 -899 -1776 -2130 -2443 -2292 -1938 -1152 -405 715 1384 2158 2940 3175 2880 2669 2034 1264 147 -842
3092 -842 -1356 -1855 -2378 -2332 -2114 -1391 -600 65 978 2167 2377 2600 2913 2699 2386 1424 601 -360 -1060 -1767
3112 -1767 -2003 -2408 -2245 -1705 -1082 -107 599 1555 2374 2717 2969 2985 2425 1905 1023 -40 -861 -1498 -2112 -2179
3132 -2179 -2209 -1919 -1257 -466 363 1241 2028 2564 2993 2719 2466 1735 1248 283 -366 -1498 -1812 -2002 -2186 -1938
3152a938N78N06P84Q60Q68P57L20P9k24k04r15o63q14q91o79m13l58K07L15Q89
3172i36P07Q70Q76O24O31nR8l36p43q11q05q29p15q02pOK92O99P11Q77Q36N75
3194A813O75J15k9K01q79p52l40j286q39l77j30m05M33K57Q64N32Q71O46R40K89
3214B599J04l58j53p36q22p37p89n11m81k75K59K98M87O26J026Q78N04M68M78
3233B865k05l18n11o65r95o19p98n77l33J55K11N10N85R25O13P82P84J19P2o9
3253B531m63q28o64q02o73p40l47j47J04N30N28R04N07Q78N49Q28O4l55j42p11
3273A551n78j022o76o87m04k26K85J19M15R23N97P05Q82N56M57j92n34q8q19o91
3293E73j023n53l95n45j23K57L99N63Q30P93O74Q95K61p7l2n05m33p38q41q29
$$ plain form
3152 -1938 -1360 -854 -70 790 1658 2415 2735 2814 2590 2386 1471 808 -6 -897 -1576 -1989 -2347 -2140 -1825 -936
3172 -936 -229 641 1517 2141 2772 2767 2865 2529 1786 975 170 -659 -1374 -2176 -2183 -2177 -1885 -1186 -475 402 1238 1813
3194 1813 2488 2603 2574 2775 1896 1144 804 -482 -1321 -1698 -1828 -2233 -1800 -1543 -679 -147 724 1370 2310 2599
3214 2599 2703 2345 2192 1456 634 -103 -892 -1403 -1884 -2159 -1900 -1602 -1115 -489 537 1415 1919 2387 2865
3233 2865 2660 2342 1831 1166 171 -448 -1246 -1823 -2156 -2001 -1790 -1280 -695 230 843 1625 2409 2528 2600 2531
3253 2531 2068 1240 576 -226 -899 -1639 -1986 -2133 -2029 -1499 -971 -67 440 1318 1867 2695 2759 2404 2262 1551
3273 1551 973 -49 -725 -1412 -1816 -2042 -1757 -1638 -1223 -300 297 1002 1884 2440 2897 2705 2171 2083 1264 573
3293 573 -450 -1003 -1398 -1943 -2066 -1809 -1410 -847 -17 776 1450 2345 2606 2529 2497 1992 1559 821 -20 -849
3313h49n22m71j11M1M49M03Q31R62M98Q79L36K04R3o46k07p60j014m76p69n47
3333a676l29K44J90M79N53J036M21P42L93L88Rm1p12n25p12o14p37p36k10q4J90
3354a731J63P57P86P27O45O39M96n4j20l59k85q07r17o41m99o47j09L8L57P00
3374h61N42O02R11K76Q75J22J3k54m42p84m86r80l76o95k53R0J43M24O04N14P98
3395G83Q79M61L0l2K08l71n87o60q53n50m40o09k07J67M37O05P20N25Q92K78L98
3416B074K50J78m10m99p31p05o74n57m46l71J24J13O24N79R03P49M25N01M29k27
3436B329j03n78n17o17q29o63n00j86L4j54O79L84R09N26N54O74M08N2q8k90m64
3457A560j130m70o70n95k23k32K9K63N84Q62M48R32M81K59M50j04m93l71n92o69
$$ plain form
3313 -849 -1371 -1842 -1953 -1912 -1463 -1060 -229 733 1231 2110 2446 2650 2743 2097 1890 1130 116 -360 -1129 -1676
3333 -1676 -2005 -1761 -1571 -1092 -539 497 918 1660 2053 2441 2450 2409 1697 1172 460 -154 -891 -1627 -1837 -1921 -1731
3354 -1731 -1568 -811 -25 702 1347 1986 2482 2428 2308 1949 1664 857 -60 -701 -1200 -1847 -1956 -1918 -1561 -861
3374 -861 -319 283 1194 1470 2345 2467 2480 2226 1784 1000 514 -466 -842 -1537 -1790 -1700 -1557 -1133 -529 -15 783
3395 783 1662 2123 2153 2121 2329 1958 1371 711 -142 -692 -1132 -1741 -1948 -1781 -1344 -739 -19 506 1398 1676 2074
3416 2074 2324 2502 2092 1593 862 157 -517 -1074 -1520 -1891 -1767 -1654 -1030 -451 452 1201 1626 2127 2556 2329
3436 2329 2226 1648 1131 514 -315 -978 -1478 -1664 -1630 -1784 -1105 -721 188 714 1268 1942 2350 2402 2314 2024 1560
3457 1560 430 -40 -710 -1305 -1528 -1760 -1731 -1468 -884 -22 426 1358 1839 2098 2548 2444 1951 1580 988 319
3477C19p92o19l10n02K47K26K50O02Q73N61N66N66K95J04k22n76l90n44p05o33
3497f84o40k79l03K56L71O70N46N39P86O58J85r7L53n04l95p61n45o91m49n73
3517a557k11K82N9O91K14Q20R62J42O57K70O8m50l41n84q18m66n86o02j1r3O8
3538a486L87O11N34Q65M07N91N82k16k63k67m51p60o44o31l84l60r5J56Q1P24
3558f19O58O12P55M39L27j19M7j17o03n02o60o77n04m19k47R3J99L97N98P47M87
3579H92P21K13K66J49j80l87o36n20o83o01l58n47R7K23L49L94N94P07M63N82
3599A738L08r1K9j72l78n62q43n32o26l13j68P4M25L33P58M91O52L70M37J85q7
3620B028o4o01n25n50o12l59l01o24K51J38K80O77N68O62K63O52J55J63l73l13
$$ plain form
3477 319 -473 -1092 -1402 -1904 -1657 -1431 -1181 -579 294 855 1421 1987 2282 2386 2164 1588 1198 654 -51 -684
3497 -684 -1324 -1603 -1906 -1650 -1279 -609 -63 476 1262 1920 2105 2008 2361 1857 1462 701 156 -535 -984 -1557
3517 -1557 -1768 -1486 -1427 -736 -522 298 1260 1402 2059 2329 2397 1947 1606 1022 204 -262 -848 -1450 -1461 -1554 -1486
3538 -1486 -1099 -488 46 911 1318 1909 2491 2275 2012 1745 1294 534 -110 -741 -1125 -1485 -1580 -1424 -1343 -619
3558 -619 39 651 1406 1845 2172 2053 2100 1983 1380 878 218 -459 -963 -1382 -1629 -1536 -1337 -940 -342 405 892
3579 892 1613 1826 2092 2241 2061 1674 1038 518 -165 -766 -1124 -1671 -1574 -1351 -1002 -608 -14 693 1156 1738
3599 1738 2046 1955 1984 1812 1434 872 29 -503 -1129 -1442 -1610 -1536 -1111 -778 -20 471 1123 1493 1930 2115 2028
3620 2028 1964 1363 838 288 -324 -683 -984 -1608 -1357 -1219 -939 -262 306 968 1231 1883 2038 2201 1828 1515
3640A515n53k88r64l97n07Kj93P7L96K35O21O43N58N26kK72J10l45l67m74m79
3661C86r34n02n49J77j03J32M63P03M47Q58M39M88l5K30l20l93n83n18p04m38
3681g56m90r1L5J78K31L79O06N45N53N85J25R9n0k29n54n32n17m24n66n58j65
3702a596K14L76K99N44P65N11N05K55P0j00k0k72p72m06o57l59n86M4k15M35J60
3723h05M89M65Q18L61N21L01j19k59j04o60p88j35r31k32j31j18J16J46N46M27
3743i2R48L08O66j07K85n8l54m78l45o40q04j70k64mj71K26M75M36N56M42N99
3764A454J17L74l1l56j56m20o43n43o21l37o2k42J84N39L97M31O89N22L85K69
3784A950Q5j96l25m45k16q04n26n07l17k9P6K99K79P21M65L15P73L61r2J18l14
$$ plain form
3640 1515 962 674 -290 -687 -1194 -1192 -1385 -1308 -912 -677 -56 587 1145 1671 1669 1941 2051 1706 1339 865 386
3661 386 -548 -1050 -1599 -1422 -1525 -1393 -930 -227 220 1078 1517 2005 1970 2200 1880 1487 904 386 -318 -756
3681 -756 -1246 -1337 -1302 -1124 -893 -514 92 637 1190 1775 1900 1999 1949 1720 1166 634 117 -307 -873 -1431 -1596
3702 -1596 -1382 -1006 -707 -163 602 1113 1618 1873 1943 1843 1823 1551 779 373 -284 -643 -1229 -1185 -1400 -965 -805
3723 -805 -316 149 967 1328 1849 2150 2031 1772 1668 1008 220 85 -846 -1078 -1209 -1327 -1211 -1065 -519 -92
3743 -92 856 1164 1830 1723 2008 1950 1596 1118 773 133 -671 -841 -1105 -1109 -1280 -1054 -579 -143 413 855 1454
3764 1454 1571 1945 1914 1558 1402 982 339 -204 -825 -1162 -1224 -1466 -1282 -743 -346 85 774 1296 1681 1950
3784 1950 2035 1839 1514 1069 853 49 -477 -984 -1301 -1330 -1254 -955 -676 45 510 825 1598 1959 1867 1985 1671
3805A671m38n25n98k50p58j03j17q9J63L36O68L83O43L75N22j14N9%n01l92l83
3826E52n86m51n20j66q2J41R9P16L47N59L92M25L92J66k2m23o64k24o31m28k81
3847f89l23l86L97M7M22N27M95O52K0O01J10j30j12m05m16n56p24k55l36j35P1
3868a125K6M89M75N06M13M16M12K23L5j01l95l18o04o77m18l00l14k02L19J25
3888a015N02O81N2P10M39L54n8L3j66m51l32o22n67n65J14l30j90N25J63N65L62
3909B04N50N44L51K49j58l25j13m54p58M0r78N1m60R6L54K8O72K71O53K05J14
3930A136N54J99K5m49m44m78n21m07l14l08k02K05P1N77J64P36M74L83k9L86m2
3951A716k81l07l62n02r21j67Ll27L2K74P6P73K95L55N36M21J71k48N8k38m52
$$ plain form
3805 1671 1233 708 110 -140 -898 -1001 -1118 -1207 -1044 -708 -40 343 986 1361 1883 1769 1828 1828 1327 935 552
3826 552 -34 -485 -1005 -1171 -1253 -1112 -1013 -297 50 609 1001 1426 1818 1984 1962 1539 875 651 20 -408 -689
3847 -689 -1012 -1398 -1001 -954 -532 -5 490 1142 1162 1763 1873 1743 1631 1226 810 254 -470 -725 -1061 -1196 -1125
3868 -1125 -1099 -610 -135 371 784 1200 1612 1835 1870 1769 1374 1056 452 -225 -643 -943 -1257 -1459 -1140 -1015
3888 -1015 -513 168 220 930 1369 1723 1665 1698 1532 1081 749 127 -440 -1005 -891 -1221 -1411 -886 -723 -158 204
3909 204 754 1298 1649 1898 1740 1415 1302 848 90 130 -848 -797 -1257 -1161 -807 -779 -107 164 817 1022 1136
3930 1136 1690 1889 1914 1465 1021 543 22 -385 -699 -1007 -1209 -1004 -933 -356 -192 544 1018 1401 1372 1758 1716
3951 1716 1435 1128 766 264 -657 -824 -821 -1148 -1116 -842 -766 7 302 657 1193 1614 1785 1537 1595 1357 905
3972I05n24n11n27j31j29l56R3J64O32N61N51K62M73L33j3r5k17l38m95n59l37
3993b58n49q8j82J9J65N17J88M76P54J05K13M62l0j43l88l64n11n75n11q8k39
4014a027P0J46J80K92M22O49K97L38K6L42p6l51l14m95k89p98p2k01l05J77J13
4035h76L97L61N90L33M16M46j3R2k49l86l86m63l77o25j12j48j84N13J40L15O12
4056C96K00N40M12j2Ln1k40l38m80o62j64m86m7J6k17K67N74M80K67L44N15K96
4078A613L5j13j64l85m09l84j53q20k50j46J48K40M30K09O78K39N60J24K53r3
4098A612l28k52j93n39m19j63n22j25j5J83J59M18K28O13L63L81J37K65j5m83
4118A305m09l16n83k96l84k34J15j33K82M30M62J75M05L64M41j93J18k95k27l91
$$ plain form
3972 905 381 -130 -657 -788 -917 -1273 -1180 -1016 -384 177 728 990 1463 1796 1783 1688 1471 1133 638 79 -258
3993 -258 -807 -895 -1077 -1058 -893 -376 -188 288 1042 1147 1360 1822 1792 1649 1261 897 386 -189 -700 -788 -1027
4014 -1027 -957 -811 -631 -339 83 732 1029 1367 1393 1735 1659 1308 994 499 210 -588 -660 -861 -1166 -989 -876
4035 -876 -479 -118 472 805 1221 1667 1654 1746 1497 1111 725 262 -115 -740 -852 -1000 -1184 -671 -531 -216 396
4056 396 596 1136 1548 1536 1539 1488 1248 910 430 -232 -396 -882 -929 -913 -1130 -863 -289 191 458 802 1317 1613
4078 1613 1648 1535 1371 986 577 193 40 -780 -1030 -1176 -1028 -788 -358 -149 529 768 1328 1452 1705 1612
4098 1612 1284 1032 839 300 -119 -282 -804 -929 -944 -761 -602 -184 44 657 1020 1401 1538 1803 1788 1305
4118 1305 896 580 -3 -299 -683 -917 -802 -935 -653 -223 239 414 819 1183 1624 1431 1549 1254 1027 636
4138F36m04m46m32p3m09K00J19M75K88K78N85J30M17j9J24l29j48l82r1n16n12
4159e09k51m3J02j40P8P27K23L30M96R1L99J05j74j71m49l45l37k84l91j15j90
4180h48k43M71K91L61L97L34L63L84K35l41R8m45m70l35k58m29m42j21K9R6K48
4201f25L57N85L87L78J02M76o7k99Q0n75l87m32l83k74j16l09M25J02N36J26J55
4222B42O54L22K18J43Pj82m87m08l65l90k46j75j99J62n7L39M84L38K95M01K39
4243A335j07M79l88l14k06l47p31j14k14p4k28L06o0N64L51M62NL86L44j41K62
4264A570n83k08k03m28n33k10j19k51K6N43K97L49K84K60L04L91R9o2j86m12j65
4285G63o13l33j91l59p8J3R6L58M32L40L43K84J58K26j2m1l50l80l13l51m91k38
$$ plain form
4138 636 232 -214 -646 -719 -1128 -928 -809 -334 -46 232 817 947 1364 1345 1469 1140 992 610 519 3 -509
4159 -509 -760 -803 -701 -841 -763 -36 187 517 1013 1104 1503 1608 1434 1263 814 469 132 -152 -543 -658 -848
4180 -848 -1091 -620 -329 32 429 763 1126 1510 1745 1404 1502 1057 587 252 -6 -435 -877 -998 -969 -873 -625
4201 -625 -268 317 704 1082 1184 1660 1593 1294 1374 799 412 -20 -403 -677 -793 -1102 -677 -575 -39 87 242
4222 242 896 1218 1436 1579 1586 1404 917 509 144 -246 -492 -667 -866 -704 -761 -422 62 400 695 1096 1335
4243 1335 1228 1707 1319 1005 799 452 -279 -393 -607 -681 -909 -603 -663 -99 252 714 719 1105 1449 1308 1570
4264 1570 987 779 576 148 -385 -595 -714 -965 -939 -396 -99 250 534 794 1098 1489 1588 1526 1340 928 763
4285 763 150 -183 -374 -733 -811 -798 -702 -344 88 428 771 1055 1213 1439 1427 1386 1036 656 343 -8 -499 -737
4307g37m6k6J06M89r6N02M44K5K86L06L43l68J51o68m1n67k43k02o03J55k04M54
4329e40J40O31M2L15L94K35R8K55k86k28l18m54k26m07l92J41j63N32k15M67J69
4350A90L68j5P63K01k87J36l52j91o24r7k09n62p7J10j05J97N03K01K91M81J16
4371A038K90J13j24k69k46l93k00k39l92l06p5J14j55N81J18M90J28N07K04K8
4391A212j49J46k69j94n28j88m09r0k36j59L62Q7L05K72N93J37L88J41j49%k84
4412I88j55m95k61j78l02l52J84n9j65N19M30L07K04M89L7L68m4j42m28l65k92
4433B88l82m39l6j42J03jM02P8M10N40n6M55k21K99k61j01k06l36l33Q2q22r6
4455g75P3R2ML34N45L61K11O0L34P8o7k44j46j43l44n59r6l78ml2J82N46N6L37
$$ plain form
4307 -737 -783 -809 -703 -214 -310 192 636 661 947 1253 1596 1228 1379 711 670 103 -140 -342 -945 -790 -994 -540
4329 -540 -400 231 273 588 982 1217 1315 1570 1284 1056 738 284 58 -349 -741 -600 -763 -231 -446 21 190
4350 190 558 543 1306 1507 1220 1356 1004 813 189 92 -117 -679 -756 -646 -751 -554 -51 150 441 922 1038
4371 1038 1328 1441 1317 1048 802 409 209 -30 -422 -728 -803 -689 -844 -263 -145 345 473 980 1184 1212
4391 1212 1063 1209 940 746 218 30 -379 -469 -705 -864 -502 -415 -110 162 755 892 1280 1421 1272 1272 988
4412 988 833 338 77 -101 -403 -755 -571 -630 -795 -276 154 461 665 1154 1191 1559 1515 1373 945 580 288
4433 288 -94 -533 -569 -711 -608 -609 -207 -129 281 821 765 1220 999 1298 1037 936 730 394 61 143 -679 -775
4455 -775 -702 -610 -606 -272 273 634 845 905 1239 1317 1250 1006 860 717 373 -186 -282 -660 -664 -696 -514 32 88 425
4479D25J77K41M09k83M86o59K37m89K6o47l11j35j30k1J49J07J88L26M83L34m5
4500H68N91j93n3l67j2l02m05k45l78l6n62N16Q3K51M49L5L87K49K79p8K12j74
4522A115l42k56m08k67m11J33l56M4K46K51J59L33M78l7M44J76l07J97j72l16
4542G04j67m29l59j64r1p9J66j8L02K22M77K00J92K54K4Mj6m31k00o70j63O3m09
4565e88L8K65j23MM56L80K99L26J85L3n8k56j24k30j19n31k48j67m8k2n5M98q1
4588a66M21M31M04j39M68j93J45m15l51m17l56J54l57O3k31J65L7K35K96L69P9
4609F42M17J31j35J25k15j54k95l09l17l52k52J03J28qM9K28N03K85L50K55j46
4630A033J78j14l23j18k82k67l55j37j95n3R3K56K56K18K87L81L71m7j21K1p8
$$ plain form
4479 425 602 843 1252 969 1455 796 1033 544 570 -77 -388 -523 -653 -674 -525 -418 -230 96 579 913 868
4500 868 1459 1266 1213 846 834 532 127 -118 -496 -532 -1094 -578 -495 -244 205 240 627 876 1155 1077 1289 1115
4522 1115 773 517 109 -158 -569 -436 -792 -748 -502 -251 -92 241 719 682 1126 1302 995 1192 1020 704
4542 704 537 108 -251 -415 -506 -585 -419 -437 -135 87 564 764 956 1210 1234 1238 1222 791 591 -79 -242 -179 -588
4565 -588 -550 -285 -408 -404 52 432 731 1057 1242 1275 1217 961 837 607 488 -43 -291 -458 -506 -528 -583 -85 -166
4588 -166 255 686 1090 951 1419 1226 1371 956 605 188 -168 -14 -371 -308 -539 -374 -337 -102 194 563 642
4609 642 1059 1190 1055 1180 965 811 516 207 -110 -462 -714 -611 -483 -491 -442 -214 289 574 924 1179 1033
4630 1033 1211 1097 774 656 374 107 -248 -385 -580 -633 -540 -284 -28 190 477 858 1229 1182 1061 1082 1004
4651A004j39l79k77l35nk90k00K03K2K60K05M77K83M1L37M2k46K32m59l81j26
4672B69k17l37k35L1j8N2l7N16K20L27K43J55J74Q1p0l57mm67k73j43l00j51J6
4695e25J71j09K84K54M36N9N10P6l74L68k48j75l48k27k51l20j76K13j69K33J51
4716a67L47M9M82O8J06L73n7k5l14k02k83m76j54l24j35J50L98k52J91L09N88
4737F72J00L44M3k18M4M9k16l67k01k60m05q8K82l2K4J11J11K74N46J24J5K17
4759A169L1k09l48O5m84k58k07k72J7Q9J08J87J00K84M06M6L67j08J03p3k17j67
4781F29k19o24l3l8j71J10k6K28J47L06L00Q0K26J36J78k01j00k79j71k39k28
4802A1k23j93l4mJ82J13J96L89K31O6K51K17n4q5k78l37n4n22j25m8l28K89n6
$$ plain form
4651 1004 865 486 209 -126 -131 -421 -621 -418 -396 -136 69 546 829 870 1207 1249 1003 1235 776 395 269
4672 269 52 -285 -520 -489 -507 -455 -492 24 244 571 814 969 1143 1224 1154 797 793 326 53 -90 -390 -541 -525
4695 -525 -354 -463 -179 75 511 570 1080 1156 782 1150 902 727 379 152 -99 -419 -595 -382 -551 -318 -167
4716 -167 180 229 711 779 885 1258 1201 1176 862 660 377 -99 -253 -577 -712 -562 -164 -416 -225 84 672
4737 672 772 1116 1159 941 985 1034 818 451 250 -10 -415 -503 -221 -253 -229 -118 -7 267 813 937 952 1169
4759 1169 1200 991 643 708 224 -34 -241 -513 -496 -407 -299 -112 -12 272 678 724 1091 983 1086 1013 796 629
4781 629 410 -214 -247 -285 -456 -346 -372 -144 3 309 609 689 915 1051 1229 1028 928 649 478 239 11
4802 11 -212 -405 -439 -443 -261 -148 48 437 668 734 985 1202 1148 1063 785 448 394 -128 -253 -301 -629 -340 -396
4825c96k13R15J7L08K00l8J70k3J82j92l83m2l33l45l22P6r9p5M50M2N05J54k0
4848E38M21K07j8k44M3l34j45k2k47m35j41j99n3L42J20K40K30N28j64J30J27
4869I24J60j97o6j90m88j72k26k22J9N4J84o6L42K09K06K79M5j9K25j12j04j27
4891F58k46k35l90j02j72P4L7K6K17M26L00J17J00J57L8J08k33l03L4n39l1q1
4913d0l63J18l26K02L88j08K23M12K29J38M8Q6j91R1l33k84k13m03J20j50k03
4934e59K24K52P9O3J87N05J61J83oj27j56k25l43j10n8j97k70Q7J41l0o5L33K11
4957B80L27J46L30nk74J33l20j19m75J29n23k86K84kJ01K8K41J92M30J0K19J00
4979I46j57Rj0l04j3k80k54j20q4k54L30j45L90K02L92q2K75K67Oj74k99q1l3
$$ plain form
4825 -396 -609 306 323 631 831 793 963 940 1122 930 547 505 172 -173 -495 -419 -518 -593 -143 -101 404 558 538
4848 538 959 1166 1148 904 947 613 468 446 199 -236 -377 -576 -629 -287 -167 73 303 831 667 797 924
4869 924 1084 887 821 631 143 -29 -255 -477 -458 -404 -220 -286 56 265 471 750 795 776 1001 889 785 658
4891 658 412 177 -213 -315 -487 -413 -376 -350 -133 293 593 710 810 967 1005 1113 880 577 611 72 41 -40
4913 -40 -403 -285 -611 -409 -21 -129 94 506 735 873 921 1007 816 907 574 290 77 -326 -206 -356 -559
4934 -559 -335 -83 -4 59 246 751 912 1095 1089 962 806 581 238 128 70 -127 -397 -310 -169 -199 -264 69 280
4957 280 607 753 1083 1078 804 937 617 498 23 152 -371 -657 -373 -375 -274 -246 -5 187 617 627 846 946
4979 946 789 798 788 484 471 191 -63 -183 -267 -521 -191 -336 54 256 648 566 841 1108 1114 940 641 560 527
5002E27k43j43k61k19Q7m8j1L09J61J57J00K14L88j58M7o1j11k32l23j14l10j77
5024d21LP7j40M42J32O8K24J26L30N2NJ05j61j86k28l13k44p4j99k7J86m1M39
5047A55k2J6L39M2K36L11j96j71j29R5l71k20l60O1q2j77K61m1N02K37l1J69K85
5070I09N8Ol7m64L10n09l57j11J17k95j8J54K0K35J78J88J71K41K3P6j0J16m01
5093F00k49j07j21m35K12j48J24q7K93K44q8K15M59j27J46j5j51R4m06k02k31
5114B0J0k12j41j00M26k3K15j80M82M7K91K94l34qj82n3j11k01n17J36o3K0J81
5137ck13J82M38r5J77L56J03K9q0j05P8m13o6m91K5n5k23j28J16N85j03M49o2
5160E01K54Q8K7r3O4l77Q6k46l01q2q9R3l33K8J13L96J44J31K34R3P5J89j22L
$$ plain form
5002 527 284 141 -120 -339 -252 -300 -311 -2 159 316 416 630 1018 860 907 846 735 503 180 66 -244 -421
5024 -421 -418 -341 -481 -39 93 161 385 511 841 893 898 1003 842 656 428 115 -129 -203 -402 -429 -243 -284 155
5047 155 133 149 488 530 766 1077 881 710 581 676 305 85 -275 -214 -296 -473 -212 -253 249 486 455 624 909
5070 909 967 973 936 472 782 273 -84 -195 -78 -373 -391 -237 -217 18 196 384 555 796 819 895 885 1001 600
5093 600 351 244 123 -312 -100 -248 -124 -211 82 326 238 453 912 785 931 916 765 859 453 251 20
5114 20 30 -182 -323 -423 3 -20 195 15 497 544 835 1129 795 787 605 552 441 240 -277 -141 -204 -184 -3
5137 -3 -216 -34 404 309 486 842 945 974 894 789 867 454 388 -103 -78 -133 -356 -484 -368 217 114 563 501
5160 501 755 843 870 777 841 464 550 304 3 -79 -168 -75 -408 -380 -267 129 273 404 638 731 806 995 873 876
5184H76l00k06l35J51j37k79j03J24o3L50J14jM97J19l9O5p5K43k78k49l1l29
5206A14j59k03j24O4J88R3J18L10q2L25J55N1K34l28j42j61j16k37k59J10j59
5227b08o5o1J26K42N3L41K97j07L46m4J0J9k33k32j11l57M0l34J68P3k04L35j0
5250H4m8P15j57J92K5K0j56Q4k11k36j43k23j71j70R2J03K50O8K66K04J82m3N2
5273G79O0o0o4j71k99o0k15j11J40k13K7L3m6M81K46P9l6J02l3J50j31j45j86
5296C27j5k31j30j26j21K8Q1K93J47mJ48M05j27L12l4j07p2K1l54k04n78J45k19
5319d15L19O4J80j14R5L34Q1K27O9r4K14o9k63j57k56k27m2j77K0p3O0J77K80
5342B33K8K82L11q8P8P4J69m78j57j41q6m53J85j89Q1j60J16L55j7L64j7L02J4
$$ plain form
5184 876 576 370 35 186 49 -230 -333 -209 -272 78 192 191 688 807 768 833 758 1001 723 474 443 114
5206 114 -45 -248 -372 -308 -120 -27 91 401 319 644 799 850 1084 756 614 453 337 100 -159 -49 -208
5227 -208 -273 -334 -208 34 87 428 725 618 964 920 930 949 716 484 373 16 56 -278 -110 -37 -241 94 84
5250 84 36 751 594 786 811 831 675 759 548 312 169 -54 -225 -395 -303 -200 50 118 384 588 770 727 779
5273 779 839 779 715 544 245 185 -30 -141 -1 -214 -187 -154 -200 281 527 606 570 672 639 789 658 513 327
5296 327 312 81 -49 -175 -296 -268 -187 106 253 249 397 802 675 987 953 846 774 795 441 237 -341 -196 -415
5319 -415 -96 -32 148 34 129 463 544 771 840 746 960 891 628 471 215 -12 -54 -231 -211 -284 -224 -47 233
5342 233 261 543 854 766 844 918 1087 609 452 311 225 -228 -43 -232 -151 -311 -195 160 143 507 490 792 806
5365H06J62q2l08q0o1j90k55j18N0j31j35L17r1K90K13K82J51k23J37J40j42n4
5387F78M6n04j62m8j91j12J30k0K60K39j32K73L84j18R1O1j63j71k16J68j59j95
5409A39k72Q2r4P7j55L07J57r4N78j39K72j83L05j46m89Q8p0l59j22L4K06m50
5431c28J88K21L4K08J32L23m9K70j98k46J12k28r3r6k73N3j10j93J4L18K86j00
5453B45K39J34qL54k16j54K97m14j15o5p2r9m01N5L8J61Q5J77L68l43L64J73j76
5476F27J24L9j02q9j52j98q4p8k01q8J04J27J88R9K35K60q7j3J12j91k8k87R4
5499D11k77O7l62o2P9j8L89j95M42J65J96j38P0J49j88j93k13K8J25m20j99M3
5521a01K4L8K11q4Q2K36K77q5J17J9Ro0j76k19j25J29k01l6l80K57k1P7K94J91
$$ plain form
5365 806 968 886 578 498 437 247 -8 -126 -76 -207 -342 -25 -116 174 387 669 820 597 734 874 732 678
5387 678 724 220 58 10 -181 -293 -163 -183 77 316 184 457 841 723 814 875 712 541 325 493 334 139
5409 139 -133 -51 -145 -68 -223 84 241 147 725 586 858 675 980 834 345 433 363 4 -118 -84 122 -328
5431 -328 -140 81 115 323 455 778 729 999 801 555 667 439 346 250 -23 30 -80 -273 -259 59 345 245
5453 245 484 618 610 964 748 594 891 477 362 297 225 126 -275 -220 -182 -21 64 241 609 266 630 803 627
5476 627 751 790 688 599 447 249 165 87 -114 -202 -98 29 217 316 551 811 724 711 823 632 604 317 411
5499 411 134 201 -161 -223 -144 -162 227 32 474 639 835 697 767 916 728 535 322 350 475 55 -144 -101
5521 -101 -77 -39 172 88 170 406 683 598 715 734 743 683 507 288 163 292 91 55 -325 -68 -89 -12 282 473
5545D73M8J51O0J47k20k3J8k71l4Q6n61K45l24r8J75J93J79j27M37l3j14M06Q3
5568H96l13r5J92n18j23L4k08p5K10j19K53l22L44J44L81Lk4j71J18Rqj48k77
5591A83q6Jq4p5J6K5j09L00K40n4J48J57J10n9o3r7rj96j71k28j38j48L99k45
5615a83K31K21j70J82L20j79J47K55M8k17M1m85K6j79n5o7M3k71K65m7M32l3J35
5638D60J25j49K55j7J89k80o8m05j02J00k23L3m9R8k2K98J15j07L38J28N0M4l40
5661D71L5M5k22j69j54j06K11j53j04J06L13M9O3J92kJ21nJ8N8k10K0j68j92j17
5685A00K9j35O4j0q0J35K85l0J92J27k15K46O7j04o5k30m6l6k93q5m5J80n7r8
5709a04K47K42J49K73n7K6J11m00P8j97j1k34k80n9K51k08qJ48J59J67J34L24
$$ plain form
5545 473 521 672 732 879 659 636 654 383 349 435 -126 119 -205 -303 -128 65 244 117 554 521 407 813 896
5568 896 583 488 680 162 39 73 -135 -210 0 -119 134 -188 156 300 681 684 660 489 607 616 608 460 183
5591 183 97 98 14 -61 -45 -20 -129 171 411 357 505 662 772 713 650 553 544 348 177 -51 -189 -337 62 -183
5615 -183 48 269 99 281 601 422 569 824 872 655 696 211 237 58 3 -64 -21 -292 -27 -74 358 325 460
5638 460 585 436 691 674 863 583 515 110 8 108 -115 -82 -131 -33 -55 243 358 251 589 717 767 811 471
5661 471 506 551 329 160 6 -100 111 -42 -146 -40 273 322 385 577 575 696 691 709 767 557 577 409 217 100
5685 100 129 -6 58 48 -32 103 388 358 550 677 462 708 775 671 606 376 330 294 1 -84 -129 51 -6 -104
5709 -104 143 385 534 807 750 776 887 487 565 368 357 123 -157 -216 35 -173 -181 -33 126 293 427 751
5731G51j45J41P6mk00K9m35j04j79l6J57m1K03l01K76L72l52M83L4kj38j07K13
5754F91l16j81RJj77P3l0k89J11J68K57K62k40J90K35k13K51m30K31k84k4k81
5776A4j33J26j37J91k04L44j01L89P6j76K0K86M0j60m9j87k1j58j83q6RJ05R5
5799A00j26J77K39O7J12J02j93K61R3l02O0n7j24k98j31n2l4K74N8r5J57K64j81
5822C71J51K2Q4K39k19r3Lj95j74q3R3j56j55L40j82R4K43J07%K39l4o6j66q6
5846C77K87m11P6k90K9n6r6K55m5O2J87m7L75n6N4N5j12j71M1j59j93L5j1q2j24
5871b0j76L99l6K1J39J27K5O9r7L85ll21O6k73k15kJ0j14NJ85p6J05J92J39j22
5896D12L10j7k42K20K36l03l66k05K02q8j53J35%j10L58k37P1K19J22j79K33k5
$$ plain form
5731 751 606 747 823 819 619 648 213 109 -70 -106 51 10 213 -88 188 560 208 691 725 723 585 478 691
5754 691 375 194 203 204 27 100 70 -219 -108 60 317 579 339 529 764 551 802 372 603 319 295 14
5776 14 -119 7 -130 61 -143 201 100 489 565 389 409 695 735 575 526 339 318 160 -23 -109 -100 5 100
5799 100 -26 151 390 457 569 671 478 739 832 530 590 533 409 111 -20 -72 -106 168 226 131 288 552 371
5822 371 522 544 628 867 648 555 558 363 189 106 199 43 -112 228 46 140 383 490 490 729 695 629 463 377
5846 377 664 253 329 39 68 12 -84 171 126 188 375 328 703 647 701 756 644 473 514 355 162 197 186 104 -20
5871 -20 -196 203 167 188 327 454 479 548 451 836 833 512 578 305 90 88 98 -16 -11 174 98 203 395 534 412
5896 412 722 705 463 683 919 616 250 45 247 159 6 141 141 31 389 152 223 442 564 385 618 593
5918E93o5j16k9k10qj63j43P7K0n3J96O7J09P4J22K39j32L13k50k18J05k33j35
5941A60q2k81P0J97m6M8n2M59n0R8R0L38p0m61J23nj89j69N7k05m2j24K45j65
5965e6J61O6L29K43j23j86J90OL4k21r9j94q2J67l55r1oK68k0J90O2J99p2K76
5989F86j27J35rk4k07k70J3m3k22J60m2q0L34k1m3P3J43Q4m9K03r9p4j93N5l03
6014H0N1p0JL3k22K31O2L4P5L27k4L4k9K0j27kp8o0j90j19o6M5j94M9L94J0J10
6041C75K09r9J36oRK80l93J3k50Pk05l16J61R2J49k5r6L75l4O7n2J95J2p0N7n2
6067E39k63J06j19k64J2p9k6J73P3K06JJ03M8L26j23l18J56J2k6j88l1j31r7n
6091H5O2R5k49L9K54J82q9J32J39J5j0j8j64j20k31M2M5k00K34l01J96k63O77
$$ plain form
5918 593 528 412 383 173 165 2 -141 -64 -44 -97 99 166 275 349 471 710 578 891 641 423 528 295 160
5941 160 78 -203 -133 64 18 66 14 473 423 521 611 949 879 418 541 536 347 178 235 30 -12 -136 109 -56
5965 -56 105 171 500 743 620 434 624 630 664 443 344 150 68 235 -120 -211 -217 51 31 221 283 482 410 686
5989 686 559 694 685 661 454 184 197 154 -68 92 50 -30 304 283 240 313 456 540 491 694 595 521 328 383 80
6014 80 131 61 62 95 -127 104 166 200 275 602 578 612 583 603 476 474 396 336 146 27 -39 6 -188 -139 255 265 375
6041 375 584 485 621 615 624 904 511 524 274 281 76 -240 -79 13 162 137 41 416 382 449 397 592 604 534 591 539
6067 539 276 382 263 -1 11 -68 -94 79 152 358 359 462 510 836 713 395 551 563 537 349 318 187 90 85
6091 85 147 242 -7 32 286 468 379 511 650 665 655 637 473 353 122 164 209 9 243 -58 138 -125 552
6114E52k30nL41L9O3k9q5j60j39n3j72j71L24l07N3p4K31k2L77k47K96j05P8J41
6138F96p2j03J23l64r5j34j94R2K5mL61q4J20j60K33J66L4J29k31j86K33j89k61
6161A35Q2j42o0j42K35M8qJ56J36k37J58N3K54Q6l00j28L1j03j34k1j00k1N8j32
6185i6N83m04K13J14J69K73l12P1j02m3Nj92j11O9l22k4k7L30O1j01Q0J32J19
6208D85p9J9K51j71O5j93l01J40k2p4p5K34j03j57J75O3J94j26L66j95k85L32
6230E43K06m05j9J9j99j22j0J62j64J67j07J14L76Pj67LK08nk26P9m4j76J15j41
6254B14k91J60j20P2k7N4J96J03R4P3r0j3J45J55j17m60N7p3J99l60n3P8J91J00
6278B87R5j29K82q3m2J24K4k7l8M5m60K10j42Lj77P5L0J18J6J60K05pj78R9L55
$$ plain form
6114 552 322 317 658 697 760 731 646 486 347 294 122 -49 275 -32 21 -53 178 156 533 286 582 477 555 696
6138 696 624 521 644 280 185 51 -143 -51 -26 -30 331 247 367 207 440 606 640 769 538 352 585 396 135
6161 135 217 75 15 -127 108 156 148 304 440 203 361 414 668 754 454 326 357 254 120 99 -1 -22 36 -96
6185 -96 487 83 296 410 579 852 540 611 509 466 471 279 168 237 -85 -109 -136 194 255 154 234 366 485
6208 485 406 425 676 505 570 377 76 216 194 120 45 279 176 19 194 257 451 325 691 496 211 543
6230 543 749 344 325 344 145 23 13 175 11 178 71 185 561 568 401 404 612 607 381 460 416 240 355 214
6254 214 -77 83 -37 35 8 62 258 361 455 528 438 425 570 725 608 148 205 132 331 -29 -82 -4 187 287
6278 287 382 253 535 452 410 534 558 531 493 538 78 288 146 149 -28 47 77 195 211 371 576 569 391 490 845
6303H45m23j1K46j94k00j27k07N0q0K8K48O8J74k35L15J23J16q9K33k57j17m8
6325D58j05j50J4J62m85K20k7n0L83k09K21L37l25Q7M4P8j75n6j81J33l18Q2p4
6348F4k8O5J9k29K81J42J74J12K1k27K97j61k05q4J5j83J00j22kN5J21j94K46
6371B77j8K99j2n7J29p0P6l31K64l68r8j05J16Q9RO6o4P1P8J40j24K62j24L3M3
6396E81p5j46k17K77k30m6j3M9j69K21M5N6j0Q7MJ67LJL7l99L85j29k24mj96K96
6422C51l40j9K42O9J20j54J92m9jP6J93l16P5j01k08JJ13j92K2N7P0J37l1K01
6446E08M8q0j16K93k23j59L56m60j3r8n6N8L1l1J18n4M6J7M03q0J47k20L0mp5
6471C86J20j10m0l36J2k7K02L5l5L9J75j14L2K47j50K23l06p5N7o2j64J03N3q5
$$ plain form
6303 845 422 411 657 463 263 136 -71 -21 -101 -73 175 243 417 182 497 620 736 647 880 623 506 458
6325 458 353 203 217 379 -106 114 87 37 420 211 432 769 444 531 575 653 478 422 241 374 56 138 64
6348 64 36 101 120 -109 172 314 488 600 621 394 691 530 325 241 256 73 173 51 49 104 225 31 277
6371 277 259 558 546 489 618 548 624 293 557 189 91 -14 102 191 200 266 202 273 351 491 367 629 505 538 581
6396 581 506 360 143 420 190 144 131 180 11 232 277 333 323 410 414 581 584 585 622 223 608 479 255 251 55 351
6422 351 11 -8 234 303 423 269 461 412 411 487 680 364 439 338 130 131 244 52 74 131 201 338 307 508
6446 508 556 476 360 653 430 271 627 167 154 56 0 58 89 58 176 122 168 185 588 508 655 435 465 461 386
6471 386 506 396 356 20 32 5 207 242 207 246 421 307 339 586 436 659 353 278 335 273 109 212 265 180
6495A80r5P8J0J12o3J92j28M72k11j66Q7m0k2j57N5J81m11Mp0K70k07L02k14L5
6519A94N9J44N8L6J8m8J5j05M5k28O5j1ml09N6K53j50J83J12J44K7q4P1k28J47
6544D60j46l3o7j53rJ22j00kR5P8j2qJ03K54j16K48l19J41j09P3l10m6k23K91
6568B12M4J12k99k4J12J76K13O6M9k38l4L3k2R7l43O2m8L1j88n2J26J20J13J0
6592C28p2K71j50J51m6k8k5l3l3r9l51J37M28k56l28K39Q2Q7Lp6J42L7K64j42
6616E30q1m9J3k91K31k53M0J5L4O4l8j55K85J28KP5lj67M1M0j35l3j6O7k79P2
6642A37R8k05N3K11J32p9J44K51k45l65L39m8p0KJ3j15K2j42K2m6K66l03J51K62
6666D85j28K12j2m5J00l8l24N8p7J23j9k07P3j3m8k19L87J11j10O3l8M90k68j26
$$ plain form
6495 180 85 163 173 285 222 414 286 758 547 381 468 428 406 249 304 485 74 78 8 278 71 373 159 194
6519 194 253 397 455 491 509 461 476 371 416 188 253 242 238 -71 -15 238 88 271 383 527 554 470 541 313 460
6544 460 314 281 214 61 52 174 74 72 167 245 233 225 328 582 466 714 395 536 427 500 190 144 -79 212
6568 212 256 368 69 45 157 333 546 612 661 423 389 422 400 497 154 216 168 199 11 -41 85 205 318 328
6592 328 256 527 377 528 482 454 429 396 363 264 -87 50 478 222 -106 133 215 302 305 229 371 408 672 530
6616 530 449 400 413 122 353 100 140 155 189 253 215 60 345 473 475 550 547 380 421 461 326 293 277 344 65 137
6642 137 235 30 83 294 426 347 491 742 497 132 471 423 353 355 368 253 275 133 155 109 375 72 223 485
6666 485 357 569 557 512 612 574 250 308 231 354 335 128 201 188 140 -79 308 419 309 372 334 824 556 430
6690D30lj34K5r3J1j57M8r8J42n7Q9K80q1J16l41L78k2k11K82l37J21J40l33j7
6714A78j4k1Q6p0K69j32j18J87J25M2K04j94k33l8J15r2j67J34k58J13L2j36K9
6737D1L83j84K03j00P6J18mj39k04K64l05Q8N4k45j9J59o1nj69L09jR7K58l20
6761B94J82j7N6k70Q5K3j2j33k2K4j31J70j95K01K94r4K17k58J48k06k9m62N21
6784C86j24l1m2j69kJ15l6n6K16K02l01L42j65J61K56m63M8n2M1o9j93o6r4N3
6808d3J14L21l27M04k58J11J43K1L3k11J56j82J12k52K23j64j13k9M3J23j68K37
6830B94J04k44L21k04L74o3k5k11K56k89q7j18PK37k51R5j90K70j3K57j92qJ38
6853D58O7Rj87K29j99j98K9N6k27j05J22J91l28M85j85R8J65N9j39K05k95J31
$$ plain form
6690 430 427 293 318 225 236 79 127 29 171 114 203 483 402 518 177 555 533 322 604 267 388 528 195 178
6714 178 164 143 229 159 428 296 178 365 490 532 736 542 309 271 386 294 127 261 3 116 148 12 41
6737 41 424 240 443 343 419 537 533 394 190 454 149 237 291 46 27 186 125 120 -49 260 259 356 614 294
6761 294 476 459 515 245 330 353 341 208 186 210 79 249 54 255 549 455 672 414 562 356 327 -135 386
6784 386 262 231 189 20 18 133 97 41 257 459 158 500 335 496 752 289 337 285 326 257 64 -2 -96 -43
6808 -43 71 392 65 469 211 322 465 486 519 308 464 282 394 142 365 201 88 59 102 225 57 294
6830 294 398 154 475 271 645 582 557 346 602 313 226 108 115 352 101 196 6 276 263 520 328 320 458
6853 458 525 534 347 576 377 179 208 264 37 -68 54 245 -83 402 217 315 480 539 400 605 310 441
6875D41o6l05J40k6p2K9O5o8L23j30J09j1K4O6k2Mj07k6O7j17j41q2J57nK14j57
6901C04j64J67J10j03N8j29L35j22K8O7k78p8K57k99K1l4m0l4O7l0K02J82J9O8
6925E74j08j30K29J23l84R2k16J59k13K02J10l02J6p7K05K9O9L5Q4J32p7j81L2
6948D03m6j46k1n3j54K9J04n1P7J5R8L35l06J80k0l0J15P6j61j24Q6L0m10K11
6972B37l13L97j20Q8q5L1K25M9n9K12p9L1j70J06O2l65o8n2J6R6l3L6J60j63L95
6997F34k79j8L38k24pJ22j56k04j18lK05j47K12j95J4K93n50N43q2K23j90lJ36
7020E44m1j64l1j48N7q1J61N9J7k2l08J59P7J83J3J9kJ4P2j63O3l08L32k99q9
7045A14p1J29j09J08M1R0R0r2K45K9k10J05kj69j2MKk54j3K7J37j04n3J76K87
$$ plain form
6875 441 375 70 210 184 112 141 206 138 461 331 440 429 453 519 497 501 394 368 435 318 177 95 252 247 461 304
6901 304 140 307 417 314 372 243 578 456 484 551 273 195 452 153 174 140 100 66 133 103 305 487 506 574
6925 574 466 336 565 688 304 396 180 339 126 328 438 136 152 75 280 309 378 413 497 629 552 371 403
6948 403 357 211 190 137 -17 12 116 65 142 157 255 590 284 464 444 414 529 605 444 320 406 436 26 237
6972 237 -76 321 201 289 204 235 460 509 450 662 583 614 444 550 612 247 179 127 143 239 206 242 402 239 634
6997 634 355 337 675 451 444 566 410 206 88 85 290 143 355 160 174 467 -83 460 378 601 411 408 544
7020 544 503 339 308 160 217 136 297 356 373 351 43 202 279 462 475 494 492 506 578 415 478 170 502 203 114
7045 114 43 172 63 171 212 302 392 300 545 574 364 469 467 298 286 290 292 38 25 52 189 85 32 208 495
7070D95l65L17l3J42j9pj93O4k98K70j28k92R7K32p9N9J82j45j58J88J81j44K67
7093F33l56L09j91j87Q7j48J58j17JJ70l2o0NJ03N4%J11J3l5k1l35N2L48l80O1
7118B43m4j12J86j57K63q0J97J00o6n7k22J78j25J28j19j42J6q4j16K37J10o5
7140B69r5R9O3n3J43j6K57k02n5j02n5P4k78L00l1k67K16l33J17J87l9R7P9l7
7164C38J14l2O7J5j23M3M5k31O5k05K2P5q6K68r6K23j34K23J3k24l0Q8K4l47J7
7189A32K28NMk98O1k20K55L8J73K13j59L4K28m38K60j30k3q1j44J83Q0l02O5J44
7213C08j44J55k9J75m8J41q5j32J59j34k33K1K42k60k98N62j23j68rK90k09o5
7235A16J69P4J35k2J11j98O0Qk15j46K04Qj35P5j00j86L82M5ln2K06m4n2J89k61
$$ plain form
7070 495 130 447 414 556 537 530 337 401 103 373 245 -47 50 282 203 262 444 299 141 329 510 366 633
7093 633 277 586 395 208 295 147 305 188 189 359 327 267 272 375 429 429 540 553 518 497 162 214 562 182 243
7118 243 199 87 273 116 379 299 496 596 530 473 251 429 304 432 313 171 187 103 -13 224 334 269
7140 269 174 273 336 283 426 410 667 465 410 308 253 327 49 349 318 51 267 -66 51 238 199 296 375 338
7164 338 452 420 487 502 379 422 467 236 301 96 118 193 107 375 279 502 368 591 604 380 350 438 462 115 132
7189 132 360 365 369 71 132 -88 167 205 378 591 432 466 694 256 516 386 363 282 138 321 401 99 164 308
7213 308 164 319 290 465 417 558 473 341 500 366 133 154 396 136 -162 400 277 109 100 390 181 116
7235 116 285 359 494 472 583 385 445 453 238 92 296 304 169 244 144 -42 340 385 382 330 536 492 440 629 368
7260C68j32o3P1K6m2k40K33J24j9q5J77o0J61p6p0L21J4k95j29K74l01j07K8j38
7284D0J84J3j74K55q3J10n2J39q5N5J76mj18l5N4k34J62p6k30j20L25j33m4P9
7308B04Q1J37J26j10o1p3J07n7r9J31j4r3l0l8j06J94k87J77KO9J75K11k0k88
7332C38J05K1k7l4j08p3n0j0NJ83j82J40j46J56K37l38K24j13R5L6j02Ro2M4j56
7357A92RP0O7q1k8K77k87K38j66K58r5j68L15j43k31N0K69m47K16o8o2l9L7L0
7381B13J21J33M8jk26K90J4l80K40j58O8j6j25j00r2K03r9K40M4j7J41j85J00
7404D56Mk10J10J6P6j42N3j89j96J9M09j94L6j29J80J80J43j89Lqq8J39j26k20
7428A33K20l61J16K29m15Q9L39Q3N0l45K91j8N9k52K60n9n1n1r4Q9O5j22j39J08
$$ plain form
7260 368 236 173 244 270 228 -12 221 345 326 241 418 358 519 443 373 694 708 413 284 558 257 150 178 40
7284 40 224 237 63 318 235 345 293 432 347 402 578 574 456 421 475 241 403 327 97 -23 302 169 125 204
7308 204 285 422 548 438 377 304 411 354 255 386 372 279 249 211 105 299 12 189 191 260 435 646 626 338
7332 338 443 464 437 403 295 222 172 162 167 350 168 308 162 318 555 217 441 328 423 459 357 366 304 348 192
7357 192 201 271 338 257 229 506 219 457 291 549 454 286 601 458 227 277 546 99 315 247 185 146 183 213
7381 213 334 467 515 514 288 578 592 212 452 294 362 346 221 121 29 232 133 373 417 400 541 356 456
7404 456 460 250 360 376 452 310 363 174 -22 -3 406 212 248 119 299 479 622 433 436 428 340 479 353 133
7428 133 353 -8 108 337 -78 11 350 433 483 138 429 411 470 218 478 419 368 317 223 312 377 255 116 224
7452B24J61j96J9J41J20L8k08K80j76q1M3j7O4j32l3n0j43j7K56J52r8rqP8J26
7477E34j73j8J67j16j8r3J3j79J04O4M9k21J62L7R2r4%J33M4j52J63o0J8k43K6
7502B39J17l89K12Rl1l5K34J2j00ON1R4N7k51J21M0j08J69j89J18l49K16Q0j70
7526A53J4P6M3J29J39k25K87j20P8j56k02J02J45j28j14p5L05k10M6q0O5O2J79
7549E13k27K64k52K28p4j62R0Q2k93JM8K9R4j30K46k70K57K09j19q8J04j82J35
7572E03l17K37r4N0j68K4or3O1o0K04r2q4J17j25K02O8N5o4j95R3j81r0J97k9
7597B13Rj44J93N9R8L9k06M7R1J93L5k95J49j0k38n2m8O1j62Q0jL87j83p1n6J73
7623C61N1j55J9J65k3l0o5J46k18K6Kj57R5m5J50R7K9J00j76J12M1j51J48j03
$$ plain form
7452 224 385 189 208 349 469 507 299 579 403 322 365 348 412 280 247 197 54 37 293 445 347 338 330 408 534
7477 534 361 343 510 394 376 283 296 117 221 285 334 113 275 312 404 310 310 443 487 335 498 438 456 213 239
7502 239 356 -33 179 188 157 122 356 368 268 274 325 419 476 225 346 386 278 447 258 376 27 243 323 153
7526 153 167 243 286 415 554 329 616 496 574 418 216 318 463 335 221 146 451 241 287 207 272 334 513
7549 513 286 550 298 526 452 290 380 462 169 170 218 247 341 211 457 187 444 653 534 446 550 368 503
7572 503 186 423 329 379 211 235 229 136 197 137 341 249 165 282 157 359 427 482 418 223 316 135 45 242 213
7597 213 222 78 271 330 428 467 261 308 399 592 627 332 481 471 233 181 133 194 32 112 111 498 315 244 188 361
7623 361 412 257 276 441 418 388 323 469 251 277 279 122 217 172 322 419 448 548 372 484 525 374 522 419
7647D19j21OM0k35J60P1k32ML92n1Q5k00J32P2p2J40j64o2Rr6q6%q7O2L0J58q3
7674B91K7o6K66j27J05j10j21J70m0j02K05q2j8j77J23j45n9K09k0q0K93j72k4
7697C46J70j70k4m0J33j28k73J21N6O3J6j93J76J4J04J09k45J6K93mj01K0k42
7720B17Q2m6j92J08o9J41P8j7JJ1J18m2J02M0pj39J91j05j14j04p0J70k71l7J69
7745B15K56k81K59j37L5L6o3pJ6Q0n9J61p6l70K98j85J77k63j17K95k35K13J35
7768C83j51K78r2J00m1k40j7Q8J57l4k21J57j70K7K8j13J26Q0j5O9R5pj60K21
7792E48k54J89j40j28l0J46J11l43P0J55j7o0o4K18o0o8J86P7k98R9o3j59L93
7815E08k34k4j60K65j66J97j01P6k8J16p8Q1K4q6k04Q6j9j44R7K0k01K99k11K71
$$ plain form
7647 419 298 304 344 109 269 340 108 112 504 453 538 338 470 542 470 610 446 384 393 297 211 211 124 186 216 374 291
7674 291 318 252 518 391 496 386 265 435 395 293 498 416 398 221 344 199 140 349 329 249 542 370 346
7697 346 516 346 322 282 415 287 14 135 191 254 270 77 253 267 371 480 235 251 544 540 439 459 217
7720 217 299 253 61 169 100 241 319 302 303 314 432 390 492 532 525 386 577 472 358 254 184 354 83 46 215
7745 215 471 190 449 312 347 383 320 313 329 409 350 511 435 65 363 178 355 92 -25 270 35 248 383
7768 383 232 510 418 518 477 237 220 308 465 431 210 367 197 224 252 139 265 345 330 399 494 487 327 548
7792 548 294 483 343 215 185 331 442 99 169 324 307 247 183 401 341 273 459 536 238 337 274 115 508
7815 508 274 250 90 355 189 386 285 361 333 449 371 452 476 390 186 272 253 109 206 226 25 324 113 384
7839C84MJ71j08n9j38J49K80l36K13k63j29K17k22R2m8Pj27K66j11Q2O9O2p7P
7863C85L1K44l86R5Rj87K19k59K70j76k09N1R0J12J02r6L83k59J88k80J82j19
7885C90r3J69j17J9k14J50j59J14OL7j27J53k8J38o4j54J01R8j87K35k55K08l63
7908E7K12j84O8K3NJ00k5K03j67L64k80l4r9N3j96K05O1j97m2k29N4J07J18k8
7932A49L87k08j29K55j44J70k0O8l31L8jr4K17k37J06QJ32k7J8p2J04o4M2J91
7956E58k24nJ84k88J61q0l3p9j07J38o7P2K3O2J8M7O1q1L4Q5k64K94R1n21J18
7981A97Q0k91M44j71k25J09L64j56j26J33o2J1n1L45k95jM3j35l7Jj16L4O9O6
8005B30R0J33j45L02l60NK06r6K7o7K1j78K63k68j62K30j30K92J52k61J49l7j56
$$ plain form
7839 384 388 559 451 392 254 403 683 347 560 297 168 385 163 255 207 214 87 353 242 324 393 455 378 385
7863 385 416 660 274 369 378 191 410 151 421 245 36 87 177 289 391 295 678 419 607 327 509 390
7885 390 297 466 349 368 154 304 145 259 265 302 175 328 300 438 374 220 321 419 232 467 212 420 57
7908 57 269 85 153 176 181 281 256 459 292 656 376 342 243 296 100 305 366 169 127 -102 -48 59 177 149
7932 149 536 328 199 454 310 480 460 528 197 235 234 140 357 120 226 234 366 339 357 285 389 325 367 558
7956 558 334 329 513 225 386 306 273 194 87 225 158 230 253 315 333 380 441 360 394 479 215 509 600 79 197
7981 197 277 -14 430 259 34 143 507 351 225 358 296 307 256 601 306 305 348 213 176 177 61 95 164 230
8005 230 320 453 308 610 250 255 461 365 392 325 346 168 431 163 1 231 101 393 545 284 433 396 240
8028B40Q4J04Q3l06K8m8J95j28O5j57p5K70N2l1j14R6J40k10J37k8j64K80r7L0
8052D46n7k29J77J19j92N3m4J22k07J9j41M29j64J04Pl6j65J49J1j44l0k7j4n7
8076A29L30l97K20J26n0R6J4J39l09J85K5j38Lp4O3k78R1J07Nk46L06j79J78R1
8100D37K19k40j3L2j59j5lJ29p1J87l92K33o1K7k6J8m5R1OJ4p6N7lP0m3j64pJ26
8128C28k0l3r5k1mK54k08j05L68j57QP8pM6o8L5j76O9J04j43nj46K78k18P2P1
8154C05q4J16K20k82J71j56P4k98M44j20j7k31J63J46k80J02k8m9K08J7oJ38r0
8177D63q7J29k95M7R8J16j40k60J24K7J91k31R7J73K55l70K0n5nK23j08q2j16
8200B14K59k81o3J57j06J51j45J19J25j02l2K17p6M8K7o5l30K39j95J04J33l7
$$ plain form
8028 240 324 428 511 205 233 185 380 252 317 160 85 355 407 376 262 358 498 288 425 397 233 513 416 446
8052 446 389 160 337 456 264 317 273 395 188 207 66 495 331 435 442 406 241 390 401 257 227 200 186 129
8076 129 459 62 282 408 358 454 468 607 298 483 508 370 373 299 362 84 175 282 287 41 347 168 346 437
8100 437 656 416 403 435 276 261 258 387 316 503 111 344 283 310 284 302 257 348 354 368 292 349 346 416 373 209 202 328
8128 328 308 275 180 159 155 409 201 96 464 307 315 393 386 432 364 399 223 292 396 253 248 102 380 162 234 305
8154 305 221 337 557 275 446 290 364 66 510 390 373 142 305 451 171 273 245 196 404 421 415 553 463
8177 463 376 505 210 257 355 471 331 71 195 222 413 182 279 452 707 337 357 302 297 520 412 330 214
8200 214 473 192 129 286 180 331 186 305 430 328 296 513 437 485 512 447 117 356 161 265 398 361
8222C61r6l24L95k03L34k01K31J2j25p6K23k46j24J82q7m9J8Ml7J77j01O7r7K02
8246D40N0q9L7j14J5N9O4l53P3L86l70Lq1J26N1j76M7L07l5p8M9L3r6j08K80k46
8272B74Jj33N4K1j61P6L7O3j74L27n7K5K85l99K09k00q8K72o0j98K96j38M2j58
8296B16J77r3q1J65J9m5K46k34K62k43k23J79P0j32O2N2j00p1l5Rn2J97J04Q3
8320E32kj34P6l4j53J72j36J7n9J0oj04O1j36K72j30K09j39Q5J27k19J65r6M5
8344D23o2J6m0q7J35q0n6K9j32J50o6K9M6j01q8N12k90o3L4K10j40O7l19M9N3
8369B29J81k17R2r9K12p1K23j39j7j52m5L98j73mj66J05k52J02q4J38j16J8J53
8392C16K4j60K87J48j94j77K14j95Q2j27r9m2J70j41R8K2J98j43m8K60r3q3O0
$$ plain form
8222 361 265 -59 336 133 467 266 497 509 384 308 531 285 161 343 256 207 225 229 192 369 268 335 238 440
8246 440 490 401 438 324 339 398 462 109 182 568 198 201 120 246 297 121 168 475 440 362 411 444 348 240 520 274
8272 274 275 142 196 217 56 132 169 232 58 385 328 353 638 239 448 248 160 432 372 174 470 332 374 216
8296 216 393 300 219 384 403 358 604 370 632 389 166 345 415 283 345 397 297 226 191 200 148 345 449 532
8320 532 530 396 472 438 285 457 321 338 279 289 283 179 240 104 376 246 455 316 401 528 309 474 378 423
8344 423 361 377 337 250 385 305 249 278 146 296 230 259 305 204 116 628 338 275 309 519 379 446 127 176 229
8369 229 410 193 285 186 398 327 550 411 394 242 197 595 422 418 252 357 105 207 123 261 145 163 316
8392 316 340 180 467 615 421 244 458 263 345 218 119 77 247 106 204 226 424 281 233 493 400 317 377
8415C77N0J5m8k08O0J12p5j71J70o2p3J03J15qN2j83K32j73K34r4l57r4K23j10
8439H7J64k84M52o2Pl5j4j28M1J01J68Q3k28R1k51j0J6J10o6J83Rj44P1L5k28
8464A68K9Q0J92j19PK8N1j93qO4o1l1L2o3J79j59K2R5J65j92L9J08Kk21K37P0
8490E21l62J72M7N4k55J78j95o0L5MJ29J62K5m3q3R6Kj45J40o9j15J22m0O1j83
8515A98Q3j15L35k33q5N6Q2J26Pnl0n2N7j21J6q4N4k35K21k11K58k99L27J57j3
8540D94j03nP3j35nj35J47J30r5k86M65j81j59j96L21o4K16k23J68J24l08R2L
8563C38j4J82k45Q9R2k45M7m8J57q4J9K8p9J50J50k34n6J51J21l41J84o3P1qo4
8588B98P6k93J7J10J35j18J66J47j32K81l90J4l7L6q6k6j45n2J05j28L07N0r4
$$ plain form
8415 377 427 442 394 186 246 358 283 112 282 220 147 250 365 357 409 226 458 285 519 425 68 -26 197 87
8439 87 251 -33 419 357 364 329 315 187 228 329 497 580 352 443 192 182 198 308 242 425 434 290 361 396 168
8464 168 197 277 469 350 357 385 436 243 235 299 238 207 239 176 355 196 218 313 478 286 325 433 435 214 451 521
8490 521 159 331 378 432 177 355 160 100 135 139 268 430 455 412 329 425 427 282 422 353 238 360 320 381 198
8515 198 281 166 501 268 183 239 321 447 454 449 419 367 424 303 319 235 289 54 275 64 322 23 350 507 494
8540 494 391 386 459 324 319 184 331 461 366 80 545 364 205 9 330 266 482 259 427 551 243 335 338
8563 338 324 506 261 350 442 197 244 196 353 269 288 316 237 387 537 303 247 398 519 178 362 299 370 362 298
8588 298 374 81 98 208 343 225 391 538 406 687 297 311 274 310 224 198 53 1 106 -22 285 335 241
8611B41o5Q9J53j76L58l50J36K1m5n7J1j43J46p8P3j35j04K66j00J17p9R0m7K22
8635E44l99L4K19j75j07K02J4O3j74j1J16j56K2r7L05K7K58k16q7N3m03M24j60
8658B96L6N2J5j89J03k9Q1n9K07m7k61K77k02K17k01j4R7P3k48K26j70p0jQ8J24
8683D01L6l7j93K41Mj22j38K18j07J36r9J27k11J48q6j32o7L4m0J31M4R3QJO9
8708D59q4j18K92q2j81q7O6q5q2J58R8n2j22J83l1J16j00J0q9R7j98K50j89J3
8732B42L4j93J24m4LJ77N0j71K66L9k84J94j10L2J7J21j31j19l0m3N7P0o0J40
8756C81k59J03K34k0j41J13p6J3ljJ5kj04j64J88N5j1r1l4j23N59l71P5NJ29n8
8782D12M8J0J14j85k08L2j9j6J09k09L40k80P5K23k41J68J69k03J69r5J22k26
$$ plain form
8611 241 176 265 418 242 600 250 386 407 362 305 316 173 319 241 314 179 75 341 241 358 279 369 322 544
8635 544 145 179 398 223 116 318 332 395 221 210 326 170 192 95 400 427 685 469 382 435 32 456 296
8658 296 332 384 399 210 313 284 365 306 513 466 205 482 280 497 296 282 379 452 204 430 260 190 189 277 401
8683 401 437 400 207 448 452 330 192 410 303 439 340 467 256 404 318 186 119 153 113 244 288 381 389 390 459
8708 459 375 257 549 467 286 199 265 180 98 256 354 302 180 363 332 448 348 358 269 366 168 418 229 242
8732 242 276 83 207 163 166 343 393 222 488 527 243 437 327 359 376 497 366 247 217 174 231 301 241 381
8756 381 122 225 459 439 298 411 335 348 345 344 359 357 253 89 277 332 321 230 196 73 632 261 336 341 470 412
8782 412 460 470 584 399 191 223 204 188 297 88 428 148 223 446 205 373 542 339 508 413 535 309
8804C09j4J91k03n7N7j36P5Q5P7r0p5R7n7J9P4N4R1l32J36K8P7l8J95m00J95j29
8830B29J4rj17L70J18k14qL9j66K34j39m8p4L6n1jP0PM1J80k63J19J33q1K0N8
8856D97q3k9m0J55j72j1j68K66j63m1K06k25L50k86N0J44k0J07q4j17p0K52k10
8879C08o0J71k41j83L68q8J3M9r4O0P7Q0k12o7J55j33K74Nj40M2r7J94m33j38
8903i0L77k0J63j67J72Mk3j70J55J8n6o1j68%m3K26M0k98J73J17j57R5R5j03J12
8928C91j37J94j69K14k86n7J56Q0Qj39j70J60J55k11K9J49J0j31J89J22k29K7
8950C55L8k00P7j02J31n7P1p7J35k62L15o3K00p2j03po6l2P3oJ83l98J50k35K28
8975B76L43m48q2K12RnL3j08K10K7j9r1j12j45J53M9j27J07r2k3J60m8J42j41
$$ plain form
8804 309 295 486 283 226 283 147 222 307 384 294 219 316 259 278 352 406 497 165 301 329 406 368 563 163 358 229
8830 229 243 234 117 487 605 391 383 422 256 490 351 303 229 265 214 213 283 290 331 511 248 367 500 419 439 497
8856 497 414 385 345 500 328 317 149 415 252 211 417 192 542 256 306 450 430 537 453 336 266 518 308
8879 308 248 419 178 -5 363 275 288 337 243 303 380 460 248 181 336 203 477 482 342 384 287 481 48 -90
8903 -90 287 267 430 263 435 439 416 246 401 419 363 302 134 134 91 317 357 59 232 349 192 287 382 279 391
8928 391 254 448 279 493 207 150 306 386 394 255 85 245 400 189 218 367 377 246 435 557 328 355
8950 355 393 193 270 168 299 242 313 236 371 109 424 361 561 489 386 379 313 281 354 348 531 133 283 48 276
8975 276 619 171 89 301 310 305 338 230 440 467 448 357 245 100 253 302 175 282 190 167 327 279 421 280
8999B80k4r7J16k5QQ4j78J67J2r7R5n7M9R5j46J58k23N2K9P8q7r0K10m8k26J63
9025B98N0r8J48r2Nj25l9J23M7rm8K49r6L8k10j39K09r9J49J0j95j03J76N8l6
9050B71Lk4R4o0N0j89K68k45J38M7n2L4r7J14k57J05P4p2O3J1R5m5q9J78k7K5
9076D13j58K36j76j32J18k15K15oJ1j32P6l5O9o9k79L15J42k33J56J59p1J02k28
9099B78L4j16K42J81l24m2q4J61j67k3L33kJ79l18r8O8m2j3L1m2o6N4J21j55j3
9124A77K34j58J62j55K32N1k46n3J10Q4r0J15o7j19P5o0k15J52J16k28J16J67
9146D00j02K06q2n0r1J21k61KK12l43J51O3O6j88K01J00q7j21K32k29K70J01j39
9169D32O0l86K58R0j30k00oJ59K08k04k8m5K42j77J1J30m6m5k5k4L2J0K04j04
$$ plain form
8999 280 256 159 275 250 258 342 164 331 343 246 341 284 333 428 282 440 217 269 298 376 289 199 409 361 135 298
9025 298 348 250 398 306 311 186 147 270 317 308 260 509 413 451 241 102 311 212 361 371 176 73 249 307 271
9050 271 274 250 344 284 334 145 413 168 306 353 301 335 238 352 95 200 274 202 265 276 371 326 237 415 388 413
9076 413 255 491 315 183 301 86 301 295 306 174 250 215 284 215 -64 251 393 160 316 475 404 506 278
9099 278 312 196 438 619 295 253 169 330 163 140 473 471 650 332 234 302 260 247 278 236 170 224 345 190 177
9124 177 411 253 415 260 492 543 297 244 354 438 348 463 396 277 352 292 77 229 345 117 233 400
9146 400 298 504 422 372 281 402 141 143 355 12 163 226 292 104 305 405 318 197 429 200 470 571 432
9169 432 492 106 364 454 324 124 118 277 485 281 253 208 450 273 284 414 368 323 298 274 306 316 520 416
9193D16j04J24j33j49J78J55j17j63K38p1j99K86O5j36p1L8j05R6j69J00J1N0
9215C40k8J12P8j96M5J00Jj49J56j24k15K28p6Kj21o3J90l3L6L7j57J23J68j46
9239C08Pp7K14m5j32J31j89J02O6j58K51o1k24l6J89M1j80K3J92K2k8r3P2o3R7
9264D29k59l8J97k45Q1K55j46o2j1J41J69q4r1r5J6K17j46J9k08K15J30l35Q6
9287B35l5J01J31K6k24L29k39l1j08K47r4j13j35L64j48q3J60K7j97J46j49Q1
9309B91K97j60L6O9J12l03j0J59l80M43m15J86p7r4k0P1K50k64p9K75m8J37j92
9332B84L0J27j00J13j22K1j35Q7r8J76j2Nk39R3J08J86j41k4Q5n5m8J79j94o7
9356B59j12J98j07o4K43l27K12K14o7j56m2J68R5l38QK81j72p4L6K7J28l76J20
$$ plain form
9193 416 312 436 303 154 332 487 370 207 445 374 175 461 526 390 319 357 252 348 179 279 290 340
9215 340 312 424 502 306 351 451 452 303 459 335 120 348 272 274 153 90 280 247 283 320 163 286 454 308
9239 308 315 238 452 407 275 406 217 319 385 227 478 417 193 157 346 387 207 230 422 444 416 323 395 332 429
9264 429 170 132 329 84 165 420 274 212 201 342 511 427 336 241 257 474 328 347 139 354 484 149 235
9287 235 200 301 432 458 234 563 324 293 185 432 338 225 90 454 306 223 383 410 213 359 210 291
9309 291 588 428 464 533 645 342 332 491 111 554 139 325 248 154 134 205 455 191 112 387 339 476 284
9332 284 314 441 341 454 332 353 218 305 207 383 371 376 137 230 338 524 383 359 444 389 341 520 326 259
9356 259 147 345 238 174 417 90 302 516 449 293 251 419 514 176 184 465 293 219 255 282 410 34 154
9379A54K76o3j91J5K38j36Q6j9Nk11J90MP4j08J18k37J40J7R9l26J4J67j10N3
9403B49K1N6J3K61j76Kk7Nj25k2J06k74J02k6o7J81KK4N9p8P0j78K09l07J85J19
9429C84j79K02J6k2j14l5J80k42K87Oj16K5j37Q3J30k06J0j60K43p3j33Q0l1k19
9453b1L90M6j13J79P8k64K06o5q4K9k22L31j08l04k0J6Q3j65K06P5j42K57j49
9476B39J85m8p1L34k80j47K88o5J0j93R7o1j24Q5K21k49n4K53J07k8l25K89j4
9499D49L1Jj78j8j4m3r6L8J92j13M6J35j53J49J2l78L21J3L2j6Ro1j82K2J15p6
9525B37j9j40K16o2J09P4J24j6p2j15K2N8j43K08l81K36j05j77K72j54K29j49
9547B52n6N3J58r6J36K50m51M16l36K1k93K18n0o5P8K40k44j37J90m4M0n4P9K1
$$ plain form
9379 154 430 367 176 191 429 293 379 360 365 154 344 348 422 314 432 195 335 352 451 125 139 306 196 249
9403 249 270 326 339 600 424 426 399 404 279 257 363 89 191 165 98 279 281 305 364 286 356 178 387 80 265 384
9429 384 205 407 423 401 287 252 432 190 477 483 367 392 255 338 468 262 272 112 355 282 149 229 198 -21
9453 -21 369 415 302 481 559 295 501 436 352 381 159 490 382 78 58 74 157 -8 198 273 131 388 239
9476 239 424 376 305 639 359 212 500 435 445 252 349 288 164 249 470 221 167 420 527 499 174 463 449
9499 449 480 481 303 285 271 228 132 170 362 249 295 430 277 426 438 60 381 394 426 410 419 358 176 198 313 237
9525 237 218 78 294 232 341 415 539 523 451 336 358 416 273 481 100 336 231 54 326 172 401 252
9547 252 196 249 407 311 447 697 246 662 326 347 54 272 222 157 235 475 231 94 284 240 280 226 305 326
9571C26M9N3r9j3N6O5j11j34J59o5R4j49J46j73J66n7k0J19J67m72J21M3l4K04
9595D41j89nj14k11L20J61j63m2L02l67QJ52q1j06K65N6q7K47l68K44j90j14m5
9618A14M8L06k26j8m9K4J57N0%j01J5n7L8l5J66j20J64k59R4j60J64L0J2r7N5
9643C15j5K25j17n2l4p7M6r1K89k54J20j7R4j25k00J55K54j61q8K53j52L8q4j00
9667B22j01%K8J20J23j12J35Q7j85m5N4K15l18J46M4j76K46q3k03Q3L7j90j0J17
9691B34K29r3j66J35p8j01J36L4p5j37J11R3J66j73J27j93J27k54l0K45J0q2P0
9714C35k19K65J72k18J72j84J80k47j47J39n1J42O7k19J97L0l04Q2J32R5M7j38
9736C28k8k5p6R4K40k56J9m8J47j5K9k61M2J60Q8j99J56r8N5N4k7j36k3J30n5
$$ plain form
9571 326 375 428 329 316 372 437 326 192 351 286 380 231 377 204 370 313 293 412 579 107 228 271 237 441
9595 441 252 247 133 -78 242 403 240 198 500 133 141 293 212 106 371 427 340 587 219 463 273 159 114
9618 114 162 468 242 224 175 199 356 406 406 305 320 263 301 266 432 312 476 217 311 151 315 345 357 260 315
9643 315 300 525 408 356 322 245 291 200 489 235 355 338 432 307 107 262 516 355 267 520 368 406 322 222
9667 222 121 121 149 269 392 280 415 502 317 272 326 541 223 369 413 237 483 400 197 280 317 127 117 234
9691 234 463 370 204 339 261 160 296 330 255 118 229 322 488 315 442 249 376 122 92 337 347 265 335
9714 335 116 381 553 335 507 323 503 256 109 248 197 339 406 187 384 414 110 192 324 419 466 328
9736 328 300 275 199 293 533 277 296 248 395 380 409 148 190 350 438 239 395 297 352 406 379 243 220 350 295
9761B95j37P7n2P4M6j06L69j69%j83J4P4j07J61j52J71Q6j16J12k56J04j83J26
9784B48J36j32k29O01j91k81K27j10mp5r3J27J43j45j08K07o8Q6J14j71r8K49
9806D33j64J04n3k09L38k11J4l4O3J90r5q1j6R1j67R0P4k2k20M6P1J53r3ln4N4
9832B99mK3o7Q8j69J17j14L28k52J68J05k75r1P9R9J07j53K5j2o0j9j2k7k8J69
9857C24j75K03j87k6M1J49M1j8K13k31Q4k78M47l26j51K97j28J71j3j81J34j30
9879B60L29k08r8q5o6K88l04K47j17J17k48J09j03K3M71k57j34J08kJ28k97J20
9901B81O3K45l70R1K2j23J25O2q0j51J81J38j93r1J63O5r9R7J47m17M1K11kj%
9926D05l57K10K3N7OO5j38oj8J03J44r8L2J37j84k2j20o6K25j33j33K68k05Q6
$$ plain form
9761 295 158 235 183 257 303 197 566 397 397 214 228 302 195 356 204 375 461 345 457 201 305 122 248
9784 248 384 252 23 624 433 152 379 269 265 190 97 224 367 222 114 321 253 339 453 282 184 433
9806 433 269 373 320 111 449 238 252 218 281 471 376 295 279 370 203 293 367 345 125 171 242 395 302 299 245 299
9832 299 295 318 251 339 170 287 173 501 249 417 522 247 156 235 334 441 288 313 301 241 222 210 183 155 324
9857 324 149 352 165 139 180 329 370 352 565 334 418 140 587 261 110 407 279 450 437 256 390 260
9879 260 589 381 283 198 132 420 116 363 246 363 115 224 121 144 615 358 224 332 330 458 161 281
9901 281 344 589 219 310 332 209 334 396 316 165 346 484 291 200 363 428 329 426 573 156 197 408 406 405 405
9926 405 48 258 281 338 344 409 271 265 247 350 494 396 428 565 381 359 239 173 398 265 132 400 195 281
9950B81j15J45nJ7l6Q9j48N0K03k71Q6J52k58K14j97j71L46j06N2n6L3J68j15
9973C58k08K67j83L6R0qj00K15j51q5J79l09J54N2J10j0n2J61l22n9J79K8J55
9996D97j96l0p4j30K85p5J38j65n9J14p6K81j87O5j04R7j68k2K77j96j2k01K55
10019C14J70k92J00jJO2j40K95l08Q3n3J65k61K33j18J59R2q4q2p0o4j6k6K04
10043C63l37K57K4j35J58k3L52j50k01K37k92K26k64k8J01R5k33J17K2R7Oj3k
10066C77J20j37p9J81k30L80k66J04r5J28j83m7J33J47j07j62R8m1K81n40L17
10087C79jm6N6k08O7P2m2j00K46l01K18Q8k78J39rr7K88k79J25m1q5L89l01J38
10111D17j0j13k8j36%K42q7j26k9L19r8pj2Mj04L0l4j5L0j9j0Q9n2J17k6J87k39
$$ plain form
9950 281 166 311 306 323 287 376 228 278 481 210 296 448 190 404 207 36 382 276 328 272 305 473 358
9973 358 150 417 234 270 360 352 252 467 316 231 410 101 255 307 417 407 355 516 194 135 314 342 497
9996 497 301 271 197 67 352 277 415 250 191 305 229 510 323 388 284 381 213 191 468 272 260 59 314
10019 314 484 192 292 291 292 354 214 509 201 284 231 396 135 368 250 409 501 417 335 265 201 185 159 363
10043 363 26 283 307 172 330 307 659 509 308 545 253 479 215 187 288 383 150 267 289 386 392 379 377
10066 377 497 360 281 462 232 612 346 450 355 483 300 253 386 533 426 264 362 321 602 62 379
10087 379 378 332 388 180 247 319 277 177 423 122 340 428 150 289 280 183 471 192 317 276 191 580 279 417
10111 417 407 294 266 130 130 372 285 159 130 449 351 344 332 336 232 262 228 213 243 224 214 303 251 368 342 529 290
10138B90n0l5rJ82q1k4J6M5nj11K8P8j21J52N2j36J85j02j55M3j74K60j16m1r2
10163G9L11m1k13K28r8P0N2k4o3n3O2J47q6K7P6l83J67J06k68L88j48j34jj0P5
10188B66k18K63k22J42j07J97M1j62j7L55k0kl55J27J2j6j5QJ3Q5j6j41K90j62
10212C46K0K9Q9k13J96k78J84j13J54L1o8mPo9m1K13j92j8R2m5Pl5Q7l23K09r3
10238A72JJ09J41l6o6P3o1P5j90J38P3P4k98R1M6j50J15j65J25K44k42R5k04L20
10262D80j6j9k96J55J49p4o8J66q3j44J70j57j99L39j40o3K15R7j82o5j51L26
10284D40q0m7P9k2MQj65N3L0l7J21q8q6M4o4K92J17l71J68J02k64L52j93j55P5
10309C13m4JJ69j46r3J32m8q6K00j18j21J59k0Q8J48n03Q6J41KJ79l15J29l5O6
$$ plain form
10138 290 240 205 196 378 297 273 289 334 329 218 246 324 203 355 407 271 456 354 199 242 68 328 212 171 79
10163 79 390 349 136 364 266 336 388 364 301 248 310 457 371 398 474 91 258 364 96 484 336 202 201 191 266
10188 266 48 311 89 231 124 321 362 200 183 538 518 516 161 288 300 284 269 277 290 375 359 218 508 346
10212 346 366 395 484 271 467 189 373 260 414 445 377 373 380 311 270 483 291 273 365 320 327 292 379 56 265 172
10238 172 173 282 423 387 321 394 333 408 218 356 429 503 205 296 342 192 307 142 267 511 269 364 160 480
10262 480 464 445 149 304 453 379 311 477 394 250 420 263 64 403 263 200 415 512 330 265 114 440
10284 440 360 313 392 370 374 382 217 270 300 263 384 296 210 254 190 482 599 228 396 498 234 586 393 238 313
10309 313 269 270 439 293 200 332 284 198 398 280 159 318 298 386 534 31 117 258 260 439 124 253 218 284
10333B84m4J17p1p7J78p8L9j60K29O0l3l8n1p3l2J43q5j70J70l1l1P1N1j18O7
10358C17K41q4r0J02l48K72j45L1L2R2P7l76J96j06J85m0j52K57k83J37J19l70
10380F4L80j14j1J75j22j93J73n8J2r4j8K71k24J56j86R1O5j52L24l54J02qJ50
10403D29j73m8%J22j57R6r4m4J94M8J18j08O2j57P9r5K46k95J06j24j02Q0k60
10426g7L05p8J52j22K3P7J11p9K8r5m0Q5j85K96n2P0j60m4k6K14j41q4K41P1j87
10451C03j33J9K30M8j30O8k38M3Q6L7j65l6J89j76K48r6K8Q1Kl1Ok23K51j81Q3
10476C13J30j58J29l16J55M0n8J01j2j35K64R0j37J53j48j34L37k37j06Q4j07
10497B48K27p6j41J11k09J41j00PJ08Q0k3o2J61j76K58l81o3M07l29M9N3M1J79
$$ plain form
10333 284 240 357 286 209 387 309 348 188 417 477 444 406 355 282 250 393 308 138 308 277 246 317 368 250 317
10358 317 558 474 384 486 138 410 265 296 328 420 497 121 317 211 396 356 204 461 178 315 434 64
10380 64 444 330 319 494 372 179 352 294 306 212 194 465 241 397 211 302 367 215 539 185 287 279 429
10403 429 256 208 208 330 173 269 175 131 325 373 491 383 445 288 367 272 518 223 329 205 103 183 -77
10426 -77 228 150 302 180 203 280 391 312 340 245 205 290 105 401 349 419 259 215 189 403 262 178 419 490 303
10451 303 170 189 419 467 337 405 167 210 296 333 168 132 321 145 393 297 325 406 408 377 383 160 411 230 313
10476 313 443 285 414 98 253 293 235 336 324 189 453 543 406 559 411 277 614 377 271 355 248
10497 248 475 399 258 369 160 301 201 208 316 396 373 311 472 296 554 173 110 517 188 237 290 331 510
10520E10m69L95l50K67j66L78l12r2J16j36J90k40N7J11j43J76P8j93J87O4j57
10541B71J60L8o7j31lR1l3r1j05K88k48L30k43n0J16J44n7qk7O8l2Q2j77J16j18
10566C14M8j72J74n6Oj3L0r6J25j22L01l01Q5p3K5L1N1K15k82oj27K07k0K3j72
10591A95L5P0QR3p6j07J11j06J50M5L4j28k27J79j7j56L07J4j79OJ13Nj48K41
10615D62O0k30L7K5K62l10N9j66j7O8L0J81K4j83j1J06o0L08l25l31N48k41p6
10638B20J46mn0j18J27j59M4R7Jj01J7N5j61J12L9P3Mn1J68l21L28k51N4O0NK1
10664C55l6k51K74n0J82rk21M2M4O7K0j31J24l48L3J80r1J76j38k7J38J78k35
10687B76p4J18n0O4j68rK51mr4J3m4q2N2J14J70n4k06J1J03J51k14O6l1MR9l48
$$ plain form
10520 510 41 436 86 353 187 565 253 161 277 141 331 91 148 259 116 292 370 177 364 428 271
10541 271 431 469 402 271 268 359 326 235 130 418 170 500 257 207 323 467 410 402 375 443 411 493 316 432 314
10566 314 362 190 364 308 314 301 331 235 360 238 539 238 323 250 275 306 357 572 290 284 157 364 344 367 195
10591 195 230 300 308 401 325 218 329 223 373 418 452 324 97 276 259 103 410 424 245 251 364 369 221 462
10615 462 522 292 329 354 616 306 365 199 182 250 280 461 485 302 291 397 337 645 320 -11 537 296 220
10638 220 366 362 312 194 321 162 206 303 304 203 220 275 114 226 265 338 342 291 459 138 466 215 269 329 334 355
10664 355 319 68 342 292 474 465 244 286 330 397 417 286 410 62 95 275 184 360 222 195 333 511 276
10687 276 202 320 270 334 166 157 408 404 310 323 279 197 249 363 533 479 273 284 387 538 324 390 359 363 462 114
10713A14J39J78k48J42m9o7J56k18K55j19L4j7R7mK8j59P3j50J05O6k16K41O6
10736D47l63K93j64M47k19j07k68L84j79R7j29j22L50o6j01j41M1j46L56j4k99
10757I7K19J21J24l91N2N1L9k20J88M0k48J94M3j57K43j57J05k8L4k51L52j35
10779C15N2ro8lJ29j91J99j26p5J63k60K44J0j92M8P7j37J78j23K67j81J22l09
10802A30R2J88q3k5J96l49J61N4q5O1qJ27j31j50K56k69K03j49J95j55q2L16o7
10825D26q4P6l00K72k22P2J57j02K1oN5o4K7N6q4L3M4P5k23L5kJ84n5q9J39l24
10851A17J72Rq9K03m7k8J07j32j6J00j83J42j34R9j58L4K18n3j25M1k3j07J07
10874B54Ll3K72k53k82J85k1L2J02Q5m1J33j39q9q8OJ79N8Q3j30j09J98j89J22
$$ plain form
10713 114 253 431 183 325 276 209 365 147 402 283 317 300 397 393 421 262 335 185 290 356 140 381 447
10736 447 84 377 213 660 441 334 66 450 271 368 239 117 467 401 300 159 200 54 410 396 97
10757 97 316 437 561 170 222 273 312 92 280 320 72 266 309 152 395 238 343 315 349 98 450 315
10779 315 367 358 290 287 416 225 424 298 223 386 126 370 380 188 236 313 176 354 231 498 317 439 130
10802 130 222 410 327 302 498 149 310 364 279 340 332 459 328 178 434 165 368 219 414 259 177 493 426
10825 426 342 418 118 390 168 240 397 295 316 310 365 301 328 384 300 333 377 452 229 264 262 446 391 302 441 117
10851 117 289 298 209 412 365 337 444 312 296 396 213 355 221 320 162 196 414 361 236 277 254 147 254
10874 254 257 224 496 243 -39 146 125 157 259 344 303 436 297 208 120 126 305 363 446 316 207 405 216 338
10898C38P6k3j84P8k45L54k67K24j22J2J30J07k11j09P6M0RJ46j94J51l7j3M1
10921C77j53J2R1rq4J05M3p9J15j8k50M8J31j81K05m7j32J17p2L27j15n4j69j9
10945A89l3K92j66m0J19p4J5k5J00m3j14K11j10Q2lj16j25J79N0qO0k55K28j80
10969B33J88k59R5j40J71rL6o4o8J99j07J1j15K31j64QN0j11J81M4O5n1q7j8j09
10994B10K58k93p1pJ80j42L18n6Jk51L70j21j79K64l0l69K08R7M3j60N9j13K04
11017D20l15K16J09n1N2N2j27j03L5N4N2j60J26M3O2l03R5J15%j86K77j00O4k06
11041B21K10j29J30r8J5L5j02PJ13j62R5l9J48l02J14n4R5O9q2P0ol9N4jk14J36
11067B84qP1k36j85K92J78J10N1k28m3j32L04j95m1j58K61j15j4L3J36N6j87J7
$$ plain form
10898 338 414 391 207 285 40 394 127 351 229 241 371 478 267 158 234 274 283 429 235 386 349 336 377
10921 377 224 236 327 318 234 339 382 303 418 400 150 198 329 148 353 306 174 291 219 546 431 377 208 189
10945 189 156 448 282 242 361 287 302 277 377 334 220 431 321 403 400 284 159 338 388 380 440 185 413 233
10969 233 421 162 257 117 288 279 315 251 183 382 275 286 171 402 238 246 296 185 366 410 475 424 337 319 210
10994 210 468 175 104 97 277 135 453 397 398 147 517 396 217 481 451 82 290 387 430 270 329 216 420
11017 420 105 321 430 379 431 483 356 253 288 342 394 234 360 403 465 162 257 372 372 186 463 363 427 221
11041 221 431 302 432 334 349 384 282 289 402 240 335 296 444 142 256 202 297 366 284 354 348 309 363 362 148 284
11067 284 276 347 111 -74 218 396 506 557 329 286 154 458 263 222 64 325 210 196 229 365 421 234 251
11090B51Q9P5k25K20j42J17l32M12j54k73K50j66P9K52j32o4r6J23R2j83j18O2
11112A37K04j72M6J16o8J21QP8j37j82K25r3J41j7j76J18l81J40M32k51PQ8j41
11135B43lJ53P0k14J72j0o4k50J70m0K21k3J82m78N2M0J2J41j66J73N8L2l19K31
11159C83j10O8n6j8q4K87q6l1j64K1P1J52k36J97j7j23o5O5j09K54k01L49k45
11182C02j28J20j69K21m4O3Pp7M3j7M4j22p8P2l7J48pJ41k66R5k08M03k05M7J04
11207D52j96j25K62r0m2n7m7J97J2oJ46j95r7nm0K22j4p1R3o5K09l13J48j35J33
11232C76O1k84o6L60o8L6j31j90K17mj72J07K52j09q6J72k69L25j91o7K4j04O5
11255B54n9L68l71j2L70j54P5j24l5J8K2j63n7J14r4o9K08j7K4N4Q5k56K20j64
$$ plain form
11090 251 340 415 190 410 268 385 53 465 311 38 288 122 201 453 321 257 161 284 376 193 75 137
11112 137 341 169 215 331 263 384 392 470 333 151 376 283 424 407 231 349 -32 108 540 289 296 384 243
11135 243 240 393 463 249 421 411 347 97 267 227 448 425 607 129 181 221 233 374 208 381 439 471 152 383
11159 383 273 341 285 267 183 470 384 353 189 210 281 433 197 394 377 254 189 254 145 399 198 547 302
11182 302 174 294 125 346 302 365 372 295 338 321 365 243 165 237 200 348 341 482 216 311 103 506 301 348 452
11207 452 256 131 393 303 261 204 157 354 366 360 506 311 214 209 169 391 377 306 399 334 543 230 378 243 376
11232 376 437 153 87 447 379 415 284 94 311 307 135 242 494 385 299 471 202 527 336 269 293 189 254
11255 254 195 563 192 180 550 396 471 347 312 330 352 189 132 246 152 83 291 274 298 352 437 181 401 237
11279B37L1o0Q4J42l05M7R0O6o3j8M4J0q4J90p1N9j09P4k22J58J29j07r3O6j3
11304B82J18k43p3J12K10n6n1J01J07j12j1k81L06n1p9k0K49k38M0J1O3l5p7j33
11328A39J29j8j04K19J3k36J07J03K8j05J1n5k2J40m10N06l29K59J6lQ8n8Q0r0
11352D08O2O1j19j25j19MJ06Kj47j18J19K39nn1r7k4o4K10O5j56R8M0l9J32kk90
$$ plain form
11279 237 268 208 292 434 129 176 266 332 269 251 295 305 221 411 340 399 290 364 142 300 429 322 229 295 282
11304 282 400 157 84 196 406 350 299 400 507 395 384 103 409 358 279 259 508 270 310 321 384 349 272 139
11328 139 268 250 146 365 378 142 249 352 380 275 286 231 209 349 -61 445 116 375 391 388 476 418 498 408
11352 408 470 531 412 287 168 172 278 280 133 15 134 373 368 317 220 196 132 342 407 251 349 389 350 482 480 190
$$ [...]
16383B32
##END NTUPLES=NMR FID
##END=
