##TITLE=1Hres-test
##JCAMPDX= 6.0         $$ Bruker NMR JCAMP-DX V2.0
##DATA TYPE= NMR SPECTRUM
##DATA CLASS= NTUPLES
##ORIGIN= UXNMR, Bruker Analytische Messtechnik GmbH
##OWNER= root
$$ XWIN-NMR		Version 3.5
$$ Fri Aug 14 17:06:08 2015 Russian Standard Time (UT+4h)  servis@DPX200
##.OBSERVE FREQUENCY= 200.13155
##.OBSERVE NUCLEUS= ^1H
##.ACQUISITION MODE= SIMULTANEOUS
##.ACQUISITION SCHEME= undefined
##.AVERAGES= 1
##.DIGITISER RES= 19
##SPECTROMETER/DATA SYSTEM= spect
##.PULSE SEQUENCE= zg30
##.SOLVENT NAME= Acetone
##.SHIFT REFERENCE= (INTERNAL, Acetone, 0, 10.2473)
##AUDIT TRAIL= $$ (NUMBER, WHEN, WHO, WHERE, WHAT)
$$ ##TITLE= Audit trail, XWIN-NMR		Version 3.5
$$ ##JCAMPDX= 5.01
$$ ##ORIGIN= Bruker BioSpin GmbH
$$ ##OWNER= servis
$$ F:/spectra/data/test/nmr/1Hres-test/1/pdata/1/auditp.txt
$$ ##AUDIT TRAIL=  $$ (NUMBER, WHEN, WHO, WHERE, WHAT)
(   1,<2015-08-14 17:04:24.29 +0400>,<servis>,<DPX200>,
      <created by zg, POWCHK disabled, PULCHK disabled
       configuration hash MD5:
       00 E9 B6 7A A2 85 ED C7 34 08 36 98 17 FE 4E 26
       data hash MD5: 32K
       72 BE 01 21 2C 26 A0 97 1F 1B 52 78 91 F5 90 3B>)
(   2,<2015-08-14 17:04:31.34 +0400>,<servis>,<DPX200>,
      <Start of raw data processing
       fp BC_mod = 2 FT_mod = 6 PKNL = 1 PHC0 = -85.57392 PHC1 = -29.45794 SI = 32K 
       data hash MD5: 32K
       4B BD 33 FE 9B 66 51 B1 CC 03 BE 1E EF 61 9F CB>)
$$ ##END=
$$ 
$$ hash MD5
$$ DC B2 CA 29 AA A1 88 60 4B FE 1C D9 40 1C 70 A5
##$RELAX= 
##$RELAX= 
##$RELAX= 
##$RELAX= 
##$RELAX= 
$$ Bruker specific parameters
$$ --------------------------
##$DU= <F:/spectra>
##$EXPNO= 1
##$NAME= <1Hres-test>
##$PROCNO= 1
##$TYPE= <nmr>
##$USER= <test>
##$AMP= (0..31)
100 100 100 100 100 100 100 100 100 100 100 100 100 100 100 100 100 100 
100 100 100 100 100 100 100 100 100 100 100 100 100 100 
##$AQSEQ= 0
##$AQ_mod= 1
##$AUNM= <au_zg>
##$AUTOPOS= <>
##$BF1= 200.13
##$BF2= 200.13
##$BF3= 200.13
##$BF4= 200.13
##$BF5= 200.13
##$BF6= 200.13
##$BF7= 200.13
##$BF8= 200.13
##$BYTORDA= 1
##$CFDGTYP= 0
##$CFRGTYP= 5
##$CHEMSTR= <none>
##$CNST= (0..31)
1 1 145 1 1 1 1 1 1 1 1 1 1 1 1 1 1 1 1 1 1 1 1 1 1 1 1 1 1 1 1 1 
##$CPDPRG= <>
##$CPDPRG1= <>
##$CPDPRG2= <>
##$CPDPRG3= <>
##$CPDPRG4= <mlev>
##$CPDPRG5= <mlev>
##$CPDPRG6= <mlev>
##$CPDPRG7= <mlev>
##$CPDPRG8= <mlev>
##$CPDPRGB= <>
##$CPDPRGT= <>
##$D= (0..31)
0 2 0 0 0 0 0 0 0 0 0 0.03 0 0 0 0 0 0 0 0 0 0 0 0 0 0 0 0 0 0 0 0 
##$DATE= 1439557463
##$DBL= (0..7)
120 120 120 120 120 120 120 120 
##$DBP= (0..7)
150 150 150 150 150 150 150 150 
##$DBP07= 0
##$DBPNAM0= <>
##$DBPNAM1= <>
##$DBPNAM2= <>
##$DBPNAM3= <>
##$DBPNAM4= <>
##$DBPNAM5= <>
##$DBPNAM6= <>
##$DBPNAM7= <>
##$DBPOAL= (0..7)
0.5 0.5 0.5 0.5 0.5 0.5 0.5 0.5 
##$DBPOFFS= (0..7)
0 0 0 0 0 0 0 0 
##$DE= 6
##$DECBNUC= <off>
##$DECIM= 128
##$DECNUC= <off>
##$DECSTAT= 4
##$DIGMOD= 1
##$DIGTYP= 9
##$DL= (0..7)
0 120 120 120 120 120 120 120 
##$DP= (0..7)
150 150 150 150 150 150 150 150 
##$DP07= 0
##$DPNAME0= <>
##$DPNAME1= <>
$$ [...]
##$SUBNAM1= <"">
##$SUBNAM2= <"">
##$SUBNAM3= <"">
##$SUBNAM4= <"">
##$SUBNAM5= <"">
##$SUBNAM6= <"">
##$SUBNAM7= <"">
##$SUBNAM8= <"">
##$SUBNAM9= <"">
##$SW= 5.00472096529788
##$SWIBOX= (0..15)
0 0 2 0 0 0 0 0 0 0 0 0 0 0 0 0 
##$SW_h= 1001.60256410256
##$TD= 32768
##$TD0= 1
##$TE= 0
##$TE2= 300
##$TE3= 300
##$TEG= 300
##$TL= (0..7)
0 120 120 120 120 120 120 120 
##$TP= (0..7)
150 150 150 150 150 150 150 150 
##$TP07= 0
##$TPNAME0= <>
##$TPNAME1= <>
##$TPNAME2= <>
##$TPNAME3= <>
##$TPNAME4= <>
##$TPNAME5= <>
##$TPNAME6= <>
##$TPNAME7= <>
##$TPOAL= (0..7)
0.5 0.5 0.5 0.5 0.5 0.5 0.5 0.5 
##$TPOFFS= (0..7)
0 0 0 0 0 0 0 0 
##$TUNHIN= 0
##$TUNHOUT= 0
##$TUNXOUT= 0
##$USERA1= <user>
##$USERA2= <user>
##$USERA3= <user>
##$USERA4= <user>
##$USERA5= <user>
##$V9= 5
##$VALIST= <valist>
##$VCLIST= <CCCCCCCCCCCCCCC>
##$VD= 0
##$VDLIST= <DDDDDDDDDDDDDDD>
##$VPLIST= <PPPPPPPPPPPPPPP>
##$VTLIST= <TTTTTTTTTTTTTTT>
##$WBST= 1024
##$WBSW= 8
##$XGAIN= (0..3)
0 0 0 0 
##$XL= 0
##$YL= 0
##$YMAX_a= 44349
##$YMIN_a= -42768
##$ZGOPTNS= <>
##$ZL1= 120
##$ZL2= 120
##$ZL3= 120
##$ZL4= 120
##$ABSF1= 0
##$ABSF2= 0
##$ABSG= 0
##$ABSL= 0
##$ALPHA= 0
##$AQORDER= 0
##$ASSFAC= 0
##$ASSFACI= 0
##$ASSFACX= 0
##$ASSWID= 0
##$AUNMP= <proc_1d>
##$AZFE= 0.1
##$AZFW= 0.1
##$BCFW= 0
##$BC_mod= 2
##$BYTORDP= 0
##$COROFFS= 0
##$CY= -3
##$DATMOD= 1
##$DC= 0
##$DFILT= <>
##$DTYPP= 0
##$F1P= 0
##$F2P= 0
##$FCOR= 1
##$FTSIZE= 32768
##$FT_mod= 6
##$GAMMA= 0
##$GB= 0
##$INTBC= 1
##$INTSCL= 1
##$ISEN= 128
##$LB= 0
##$LEV0= 0
##$LPBIN= 0
##$MAXI= 10000
##$MC2= 0
##$MEAN= 0
##$ME_mod= 0
##$MI= 50
##$NCOEF= 0
##$NC_proc= -6
##$NLEV= 6
##$NOISF1= 8.587773
##$NOISF2= 6.764455
##$NSP= 0
##$NTH_PI= 0
##$NZP= 0
##$OFFSET= 10.24735
##$PC= 4
##$PHC0= -85.57392
##$PHC1= -29.45794
##$PH_mod= 1
##$PKNL= yes
##$PPARMOD= 0
##$PSCAL= 0
##$PSIGN= 0
##$REVERSE= no
##$SF= 200.13
##$SI= 32768
##$SIGF1= 9.934552
##$SIGF2= 5.24259
##$SINO= 14.65473
##$SIOLD= 32768
##$SREGLST= <1H.CDCl3>
##$SSB= 0
##$STSI= 32768
##$STSR= 0
##$SW_p= 1001.60256410256
##$SYMM= 0
##$S_DEV= 0
##$TDeff= 32768
##$TDoff= 0
##$TI= <>
##$TILT= no
##$TM1= 0
##$TM2= 0
##$TOPLEV= 0
##$USERP1= <user>
##$USERP2= <user>
##$USERP3= <user>
##$USERP4= <user>
##$USERP5= <user>
##$WDW= 0
##$XDIM= 32768
##$YMAX_p= 313388820
##$YMIN_p= -1939948
$$ End of Bruker specific parameters
$$ ---------------------------------
##NTUPLES= NMR SPECTRUM
##VAR_NAME=  FREQUENCY,     SPECTRUM/REAL,   SPECTRUM/IMAG
##SYMBOL=    X,             R,               I
##VAR_TYPE=  INDEPENDENT,   DEPENDENT,       DEPENDENT
##VAR_FORM=  AFFN,          ASDF,            ASDF
##VAR_DIM=   32768,         32768,           32768
##UNITS=     HZ,            ARBITRARY UNITS, ARBITRARY UNITS
##FACTOR=    0.0305674173437471, 1,          1
##FIRST=     2050.80210328102, 0,            0
##LAST=      1049.19953917846, 0,            0
##MIN=       1049.19953917846, -1939948,     0
##MAX=       2050.80210328102, 313388820,    0
$$ Real data points
##PAGE= N=1
##DATA TABLE= (X++(R..R)), XYDATA
$$ [...]
21328A28239k41674l5862J17874R2582J37339k84345K7413j06618O8585Q1080
21318a5387q1535P6383O9063l44699L24406K19808l38407O8917J75550j74009
21308a9910j72922L35890j02479j12446K4413p7154J6875j02968K53730p1401
21298b8372O4863j41945O8156J33892m9473j55209r1311R2500K17655k13018K9531
21287g2731J18831l5801j18693N8741r3525J77952J10757j2649k88012J01478
21277e3652P5992Q1508j48850n5714J19934j20813l0207J65275k20824J21817
21267f5534P6639j7808j04455J09688j08586j1227J10939J43768j06102k4373
21257B949n4185k41042L0462K51086p9469J26066J4388j08133l2634j13314K00691
$$ plain form
21328 128239 -113435 -149297 -31423 61159 198498 -85847 -58434 -165052 -96467 -15387
21318 -15387 -96922 -20539 48524 -296175 28231 248039 -90368 -21451 154099 -19910
21308 -19910 -192832 143058 40579 -71867 -47454 -124608 -107733 -210701 43029 -28372
21298 -28372 36491 -105454 -37298 96594 47121 -108088 -199399 -106899 110756 -102262 -72731
21287 -72731 46100 10299 -108394 -49653 -143178 34774 145531 132882 -155130 -53652
21277 -53652 22340 103848 -45002 -100716 19218 -101595 -131802 33473 -187351 -65534
21267 -65534 11105 -6703 -111158 -1470 -110056 -121283 -10344 133424 27322 2949
21257 2949 -51236 -292278 -261816 -10730 -90199 35867 50255 -57878 -90512 -203826 -3135
21246c135J98559m4507j22353j79051m6295K64301j01198N6847j69853K14161
21236F7476k47970Q6515J00356P8286j91455R5286L5127j73706P9997j9901J5103
21225g4886J39209k96809K83513k11278K296J57250k92577L12366k65272K55690
21215I502O9558j56965k2670J36565n7253n7893J3062j02887j6712J00663M5909
21204c9121l04872K58210q3468J88480q9963l00840K39054n3425J23583K71855
21194B09493k99935P6935o5071j19817J23713P0515m6278R4766R6572p0829j69221
21183i9157J58952j22154o6441M1737K2896J35461j56047O8269r0006j2713m7439
21172a66642J56682k051J9890J64238j76288K5358j10328K33215j22794k42295
$$ plain form
21246 -3135 195424 150917 28564 -150487 -196782 67519 -33679 23168 -146685 67476
21236 67476 -180494 -93979 6377 84663 -106792 -11506 23621 -150085 -70088 -89989 -74886
21225 -74886 64323 -232486 51027 -160251 -157955 -705 -293282 19084 -246188 9502
21215 9502 79060 -77905 -100575 35990 -21263 -79156 -66094 -168981 -185693 -85030 -39121
21204 -39121 -343993 -85783 -169251 19229 -70734 -371574 -132520 -185945 -62362 209493
21194 209493 -90442 -13507 -78578 -198395 -74682 -4167 -50445 44321 140893 70064 -99157
21183 -99157 59795 -62359 -128800 -87063 -64167 71294 -84753 -16484 -106490 -119203 -166642
21172 -166642 -9960 -12011 7879 172117 -4171 21187 -89141 144074 21280 -221015
21162b21015N8696K83280j86396O0500J12258j66686J13027O4093k00081P2137
21152a0187K5150M3279Q4075k50468K6895M8846r6139R7947K4459k7660Q9199
21141E5396q1746J27953J54027o9405j95119O2852l1756j91077M2025j52520R4176
21130a85194J35470J3501J19181j46496N4667j3415J40549r8910J29536k46531
21120i7642N9502M4159j0595R1890q0760K9990n3949R9130m5965K9j71705J66394
21108C0478n8875J16616r0845j45544L51862k10433j11433J83447k64278J28642
21098g0363o9599J96504j09096j51655K60784O1083m0657j18425r0935J17504
21088a4855J90204J5565j09729J4514p2704j71038K00569n5802j53681k3448J81838
$$ plain form
21162 -221015 -162319 120961 -65435 -4935 107323 -59363 53664 117757 -82324 -10187
21152 -10187 14963 58242 142317 -108151 -81256 -32410 -128549 -30602 -6143 -33803 55396
21141 55396 -26350 101603 255630 186225 -8894 53958 22202 -168875 -126850 -279370 -185194
21130 -185194 -49724 -36223 82958 -63538 -8871 -22286 118263 19353 148889 -97642
21120 -97642 -38140 6019 -4576 87314 6554 36544 -17405 81725 35760 35789 -135916 30478
21108 30478 -28397 88219 -2626 -148170 203692 -6741 -118174 65273 -199005 -70363
21098 -70363 -139962 56542 -52554 -204209 56575 117658 77001 -41424 -132359 -14855
21088 -14855 175349 190914 81185 95699 22995 -148043 52526 -3276 -156957 -180405 1433
21077A433j14055K62093l46925J22438J84687j67953L3685n5731K74373j04283
21067H9762k05051P7480o1927K25208k93982J95945j13432K13750m1066k15930
21057a29243L17705j54163k08818K35748J08348k03175j9675l4966j62426O1786
21047a88879J77813M8279j8693o71r5182J52689m2230k5281J48813l43875J17266
21036f9951J05710n9803n4608J45429J04618k11084M3810k41221L11748M2169
21026A16817j31673j16277L12955O8077n01663K49222L708K67506m26238J20515
21016c7051J40387r1837o7140J41636k11364J20108p0924m7272L9259J61225J16229
21005A93256O1635k25082j80579N5885r4371J74193l9394J9445M02O2888q6343
$$ plain form
21077 1433 -112622 149471 -197454 -75016 109671 -58282 -24597 -80328 194045 89762
21067 89762 -115289 -37809 -99736 125472 -168510 27435 -85997 127753 86687 -129243
21057 -129243 188462 34299 -174519 61229 169577 -33598 -53273 -88239 -250665 -188879
21047 -188879 -11066 37213 18520 17849 -77333 75356 33126 7845 156658 -187217 -69951
21036 -69951 35759 -24044 -78652 66777 171395 -39689 4121 -237100 74648 116817
21026 116817 -14856 -131133 181822 249899 -251764 -2542 1166 268672 -157566 -37051
21016 -37051 103336 11499 -55641 85995 -125369 -5261 -76185 -123457 -84198 77027 193256
21005 193256 254891 29809 -150770 -94885 -189256 -15063 -54457 -35012 -34610 28278 -58065
20994e8065J68671p0939j8751n1106K61889m49701J69375m8977p1553J72059k5345
20983b2443O3472q6484J7855k21062L37690k91543K76731r9603K45692l41557
20973a21252p6054K75096j20405o388n4667J04336j05593o235J10447R716m9850
20962d0849J2608j6636p0569k8612J78767M274Q1770m0546j37588k7719n0914
20951a36014p7307N00609k97880n5495N3755Q4989k09203K45645r2953r3151N6819
20940b0186k2982j67594L5723M7057M6728K41394j14002k23748N7186p5368n1060
20929b46852k623K00917l8700j91994J61525m1245L77245l83600L3145J29401
20919b781j28104K3419J74039k26538l1197J02593K40064o74k09327j84357J44540
$$ plain form
20994 -58065 110606 39667 20916 -30190 231699 -218002 -48627 -97604 -169157 2902 -22443
20983 -22443 41029 -45455 -27600 -248662 89028 -202515 74216 -25387 220305 -121252
20973 -121252 -197306 77790 -42615 -49003 -103670 666 -104927 -111162 -715 9001 -40849
20962 -40849 -28241 -44877 -115446 -144058 34709 38983 120753 80207 -57381 -85100 -136014
20951 -136014 -213321 287288 -10592 -66087 -12332 72657 -136546 109099 16146 -77005 -20186
20940 -20186 -43168 -210762 -175039 -127982 -81254 160140 46138 -177610 -120424 -195792 -246852
20929 -246852 -249475 -48558 -87258 -279252 -117727 -158972 218273 -165327 -132182 -2781
20919 -2781 -130885 -107466 66573 -159965 -191162 -88569 151495 150821 -58506 -242863 -98323
20908i8323J78343j88860k11674K01293J31863o0273J03276k12329m0054K01801
20898E063Q6636J35362j23253j72207J95796o2552l47321J45742J86859M4100
20888I4225L89M9679j76309k37306L37022o1940q107p7071M9258m1745N1815j8914
20876c9004j91030K15927l3308l8561p2893M0033m3727J47335l4135K36368k43517
20865e6512K4691q5752J15810j26417J91418K9496l21103P2246N2986K36469j70793
20854c7461J54253k62594K10635k85844Q4223q180K65418n0459M0161k87998J22617
20843e5229N0205P3518k60925J75355J88521l35911m1293L54410k02680J8542
20833c5487j68974R502K28731o0743j70034O368K37147k81421J77607N6486m5957
$$ plain form
20908 -98323 80020 -108840 -320514 -119221 12642 -47631 55645 -156684 -196738 5063
20898 5063 91699 227061 103808 -68399 127397 64845 -282476 -136734 50125 94225
20888 94225 94614 144293 -32016 -269322 67700 5760 -2347 -79418 -30160 -71905 -20090 -39004
20876 -39004 -230034 -14107 -47415 -85976 -158869 -118836 -162563 -15228 -49363 187005 -56512
20865 -56512 -31821 -117573 -1763 -128180 63238 92734 -228369 -156123 -103137 133332 -37461
20854 -37461 116792 -145802 64833 -221011 -136788 -144968 120450 69991 110152 -177846 -55229
20843 -55229 -5024 68494 -192431 -17076 171445 -164466 -205759 148651 -54029 -35487
20833 -35487 -204461 -194959 33772 -26971 -197005 -190637 46510 -234911 -57304 -818 -46775
20822d6775j16041J98463m7136Q135K77939l23749Q243j60922J93730j05871r3447
20811b07431K89424j18442J06728p9230O1248J82193m72073P9226K02382j37195
20801i3170J05555l36016J61116J42260R8826k10057J00877j515M1688j5883M5978
20790C9659M9306k96008K1030Q3701J51355n2694p9986K40180k15027K44245n1857
20779A33904j5208p0334j47801R4986r4908R4131j4728j31498J81807j54858K09708
20768H5201j34065m3485r5484L36441l65532K12191n6644k90428J95382J30627
20758b5796k34858L32383k14913M7518P2064m9596P5063O6817q8480j58620J23667
20747e4751k6023k0554K32623j69011j68486J79235k5772J37129k77315J92931
$$ plain form
20822 -46775 -162816 35647 -11489 -3354 274585 -49164 -40921 -201843 -8113 -113984 -207431
20811 -207431 81993 -36449 70279 -8951 52297 234490 -237583 -158357 44025 -93170
20801 -93170 12385 -323631 -162515 -20255 78571 -131486 -30609 -32124 9564 -6319 39659
20790 39659 88965 -207043 -186013 -102312 49043 -3651 -83637 156543 -58484 185761 133904
20779 133904 118696 48362 -99439 -4453 -99361 -5230 -19958 -151456 30351 -124507 85201
20768 85201 -48864 -92349 -187833 148608 -216924 -4733 -61377 -351805 -156423 -25796
20758 -25796 -260654 71729 -143184 -95666 -23602 -73198 1865 68682 -19798 -178418 -54751
20747 -54751 -80774 -101328 131295 -37716 -206202 -26967 -52739 84390 -192925 6
20737FJ9299k7321J40183k64684O8494O2557l35245L87444O3084j835j67947N1597
20725d368j77187L05585m9784n9061K7376o3498k6361P6571m0071m1157M0376
20714a1579l7696J26690k09942K43467j94448M6678Q5814j76383J17912p4498
20704h3985n1789K9261q1732J91757J12L7282m0196n2530o930j67702J74052K49089
20692A96689k26718j0652J40450j60682j84716K73061o9176q7973Q9483l7972
20682g8206J84145P7614k91427j05364J30143M4131J18157k72368K46920j27126
20672g3381l03311J41687K27767q6768R1978p8846M3907q8285J31777k5012m2257
20661f0744k4961J14266J05839j14200L4717k18079Q7462R7576J33580k72374
$$ plain form
20737 6 19305 -8016 132167 -132517 -64023 -1466 -336711 50733 113817 111982 -55965 -4368
20725 -4368 -181555 124030 74246 15185 42561 -20937 -47298 29273 -10798 -51955 -11579
20714 -11579 -49275 77415 -132527 110940 -83508 -36830 48984 -127399 -9487 -83985
20704 -83985 -135774 -106513 -188245 3512 3624 40906 710 -51820 -58750 -226452 -52400 196689
20692 196689 -30029 -40681 99769 -60913 -245629 27432 -41744 -129717 -40234 -78206
20682 -78206 105939 183553 -107874 -213238 -83095 -38964 79193 -193175 53745 -73381
20672 -73381 -376692 -235005 -7238 -94006 -2028 -80874 -36967 -125252 6525 -18487 -60744
20661 -60744 -85705 28561 134400 20200 54917 -163162 -75700 21876 155456 -116918
20651a16918Q2936J9971J00334l69744K37612o7927J82942Q822j28101N5905j84141
20640a78309J82012l6500j04758J46409k359l3221q2747o4831J83464k54328L55750
20629A10582j40749J59293j96762R6271j64396M5883N6984N7123j46711K41919
20619A19437l21108Q6958K64421j02177M9387j43890J44033p1908J03720O3354
20609A92227l2149k05509J8458J17462j90956N3857j5384J07646M1411j23969
20599c6906l7640J17015J4228j04132k4857J97077k76739J10209k16872J90834
20589f7783k1761k03603K23114M2962J30245l294r4897L5886j6482K2368r9505
20578e2750P0451q1238n0031J04988q5537K85655k93419M5241L3782m3597J14289
$$ plain form
20651 -116918 -33982 -14011 86323 -283421 -45809 -113736 69206 78028 -50073 5832 -178309
20640 -178309 3703 -32797 -137555 8854 6495 -26726 -109473 -174304 9160 -245168 110582
20629 110582 -30167 129126 -67636 28635 -135761 -89878 -32894 24229 -122482 119437
20619 119437 -201671 -114713 149708 47531 96918 -46972 97061 25153 128873 192227
20609 192227 160078 -45431 -26973 90489 -100467 -46610 -61994 45652 87063 -36906
20599 -36906 -74546 42469 56697 -47435 -72292 124785 -151954 -41745 -258617 -67783
20589 -67783 -89544 -293147 -70033 -27071 103174 99880 4983 40869 24387 46755 -52750
20578 -52750 17701 -63537 -113568 -8580 -94117 191538 -101881 -56640 -22858 -66455 47834
20567D7834o2461o7850J58722j37662N843j20761K84587K4281l43451K32438K447
20556B3967M3520q6692j08367K8760n0609J60339j58772J38347j21944K60075
20546A28624k59023J488K27628k00922J2121k8325K62281j26024j05464K31269
20536A43653k90912K67642k3229j10576j19749J58353k81297K67255L4337j65251
20526a19774j11825J17465J5953J26114k63607j5372L16235p0963j04468J14801
20516D559j4961j23865K59394k34115J72522m8282k62085L01128m8135o6383j3386
20505g3609J67733k44375o818R4762K6759r5633p592J54052j93853R3720j13969
20494a98823J69108L8042l9550o4855K46243m901l61049j9962K430J73058j40687
$$ plain form
20567 47834 -14627 -82477 76245 -61417 -55574 -176335 108252 132533 -210918 21520 23967
20556 23967 67487 -19205 -127572 -98812 -149421 10918 -147854 -9507 -131451 128624
20546 128624 -130399 -128911 98717 -102205 -90084 -118409 143872 17848 -87616 143653
20536 143653 -147259 120383 97154 -13422 -133171 25182 -256115 11140 45477 -119774
20526 -119774 -231599 -114134 -98181 27933 -235674 -251046 65189 -5774 -110242 4559
20516 4559 -10402 -134267 125127 -108988 63534 15252 -246833 54295 6160 -60223 -73609
20505 -73609 94124 -150251 -157069 -62307 -35548 -131181 -138773 15279 -178574 -84854 -198823
20494 -198823 -29715 8327 -31223 -96078 150165 145264 -215785 -235747 -233317 -60259 -200946
20483b00946J65515r1315O652K48290k44692L9217M6801k4198p1768K50750l81145
20472b56839K54809k07289K13342j08420R4009q64j06099j4634N3482P1252J5884
20461H633N3721O4474j15308N0531j9433j46927o3507J49321j97202K08279j00198
20450a07616p1247m55Q6527N6164k39964J07740K21977j22155k14387K71829J14317
20439A02730j25586K17026k32831L5257o0276j2483j18248K4711K7360J00899
20429d1441J39425j22785j81130K08935J57402k84683J14549q9998K23211j32850
20419i365Q7263k29343k9474J71479K1943l4784p3082J75828l9671k76642J77368
20408e8480J01262j92425J50923j30320K26622l1759j97100M1066J17120j42376
$$ plain form
20483 -200946 -35431 -126746 -120094 128196 -116496 -77279 -30478 -54676 -126444 124306 -256839
20472 -256839 -2030 -209319 4023 -104397 -10388 -11252 -117351 -131985 -78503 -7251 8633
20461 8633 62354 126828 11520 62051 42618 -104309 -167816 -18495 -215697 -7418 -107616
20450 -107616 -178863 -179318 -92791 -36627 -276591 -168851 53126 -69029 -283416 -11587 102730
20439 102730 -22856 194170 -38661 -3404 -63680 -76163 -194411 -169700 -142340 -41441
20429 -41441 97984 -24801 -205931 3004 160406 -124277 -9728 -99726 123485 -9365
20419 -9365 77898 -151445 -180919 -9440 12503 -22281 -95363 80465 40794 -235848 -58480
20408 -58480 42782 -149643 1280 -129040 97582 65823 -131277 -90211 26909 -115467
20398a15467K48619j69773j8673J96703k78855J95460M2533l06103K86662j54556
20388g3450j6877j87675J34970J75756j34455p463p5191J04902j01420K47888
20378F6985J30370j32877n2080J51911k96412p0780J77246M1245l27709K70066
20368d2035k261R7879p5308J47876o3734J1782j79658r3312O9298n4197J42165
20357d1505K00470k05027M1168j0312K18674j29544k09031P4725m8368J6647J17630
20346B5527j3812J63652l37347J66985R5351n0580m0048j81547p294J61083R6940
20335G8910j49553P6439J54168l38664K61986j24502O5098J5902Q0219j74726
20325e4723k7682K45913n5217k62784J5796J0036j8084J58036k2374q2171p4783
$$ plain form
20398 -115467 133152 -36621 -55294 141409 -137446 58014 100547 -205556 81106 -73450
20388 -73450 -90327 -278002 -143032 32724 -101731 -109194 -184385 -79483 -180903 66985
20378 66985 197355 64478 12398 164309 -132103 -202883 -25637 15608 -312101 -42035
20368 -42035 -44296 53583 -21725 126151 62417 74199 -105459 -198771 -129473 -183670 -41505
20357 -41505 158965 -46062 -4894 -15206 203468 73924 -135107 -60382 -108750 -92103 25527
20346 25527 11715 175367 -161980 5005 100356 49776 9728 -171819 -179113 -18030 78910
20335 78910 -70643 5796 159964 -178700 83286 -41216 23882 39784 120003 -54723
20325 -54723 -82405 163508 108291 -154493 -138697 -128661 -146745 11291 -11083 -93254 -168037
20314a68037K41892q803j2353k80898J44500N1504K6173L0737M9443k38423J25113
20303c9152Q4562J32116j71387q9718J29702j18071p704O7681N4033l0672k354
20292I036j83063K6915Q6374j40939R2291j6590K59784q1671m9960L8183j61657
20281a21297j8297L8917O4914O1420p2426k6443N1604O3977j04040r9J56484k35008
20269a40294L27919l94660M3946L63325k99905J2589p2583J92406N2863P6903
20259A62509j64152k9174j07560L59495k81657j24513K78695l52802K69467j11182
20249a00874o8667K35430k15600j2508J61855J14547k50589N3785J87669j48919
20239d3871J09556j03383m3411J05173j10791J6182K1886J03091j12936L4432
$$ plain form
20314 -168037 73855 65052 52699 -228199 -83699 -32195 -6022 24715 74158 -164265 -39152
20303 -39152 45410 177526 6139 -83579 46123 -71948 -79652 -11971 42062 11390 9036
20292 9036 -174027 -147112 -60738 -201677 -109386 -125976 133808 52137 2177 40360 -121297
20281 -121297 -139594 -100677 -35763 25657 -46769 -73212 -21608 42369 -61671 -61770 94714 -140294
20269 -140294 187625 -207035 -163089 200236 -99669 -87080 -159663 32743 85606 162509
20259 162509 -1643 -30817 -138377 221118 -60539 -185052 93643 -259159 10308 -100874
20249 -100874 -169541 65889 -149711 -162219 -364 114183 -136406 -82621 105048 -43871
20239 -43871 65685 -37698 -81109 24064 -86727 -70545 -48659 54432 -58504 -24072
20229b4072J05360k57565P4863k5308j11669J54082M8247n8940J4144n6654l131
20218a40643L57853k65926K8916J44269j31154k51387J96970K5872l3784J4233
20208e4781q8976K471J15516O8918J51660j96748o8978j2762J04614J03724j68322
20197d3664P4181N1636j41183O2879J9298n7404O937K5057J99101m21192J92408
20186c1946R82K35435k92945J91887k20779o8208J61355J10192j50865L6238j142
20175b9796j75169J71577r7644l0480L11575k04674n14J76791l96339J44832J30169
20164C28J52559k26719j29814J68266j1743j55097L3419K80323j98872j42260
20154b29610K51474j95296J51804q0268K51512k96684j73045M73339k42334K09236
$$ plain form
20229 -24072 81288 -176277 -101414 -126722 -238391 -84309 -36062 -95002 -80858 -137512 -140643
20218 -140643 217210 -48716 -19800 124469 -6685 -258072 -61102 -35230 -69014 -54781
20208 -54781 -143757 -141286 -25770 43148 194808 -1940 -70918 -83680 20934 124658 -43664
20197 -43664 30517 82153 -59030 3849 23147 -34257 -27320 -2263 196838 -224354 -31946
20186 -31946 -30964 204471 -88474 103413 -117366 -185574 -24219 85973 -64892 -28654 -29796
20175 -29796 -204965 -33388 -131032 -161512 150063 -54611 -55125 121666 -274673 -129841 328
20164 328 152887 -73832 -203646 -35380 -47123 -202220 -168801 111522 -87350 -229610
20154 -229610 21864 -173432 -21628 -101896 149616 -147068 -320113 153226 -89108 120128
20144A20128j67706j79087J45886J39646j63745K4013K50665j63438j49998J12812
20134c0824N5233P820j3607J12251j19455j21157n9280R1802J90606k98339Q6999
20123i7951J48916l235n5612j26063l2110K11253N1814m8659J1865M5052j11603
20112f333K09119k7381j26555j37855J36660O6594k6353k1149K9918K3082j39477
20101a9730J07911j25076J31631j27383j46615J8378J17654P6612q5333J11078
20091E9127n2895R3465j2361n1550k5216J67662j41859k3647n8380p3405O1157
20080e7902N8218o2824R3696l1822j33603q9063L43851j78792J78077k7986k56772
20069a64922k0957q4156K98146l9658Q0092o0197K7297j74543J9319L2659J57199
$$ plain form
20144 120128 -47578 -226665 -80779 58867 -104878 -80865 169800 6362 -143636 -30824
20134 -30824 24409 32229 18622 130873 11418 -109739 -169019 -77217 113389 -184950 -97951
20123 -97951 50965 47730 -7882 -133945 -166055 45198 97012 48353 60218 105270 -6333
20112 -6333 202786 175405 48850 -89005 47655 114249 87896 66747 96665 119747 -19730
20101 -19730 88181 -36895 94736 -32647 -179262 -160884 -43230 33382 -51951 59127
20091 59127 6232 99697 87336 35786 10570 178232 36373 12726 -45654 -119059 -57902
20080 -57902 316 -62508 31188 -634 -134237 -223300 120551 -58241 119836 91850 -164922
20069 -164922 -185879 -270035 28111 -11547 68545 8348 35645 -138898 -119579 -86920 70279
20058G0279k79113J94803L9100m6220n6441n1195m0374K45913p9852J30034l0106
20047I6828K6018m6309l41959K57304M8942l2143p4805j39322K54433j66859o8296
20036a86168K11871P2554j31924Q051n7560J20477j35178j14909J61594j29867
20026a81059m7681P5376J2758O2137L9321o027J33498q1468J12973k33947R3354
20015b0765j2782O7254k76779J91033L7370K7162O0163q2211j61818Q4358J41278
20004E4263j73043p6842K67089R0871k01484J44991l50867K45226j53394J65658
19994A2468j15329m3968J67435k9168J27356l21286K43695O0558k19498J8377
19984i9360p263L3551l8767K0236r394J20974j7186l56718L51573j30129J63622
$$ plain form
20058 70279 -208834 -14031 25069 -21151 -77592 -128787 -169161 76752 -3100 126934 96828
20047 96828 122846 76537 -265422 -8118 40824 8681 -66124 -205446 48987 -117872 -186168
20036 -186168 25703 98257 -33667 -25616 -83176 37301 -97877 -212786 -51192 -181059
20026 -181059 -228740 -153364 -140606 -78469 -39148 -45175 88323 6855 119828 -114119 -20765
20015 -20765 -33547 33707 -243072 -52039 -14669 12493 72656 -9555 -171373 -87015 54263
20004 54263 -118780 -195622 71467 162338 -39146 105845 -245022 204 -153190 12468
19994 12468 -102861 -146829 20606 -8562 118794 -202492 41203 101761 -117737 -99360
19984 -99360 -106623 -73072 -111839 -91603 -100997 19977 2791 -353927 -2354 -132483 31139
19973C1139j00654j34125K10142Q4829j34823L9081j352o2596R9438j6309J58434
19962A73204k42604J7515J8893p002J05132m16844M45967j15603j01707J4013
19952a09036q7792J81739n0382O4760o9094K26886M6476k48164R078j1657K07607
19941A60421j39568Q0360L378r0197j61033L04651k545l21563j26623J06261J95680
19930I222q7768k00674J97813O6128J21898K5167l22900J07470L4594K2426m0817
19919f7441n3094j11496k4439K62351P1599k16750p5000M4484J33421m3638K19110
19908A39107j96863J01829O9572l32312J53961P2219n1298J024o6403N9308q9542
19897a39398k860Q9520r0862R918o2285Q6022K3586K43689j53206j29182n3004
$$ plain form
19973 31139 -69515 -203640 6502 91331 -43492 -4411 -5763 -68359 31079 14770 173204
19962 173204 -69400 -51885 -32992 -39994 65138 -351706 94261 -21342 -123049 -109036
19952 -109036 -196828 -15089 -65471 -711 -69805 157081 203557 -44607 -35529 -47186 160421
19941 160421 20853 101213 104591 14394 -146639 158012 155467 -166096 -292719 -186458 9222
19930 9222 -78546 -279220 -81407 -15279 106619 131786 -191114 -83644 -49050 -26624 -67441
19919 -67441 -120535 -232031 -256470 5881 77480 -139270 -214270 -169786 -36365 -80003 139107
19908 139107 -57756 44073 113645 -218667 -64706 7513 -43785 -42761 -109164 -49856 -139398
19897 -139398 -142258 -52738 -143600 -133682 -195967 -109945 -86359 157330 4124 -125058 -178062
19886a78062J98997j72423K62237l42224J63932j14883J25440J70783l44781L33758
19876A02774j66612j56345K13623J27295n7566k8876J4775j23455j69500K36136
19866g751q3110q0871J3698K10262j24718q2529o7248R4774M4051P1372j08790
19855a20860J55477q430j0880j39945J18308j72456J07988O5643Q344O5709j00943
19844c2045n38m0629j25461L75281k42475J87391k85403J80958J43201j14314
19834D5966J52m24611O4094K08540r211J35251j02952k1192K1587P2935k3641
19823c3082m1401O2524j12943J29658k6774l0354R7530J7833q522j5734r890j85429
19811a56584o3845o8736L71451p0933n6698k08011J52534J1310L7121o8808P9277
$$ plain form
19886 -178062 20935 -151488 110749 -231475 -67543 -182426 -56986 113797 -230984 102774
19876 102774 -63838 -220183 -6560 120735 63169 34293 49068 -74387 -243887 -7751
19866 -7751 -90861 -171732 -158034 52228 -72490 -155019 -222267 -127493 -83442 -12070 -120860
19855 -120860 34617 26187 15307 -124638 -6330 -178786 -70798 -5155 3189 68898 -32045
19844 -32045 -32583 -73212 -198673 176608 -65867 121524 -163879 17079 160280 45966
19834 45966 46118 -378493 -314399 -105859 -115070 20181 -82771 -103963 -82376 -9441 -33082
19823 -33082 -74483 -11959 -124902 4756 -22018 -52372 45158 62991 54469 38735 28845 -156584
19811 -156584 -220429 -289165 82286 11353 -45345 -253356 -100822 -89512 -52391 -121199 -41922
19800d1922J21290j54910k1013N221j47891L23234j16858p1382J14956l24611
19790c13886M48123j55223o8578l1714J14205q3305J62603K2638p2262p6768O3235
19779I068k94443L31567k12811K07044j36853O8831m6168m6159J21779k17007
19769b15152L78575k37666J52649J56326l17360m8903P7960Q3150j04177P3960
19759f38L20663j48480M7078k41282J94283k0146K38021k71860J36442l03295
19749d9214J9530l2191J12847o9735j53796K63802m3806p7564J39092j33538O3447
19738C8874l0302k47688L47516R206j79250R3254m115r9123K13844j32281j84883
19727a74948L62002k90520M9378L022j9693K12273n6124j32084j48780L77057
$$ plain form
19800 -41922 79368 -75542 -96555 -91334 -239225 84009 -32849 -104231 10725 -313886
19790 -313886 134237 -20986 -89564 -121278 -7073 -90378 72225 94863 22601 -54167 9068
19779 9068 -285375 46192 -166619 40425 -96428 -27597 -73765 -119924 1855 -215152
19769 -215152 163423 -74243 78406 234732 -82628 -131531 -53571 29579 -74598 -638
19759 -638 320025 171545 218623 -22659 171624 151478 389499 117639 254081 -49214
19749 -49214 -29684 -61875 50972 -18763 -172559 91243 47437 -30127 108965 -24573 38874
19738 38874 8572 -239116 108400 117606 -61644 31610 27495 -71628 142216 9935 -174948
19727 -174948 187054 -103466 -54088 -51066 -70759 141514 85390 -46694 -195474 181583
19717A81583j27151J45461k54633l1063j42336L69828j96923p3604P4845J0933
19707d3060j9693K23513j45791k2278n4454r6240J24984K06247r6731k06522M6717
19696h3308K32525q2103O3515m2808M0236L5589l68245K55350Q7673r3376l2187
19685A2861j70905Q4705J73879j35098J19840j15460J17726J1442j26941L2625
19675D674J5366K03877l10499L7147J84753j83127j37692J50995k820M7067n9968
19664e0227M6063L4346Q589j1059J0784k26124J51955J45391n4227j04298k03413
19653b52220J48551J2944M4264J23114k1325M7808k19657J4602Q0300l23587L85296
19642D0090k98956L48032l15381L08960k22545N1740J60036l27825J66150L99
$$ plain form
19717 181583 54432 199893 -54740 -85803 -228139 141689 -55234 -128838 -53993 -43060
19707 -43060 -62753 160760 14969 -7309 -61763 -158003 -33019 173228 76497 -130025 -83308
19696 -83308 149217 67114 130629 87821 128057 163646 -204599 50751 138424 45048 12861
19685 12861 -158044 -73339 100540 -34558 85282 -30178 87548 98990 -27951 4674
19675 4674 20040 223917 -86582 -49435 135318 -47809 -185501 -34506 -37326 9741 -50227
19664 -50227 -4164 30182 38771 27712 38496 -187628 -35673 109718 55491 -48807 -252220
19653 -252220 -103669 -90725 -46461 76653 55328 103136 -116521 -101919 -21619 -345206 40090
19642 40090 -258866 89166 -226215 82745 -139800 -88060 71976 -255849 -89699 -89300
19632h9300K63097m08612K9747J01377Q4547j62233n1264J98281k53401J9578
19622b68183K67040l02288J59837R7606j08949K03859j39657L3773j04577R5459
19612f6080Q9177m750L4437k41600N00501n33317p1231K23090k18152n5580M74812
19601A31307j607j05782n4247R9724j84593j61942L31241k27866L38505l31355
19591a66615J63270n0723K2726J50293l54154K31363R7633j50160k0642o6325
19581a43334K76855n622r2479j60162r6166J78348k75743M95711l20924J27528
19571a5988j76721K21513m29808N53505k20067m2527L45951j41032m8810j87402
19561a41386n3511J42432J06080j49399O824j42862J68283k66284M59323k12752
$$ plain form
19632 -89300 173797 -234815 -205068 -103691 -19144 -181377 -232641 -34360 -287761 -268183
19622 -268183 -1143 -303431 -143594 -45988 -154937 48922 -90735 -56962 -161539 -66080
19612 -66080 23097 18347 52784 -188816 311685 -221632 -292863 -69773 -287925 -343505 131307
19601 131307 129700 23918 -30329 69395 -115198 -277140 54101 -173765 164740 -166615
19591 -166615 -3345 -54068 -31342 118951 -235203 -3840 93793 -56367 -77009 -143334
19581 -143334 133521 127899 35420 -124742 -220908 -42560 -318303 177408 -143516 -15988
19571 -15988 -192709 28804 -401004 152501 -67566 -110093 235858 94826 46016 -141386
19561 -141386 -194897 -52465 53615 -95784 -88960 -231822 -63539 -329823 129500 -83252
19551h3252J12024j2053j32790M5654P8945j34947J7153j8994J80636j34631j67464
19540b49719K40611l5776j186j28901M9647L5765q1354J83089R4959k33401K55772
19529A29506q6311j29726o727J96010n0830j49769J07323j10630J36463p7974
19519d2665p9989l4306J21444o8708j33365N314K47430k12840M17535l66834J70283
19508B3299R110j02612o1769J77228P0247k21090Q013p3986P6581m6485J54604
19497A3140k7394J98434k04312j69354L18081j64251K1540m4004k55525L79861
19487F6216j66052R0368k09883K32006p8741r2609p4278J58320J06235j19755
19477h8173P0340J89312j06888M9263m3480J21731l16579J19213m3476P7123j32493
$$ plain form
19551 -83252 28772 16719 -116071 -70417 8528 -126419 -109266 -128260 52376 -82255 -249719
19540 -249719 -9108 -44884 -46070 -174971 -125324 -89559 -170913 12176 107135 -126266 129506
19529 129506 43195 -86531 -93258 102752 51922 -97847 9476 -101154 35309 -42665
19519 -42665 -122654 -156960 -35516 -104224 -237589 -232275 15155 -197685 219850 -146984 23299
19508 23299 32409 -70203 -131972 45256 115503 -105587 -97574 -171560 -94979 -141464 13140
19497 13140 -14254 184180 -20132 -189486 128595 -35656 -14116 -58120 -313645 66216
19487 66216 -99836 -9468 -219351 12655 -66086 -158695 -232973 -74653 31582 -88173
19477 -88173 -17833 171479 64591 113854 70374 192105 -124474 -5261 -48737 28386 -104107
19466a04107J60760q6383L1377q8023J92636l08547Q4766L4168J02813j1142k46114
19455b37796K90224k57408K38906n3077l82235K76003J7053p898j53786J36559
19445a33455J2687j26213J23680k11905K14802j7747L23821k39026j5358n9248
19435a27962K40121m55511L55317o5079L00516l73490O6926J80915j62605j41834
19425a82686K40412j57242L09116n8894k75254L3667J16987m3311J83950j71090
19415d345j1225p6999K119K38400k23261J87972m7808p3734p7595Q3893q3064
19404h5647L21872l08500r0071j7876q2655J74079k1993L8991O657J1298q3557
19393a37402j7029O7662P2031l653j15847k0513L9906l4205M5017J30460j02716
$$ plain form
19466 -104107 56653 -29730 1647 -86376 106260 -202287 -117521 -83353 19460 8318 -237796
19455 -237796 52428 -204980 33926 -19151 -401386 -125383 -108330 -116228 -270014 -133455
19445 -133455 -120768 -246981 -123301 -335206 -120404 -138151 185670 -53356 -68714 -127962
19435 -127962 112159 -343352 11965 -53114 247402 -126088 -59162 121753 -40852 -182686
19425 -182686 57726 -99516 209600 150706 -124548 -90881 26106 -17205 166745 -4345
19415 -4345 -15570 -92569 -90450 147950 -75311 112661 64853 -8881 -86476 -2583 -85647
19404 -85647 236225 -72275 -162346 -180222 -262877 -88798 -110791 -71800 -65143 -53845 -137402
19393 -137402 -154431 -86769 -14738 -18391 -134238 -154751 -114845 -149050 -104033 26427 -76289
19382g6289j50195J95012j77020K51812k22219K27963k88185J26429J43892k54529
19372b23329J43118k08206J0174l0741J29438J24909N951j44040m5582k8877j0033
19361b77218j52468K33942j08446J3469o4706j64055J66368p515k3269M35979
19351E2081k06736M7174J99393r5100K80293l69051m8635K30631k03048J68410
19341E5412J86546k69199R741k12172l0769K93466j00890J06229K2622j79880
19331a18894J51907k98258M16661q6575j39310L05220j27723O7709j28994l3928
19321G815N1702m6914r0108j0142K48643k35722K10277l5681J0055j13616P6290
19310G2599K519Q6119l0249k03242L5655K18411j41886J02444k09881J37587L9905
$$ plain form
19382 -76289 -226484 -31472 -208492 43320 -178899 49064 -239121 -112692 31200 -223329
19372 -223329 -80211 -288417 -278243 -308984 -179546 -54637 -48686 -192726 -238308 -267185 -277218
19361 -277218 -429686 -195744 -304190 -290721 -355427 -519482 -353114 -360629 -383898 52081
19351 52081 -154655 -107481 91912 -3188 277105 -91946 -140581 90050 -112998 55412
19341 55412 241958 -27241 -17500 -229672 -260441 33025 -67865 38364 60986 -118894
19331 -118894 33013 -265245 151416 64841 -74469 230751 103028 170737 41743 7815
19321 7815 59517 12603 -77505 -87647 160996 -74726 135551 99870 109925 -3691 72599
19310 72599 75118 161237 130988 -72254 -36599 181812 39926 142370 -67511 70076 109981
19299A09981p6345P8132r5028m2027j02850J84456m358j99370Q104M11990l77456
19288a04771k7856J75987J72760k77529q5179J80443j17876r0635J09235p0883
19278a36304k7166K6911J25360j65270O5315J62911j88622J41204R5329k43358
19268a43690J94857q6973m230O3375j74581L57874j35724j04833R7156k98657
19258b35426L24026j09972N755r7658K28698j21870Q3053m2668J22135l93148
19248b37075J58524J76655l15192P6737J00254j22481J39354J86341j18153j92332
19238a47368J92227p1755L119p5882j33345J49104J54064o7621J0804o682j49051
19227a42386J16794l02067N50379k01955J04815j48327J0315K11355j45072P7149
$$ plain form
19299 109981 33636 111768 16740 -25287 -128137 56319 51961 -147409 -139305 272685 -104771
19288 -104771 -132627 43360 216120 -61409 -146588 33855 -84021 -174656 -65421 -136304
19278 -136304 -163470 -136559 -11199 -176469 -111154 51757 -136865 4339 99668 -143690
19268 -143690 51167 -35806 -40036 23339 -151242 206632 70908 -33925 63231 -235426
19258 -235426 88600 -21372 -15617 -113275 115423 -6447 76606 33938 156073 -237075
19248 -237075 -78551 98104 -217088 -140351 -40097 -162578 -23224 163117 44964 -147368
19238 -147368 44859 -26896 -23777 -99659 -233004 -83900 70164 2543 13347 6665 -142386
19227 -142386 -25592 -327659 222720 20765 125580 -22747 -12432 198923 53851 131000
19217A31000j62067K3917k78583L36208j30835l1291N8102J29180j27783l8357
19207i0509l0937K28435J65031j98652L4730j23157n5175M2074L7731n8690J12808
19196F3689J6338j46200J57600l51442K30395L1928J245J03903l44357K87708
19186E0807J08082j00973j63344K27617k31307O6641q1822j01419L09277k83601
19176b00042Q6234J40637J55088k47771J15415L1888k55785K25801n2243M709
19166C931J18390j46797P1025o453J5235o0258J93874k0063j00217r1137j75329
19155a97799K04289Q6032j66234K88510r1263N4788o8803j90592J44628M4705
19145A08261Q041k04438L0706J37009k35875j8142L15665K0494m00613J64082
$$ plain form
19217 131000 -31067 -7150 -285733 50475 -80360 -111651 -53549 75631 -52152 -90509
19207 -90509 -121446 106989 272020 73368 108098 -15059 -70234 -28160 9571 -49119 63689
19196 63689 80027 -66173 91427 -260015 -29620 2308 3553 107456 -236901 50807
19186 50807 158889 57916 -105428 122189 -109118 -42477 -124299 -225718 83559 -200042
19176 -200042 -113808 26829 181917 -65854 49561 81449 -174336 51465 -778 3931
19166 3931 122321 -24476 46549 40096 55331 -4927 188947 168884 68667 -22470 -197799
19155 -197799 6490 92522 -73712 214798 123535 178323 109520 -81072 63556 108261
19145 108261 116302 -88136 -57430 79579 -156296 -174438 141227 161721 -238892 -74810
19135g4810M8064n9846J47701j60835J46219J28263j70183P2008j23859j52820
19125b00098K75543r1176j8731K8994K31021j50892l06502N5544K25281j78168
19115a29184J56802N0894p6177K56659j76025q3533J59895j50126J8707Q4746
19105A12658P022j33221J34528k48068J18867J3709o8475K07258n6900o9690j14020
19094i6332M4835L3779Q7568r2058J78958j47417N0988q8969J43713k93857J20192
19083e8600N5518P0622J07288k16084K65899m95523M26596j56053k0796K54996
19073B33863p4704k5876k53893L28947j79363K15558k42363K69992j42758j14770
19063A4633J82841m61680M43441j24307j42409K33464k5714J8448j73943O7093
$$ plain form
19135 -74810 -26746 -86592 61109 -99726 46493 174756 4573 76581 -47278 -200098
19125 -200098 75445 -15731 -34462 -5468 225553 74661 -231841 -176297 48984 -129184
19115 -129184 27618 78512 2335 258994 82969 -564 159331 9205 27912 112658
19105 112658 119680 -13541 120987 -127081 -8214 5495 -62980 144278 87378 17688 -96332
19094 -96332 -51497 -17718 69850 -22208 156750 9333 60321 -28648 115065 -178792 -58600
19083 -58600 -3082 67540 174828 -41256 224643 -270880 155716 -337 -21133 233863
19073 233863 159159 133283 -120610 208337 28974 244532 2169 272161 129403 14633
19063 14633 197474 -264206 179235 54928 -87481 145983 120269 138717 -35226 31867
19053C1867j34605M1568M5236k11691L22178p0306k1792j77482K55963n0562K7449
19042E7823k316P0803k9533j06759Q6600L3580j68241J72543L3440k07414o1991
19031a21465J40406P615l0815j05069J32907j68460L5031L53322J22201m17829
19021e2156J16839J1668j50852J82210k65748K36252o2838j04299K97191m00809
19011a92542J82962l0946J98148J73223k16149o7852R8474j42633N0161j19812
19001f6966Q6239l2711K7687j67909l5136l6296j2194K58023r7922k04157j42413
18990d23755K52318K3956O273l553J32586J8841k92568L85581q4272o0863J98712
18979A53256j46873K20504l03859K05447K5304k06612J37378q2293J59112j89884
$$ plain form
19053 31867 -102738 -61170 -15934 -227625 94553 24247 2455 -175027 80936 30374 57823
19042 57823 55507 126310 96777 -9982 76618 110198 -58043 114500 147940 -59474 -121465
19031 -121465 18941 26556 -4259 -109328 23579 -144881 -109850 243472 365673 -52156
19021 -52156 64683 76351 -74501 107709 -158039 78213 15375 -88924 208267 -192542
19011 -192542 -9580 -40526 157622 330845 114696 46844 145318 2685 52846 -66966
19001 -66966 19273 -13438 14249 -153660 -188796 -225092 -237286 20737 -77185 -281342 -423755
18990 -423755 -171437 -147481 -141208 -144761 -12175 6666 -285902 99679 15407 -45456 153256
18979 153256 6383 226887 -76972 128475 153779 -52833 84545 2252 161364 -28520
18969b8520K61833k83839J81716n2392j39003j15246K05586q8367O9779n2017
18959d0470M103j6574K6390K3057j26850K68916k99670L63951k77049J40730K89994
18948C56528k41108j85090K49768l86244J86333J75547j90988N8699k20598R9138
18938i8015J07669N912k57311M30664k02081j4418N0776l07081M13031M6283j91828
18927a6399Q8694M9639j9724J27331k72516P3202j08977K34418j82207m0019k52601
18916c19159K08355L30901k07259o4366J88941O3503r4117n0270j49674J53886
18906F0741J60399k42277q8421N5641M0455M3828o023o465J15377j8286j04709
18895A0260L8088K94329l46998L10238k29805R851N0870j58458K7632L400j3175
$$ plain form
18969 -28520 233313 -50526 131190 78798 -60205 -175451 30135 -58232 11547 -40470
18959 -40470 -36367 -52941 -26551 -3494 -130344 138572 -161098 202853 -74196 66534 356528
18948 356528 115420 -69670 180098 -206146 -19813 155734 -35254 23445 -197153 -98015
18938 -98015 9654 15566 -241745 188919 -13162 -27580 23196 -283885 129146 175429 -16399
18927 -16399 72295 121934 102210 229541 -42975 30227 -78750 155668 -26539 -66558 -319159
18916 -319159 -110804 220097 12838 -51528 137413 200916 106799 56529 -93145 60741
18906 60741 221140 -21137 -109558 -53917 -13462 30366 24343 17878 133255 114969 10260
18895 10260 48348 342677 -4321 305917 76112 85963 136833 -21625 6007 9407 -3768
18884c768J03130q5613l7742k229J59485n1176l2683j9096K70751l84699P9579
18873d061R6878j79135J59623l2227j11520l7940j7222K22783K9946k29476M84559
18862C82208l22197L1988J63656j58184l5053J4296j71364K10289j34669l6101
18852e5131J54199j35452J73895M3788k6713q2154p0750k6120o9107M31934j87911
18841A50478o2125l27668l0976L18994K766k39416L02952J289k80720Q9767l4597
18830a09256J88680P151k23605L5876J23114k51215K9385J78523O9805o5694Q4244
18819F7008j58532J40703O3460k7932j76778J02084K02250o7565m4960J4099N2239
18808A66076p2804k8513j1673k3907j6555q3402L58891k22057j88666J56046K52879
$$ plain form
18884 -3768 99362 13749 -23993 -26222 133263 82087 49404 30308 301059 -83640 -4061
18873 -4061 92817 -86318 73305 41078 -70442 -108382 -125604 97179 127125 -102351 382208
18862 382208 60011 91999 255655 97471 62418 76714 -94650 115639 -19030 -55131
18852 -55131 99068 -36384 137511 181299 154586 72432 1682 -24438 -93545 338389 150478
18841 150478 88353 -239315 -270291 48703 51469 -187947 115005 116294 -164426 -74659 -109256
18830 -109256 79424 86575 -137030 -101154 21960 -229255 -199870 -21347 48458 -17236 67008
18819 67008 -91524 49179 112639 84707 -92071 10013 212263 144698 99738 113837 166076
18808 166076 93272 64759 53086 29179 12624 -70778 288113 66056 -122610 33436 286315
18797B86315j47091l14798K23543O1402L9535M7245q1855L0042J67255j39616
18787A71977J5827N9973j78471O0529j02587j56436K60577k3849Q1427k8594J734
18776A62107P9754j52056J85283k96213M5907J21697j66325r31M1242n5113K65272
18765B30624j36540M9759L2589k0125j66531K40757o7744K1566q5186j48794K31617
18754A81992p1694O875j62276L20054l13323K27889J1436L475J1172j05541L6686
18743A46745L2607l412L0741P3712m510l20248P0003J16103l4629k8823m8484
18732B9805j66914L64723k58764L66197j31223j29033K9180L8078p6611J72740
18722B38178l9895m1947k88735J71065M2017m6643J61304J9009k18851J85589
$$ plain form
18797 286315 139224 -175574 47969 109371 148906 196151 114296 144338 311593 171977
18787 171977 187804 247777 69306 129835 27248 -129188 131389 107540 188967 160373 162107
18776 162107 241861 89805 275088 -21125 24782 146479 -19846 -20777 20465 -34648 230624
18765 230624 94084 143843 176432 156307 -10224 230533 162789 184355 99169 -49625 181992
18754 181992 110298 117173 -45103 274951 -38372 189517 200953 204428 215600 110059 146745
18743 146745 179352 175940 206681 280393 275883 -44365 25638 141741 107112 78289 29805
18732 29805 -137109 227614 -31150 335047 203824 74791 103971 142049 65438 238178
18722 238178 198283 156336 -132399 38666 80683 34040 195344 214353 -4498 181091
18712A81091J61949j88886k47449P1880m0376n841J65861K05370k85295J96224
18702B14528O3257j69852l674k48927K42904J8463K4294l3487j34957K58358j42901
18691H8006L4410k41953K18462l46697J92361L86882m39611K57943Q952K29622
18681C88377m89140J13064P6007P1884p2143P6626k34523K19685j11844J18062
18671A56055l742p4266J67830j2982p0179j42502J858r56q9136J47873j6701J40679
18659B03831K30914k37518k13989M85665m28021J32147J00403j89339J06692q6009
18649A04776Q0459j36203l722J531J50368j75266J22230L9770q8465K64984j69236
18638A91226Q9509L9045j82218J48042q7184R5455Q5306l37670L05881j75955
$$ plain form
18712 181091 343040 154154 -93295 -21415 -61791 -67632 98229 303599 18304 214528
18702 214528 277785 107933 104259 -144668 98236 116699 140993 107506 -27451 230907 88006
18691 88006 122416 -119537 98925 -247772 -55411 331471 -108140 149803 158755 388377
18681 388377 -100763 12301 88308 160192 88049 164675 -69848 149837 37993 156055
18671 156055 152313 78047 245877 232895 162716 20214 22072 21116 -68020 79853 63152 203831
18659 203831 434745 197227 -16762 468903 40882 173029 273432 84093 190785 104776
18649 104776 185235 49032 45310 46841 197209 21943 144173 183943 95478 360462 191226
18638 191226 280735 319780 137562 285604 198420 293875 379181 41511 347392 171437
18628A71437j41616L16287j1921k72161P1523K27992j54583k13255L86913j57442
18618B23174R4551q3891j26221O328P0392J28255o2615o638J4926K3673j7670
18607B64264k43570J88199o8630R3820j0134j8765P2075P1730k59333N4935J86504
18596C31095M421j10446L5182j16996J14050k0792M3898j9410M8797P0293m8166
18585C31926j17723J22471k43580n0433K11033J8156j43403K00110j36964n897
18575A85696r7818J53526P9645J02305p0140k94440K79406m5390J20785j12699
18565C00876L4508N6644J7518j49409N0624j4312p498K0680K18611o5156q7984
18554C75102Q196n6036J28159n903k35855J2368J56262N9468k7748M8286m8022
$$ plain form
18628 171437 29821 346108 334187 62026 133549 361541 206958 -6297 380616 223174
18618 223174 317725 233834 107613 113941 184333 312588 249973 243335 258261 281934 264264
18607 264264 20694 208893 140263 234083 223949 205184 277259 348989 89656 144591 331095
18596 331095 335516 225070 260252 143256 257306 236514 280412 261002 309799 380092 331926
18585 331926 214203 336674 93094 42661 253694 271850 128447 328557 191593 185696
18575 185696 87878 241404 321049 423354 353214 58774 338180 292790 413575 300876
18565 300876 335384 392028 409546 260137 310761 296449 288951 309631 528242 463086 375102
18554 375102 383298 327262 455421 449518 213663 226031 382293 441761 414013 462299 414277
18543D14277j55584J25216j59633q8632L26727k66317P6006R3360j26443j98380
18533D0597J4938j21459L02761k0248j22250K07378O1372o9531J45853j70399
18523B69012q9362K16139j30104R590L9795j62607J45496j21897O6503j9348J30366
18512C53583j33974r7626L12877k9853j26234n712p8234K46789l11689K04410
18502C34337K89303k71636n6302L8579k49882L54121k5137r036k39888K24461
18492C88920l36187L72206J75608J14517n55390M142M05063j5591N388m10023
18482A48653J58577K27616k84421P6845Q6385j39988J37640Q397l4883j60918
18472B23903K23292N4425j81056K89232k36169j8917P6887N1095j02552J47318
$$ plain form
18543 414277 258693 383909 224276 135644 462371 196054 272060 365420 238977 40597
18533 40597 55535 -65924 236837 216589 94339 301717 363089 293558 439411 269012
18523 269012 179650 395789 265685 275275 315070 152463 297959 176062 242565 223217 353583
18512 353583 219609 121983 434860 405007 278773 273061 194827 441616 129927 334337
18502 334337 623640 352004 295702 334281 84399 438520 413383 404347 164459 388920
18492 388920 52733 424939 600547 715064 159674 163816 568879 553288 558676 148653
18482 148653 307230 534846 250425 327270 413655 273667 411307 419704 384821 223903
18472 223903 447195 501620 320564 609796 373627 354710 431597 482692 380140 527458
18462E27458K17513k36490j34290J65252j17220J87903k13806K3417m757l4317
18452C80663J58082n929m8925O3755J22658k54489J93755r2024J3571j70555K47021
18441F07583k30462N3856J63052o1678k9588l5777j33806K53206j14367p8601
18431C93418N4747J04204j11969J05781J27344J9636k03515j52050L56540j49645
18421E44491P9351l2298M9849J47202k00861Q6844K6693q6506Q6100j58463M5343
18410E87745J25353p0888N7044j54397m8099R3240J85561R0606k17615Q8410M5402
18399G82362m6488q8666k05859K32741l10542L39769k06509R9112N501J64998
18389G66419j23163J02751n8388q0627K4270J63777M2082l82430K78414K2099
$$ plain form
18462 527458 744971 508481 374191 539443 422223 610126 396320 419737 414980 380663
18452 380663 538745 532816 483891 547646 670304 415815 609570 517546 531117 360562 607583
18441 607583 377121 430977 594029 532351 502763 466986 333180 586386 472019 393418
18431 393418 448165 552369 440400 546181 673525 693161 489646 337596 694136 544491
18421 544491 623842 591544 641393 788595 587734 674578 701271 614765 700865 542402 587745
18410 587745 713098 642210 699254 544857 496758 589998 775559 866165 648550 736960 782362
18399 782362 735874 647208 441349 674090 363548 703317 496808 595920 601421 766419
18389 766419 643256 746007 687619 606992 631262 795039 837121 454691 733105 755204
18379G55204K26875l1236R5701j62561j02827J27769r5639J44669L8923j46476
18369H50402j260J54829j06732q1171J57741l2328j02360J1822p2139j13186K70219
18358I35837m17534R7128J30954k6066q7334Q1393M4166Q3146R3077k1351J47136
18347A060552R8628p981J07648L5726j72407r5842L67135n5038m26172Q3376R700
18336A005325k41065J83592L74437m26058L00980k38678J83556J55283k5971j37907
18326A133494j53253j24755L08761r7552J7887j99488k08504K64491p7787p954
18316H55340L5962j15074J26108M5810r1293M278J10752p7328k772L16234j36185
18305A071832R2828j69292o9604J03948j35150J08693k0099K27580o632j52277
$$ plain form
18379 755204 982079 950843 1046544 883983 781156 908925 813286 957955 996878 850402
18369 850402 849142 1003971 897239 816068 973809 941481 839121 850943 778804 665618 935837
18358 935837 518303 615431 746385 720319 632985 714378 758544 841690 934767 913416 1060552
18347 1060552 1159180 1151199 1258847 1294573 1122166 1026324 1393459 1338421 912249 995625 1005325
18336 1005325 764260 947852 1322289 896231 1197211 958533 1142089 1297372 1271401 1133494
18326 1133494 980241 855486 1164247 1066695 1084582 885094 676590 941081 863294 855340
18316 855340 891302 776228 902336 948146 856853 861131 971883 894555 891783 1208017 1071832
18305 1071832 1164660 995368 925764 1029712 894562 1003255 983156 1210736 1204104 1051827
18295A051827L16987j06054K82669Q8923j60626K37265J39722q8560K1312N6636
18285A840101O1906K30817n7125K69939j19907R5305l4050J28626j57465J09466
18275B367613q7746k53791o120O8864q578J39974k73551L18636o4343J17163q494
18264B309627J84657l31628K87K54079m65093J81586j81731p7072J87028J78017
18254B239757q368R5936r9529k1708P6382N744J86283l012K46745P2761R4850
18243B885841J99050j55759J60826K95459L1306J40278Q8748r157J17600P8300
18233C832492j15320m7427L5050J50879K29543R7462M76017j77561K58581K99059
18223E038775M71543k27393K93385P4436J03712L71896O4497J94232M58129O4886
$$ plain form
18295 1051827 1368814 1262760 1545429 1634352 1473726 1710991 1850713 1762153 1783465 1840101
18285 1840101 1902007 2132824 2075699 2345638 2225731 2321036 2286986 2415612 2258147 2367613
18275 2367613 2279867 2026076 2019956 2088820 2080242 2220216 1946665 2265301 2200958 2318121 2309627
18264 2309627 2494284 2162656 2162943 2417022 1951929 2133515 1951784 1874712 2061740 2239757
18254 2239757 2231389 2327325 2227796 2206088 2282470 2288214 2474497 2471485 2718230 2790991 2885841
18243 2885841 3084891 2929132 3089958 3385417 3416723 3557001 3645749 3636592 3754192 3832492
18233 3832492 3717172 3669745 3704795 3855674 4085217 4182679 4658696 4481135 4739716 5038775
18223 5038775 5510318 5282925 5576310 5650746 5754458 6126354 6190851 6385083 6843212 6908098
18213F908098K75472K80843K99767J85391M22136L75848L40341P81231M12588
18204A0281715k3411L94792L99838K50088L32456Q17776j05379Q87454Q55188
18195A4090517Q12571Q31905J287336R53343J392914J784329J564919K069705
18187B4787539K054209J958682K873181K847566L441711M164290M293305N225177
18179E1645660N747211O660999P138736Q314209J0240360J2631654J6313758K1168331
18171A39860918K7669793L3284412M3261652M5721967K3590078j1007627l6662140
18164B65719053m5419182m2117916l3745835k4379417j7586897j3708067j0863009
18157G7898730r757766p702181o467683n252368m704063m139529l802296k956210
$$ plain form
18213 6908098 7183570 7464413 7764180 7949571 8371707 8747555 9087896 9869127 10281715
18204 10281715 10258304 10653096 11052934 11303022 11635478 12453254 12347875 13235329 14090517
18195 14090517 14903088 15734993 17022329 17975672 19368586 21152915 22717834 24787539
18187 24787539 26841748 28800430 31673611 34521177 37962888 42127178 46420483 51645660
18179 51645660 57392871 64053870 71192606 79506815 89747175 102378829 118692587 139860918
18171 139860918 167530711 200815123 244076775 289798742 313388820 302381193 265719053
18164 265719053 220299871 178181955 144436120 120056703 102469806 88761739 77898730
18157 77898730 68140964 60438783 53971100 48718732 44014669 39875140 36072844 33116634
18149C3116634k900593k390785k362271j726175j415084j445102j154758r29677
18141A8792189j374725n45920j078424p05961r79687n41847o59955o93906o66658
18132A1545106q63656o91567k05621m65841n23153l60385q4016j45854m22459
18123G782554q2926k90513j88883k98839k94384m130j10429m87839J57831o06856
18113E575586k56957K7447k29213n324q0021k223j96279k52455L1187L8219k41923
18102D408044M5462o7234j72863k80643n6468k23815l40727J52161k7795j81873
18092C254249q9966P9830l5463j1162M1378j38261j615K20324l6609l14015j22807
18081B845883O0365k03587p2399J09083j53359J25373k14856j4292N3381k20181
$$ plain form
18149 33116634 30216041 27825256 25462985 23736810 22321726 20876624 19721866 18792189
18141 18792189 17417464 16871544 15793120 15087159 14107472 13565625 12905670 12211764 11545106
18132 11545106 10681450 9989883 9784262 9318421 8795268 8434883 8350867 8205013 7782554
18123 7782554 7699628 7409115 7220232 6921393 6627009 6622879 6512450 6024611 6182442 5575586
18113 5575586 5318629 5346076 5116863 5111539 5031518 5029295 4833016 4580561 4611748 4649967 4408044
18102 4408044 4453506 4386272 4213409 3932766 3876298 3652483 3311756 3463917 3436122 3254249
18092 3254249 3164283 3244113 3208650 3197488 3238866 3100605 3098990 3319314 3282705 2968690 2845883
18081 2845883 2906248 2702661 2630262 2739345 2585986 2711359 2496503 2482211 2535592 2315411
18071B315411j57009m17349K10975j49756m1842o5911j44229j59397L22149j27428
18061A585614J37030l26944m875j21720l25760k8039n3345q0452k9561J46441
18051H98389K12131n0168N0852J13702j19348N0526r2192Q3337O5476l2399j89792
18040I90514J70948K90386k19938L42988o5231j46614j34346J37501Q6316j02183
18030A350341j85091p8835j27197O1495J18051K63415l27855r0592J31740j23352
18020I92120J01934k11167Q5099j0492J40827J09422j95821j01489o2364J3700
18010H61769k15717P6191k31895M43O6304j2583j94423P2598K7084N3671l8855
17999D64587k56690m6293L00164p5578q324J85083j23171j12445j57269N4899
$$ plain form
18071 2315411 2158402 1741053 1952028 1802272 1760430 1694519 1550290 1390893 1713042 1585614
18061 1585614 1722644 1395700 1390825 1269105 943345 915306 861961 781509 751948 898389
18051 898389 1110520 1060352 1111204 1224906 1105558 1156084 1063892 1147229 1212705 1180306 990514
18040 990514 1161462 1451848 1231910 1574898 1509667 1363053 1228707 1366208 1452524 1350341
18030 1350341 1165250 1086415 959218 1020713 1138764 1402179 1074324 983732 1115472 992120
18020 992120 1094054 882887 967986 957494 1098321 1207743 1011922 910433 848069 861769
18010 861769 646052 722243 490348 490791 557095 544512 350089 422687 449771 503442 464587
17999 464587 207897 161604 461768 386190 377866 562949 439778 327333 170064 224963
17989B24963m14154K56914J81319l2710o1060j08162K79862K9427m0028J47964
17979D64335j27677K09409k48398J60320k3036K39706l01495M7656p7790m6549
17969B96481l34222K19863O7525r6391j98781j38216L38835k23754J10365k540
17959C9165J9434k0060O7651l4281K9545P3268n9201O6578n7798K20955J08469
17948D53725j49718l489q9845N6563n4510J17057j45241O4878k3167O0026p0501
17937B15778K18194j67638K3205p924k40584m5015J33463p365J22337k08864K60311
17926B95898N8274j98780J28845l28315K50372j40589o5482l7835J59041j51277
17916b9848R3868J22311j38438Q8129n708Q8787J85136j91747o6999J6260J04078
$$ plain form
17989 224963 -189191 67723 249042 216332 155272 47110 326972 356399 316371 464335
17979 464335 336658 546067 297669 457989 434953 674659 373164 420820 343030 296481
17969 296481 -37741 182122 249647 153256 -45525 -183741 155094 -68660 41705 39165
17959 39165 58599 38539 106190 71909 101454 174722 115521 182099 124301 345256 453725
17948 453725 304007 300518 210673 267236 212726 329783 184542 249420 226253 286279 215778
17937 215778 433972 266334 289539 281615 41031 -3984 129479 122114 244451 35587 295898
17926 295898 354172 155392 284237 -44078 206294 65705 223 -37612 121429 -29848
17916 -29848 64020 186331 47893 136022 130314 219101 404237 212490 145491 161751 265829
17905B65829N0002j20460M0348Q2092j75935J58416r8163L3868j09469O8591R4787
17894B89906K1876j36750N292j94394J63277q3817k6385L6598q830L84652o23466
17883a72041K76932J713J45582k44114J39144r2363M7997L6017R8758k5446j42982
17872F9197J21150o3893j23171O1636K19830n6722P7026k60398N1078j33469J43617
17861A05881j13329L07681j7766J4807J01129P6694l26748N2060p8963j1276Q1802
17850A91972O4962j93741J2055p9116r2856J4032j32809K97926j14377K02256
17840A70304j39491J16430r7669q398J31931j62803J0772J86190p4813o6291J05885
17829A72047K0291j4522r9720J3972r4000k647Q2570J53591J45211k25215K4473
$$ plain form
17905 265829 315831 195371 235719 317811 141876 300292 202129 235997 126528 195119 289906
17894 289906 311782 175032 180324 -14070 149207 65390 39005 75603 66773 451425 -172041
17883 -172041 104891 106604 252186 8072 147216 54853 102850 138867 237625 212179 69197
17872 69197 190347 126454 3283 64919 284749 228027 305053 44655 95733 -37736 105881
17861 105881 -7448 300233 282467 297274 398403 475097 148349 200409 121446 110170 191972
17850 191972 256934 63193 75248 -3868 -96724 -82692 -215501 82425 -31952 170304
17840 170304 30813 147243 49574 41176 173107 10304 21076 207266 132453 66162 172047
17829 172047 192338 177816 78096 92068 -1932 -4579 77991 231582 376793 151578 176051
17818A76051P2544n5380j31485q8227J64856Q8400j61347R7821l4323J32051j77336
17807H3625l9550J27516J49512k36423k57008L84187k06455O3547K42397m06429
17797i5081l7514L16401q9257l0472j04143J55016k07888J5966N0293K02079j97203
17786b1803j34156J12646J14044J8035p3530r6398K5994k7799J75636k07844K2026
17775i3149O5892J1308j71711L24970l85984M03363k07492M1372M4941Q0977k41178
17764a26691K27327K2321j26936j87812K41841J48728k9656m13631K51005J89182
17754A95678l04232L12996l69610P3190O6791K73800l88000K92035j10583L0521
17744G2586k12627K33829j8120m2997m2589K43546l47920J76128j96353M2794
$$ plain form
17818 176051 248595 193215 61730 -26497 138359 226759 65412 163233 128910 260961 83625
17807 83625 44075 171591 321103 84680 -172328 211859 5404 68951 311348 -95081
17797 -95081 -132595 183806 94549 64077 -40066 114950 -92938 -76972 -26679 175400 -21803
17786 -21803 -155959 -43313 70731 88766 15236 -81162 -55168 -82967 92669 -115175 -93149
17775 -93149 -27257 -15949 -187660 137310 -248674 154689 -52803 -11431 33510 114487 -126691
17764 -126691 100636 122957 -3979 -191791 50050 198778 169122 -244509 6496 195678
17754 195678 -108554 204442 -165168 -91978 -25187 248613 -139387 152648 42065 72586
17744 72586 -140041 93788 75668 32671 -9918 233628 -114292 61836 -134517 -91723
17734i1723j57472J10447l9279K23397N609k04998K45136j33454L9840K21523
17724B19026k47620M9253K15681j81214m3379k19821K86875J41260k17039O9587
17714G2609n8423l8677N4640J02126o387j83361O7250J69563k23035m011O4494
17703A6788M9159n0509J0762J07881o412k73015K04310m419n4563p8694J60511
17692H1799o0871j8215l2156P5764j9916M7613J49800l16207J81060p9356N5250
17681F4565j60421L69113j34536k89268L6600J37649J34010k01072K677J88766
17671A48083N2056j20184K7746J1210l3525k65924L89856l54854K39617o8964
17661B5117j37279Q6953O3291M2884m7095n2949r3738J00978J43395l2350j829
$$ plain form
17734 -91723 -249195 -138748 -178027 45370 50979 -154019 91117 -42337 -2497 219026
17724 219026 -28594 20659 236340 55126 11747 -208074 78801 220061 3022 72609
17714 72609 14186 -24491 30149 132275 125888 -57473 9777 179340 -43695 -47706 16788
17703 16788 65947 15438 26200 134081 127669 -145346 58964 54545 -18 -78712 81799
17692 81799 20928 2713 -29443 46321 26405 74018 223818 -92389 88671 9315 64565
17681 64565 -95856 273257 138721 -150547 -113947 23702 157712 -43360 -40683 148083
17671 148083 200139 79955 107701 118911 85386 -180538 209318 -145536 94081 25117
17661 25117 -112162 -25209 38082 80966 33871 -19078 -112816 -11838 131557 99207 97378
17650I7378j77436K05707K6495j16967O2498J43695k13895m4082l3936J76094
17640A25551k61686L52497l14989j497K15932l46174K13880r751P6826J31799
17630A82388j06808q857j34928K13133j12369J8884K8982m2594P4781j69356K79963
17619B23219j82838l857r7110J13815k30988J71452l4561M08994j91624R8016
17609B74518l37737K52456l3559k61215N1776M2173K3283l6611J53869o5495J435
17598F4893m8527R6618k23404J04371j79509J61328J1400m2699P5611K8954j21196
17587g2160P2900j17665m5916K48853j46965r095L5031j70078J63114R8192k45425
17576a89214K65478l07874J88087n5513K9401N0619k33875J59101R3088P7132
$$ plain form
17650 97378 -80058 125649 152144 35177 97675 241370 27475 -16607 -50543 125551
17640 125551 -136135 216362 -98627 -100124 115808 -230366 -16486 -26237 50589 182388
17630 182388 75580 66723 -68205 144928 32559 51443 80425 37831 112612 -56744 223219
17619 223219 40381 36524 -60586 53229 -177759 -6307 -40868 368126 176502 274518
17609 274518 -63219 189237 155678 -105537 -53761 -11588 11695 -24916 128953 63458 64893
17598 64893 16366 112984 -110420 -6049 -185558 -24230 -12830 -55529 20082 49036 -72160
17587 -72160 740 -116925 -162841 86012 -60953 -70048 -35017 -205095 -41981 56211 -189214
17576 -189214 76264 -231610 -43523 -99036 -69635 -19016 -252891 -93790 -702 76430
17566G6430R807r4576K86881k92121K8971k09653J37135N1678J665Q540j7387
17555a2630j33137Q8225N4711J03414j91981J57429j23238q4677O1261J90212
17545A09589m2103j86295p4241O7992L72981k51680j58177K77698j11406N0394
17535E4752Q4711q3008M1330j09664L0596M1895l68l05271n2045J81383Q4708
17524c0981M0092j16131k883J39538O9563L3356o8320j30785Q1835M7410j55352
17513i2658J20792q5346K02496q4706p4354K3287l24981L32047J20439n6549L6263
17502A16730k46758L9265j2532J66317J08170j23665n5147K99591p7483l14177
17492i9689J8664K9010r0452J16793k19996K38279m1311O4140l7396j23094K7546
$$ plain form
17566 76430 86237 -8339 278542 -13579 15392 -194261 -57126 -5448 -3783 4757 -12630
17555 -12630 -145767 -57542 -2831 100583 -91398 66031 -57207 -141884 -80623 109589
17545 109589 67486 -118809 -193050 -125058 247923 -3757 -161934 115764 4358 54752
17535 54752 139463 56455 97785 -11879 18717 60612 60244 -245027 -297072 -115689 -30981
17524 -30981 9111 -107020 -109903 29635 99198 132554 64234 -66551 15284 62694 -92658
17513 -92658 28134 -57212 145284 60578 -13776 9511 -315470 16577 137016 80467 116730
17502 116730 -130028 -90763 -103295 63022 171192 47527 -7620 291971 214488 -99689
17492 -99689 -81025 -52015 -142467 -25674 -245670 -7391 -48702 15438 -21958 -145052 -117506
17481a17506k0010K48422j44252o8726J98199j91769K526J33578q1619K05297
17471A64140j90412o2731J66115J35319j39528m6295O9505J03197j35164J25191
17461A89337l38535J34321J94382k80746j19497R2982K34152R7231k69874O8862
17451B615O1394k50498P8824j68608R8028r3470M14047l11428L5812j96327M96223
17440A66612k29307p9259O0334n1724J52955J49682l02339J78857j17411P7205
17430E605j803q4185K74565r4769k12284J05954R1986k46967O7555J0816R7147
17419A3620K1990n8258K2382m3544K8933J68010j02168J86732j89823Q3159k70478
17408a39445J97064J92180l68170j49072K82786p4832j59916J57830j33755K38741
$$ plain form
17481 -117506 -137516 110906 -33346 -102072 96127 -95642 -93116 40462 -41157 164140
17471 164140 -26272 -89003 77112 212431 72903 26608 96113 199310 64146 189337
17461 189337 -149198 -14877 179505 -101241 -220738 -127756 106396 203627 -66247 2615
17451 2615 64009 -186489 -107665 -276273 -178245 -271715 142332 -169096 -133284 -329611 166612
17440 166612 -62695 -141954 -81620 -133344 19611 169293 -133046 45811 -71600 5605
17430 5605 3802 -80383 194182 99413 -112871 -6917 85069 -161898 -94343 -83527 13620
17419 13620 35610 -22648 -266 -43810 -14877 153133 50965 237697 47874 131033 -139445
17408 -139445 57619 249799 -118371 -267443 15343 -59489 -219405 -61575 -195330 43411
17398D3411r3938j8779K01830j54190J1566n3707J49538r6761K5382j5040p0482
17387g1170K5264Q6729k04525J39207Q1414j1618q4958k5890m7616Q8119N73k66935
17375b91406K02069N6925m4834J11721l41898J71816J46642k61536N20584j34750
17365A35333j16885J51725j10657l0943p7694K16745n736n8356L4281j71178L7094
17354C729K43654k64654N7883k87798M41234k95419K24037m3174q0200J23938
17344A23230j28227N437K41101p4735k46370J23406k13686K07998n7336j2364
17334c1546Q5646l3972k34865K83198k14112p8439K88233k69860o4734K89460
17324A9009O041j45113J6945Q0444k50223K78229r3364P9889O0865o7674j02668
$$ plain form
17398 43411 -50527 -69306 132524 -21666 -10100 -63807 85731 -11030 14352 -688 -71170
17387 -71170 -45906 40823 -163702 -24495 56919 45301 -39657 -65547 -113163 -25044 -24471 -291406
17375 -291406 -89337 -32412 -77246 34475 -307423 -135607 11035 -250501 270083 135333
17365 135333 18448 170173 59516 28573 -49121 167624 161888 103532 137813 -33365 3729
17354 3729 247383 -17271 40612 -247186 194048 -101371 122666 79492 -708 123230
17344 123230 -4997 440 241541 166806 -79564 43842 -169844 38154 -19182 -31546
17334 -31546 54100 20128 -214737 68461 -145651 -224090 64143 -205717 -270451 19009
17324 19009 25050 -120063 -103118 -22674 -272897 5332 -88032 -8143 52722 -14952 -117620
17313a17620q6152J34952l0167j6557N6767J37838k03936N5277k21104K21873
17303f8829j81349J35753j58820K78736o6220n8891J29038l7588o0961N5233M5049
17292A1151k9324r2612K82207l59908J56276K54k03281P595L91634k61258j49273
17281b46539L50292k05985J41370k3189j28972j9098J24309L5369Q074k31481
17271a95850J54273j78924R4645L2792p4823L3250Q1094o6134J77275J06852l48268
17260a83818n731J92378l19553K23047L04668l08633p2642J30229K1567J82753
17250A64265k29432J98998k58582K37256l25493K22815m5493K7315q0732J57969
17240F8886O7310k55492J16407j53989J2618R1279o0206J08099M9194j35292M6144
$$ plain form
17313 -117620 -203772 -68820 -98987 -115544 -58777 79061 -124875 -69598 -290702 -68829
17303 -68829 -250178 -114425 -273245 5491 -60729 -119620 9418 -28170 -89131 -33898 11151
17292 11151 -18173 -110785 171422 -188486 -32210 -31956 -235237 -227642 163992 -97266 -246539
17281 -246539 103753 -102232 39138 15949 -113023 -132121 -7812 27557 35631 -195850
17271 -195850 -41577 -220501 -125856 -93064 -167887 -134637 -53543 -119677 57598 164450 -183818
17260 -183818 -189549 2829 -316724 -93677 210991 -97642 -170284 -40055 -18488 164265
17250 164265 -65167 133831 -124751 112505 -212988 9827 -35666 -8351 -89083 68886
17240 68886 136196 -119296 -2889 -156878 -144260 -52981 -113187 -5088 44106 -91186 -45042
17229d5042P2400n0083j83243J30237q6447L40928K2954k61491Q7771r860j23743
17218a05619O4372r1023J42668M6981l68369K31808J8702k6871P0232J1463p9400
17207h5056r3112J03215J67360p2544k0355L0401J52505r2569k45433J88864K4744
17196E8020k05332L8333j0545j8092J45782J70011j24623k11914J10886o8297
17186a15771q8560Q2812M2774R103j16144J14794j6365l4158J30353J16026k07444
17175h2580J70087k08501J30030j0653o0694J66688j57972r8989R6798j30444
17165a86230J2695j21741K98006k94419K06997J15909q1617J84556k4630k12663
17155a03137N2277L25857n0170k64927J68289j14954J03395J03005j53654Q4886
$$ plain form
17229 -45042 27358 -22725 -205968 -75731 -162178 178750 201704 -59787 27984 18124 -105619
17218 -105619 -41247 -132270 10398 57379 -310990 -79182 -60480 -87351 -17119 -5656 -85056
17207 -85056 -178168 -74953 92407 19863 -492 29909 182414 89845 -155588 33276 58020
17196 58020 -147312 -108979 -119524 -137616 8166 178177 53554 -158360 -47474 -115771
17186 -115771 -204331 -121519 -78745 -69642 -185786 -70992 -87357 -121515 8838 124864 -82580
17175 -82580 87507 -120994 9036 -1617 -62311 104377 -53595 -152584 -55786 -186230
17165 -186230 -173535 -295276 2730 -291689 -84692 31217 -50400 134156 109526 -103137
17155 -103137 -50860 274997 224827 -40100 128189 13235 116630 219635 65981 150867
17145A50867p2454l5120J08454r8992r704J6844p841M0655j23799K8921q0852
17134h3021M5120n8409R4566k17700J46096K4490K06955l70943J82204N9661k3482
17123E537P4999r2664J0968j53509L98275j04554o6441j14077J46950j45588k21647
17112b61751K56799O5822k59408K69323J67456l68205O3739K24906n0214O2563
17102A71030j15877m0149r4130K4683n8249q4112O9273J01334j0034l0092O5862
17091d61J61632j03055j41283o1216K79671k35616J56527j6054j01414J84252
17081A22983k47019K64678k12015m1759J70520M8597j22861J5557j45905Q6958
17071f0266p027K30194l24505K67677m65564N52132L213l19467M21590l37715
$$ plain form
17145 150867 78413 43293 151747 52755 43051 59895 52054 92709 -31090 -2169 -83021
17134 -83021 -37901 -96310 -1744 -219444 -73348 -48858 158097 -212846 -30642 29019 5537
17123 5537 80536 -12128 -1160 -154669 243606 139052 72611 -41466 105484 -40104 -261751
17112 -261751 -4952 60870 -198538 70785 238241 -129964 -66225 158681 108467 171030
17102 171030 55153 15004 -79126 -54443 -112692 -196804 -127531 -26197 -36231 -66323 -461
17091 -461 161171 58116 -83167 -144383 135288 -100328 56199 40145 -61269 122983
17081 122983 -124036 140642 -71373 -113132 57388 105985 -16876 -1319 -147224 -60266
17071 -60266 -67293 162901 -161604 106073 -359491 192641 195854 -123613 297977 -39738
17061c9738l1934K22840P4875k80933j29938L69958j90350k23841J99233L0253
17051D25o4471J50421j5847n1412j18639O6440k04886K41043j61893J20900j85335
17040b23254K05877j02505J45830J50929k03470M0215q3433J17991n4452j46731
17030a53003O4224K24369k32800n2086J13142L2100J76205l69732K13369r3422
17020g7634J79777n0929n9824Q4478q4561P6780q6060j57931J88762k30351K36056
17009A8563n0053Q7940k9303j26269o0050P9042O3047r5301K07553j52511O4102
16998F760k20238R1335J80052k20362n229J02730R7488p8457k976P7755l07125
16987b78267M55352l46497N5764J21508p1166K03804J77144j69441L7289J65172
$$ plain form
17061 -39738 -71672 151168 226043 -54890 -184828 185130 -5220 -229061 -29828 425
17051 425 -64046 86375 70528 19116 -99523 -33083 -237969 3074 -158819 -37919 -223254
17040 -223254 -17377 -119882 25948 176877 -26593 13622 -69811 48180 -6272 -153003
17030 -153003 -88779 135590 -97210 -149296 -36154 -4054 172151 -197581 15788 -77634
17020 -77634 102143 51214 -8610 75868 -8693 68087 -17973 -175904 12858 -217493 18563
17009 18563 -31490 56450 27147 -99122 -159172 -80130 -17083 -112384 95169 -57342 6760
16998 6760 -213478 -122143 57909 -162453 -167682 -64952 32536 -45921 -48897 28858 -278267
16987 -278267 177085 -169412 -113648 7860 -63306 140498 317642 148201 185490 350662
16977C50662J03895j78104m5438O3911j11303M6431m7879K5207j66738J11492
16967A52136J20060j99275J05839o3368j40254J49188J658k11503K02073Q5781
16957B02335j72802j1539J4328j85069K93060j16238o459l5423M2589p6733J79077
16946A27126j68991J71647Q5023k78028j13673L54937k70763p8195K29121o0354
16936b150J46491k22086O3601J45372k79743J11504K5602L9416J7754m0898O2102
16925F6965j18147j44372K17246j4467J57934l2774k98518K10550j60876j06768
16915b23227K6013P4198Q1182K32998l07552O2181J4703j18059J83499r8024J00115
16904B8027j16655L1643K72217k33038j20198L3223J04967k773p7834Q607J53182
$$ plain form
16977 350662 454557 276453 231015 294926 183623 230054 182175 207382 40644 152136
16967 152136 272196 72921 178760 115392 -24862 124326 125984 -85519 116554 202335
16957 202335 29533 17994 32322 -152747 140313 24075 17616 -17807 24782 -51951 127126
16946 127126 -41865 129782 214805 -63223 -176896 178041 -92722 -170917 58204 -2150
16936 -2150 144341 -77745 -14144 131228 -148515 -37011 -11409 28007 45761 4863 66965
16925 66965 -51182 -195554 21692 7225 165159 132385 -166133 44417 -116459 -223227
16915 -223227 -197214 -123016 -41834 191164 -116388 -54207 -39504 -157563 25936 -72088 28027
16904 28027 -88628 -56985 215232 -17806 -138004 -104781 186 -2587 -80421 -71814 81368
16893H1368j17331J62667K5012k09236J24189J18220k7159p8413J9778n5657k5017
16882A8421J62649k89962K11307j01273J28583j0764j77380n0984J12941j94418
16872a90880J99896p4116Q8029Q4363M523j49776K8364K5347r9271O9292J8772
16861D543m6949q1656K84379p5589j17190L9571O9403R5718M4866j45281k00753
16850a28938J43519Q5701m53724L63058M2970j9643j0085q8015k53839O36038
16840C17042l86997n7708N5905l5780Q4840J21168j99804k2399k41264K84669
16830h0328J02475l2753K80813j97403l3856M4605l9914J26480m1185N8992k32228
16819d4302J8799k0765J1137L1891j39184l4760J61086m2906r089O6151L7913
$$ plain form
16893 81368 -35963 126704 151716 -57520 66669 184889 157730 79317 99095 43438 18421
16882 18421 181070 -108892 102415 1142 129725 118961 -58419 -109403 3538 -190880
16872 -190880 9016 -65100 22929 107292 111815 -37961 -9597 15750 -83521 -14229 4543
16861 4543 -42406 -124062 160317 84728 -32462 7109 76512 172230 217096 71815 -128938
16850 -128938 14581 100282 -353442 9616 52586 32943 22858 -65157 -318996 317042
16840 317042 -69955 -127663 -71758 -107538 -22698 98470 -101334 -123733 -364997 -80328
16830 -80328 22147 -10606 270207 72804 38948 83553 43639 170119 128934 187926 -44302
16819 -44302 -25503 -46268 -35131 -3240 -142424 -177184 -16098 -59004 -68093 -1942 35971
16808C5971P140k1208r5422j04342K69156k49317j71631M72960L7984k32106J39344
16797H8529N2237j25431K36p8647q2888J95414j3148q733j92722R4584o8214j59268
16785b98051K67636J87029j39433k45844J20001k15524M16682o762J07985k92263
16775i8544J32163L8438k18643M13470j86321j00334J16042n7427j1564k1319
16765E961M7970j05029K0173K86054m02666K57158l67571M64263n3637j56477
16755c801j98681J46472M3824J15333j54622J02958P7548k14053L45703l28283
16745f7602J0903j22356L64218r1303k05599K43987o9496m7500j77771J82074
16735A9555l952K96728m00072Q4719m1847O8859j29688Q2319Q1984N6835o9081
$$ plain form
16808 35971 43111 21903 -73519 -177861 91295 -158022 -329653 143307 181291 -50815 88529
16797 88529 140766 15335 15571 -63076 -145964 49450 36302 27569 -165153 -70569 -138783 -298051
16785 -298051 -30415 156614 17181 -228663 -108662 -324186 92496 85734 193719 -98544
16775 -98544 33619 72057 -146586 266884 80563 -19771 96271 38844 27280 5961
16765 5961 53931 -51098 -30925 255129 -147537 109621 -257950 206313 152676 -3801
16755 -3801 -202482 -56010 -12186 103147 -51475 51483 129031 -85022 260681 -67602
16745 -67602 -56699 -179055 185163 93860 -111739 132248 62752 15252 -162519 19555
16735 19555 15603 312331 -87741 -3022 -44869 23990 -105698 -23379 58605 115440 46359
16724D6359r4684j63158K89866J60875j14879j47214j21225j2613L82426l14707
16714h8954L4648J44887k18452J64634k70108K01381l1237n8672J67793O7489
16704A13409n1034j08991q0145L12747l52836M49063l97417R5546r6658R5983
16694b0333j11436N2699J19270j31496K63056l8552l28628J24067J24432O032
16684E9111k03534K73876k63556j6239J33759K05452j09494O8778k06482r8383
16674a56712K06629k77608K72241K3924r8934p1834J50713J3699j60331M9855
16664d8358m4497L3563P1373q2976j13981P3214K35405o4194n1556j74567J74191
16653G617q4395o0146R0487M3938l2100J49001q4560O4086j48673N240m9682j55750
$$ plain form
16724 46359 -48325 -211483 78383 239258 124379 -22835 -144060 -156673 225753 -88954
16714 -88954 -54306 90581 -127871 36763 -233345 -31964 -63201 -121873 45920 113409
16704 113409 62375 -46616 -126761 185986 -166850 282213 -115204 -19658 -116316 -20333
16694 -20333 -131769 -79070 40200 -91296 171760 133208 -195420 -71353 53079 59111
16684 59111 -144423 129453 -134103 -150342 -16583 188869 79375 148153 -58329 -156712
16674 -156712 49917 -227691 44550 68474 -30460 -102294 48419 62118 -98213 -48358
16664 -48358 -92855 -59292 12081 -70895 -184876 -111662 123743 59549 7993 -166574 7617
16653 7617 -76778 -136924 -46437 -2499 -34599 114402 29842 93928 -54745 -49505 -99187 -254937
16641b54937l0034K30698K21445k32916j7189M2827k92r8609m5510N9199K01664
16630G6346j26105J9534p3472J72818K0094j42454k1085J0439j73525K10297j44044
16619a71157J54831J71449o1691j32034k25595K79114k60446K15344O779k5214
16609d8620k26046K31356l9872L32009n44311K24162K3041Q0749j78927J70978
16599B4519m15971L63701l9516p1447J28510M686j45577p1046R9238K9649j39513
16588b32767O3659J39762k371q8346k38029K55423O9622o4811l30269L60425k8342
16577i6044j69101m5648J34419l6985J71811j5472R2026j73243n5509q3560J14951
16566a62355Q7680J43931P5696m30898L01252j0329P0990p0342J42754q6845j13209
$$ plain form
16641 -254937 -284971 -54273 167172 -65744 -82933 -40106 -40398 -139007 -184517 -125318 76346
16630 76346 -49759 -30225 -103697 69121 89215 -53239 -74324 -63885 -237410 -27113 -171157
16619 -171157 -16326 155123 93432 -38602 -264197 14917 -245529 -30185 -23406 -48620
16609 -48620 -274666 -43310 -83182 248827 -295484 -71322 -48281 32468 -146459 24519
16599 24519 -391452 -27751 -67267 -138714 -10204 -5518 -151095 -222141 -122903 -93254 -232767
16588 -232767 -169108 -29346 -31717 -120063 -358092 -102669 -33047 -97858 -428127 -67702 -96044
16577 -96044 -265145 -310793 -176374 -213359 -41548 -57020 35006 -138237 -193746 -277306 -162355
16566 -162355 -74675 69256 144952 -285946 15306 4977 75967 5625 148379 61534 -51675
16555e1675J17669q7293J15223j93421J98734l50693K41900J31604l16346J21003
16545g3295l9208J43621j46382R0445j08740j5262o4669J6975M23467j85418j10764
16534f9230q4698m3915l7975L18918k48843J42774o1487M3905o5440Q1156l5925
16523f0760Q2322j8305k95594K97790k9336L800J1011q4340M4750N670k8250P7137
16511E895l01442L63326Q1027k66641K8643M9259J0308q2559J72247k57127J67021
16500c0043J31506k12040Q8637k81548M2846M7404M79687j90063k21028L610J4108
16489a26924M19367l11411N6359l72512K01113L08384j14887j60117K06530j43339
16479c7437j18074J46391j92094o2163L56265j0503j99932q1150K6585J71140
$$ plain form
16555 -51675 65994 -21299 93924 -99497 99237 -251456 -9556 122048 -194298 -73295
16545 -73295 -112503 31118 -115264 -24819 -133559 -148821 -213490 -196515 226952 41534 -69230
16534 -69230 -153928 -197843 -235818 83100 -165743 -22969 -84456 -40551 -105991 -24835 -60760
16523 -60760 21562 3257 -292337 5453 -23883 -20083 -9072 -93412 -48662 -42992 -71242 5895
16511 5895 -295547 67779 148806 -117835 -89192 -39933 -29625 -112184 60063 -197064 -30043
16500 -30043 101463 -110577 -21940 -303488 -260642 -213238 266449 76386 -144642 -141032 -126924
16489 -126924 292443 -18968 37391 -335121 -134008 174376 59489 -100628 105902 -37437
16479 -37437 -155511 -9120 -201214 -263377 92888 82385 -117547 -198697 -172112 -972
16469i72j37866J11529J3376K5303n1080k3207O3783j33097Q595m0086Q1393p5362
16457a57691N1747K26603j04648j99678M1030J36718K3995l04416L38758J43644
16447A96062k68420K10032j08401k959j85091l557M43293l10951m5497R213J16805
16436E0529k71807j4628p13Q2774l5820J36018r0556m0310J01822J4350P5246
16425F905q6557R1426j19153K93545k44764O3816k34511o4713J55467L02664k50872
16414h6747K5090R1715N0510k24403k6093O4181J9168N5069j00317N6459L5230
16403d0138Q1980K1641m0156o7757q9220Q2678j73706M13163m05818L22805l78163
16392b72691L88473l69048M16272l70982L71329j012809R99405j221274q68623
$$ plain form
16469 -972 -138838 -27309 -13933 11370 -39710 -62917 866 -132231 -123636 -163722 -82329 -157691
16457 -157691 -105944 120659 16011 -183667 -142637 -5919 18076 -286340 52418 196062
16447 196062 -72358 137674 29273 26314 -158777 -162334 280959 -29992 -75489 -66276 50529
16436 50529 -221278 -235906 -236619 -153845 -189665 -53647 -144203 -184513 -82691 -68341 6905
16425 6905 -79652 11774 -107379 186166 -58598 5218 -229293 -294006 -138539 164125 -86747
16414 -86747 -61657 30058 80568 -143835 -169928 -105747 -86579 -31510 -131827 -75368 -40138
16403 -40138 41842 63483 23327 -44430 -133650 -50972 -224678 188485 -217333 105472 -272691
16392 -272691 115782 -253266 163006 -207976 163353 -849456 149949 -1071325 -1939948
16383a939948K983682j286518P92425m94514J06102m59434N53446l71161L16365
16374B00445j34627r6235J42770o5014k05335J25537J56747J82656k87968J80759
16364A99735n26487M83702j1722j67205l403J2466j5930k941k7376J13718K22325
16353B76882k36218M1243O8892n2849N1107j36374j50664J46866j19608J3556
16343i7167L3865J81203q3361O6344p6431j38182P1981R9692N1586k9221n6591
16332B3718R9415j61286j0998L49686J41724l43711M7230k28873J08876J16931
16322A42712p9088J13665j58540N9220n9432j86752L13383j51430Q0156k23537
16312a49643L17974j83795O6810o6569J03460j08302J83284k22779J11714j33502
$$ plain form
16383 -1939948 1043734 -242784 549641 55127 161229 -298205 255241 -115920 200445
16374 200445 65818 -30417 112353 47339 -157996 -32459 124288 306944 18976 199735
16364 199735 -326752 156950 145228 -21977 -25380 -12914 -28844 -31785 -59161 54557 276882
16353 276882 40664 81907 150799 97950 149057 12683 -137981 8885 -110723 -97167
16343 -97167 -63302 117901 34540 100884 24453 -113729 -41748 57944 109530 80309 23718
16332 23718 123133 -38153 -49151 300535 442259 98548 145778 -83095 25781 142712
16322 142712 63624 177289 18749 77969 18537 -168215 145168 -6262 73894 -149643
16312 -149643 168331 -15464 51346 -15223 88237 -20065 163219 -59560 52154 -81348
16302h1348m8097j8629K18754Q2454j61332J3646l41444N89139k89605O6929K11040
16291B41507k61877J8616j1841J01044k9770j13428N4509k68140K95757m9521
16281b3144k38930K71509k57717J66472R6140j9590j6670j31182J42049m5690
16271e6753m7338K7428K03507l23189M2864L01305j32195j21310r2634M9726K68059
16260A19470m10285K02113K3531J04736l5825J48307J00102k5981k03791j27670
16250a05293P0458O1461j97472M5683J66044q284J75081j88182L4828j44640J65739
16239G5423k68585J82974J85016p0582p5603J69419j00176j42683J99709l13354
16229a58442J49972j80685O0898L5503q0685q2807o0034L77405j7867p1471l8876
$$ plain form
16302 -81348 -129445 -148074 70680 153134 -8198 5448 -335996 253143 -36462 30467 241507
16291 241507 -20370 -1754 -13595 87449 57679 -55749 -1240 -269380 26377 -23144
16281 -23144 -262074 9435 -248282 -81810 14330 -5260 -21930 -153112 -11063 -56753
16271 -56753 -104091 -76663 126844 -196345 -153481 147824 15629 -105681 -198315 -148589 119470
16260 119470 -290815 -88702 -65171 39565 3740 152047 252149 226168 22377 -105293
16250 -105293 -34835 26626 -170846 -125163 40881 32597 207678 19496 54324 -90316 75423
16239 75423 -193162 -10188 174828 104246 28643 198062 97886 -44797 154912 -158442
16229 -158442 -8470 -189155 -128257 -92754 -173439 -256246 -316280 61125 43258 -28213 -67089
16218f7089P6696N5309j02229L1976j53400J07495j14789K79776O5527k32086
16208e2814M6455m6563n1127J73369j6703p6845J17458k7732q9297o3789J69386
16197H1798j14047j03046J62540j08088O1622q0387K78990j10817k02607j33558
16187b67600Q8153J13052j25243J48546l04665L39747j63241N0589j1512Q1510
16177e0664j47270K55056k6716P5358k68769J22231k0232Q332Q1256M0245r8585
16166b9758n3317M7813J84595l41502K17808n8439J49945j35990k5494O824l89
16155c7904N9812k60755K65399K04604j78842O901M9304J33373k89679J34149
16145H6362l0528j1852j4646Q9622j21644K5495j49682J65281l19938K28784R3330
$$ plain form
16218 -67089 9607 64916 -37313 -5337 -158737 -51242 -166031 113745 179272 -52814
16208 -52814 -6359 -52922 -104049 69320 52617 -24228 93230 65498 -23799 -87588 81798
16197 81798 -32249 -135295 27245 -80843 -19221 -99608 179382 68565 -134042 -267600
16187 -267600 -179447 -66395 -191638 -43092 -347757 -8010 -171251 -120662 -132174 -50664
16177 -50664 -197934 57122 30406 105764 -163005 -40774 -61006 -52674 28582 68827 -29758
16166 -29758 -83075 -35262 149333 -192169 25639 -32800 117145 -18845 -44339 -37515 -37904
16155 -37904 21908 -238847 26552 231156 52314 59215 108519 241892 -47787 86362
16145 86362 55834 43982 29336 118958 -2686 22809 -126873 38408 -281530 -52746 40584
16134D0584O6452j44961J64052n6466l2145L0307j09734J04383l1367q4616J12544
16123E9033J07710m1590j47804p815R3010m8526N8921k2147l402p0789J46718
16112A23319k59111J43304J51233j20656q2321J56064o0549j28557J07110k18507
16102a88671J26905K04020o0792J20051k03192q8006n6166L65950k79008J1408
16092d7501k11782L19998k23515k4113L2681L14462k3777j27461k91206K47609
16082c4605J04885q3590J3410J06093k42520K39622k34618p5088j9828K83092
16072E6853q7994j28984K25324l9545j39162J65199k68525M50670k84746j1027
16062f1937Q6936J09419j55987n0469P2175k24435K61413k58984K59363K52694
$$ plain form
16134 40584 107036 -37925 126127 69661 37516 67823 -41911 62472 31105 -53511 59033
16123 59033 166743 125153 -22651 -30466 62544 14018 72939 50792 47390 -23399 123319
16112 123319 -135792 7512 158745 38089 -44232 111832 51283 -77274 29836 -188671
16102 -188671 -61766 142254 81462 201513 -1679 -89685 -145851 220099 -58909 -47501
16092 -47501 -259283 60715 -162800 -186913 -154232 160230 136453 8992 -282214 -34605
16082 -34605 70280 -13310 100 106193 -136327 103295 -131323 -206411 -226239 56853
16072 56853 -31141 -160125 65199 25654 -113508 51691 -216834 233836 -50910 -61937
16062 -61937 24999 134418 -21569 -72038 137 -224298 37115 -221869 37494 290188
16052B90188l04080J20869j77072l7427N5659j53245K17847p7938J67651j58318
16042e5866j46970K24177j79756J26816l9371m0614J33430r7831K16102k19890
16032g9773n9608M5704O5185j33900K76702r0399L2781J8476k28373l7149J67814
16021b2540l2772j42471L08430l15580K09457j15203K1203J30278j35998J60890
16011F5694K030j67061l6814K26899p1622j38138J18327j09522K14771j18471
16001a3907L9192O196k5846J72057l75134J22038K8155m1734J92507l36556L29916
15990I6884k39014K22452p7754P2532r3519j84781L469o1192L92482k16515Q4742
15979b14J00770p4050m236j09184J51229j15638q1206J63230J42174r3579j61305
$$ plain form
16052 290188 -13892 106977 -70095 -107522 -51863 -205108 12739 -65199 102452 -55866
16042 -55866 -202836 21341 -158415 -31599 -70970 -111584 21846 -75985 140117 -79773
16032 -79773 -139381 -93677 -28492 -162392 114310 23911 56692 75168 -153205 -190354 -22540
16021 -22540 -55312 -197783 110647 -204933 4524 -110679 -89476 40802 -95196 65694
16011 65694 67724 -99337 -136151 90748 19126 -119012 -685 -110207 104564 -13907
16001 -13907 25285 31481 5635 177692 -197442 -75404 -47249 -88983 103524 -233032 96884
15990 96884 -142130 80322 2568 75100 -18419 -203200 -199731 -260923 131559 -84956 -214
15979 -214 100556 26506 22270 -86914 64315 -51323 -132529 30701 172875 79296 -82009
15968h2009l3928L6033R6780j46782J13429P4728n6201j5936K13755m58618K53472
15957e277L408L4621K9240k07560J97169j30456p1420J94488l30673L01521k90240
15946b75179K35881o8961J11103n1848J37705l04484L69479p0922j19384o4515
15936a01125k0028L84599m74400J56090J46816k74224K07702N40j40686O4729
15926d9987J13692P859k14543L18185j12473k07926K70132K7125j64474O0176
15916D7766j36410p1616J12134k44855N31665k42293j20890Q8658k53172K02236
15906h6777L02399k43873r2840J08914j25460K76790j16954N8527k08516m8711
15896a76501K04366j24273J40176J9501k31986K57443k29726P6708O1050L0256
$$ plain form
15968 -82009 -115937 -79904 16876 -129906 -16477 58251 2050 -13886 199869 -258749 -5277
15957 -5277 -1869 32752 61992 -145568 51601 -78855 -150275 44213 -286460 15061 -275179
15946 -275179 -39298 -108259 2844 -49004 88701 -215783 153696 82774 -36610 -101125
15936 -101125 -121153 263446 -210954 -54864 91952 -182272 25430 25970 -114716 -49987
15926 -49987 63705 71564 -142979 175206 62733 -145193 124939 152064 -12410 47766
15916 47766 -88644 -160260 -48126 -292981 238684 -3609 -124499 -35841 -289013 -86777
15906 -86777 215622 -28251 -121091 -12177 -137637 139153 22199 80726 -127790 -176501
15896 -176501 27865 -96408 43768 63269 -168717 88726 -141000 -64292 -3242 27014
15886B7014j65494J44711j36646P4084n9048K11510n6693K41299k01359m1637
15876C7741M4107j29486o5753J52404O7447k4940k53377J27505p2372J40968J34200
15865A58444O7529l42456J07978j42267J09022M6961J105Q2872k60052J90719
15855A9855j59026K00431q6931m2817o4187K85803l9797j63425k06038L40773
15845H4641k19807r641K29058k20770J70026n013k86460P3894K04836l10979M68254
15834A78039n8790j09716j8389j66307J1637P0251j9980O761K96677l96781K50254
15823D3656k12527K72516k47951J33573K0149p0426J6849P7813Q3357j50500P2062
15812C8571J6679j88632J44730Q5765k48408K31025N7471l07040J40515O7044
$$ plain form
15886 27014 -138480 6231 -130415 -56331 -115379 96131 39438 280737 79378 37741
15876 37741 81848 -47638 -113391 39013 106460 81520 -171857 -44352 -116724 24244 158444
15865 158444 225973 -116483 -8505 -150772 -41750 5211 6316 89188 -170864 19855
15855 19855 -139171 61260 -25671 -68488 -132675 153128 113331 -50094 -256132 84641
15845 84641 -135166 -144807 84251 -136519 33507 28494 -257966 -184072 20764 -290215 178039
15834 178039 119249 9533 -8856 -175163 -163526 -93275 -113255 -106494 190183 -206598 43656
15823 43656 -168871 103645 -144306 -10733 9416 -61010 -44161 33652 117009 -33491 38571
15812 38571 55250 -133382 11348 97113 -151295 79730 137201 -169839 -29324 37720
15802C7720L805k06051O3599J91271j61612J5308m8382M5539K12832j23749l1048
15791g68o9114J0977K40010l15830J06610k458l3510J27136j4363k74090K9222
15780a96178P6322J4704Q8043q9966j0348J7290J23359o6252L0009j30048k8569
15769a71634N9281q9298J15416k4187J23593N1004k0046j09381l2972J70705P1007
15758A43488k98656O7944J52762L9765n2428j81629Q4839k14690J63904l1022
15748a25723J73151K643l716j23726J28826j90204K24741q2105K74559j80412
15738I8034R1063n38920K57815r0530L78581k76109N6822K5747j32132L493P7904
15727d8232Q3635N4309j5487l5078k19515L36971o9878M0256l7662m69433K04284
$$ plain form
15802 37720 41525 -164526 -100927 90344 -71268 -55960 -104342 -58803 154029 30280 -768
15791 -768 -69882 -58905 181105 -134725 -28115 -30573 -64083 63053 48690 -225400 -196178
15780 -196178 -119856 -105152 -17109 -107075 -117423 -100133 23226 -43026 -13017 -143065 -171634
15769 -171634 -112353 -201651 -86235 -110422 13171 64175 44129 -65252 -98224 72481 143488
15758 143488 -155168 -87224 65538 105303 52875 -128754 -43915 -258605 -94701 -125723
15748 -125723 47428 50071 46355 -77371 51455 -138749 85992 3887 278446 98034
15738 98034 189097 -349823 -92008 -182538 196043 -80066 -23244 2503 -129629 -126136 -48232
15727 -48232 35403 89712 74225 39147 -180368 156603 86725 126981 89319 -380114 -175830
15716a75830n9086L45612n4077p828k2620J01418k00088j9957j0293J79445K201
15705G8897j8531j10286P882K85975k06649J57602j4786k36303J0806L0192r9975
15694a15176k4113L27382r0673j68218l5810J29119r9884K9725j37970J56709
15684b8909r2234L49475k94766n7425K8658P7812j10066j6834M3683K3114L9953
15673c7539P1309o9080K16398j95798o1993J66873Q8455m40779J95354m572N9206
15662a2166p7576J90792k67125K11587N6153m23269K68671K13184j68543j28593
15652a36885j4608o9236J39950N4985J04360k39026L8064K00902m2003j3202N8408
15641H1709n0244k80123K51209k38988R4097j26818P2041r3812K04057J64142
$$ plain form
15716 -175830 -234916 110696 56619 48791 26171 127589 -72499 -92456 -102749 76696 78897
15705 78897 60366 -49920 -42038 243937 37288 194890 180104 -56199 -45393 -15201 -115176
15694 -115176 -139289 188093 97420 -70798 -106608 22511 -77373 -47648 -185618 -28909
15684 -28909 -121143 228332 -66434 -123859 -95201 -17389 -127455 -144289 -100606 -77492 -37539
15673 -37539 33770 -35310 181088 -14710 -76703 90170 178625 -262154 -66800 -71372 -12166
15662 -12166 -89742 101050 -166075 45512 101665 -321604 -52933 160251 -8292 -136885
15652 -136885 -151493 -220729 -80779 -25794 78566 -160460 -122396 78506 36503 23301 81709
15641 81709 31465 -248658 2551 -236437 -142340 -269158 -197117 -290929 -86872 77270
15631G7270l812j86419J40041k19829J15332n5036J31433k00634R4956J2905j06855
15620b00648K23672J25359k08930N1173P8153j71284O4038p94o6337J43697p3326
15609c5227N8483j95563K91035k34535J7052K87255k35423J11420k40341O4729
15599a11115J5619J78023j53517K33235p2929j84840M37773m02946J89512j08191
15589B0624l9417J26313j02045N4708k3981Q4625K4865j52189j94785L49297k53767
15578a05752j50290J98750K64368l01195q6689K99260J20082j71560r1514k02084
15568b26624L03319l1039m1104j47786J76533k21600K13034M6146j37065O4022
15558b164J48597l82115R1861J46259q4825M5423M9981j7262Q6811o7206j6541
$$ plain form
15631 77270 73458 -112961 27080 -192749 -77417 -132453 -1020 -201654 -106698 -93793 -200648
15620 -200648 23024 148383 -60547 -9374 68779 -102505 -38467 -39261 -105598 38099 -35227
15609 -35227 23256 -172307 118728 -115807 -98755 188500 -46923 64497 -175844 -111115
15599 -111115 -95496 82527 -70990 162245 89316 -95524 342249 -60697 128815 20624
15589 20624 -18793 107520 5475 60183 36202 120827 145692 -6497 -201282 148015 -105752
15578 -105752 -256042 -57292 207076 -94119 -180808 118452 238534 66974 -24540 -226624
15568 -226624 76695 45656 4552 -143234 33299 -188301 24733 70879 -66186 -2164
15558 -2164 146433 -235682 -143821 2438 -82387 -36964 13017 -4245 82566 15360 -1181
15547a181q9102k0519k4334p6171J35583l551R4792k35513K75532q4943K9886
15536D79m4565M8139j47466r5293J99319j61319P1956p4783K33437p7107n8501
15525a05704m2252J65772n3390j53633P454M9442J72329Q060k21035K31507P6048
15514A34598k49425l8140K29497q3312j6320j40222j2573q496J36829J19062m9973
15503B1525l4906m8776K7796k5358j68994K87927k46741L32036k03162m1951L00235
15492A99631j43780n3412o979j8323p6985P5425j77230L19876j26477J39207l29447
15481a98494J23619J04510k71367K59900q3211N5812r9148K4708K2151m6356M2069
15470f5807Q8480q2910Q3750j9908N4476k72186o559K88308j52594R7462K2374
$$ plain form
15547 -1181 -90283 -110802 -135136 -211307 -75724 -79275 15517 -219996 55536 -29407 479
15536 479 -44086 4053 -143413 -238706 -39387 -200706 -128750 -203533 29904 -47203 -105704
15525 -105704 -147956 17816 -35574 -189207 -181753 -132311 40018 48078 -172957 58550 134598
15514 134598 -114827 -152967 76530 -6782 -23102 -163324 -175897 -184393 -47564 71498 21525
15503 21525 -13381 -62157 -34361 -59719 -228713 59214 -187527 144509 -58653 -100604 199631
15492 199631 55851 2439 -4540 -22863 -99848 -24423 -201653 118223 -8254 130953 -198494
15481 -198494 -74875 29635 -241732 18168 -65043 -9231 -108379 -83671 -61520 -107876 -65807
15470 -65807 22673 -60237 23513 3605 58081 -214105 -220664 67644 -84950 12512 34886
15459C4886J53499m9335n4429j27830o7606M4356J80630j41468j59319J03767
15449h2849J9589L68091n85054L69453k40268j41180J74876J45668J52221j51043
15439B9504J60250k70550Q330m7833k4384J73678j30661K6585J76712q9385k41325
15428b29079K49313L583O971J39501j95300J70488r1981q1929M7777J15799k56144
15417a21001J29069K7639R1535l31681J07958Q7899N3694j24806R6235J14359
15407A30900r7060O6908k88883J27921q1741L96863l26056L6667J26745r885l9436
15396D2943j28736J31428j20805J5477K0855J03325k90598M06595q1076q9622
15386I786j92071L08670k66848J38433J00777l00701K54300J20085j14599k16158
$$ plain form
15459 34886 188385 139050 84621 -43209 -110815 -66459 114171 -27297 -186616 -82849
15449 -82849 -63260 304831 -280223 89230 -151038 -292218 -117342 28326 180547 29504
15439 29504 189754 -80796 -72466 -120299 -144683 28995 -101666 -75081 101631 12246 -229079
15428 -229079 20234 23817 30788 170289 -25011 145477 53496 -28433 19344 135143 -121001
15417 -121001 8068 35707 127242 -204439 -96481 -8582 45112 -79694 16541 130900
15407 130900 33840 100748 -188135 -60214 -141955 254908 -71148 -34481 92264 82379 42943
15396 42943 -85793 45635 -75170 -59693 -38838 64487 -226111 180484 99408 9786
15386 9786 -182285 126385 -140463 -2030 98747 -201954 52346 172431 57832 -158326
15376a58326J19357j39625P1620j9691J94494L6869q5827M4486n9880O235j64045
15365a54333L24974l58977P5065L0687J7490Q4091l15280L40216j17642K12461
15355A38752k80824j9037K04883j64938J48704o001m4255J00284k43148J73158
15345G578o7260P4149O026J21169j91767J28426p1737M8826j13685R489K02736
15334A53950j13766P6217j88088J6718K2987k82191M37952J3660j36152q717k89090
15323b96520K26228j95943M04867j95857o0558J30178k93551L34935N26L8767
15313I3072j95494J72702K7711k6478o7010o771J51453k45423N7315M2634j31648
15302a27937J4335K40217j78273K04717k56789L8858J87114j67216Q0226j42013
$$ plain form
15376 -158326 -38969 -178594 -106974 -126665 67829 104698 18871 63357 3477 9712 -154333
15365 -154333 170641 -188336 -113271 -82584 -65094 18997 -296283 43933 -73709 138752
15355 138752 -142072 -161109 43774 -121164 27540 21539 -22716 77568 -165580 7578
15345 7578 -59682 14467 20493 141662 -50105 78321 6584 55410 -58275 -48786 153950
15334 153950 40184 116401 -71687 -54969 -31982 -314173 123779 137439 1287 -7430 -296520
15323 -296520 -70292 -266235 138632 -57225 -117783 12395 -281156 53779 54305 93072
15313 93072 -102422 70280 97991 71513 4503 -2268 149185 -96238 -38923 3711 -127937
15302 -127937 -113602 126615 -51658 153059 -103730 -64872 122242 -44974 35252 -106761
15292a06761J75958l22466N607M53784j87623m3223q7790J27678k07430N8816
15282a33450O6002J82485k93368P3165K28305l39236J11690Q1033J50173k82862
15272a56063K59748k2784q5003J6842M2399j15995j24530J77831K84800l33871
15262e6626J43440k09079q8916P0820N3749K44576j89560N8769l39589J63028
15252a49388q1774J92125j25300J78044k2094Q1051k05061j0507l991J30937L4765
15241A8807l2882o0439J16840l8102o3629O3060L0341j22612p417j04178J21511
15230g8700j26441J82573P565o0008o8444J52453j29652L7459K10522o6284j31096
15219g0053R8428k72810L08404j46830P0615j06807K98806j78769k4290J37537
$$ plain form
15292 -106761 69197 -253269 -247662 206122 18499 -24724 -112514 15164 -192266 -133450
15282 -133450 -67448 115037 -178331 -105166 123139 -216097 -104407 -23374 126799 -156063
15272 -156063 103685 80901 -4102 12740 55139 -60856 -185386 -7555 277245 -56626
15262 -56626 86814 -122265 -211181 -140361 -86612 157964 -31596 27173 -312416 -149388
15252 -149388 -231162 -39037 -164337 13707 -8387 72664 -132397 -142904 -146895 -15958 18807
15241 18807 -14075 -74514 42326 4224 -59405 3655 33996 -88616 -96033 -200211 -78700
15230 -78700 -205141 -22568 -15003 -75011 -143455 8998 -120654 -83195 127327 61043 -70053
15219 -70053 28375 -244435 63969 -82861 -12246 -119053 179753 984 -23306 114231
15209A14231m25218J98968J21549m9913J1076k76802O4385J42712J1462Q1079
15199f471n6987R1551j68633J73438k40515K18443p1385O1858l549k2274q3331
15188a07855Q8694O9532q1548L6125K8639j24600N3951L529J13989k73336J24569
15177f8311j27215Q4926j61994K85444j04212J0977J16965r3672m4119J2260N0240
15166c8711K8530J14742k56268K77907k19152K5676p829j16873K96705r7785j54058
15155a47116R2508m3040J41610p6130N2044k263l9443n9778j15354K92102j08068
15144a2928o463M5094j03560J8510j68540O7489J67457k1910K16638k80030J23037
15133D4794k31784J66221j84395K50444k25334J47135J13400k57529Q5906J07723
$$ plain form
15209 114231 -310987 -112019 9530 -40383 -29307 -306109 -241724 -99012 -87550 -6471
15199 -6471 -63458 28093 -140540 32898 -207617 10826 -60559 1299 -2250 -24524 -107855
15188 -107855 -19161 50371 -31177 4948 33587 -91013 -37062 -33533 80456 -192880 -68311
15177 -68311 -195526 -110600 -272594 12850 -91362 -80385 36580 -57092 -101211 -88951 -38711
15166 -38711 -10181 104561 -151707 126200 -92952 -67276 -75105 -191978 104727 6942 -147116
15155 -147116 -54608 -97648 43962 -32168 19876 17613 -21830 -81608 -196962 95140 -12928
15144 -12928 -19391 25703 -77857 -59347 -227887 -160398 7059 -14851 201787 -78243 44794
15133 44794 -186990 -20769 -205164 45280 -180054 -32919 80481 -177048 -91142 16581
15123A6581j648J9011L987j1204k13264J16927r8045j04590K35603k0079J1705
15112d5016Q4374m3334K00263k41005l5006R1374j71027K24718k21861P7074k8062
15101a07508Q5633O1673j47370K23493k38418K28972j52740R8274n3261j17699
15091a18951J28220n6095O8267n5485k9026j1604J05647o5243R5897j34804K5876
15080d7301K8383K14455r8921j05482p9551k0954O8212O4429j99621K8125Q4136
15069f4090q7743J57491j71260P0340J19967K9318j26620k61266L06134M5285
15059A7556J13125m0886j7032k09865K02233j1495m6283j94889L40867j47347
15049E984k73J97193k55361J6596J85379k05654j14232L35565j36835l23568Q2861
$$ plain form
15123 16581 14933 33944 37931 26727 -186537 -69610 -167655 -272245 -36642 -56721 -45016
15112 -45016 39358 -3976 196287 -44718 -79724 11650 -159377 65341 -156520 -79446 -107508
15101 -107508 -21875 39798 -107572 115921 -122497 106475 -46265 52009 -1252 -118951
15091 -118951 9269 -46826 21441 -34044 -63070 -74674 30973 -34270 61627 -73177 -47301
15080 -47301 -18918 195537 96616 -8866 -88417 -109371 -41159 23270 -176351 -148226 -64090
15069 -64090 -151833 5658 -165602 -95262 24705 54023 -72597 -333863 -27729 17556
15059 17556 130681 89795 72763 -137102 65131 53636 7353 -187536 153331 5984
15049 5984 5711 202904 -52457 -35861 149518 -56136 -170368 165197 28362 -295206 -212345
15038b12345J69090j15738L7482O4210R8794O1861k95201K98042M8841k35199
15028h0163J25422j43223J86693j60413J86432j1404r3653j78211K89622j04697
15018A6405k56518K08381P3133n3446j23926K84089j35385k71426L08568j07475
15008e7600J64104l2879j26572j702j0382J19501r9132Q3979o8919j0192J06670
14997F6876J24251p1670L5386l21898R5496J20624O871o3011J07730j57243j0831
14986f7419P205J61706k92456J38896N358O4308R8194k10671J11636M6298m5433
$$ plain form
15038 -212345 -43255 -158993 -121511 -57301 41493 103354 -191847 106195 155036 -80163
15028 -80163 45259 -97964 88729 -71684 114748 103344 9691 -168520 121102 16405
15018 16405 -240113 -31732 41401 -12045 -135971 148118 12733 -258693 49875 -57600
15008 -57600 106504 73625 -52947 -54649 -65031 54470 -44662 39317 -29602 -39794 66876
14997 66876 191127 119457 154843 -167055 -71559 49065 55936 -7075 100655 -56588 -67419
14986 -67419 -60214 101492 -190964 -52068 -46710 17598 115792 -94879 16757 63055 17622
$$ [...]
##END NTUPLES=NMR SPECTRUM
##END=
