##TITLE=abcd
##JCAMPDX= 6.0         $$ Bruker NMR JCAMP-DX V2.0
##DATA TYPE= NMR SPECTRUM
##DATA CLASS= NTUPLES
##ORIGIN= UXNMR, Bruker Analytische Messtechnik GmbH
##OWNER= root
$$ XWIN-NMR		Version 3.5
$$ Fri Oct 24 18:41:20 2025 Russian Standard Time (UT+4h)  servis@DPX200
##.OBSERVE FREQUENCY= 200.131235884673
##.OBSERVE NUCLEUS= ^1H
##.ACQUISITION MODE= SIMULTANEOUS
##.ACQUISITION SCHEME= undefined
##.AVERAGES= 24
##.DIGITISER RES= 18
##SPECTROMETER/DATA SYSTEM= spect
##.PULSE SEQUENCE= zg
##.SOLVENT NAME= CDCl3
##.SHIFT REFERENCE= (INTERNAL, CDCl3, 0, 16.4885)
##AUDIT TRAIL= $$ (NUMBER, WHEN, WHO, WHERE, WHAT)
$$ ##TITLE= Audit trail, XWIN-NMR		Version 3.5
$$ ##JCAMPDX= 5.01
$$ ##ORIGIN= Bruker BioSpin GmbH
$$ ##OWNER= servis
$$ F:\spectra/data/av/nmr/H1/1/pdata/1/auditp.txt
$$ ##AUDIT TRAIL=  $$ (NUMBER, WHEN, WHO, WHERE, WHAT)
(   1,<2025-10-24 18:40:53.26 +0400>,<servis>,<DPX200>,
      <created by zg, POWCHK disabled, PULCHK disabled
       terminated by command 'halt'
       configuration hash MD5:
       00 E9 B6 7A A2 85 ED C7 34 08 36 98 17 FE 4E 26
       data hash MD5: 32K
       1F F6 FE 60 32 DB F4 5A 4A AE 9B D5 B2 58 0D D4>)
(   2,<2025-10-24 18:40:54.96 +0400>,<servis>,<DPX200>,
      <Start of raw data processing
       efp BC_mod = 2 LB = 0.05 FT_mod = 6 PKNL = 1 PHC0 = -268.1076 PHC1 = 6.501565 SI = 16K 
       data hash MD5: 16K
       28 3F 03 D6 18 79 07 77 3D 4C 47 98 D5 5E 36 6A>)
$$ ##END=
$$ 
$$ hash MD5
$$ 35 9D 12 EB 6F 20 D2 E2 CF 07 50 8B 8F 94 95 FF
##$RELAX= 
##$RELAX= 
##$RELAX= 
##$RELAX= 
##$RELAX= 
##$RELAX= 
##$RELAX= 
##$RELAX= 
$$ Bruker specific parameters
$$ --------------------------
##$DU= <F:\spectra>
##$EXPNO= 1
##$NAME= <H1>
##$PROCNO= 1
##$TYPE= <nmr>
##$USER= <av>
##$AMP= (0..31)
100 100 100 100 100 100 100 100 100 100 100 100 100 100 100 100 100 100 
100 100 100 100 100 100 100 100 100 100 100 100 100 100 
##$AQSEQ= 0
##$AQ_mod= 1
##$AUNM= <au_zg>
##$AUTOPOS= <>
##$BF1= 200.13
##$BF2= 200.13
##$BF3= 200.13
##$BF4= 200.13
##$BF5= 500.13
##$BF6= 500.13
##$BF7= 500.13
##$BF8= 500.13
##$BYTORDA= 1
##$CFDGTYP= 0
##$CFRGTYP= 5
##$CHEMSTR= <none>
##$CNST= (0..31)
1 1 145 1 1 1 1 1 1 1 1 1 1 1 1 1 1 1 1 1 1 1 1 1 1 1 1 1 1 1 1 1 
##$CPDPRG= <>
##$CPDPRG1= <>
##$CPDPRG2= <>
##$CPDPRG3= <>
##$CPDPRG4= <mlev>
##$CPDPRG5= <mlev>
##$CPDPRG6= <mlev>
##$CPDPRG7= <mlev>
##$CPDPRG8= <mlev>
##$CPDPRGB= <>
##$CPDPRGT= <>
##$D= (0..31)
0 2 0 0 0 0 0 0 0 0.06 0 0 0 0 0 0 0.0002 0 0 0 0 0 0 0 0 0 0 0 0 0 0 
0 
##$DATE= 1761316852
##$DBL= (0..7)
120 120 120 120 120 120 120 120 
##$DBP= (0..7)
150 150 150 150 150 150 150 150 
##$DBP07= 0
##$DBPNAM0= <>
##$DBPNAM1= <>
##$DBPNAM2= <>
##$DBPNAM3= <>
##$DBPNAM4= <>
##$DBPNAM5= <>
##$DBPNAM6= <>
##$DBPNAM7= <>
##$DBPOAL= (0..7)
0.5 0.5 0.5 0.5 0.5 0.5 0.5 0.5 
##$DBPOFFS= (0..7)
0 0 0 0 0 0 0 0 
##$DE= 6
##$DECBNUC= <off>
##$DECIM= 32
##$DECNUC= <off>
##$DECSTAT= 4
##$DIGMOD= 1
##$DIGTYP= 9
##$DL= (0..7)
0 120 120 120 120 120 120 120 
##$DP= (0..7)
$$ [...]
##$SUBNAM4= <"">
##$SUBNAM5= <"">
##$SUBNAM6= <"">
##$SUBNAM7= <"">
##$SUBNAM8= <"">
##$SUBNAM9= <"">
##$SW= 20.6817932712277
##$SWIBOX= (0..15)
0 0 3 0 0 0 0 0 0 0 0 0 0 0 0 0 
##$SW_h= 4139.07284768212
##$TD= 32768
##$TD0= 1
##$TE= 0
##$TE2= 300
##$TE3= 300
##$TEG= 300
##$TL= (0..7)
0 120 120 120 120 120 120 120 
##$TP= (0..7)
150 150 150 150 150 150 150 150 
##$TP07= 0
##$TPNAME0= <>
##$TPNAME1= <>
##$TPNAME2= <>
##$TPNAME3= <>
##$TPNAME4= <>
##$TPNAME5= <>
##$TPNAME6= <>
##$TPNAME7= <>
##$TPOAL= (0..7)
0.5 0.5 0.5 0.5 0.5 0.5 0.5 0.5 
##$TPOFFS= (0..7)
0 0 0 0 0 0 0 0 
##$TUNHIN= 0
##$TUNHOUT= 0
##$TUNXOUT= 0
##$USERA1= <user>
##$USERA2= <user>
##$USERA3= <user>
##$USERA4= <user>
##$USERA5= <user>
##$V9= 5
##$VALIST= <valist>
##$VCLIST= <CCCCCCCCCCCCCCC>
##$VD= 0
##$VDLIST= <DDDDDDDDDDDDDDD>
##$VPLIST= <PPPPPPPPPPPPPPP>
##$VTLIST= <TTTTTTTTTTTTTTT>
##$WBST= 1024
##$WBSW= 30
##$XGAIN= (0..3)
0 0 0 0 
##$XL= 0
##$YL= 0
##$YMAX_a= 162468
##$YMIN_a= -104460
##$ZGOPTNS= <>
##$ZL1= 120
##$ZL2= 120
##$ZL3= 120
##$ZL4= 120
##$ABSF1= 0
##$ABSF2= 0
##$ABSG= 0
##$ABSL= 0
##$ALPHA= 0
##$AQORDER= 0
##$ASSFAC= 0
##$ASSFACI= 0
##$ASSFACX= 0
##$ASSWID= 0
##$AUNMP= <proc_1d>
##$AZFE= 0.1
##$AZFW= 0.1
##$BCFW= 0
##$BC_mod= 2
##$BYTORDP= 0
##$COROFFS= 0
##$CY= 18.4799938201904
##$DATMOD= 1
##$DC= 0
##$DFILT= <>
##$DTYPP= 0
##$F1P= 9.9274215381318
##$F2P= -0.165520771350173
##$FCOR= 1
##$FTSIZE= 16384
##$FT_mod= 6
##$GAMMA= 0
##$GB= 0
##$INTBC= 1
##$INTSCL= 4.127829e-11
##$ISEN= 128
##$LB= 0.05
##$LEV0= 0
##$LPBIN= 0
##$MAXI= 10000
##$MC2= 0
##$MEAN= 0
##$ME_mod= 0
##$MI= 50
##$NCOEF= 0
##$NC_proc= -9
##$NLEV= 6
##$NOISF1= 3.799351
##$NOISF2= 2.8
##$NSP= 0
##$NTH_PI= 0
##$NZP= 0
##$OFFSET= 16.48848
##$PC= 4
##$PHC0= -268.1076
##$PHC1= 6.501565
##$PH_mod= 1
##$PKNL= yes
##$PPARMOD= 0
##$PSCAL= 4
##$PSIGN= 0
##$REVERSE= no
##$SF= 200.130005582386
##$SI= 16384
##$SIGF1= 3
##$SIGF2= 2
##$SINO= 400
##$SIOLD= 16384
##$SREGLST= <1H.CDCl3>
##$SSB= 0
##$STSI= 16384
##$STSR= 0
##$SW_p= 4139.07284768211
##$SYMM= 0
##$S_DEV= 0
##$TDeff= 32768
##$TDoff= 0
##$TI= <>
##$TILT= no
##$TM1= 0
##$TM2= 0
##$TOPLEV= 0
##$USERP1= <user>
##$USERP2= <user>
##$USERP3= <user>
##$USERP4= <user>
##$USERP5= <user>
##$WDW= 1
##$XDIM= 16384
##$YMAX_p= 419385581
##$YMIN_p= -7581730
$$ End of Bruker specific parameters
$$ ---------------------------------
##NTUPLES= NMR SPECTRUM
##VAR_NAME=  FREQUENCY,     SPECTRUM/REAL,   SPECTRUM/IMAG
##SYMBOL=    X,             R,               I
##VAR_TYPE=  INDEPENDENT,   DEPENDENT,       DEPENDENT
##VAR_FORM=  AFFN,          ASDF,            ASDF
##VAR_DIM=   16384,         16384,           16384
##UNITS=     HZ,            ARBITRARY UNITS, ARBITRARY UNITS
##FACTOR=    0.252644378177508, 1,           1
##FIRST=     3299.83951724647, 0,            0
##LAST=      -839.233330435636, 0,           0
##MIN=       -839.233330435636, -7581730,    0
##MAX=       3299.83951724647, 419385581,    0
$$ Real data points
##PAGE= N=1
##DATA TABLE= (X++(R..R)), XYDATA
$$ [...]
8051a314224J021451j920049L833525m64054k17825k037930Q69240P73700l49990
$$ -1314224 -292773 -2212822 1620703 1156649 938824 -1099106 -229866 543834 193844
8042A93844K1604J17938Q88764j307068q98124j63646J58096P33420N33092j084403
$$ 193844 215448 333386 1222150 -84918 -983042 -1146688 -988592 -255172 277920 -806483
8032h06483m850K81500L35399J268497r42346O09694j030576j82668J514287j926260
$$ -806483 -811333 -529833 -194434 1074063 131717 741411 -289165 -471833 1042454 -883806
8022h83806J73381q16713J295664L60446P47133j94472k036102K243508j329867
$$ -883806 -710425 -1527138 -231474 128972 876105 681633 -1354469 889039 -440828
8013d40828J032815j150261J352179K03776k441846M0753K272659j793704J177353
$$ -440828 591987 -558274 793905 997681 -1444165 -1403412 869247 -924457 252896
8004B52896m80776N43288J0262j064631R00881N67401j26038j642078M42040Q30009
$$ 252896 -227880 315408 325670 -738961 161920 729321 603283 -1038795 -596755 233254
7994B33254R83748o96141p38989O99575m44021j184427O54418J047805j228218
$$ 233254 1217002 520861 -218128 481447 37426 -1147001 -492583 555222 -672996
7985f72996P2943M17281J378269N10841k752018O32646o20648J990897j329410
$$ -672996 -600053 -182772 1195497 1706338 -1045680 -413034 -1033682 957215 -372195
7976c72195K97786O58011p70217M53229r49440r58074P18349K111649j381539
$$ -372195 -74409 583602 -186615 266614 -682826 -1640900 -922551 1189098 -192441
7967a92441j63665M53499n42342j256772J524620j019543J440315J05383K187173
$$ -192441 -356106 97393 -444949 -1701721 -177101 -1196644 243671 349054 2536227
7958B536227k440011p94019K61767N73396j597028K017728n78028r0130M54346
$$ 2536227 96216 -697803 -436036 137360 -1459668 558060 -19968 -110098 344248
7949C44248k113531K606935K10355k392361K636988k052345J281740k014662J100311
$$ 344248 -1769283 837652 1048007 -1344354 1292634 -759711 522029 -1492633 -392322
7940c92322K7691O39015J89437j96644J80095r27509l05013J095163R09530q14259
$$ -392322 -364631 274384 463821 267177 447272 -480237 -785250 309913 1219443 405184
7930D05184q92773J289607q08325l95753k26996K35783Q67282j003081o57496
$$ 405184 -487589 802018 -6307 -402060 -629056 -393273 474009 -529072 -1186568
7921a186568j54672L20486P3756Q79621n7734M56290j35303J62298K3505o20010
$$ -1186568 -1341240 -1020754 -946998 -67377 -125111 331179 195876 358174 381679 -238331
7911b38331p45437J334326O3516n80949q28816j82813O2496o69425P94571R20524
$$ -238331 -983768 350558 414074 -166875 -995691 -1178504 -1116008 -1785433 -990862 -70338
7901g0338j201305m13963K07445J690653o66989N72865r24186q82508p6643P76016
$$ -70338 -1271643 -1685606 -1478161 212492 -454497 118368 -805818 -1688326 -1764969 -988953
7891i88953O87792o58945J510494k24542r84695l41038j982437L495763M24044
$$ -988953 -301161 -960106 550388 325846 -658849 -999887 -2982324 513439 937483
7882I37483L41247k305913J309494r00669j115001J025390J858835n79359k13485
$$ 937483 1278730 -1027183 282311 -618358 -1733359 -707969 1150866 571507 358022
7873C58022p15214Q3610j59085r45638n72207J493281J165707j083574n06966
$$ 358022 -357192 -273582 -432667 -1378305 -1950512 -457231 708476 -375098 -882064
7864h82064L80742n73384m43357K68060J500649n81546k47906r25874M12805j437576
$$ -882064 -501322 -1074706 -1518063 -1250003 250646 -330900 -578806 -1504680 -1091875 -2529451
7854b529451Q67323J561377j963528q05797J729510P141358n304834l88085j20259
$$ -2529451 -1662128 -100751 -2064279 -2870076 -1140566 6000792 695958 307873 187614
7845A87614l6901r43190O02433O61399J416287p10198j177331r14684P20135j65680
$$ 187614 150713 -792477 -190044 471355 1887642 1177444 113 -914571 -194436 -360116
7835c60116M78909J165460j752305J216184l41812Q60860l145432J205427P13273
$$ -360116 118793 1284253 -468052 748132 406320 1267180 -1878252 -672825 40448
7826D0448O75426j337637l51322L88143K61566p17289J28996P79612J178681p48708
$$ 40448 715874 -621763 -973085 -584942 -323376 -1040665 -911669 -132057 1046624 297916
7816B97916k15380p4046J91620j174319Q64819j154985Q45799J159064j60873
$$ 297916 82536 8490 200110 -974209 -109390 -1264375 -418576 740488 579615
7807E79615j880282J608343N43413r59636j061036O36293M77536M95397p55065
$$ 579615 -1300667 307676 851089 -108547 -1169583 -533290 -55754 439643 -315422
7798c15422q42077P04027n34903Q39626N4103o36879J028618L83748l59484o87361
$$ -315422 -1157499 -453472 -988375 -148749 -94646 -731525 297093 680841 321357 -366004
7788c66004j03668m7804K5821O12489p96086J369403p83839P82681o10830m64001
$$ -366004 -469672 -517476 -491655 120834 -675252 694151 -89688 692993 82163 -381838
7778c81838j67539J594651j57529q51690J48215N52815k035791J165407L48914
$$ -381838 -549377 1045274 887745 36055 184270 737085 -1298706 -133299 215615
7769B15615J049983j704436Q85684n50893j589901J96441M96893M82201P51140
$$ 215615 1265598 -438838 446846 -104047 -1693948 -1497507 -1000614 -518413 232727
7760B32727j360435J104135M36222n40815O50691k090837J211843j3477P8369
$$ 232727 -1127708 -23573 412649 -128166 522525 -1568312 -356469 -369946 -291577
7751b91577j27801K00646J834191l70547n00956k90122l41965j496628N53880
$$ -291577 -419378 -218732 1615459 1244912 743956 453834 111869 -1384759 -830879
7742h30879J149005J94313P39123o69430j189648N14764j06907P02130l87025
$$ -830879 318126 512439 1251562 582132 -607516 -92752 -199659 502471 115446
7733A15446K05445j642788J961104o99799k16623J34809j759774Q43944P27887
$$ 115446 320891 -1321897 639207 -60592 -277215 -142406 -1902180 -1058236 -330349
7724c30349J106008j307421J68948l23655J464852k515800J071355O81455k89434
$$ -330349 775659 -531762 -362814 -686469 778383 -1737417 -666062 15393 -274041
7715b74041k27986n18855K81613J397828k248255J024289Q31851m91398j331446
$$ -274041 -502027 -1020882 -739269 658559 -1589696 -565407 266444 -224954 -1556400
7706a556400J390537J838852j631693j542904p61408R57499K052821m56995j02346
$$ -1556400 -165863 1672989 41296 -1501608 -2263016 -1305517 747304 290309 187963
7697A87963q29491P80880p17986N66652m1289J105325j259046J44778K8399L0332
$$ 187963 -641528 139352 -578634 -11982 -53271 1052054 -206992 -62214 -33815 -3483
7687c483N74035j733024J663733o99657M85503q9889O01686j09104j373017j485757
$$ -3483 570552 -1162472 501261 -198396 287107 197218 798904 689800 -683217 -2168974
7677b168974J852508J238822p43131l22668L53019l99165P62553l4889o29498
$$ -2168974 -316466 922356 179225 -143443 209576 -189589 572964 538075 -91423
7668i1423N38434j625088j42288K201561O6831q58485N61312j522795M532J157532
$$ -91423 447011 -1178077 -1320365 881196 948027 89542 650854 -871941 -867409 290123
7658B90123R77012o88072J39370j88013l62572j078752J924236n95434K60547
$$ 290123 1267135 579063 718433 530420 167848 -910904 1013332 417898 678445
7649F78445O41013k9877j887700N24482J300660p41141o04516M04398O81597k549930
$$ 678445 1319458 1289581 -598119 -73637 1227023 485882 -118634 285764 967361 -1582569
7639a582569J629060j138629K045282M11157j755950O73734j669534R85978J512514
$$ -1582569 46491 -1092138 953144 1364301 -391649 282085 -1387449 -401471 1111043
7630A111043j337770l95799J076107o96090P29662k200365J923312J48962N00197
$$ 1111043 -226727 -622526 453581 -242509 487153 -1713212 210100 359062 859259
7621H59259j342038J305976n59477l84734r33360J109640M31788j94594J31400
$$ 859259 -482779 823197 263720 -121014 -1054374 55266 487054 292460 423860
7612D23860K01683M00583j253098p81640J515058j146038Q06556L82419k86601
$$ 423860 625543 1026126 -226972 -1008612 506446 -639592 166964 549383 262782
7603B62782m59074Q55314j73326M55105j119421j52407O42069j664955K388999
$$ 262782 -196292 659022 485696 940801 -178620 -331027 311042 -1353913 1035086
7594A035086j484534l55061J046933J2868K85021l09088J073712k969425J112809
$$ 1035086 -449448 -804509 242424 255292 540313 231225 1304937 -1664488 -551679
7585e51679M44960O66116l0569j08066J360673j955232J430169j532273R51627
$$ -551679 -106719 559397 528828 420762 1781435 -173797 1256372 -275901 675726
7576F75726j151187P91836L71247o37618J222879j434309N86260P48232j323434
$$ 675726 -475461 316375 687622 50004 1272883 -161426 424834 1173066 -150368
7567a50368O91534L95426n78791J722K021772k609214J799206j326290L91383
$$ -150368 541166 936592 357801 359523 2381295 -227919 1571287 244997 636380
7558F36380J130341k914727R38847L41409J95291L45576j066365O20946L15787
$$ 636380 1766721 -1148006 -209159 132250 327541 673117 -393248 227698 543485
7549E43485J544j457980P97703R68413J518595j404968n85312k82160O94473j011896
$$ 543485 545029 -912951 -115248 853165 2371760 966792 381480 99320 793793 -218103
7539b18103J467661L8733j179683J312732l59269o10509M40829j59135o63197
$$ -218103 1249558 1288291 108608 1421340 1062071 451562 892391 733256 70059
7530G0059j189201K491381O80681k495885N50634O99598M90306k23154n5985o09042
$$ 70059 -1119142 1372239 2052920 -442965 107669 807267 1297573 1074419 1018434 409392
7520D09392O9181n1712P76279j010982N53931r76803R50397J58256J105874j133029
$$ 409392 478573 426861 1203140 192158 746089 -230714 719683 877939 1983813 850784
7510H50784l15183q51354l37008N38292J647163o62145k77842J06881P79983k043535
$$ 850784 535601 -315753 -652761 -114469 1532694 870549 592707 699588 1479571 -563964
7500e63964J227643j207235R72778l09166M67939m34685p99430J724849q06666
$$ -563964 663679 -543556 429222 120056 587995 153310 -646120 1078729 272063
7491B72063r3524m10285R14961O40721q70659K01383j129517J485899l38775q02207
$$ 272063 178539 -231746 683215 1323936 453277 654660 -474857 1011042 672267 -129940
7481a29940P04492j224375L007734k268174p442Q52877j102617M71775J371029
$$ -129940 574552 -649823 2357911 89737 82295 935172 -167445 304330 1675359
7472A675359j032862k30577o72965r77403J619312j00156M02078J141707j943237
$$ 1675359 642497 411920 -261045 -1238448 380864 280708 682786 1824493 -118744
7463a18744J648374m15165m35432R36897j883866l13183P45532J087905r14415
$$ -118744 1529630 1114465 679033 1615930 -267936 -581119 164413 1252318 337903
7454C37903o70137J580617p96148o63744j22583K019722r63547j165857P14310
$$ 337903 -332234 1248383 452235 -211509 -334092 1685630 722083 -443774 270536
7445B70536P12457j33756N96191L84146p76959j475271k86524L007755j368057
$$ 270536 982993 849237 1445428 1829574 1052615 -422656 -709180 2298575 930518
7436I30518l4302n14125n83202J282109k42244R64717r30692o22867J412051J82950
$$ 930518 896216 382091 -201111 1080998 838754 1803471 872779 249912 1661963 1844913
7426A844913j355179N87838Q10746j979194L36250Q11720j871306K302919R81875
$$ 1844913 489734 1077572 1888318 -90876 245374 1057094 -814212 1488707 2470582
7417B470582k108264R93924p3099j091854J279056j862299J977071j943803L39626
$$ 2470582 362318 1356242 1283143 191289 1470345 -391954 1585117 -358686 -19060
7408a9060R02256N29831K46005k119116K055011K75757j863026l5113P36064j50851
$$ -19060 883196 1413027 1659032 -460084 1594927 1870684 7658 -27455 708609 557758
7398E57758n64368J077075j434811L51909J224060j419196o224J204270n58211
$$ 557758 -6610 1070465 -364346 -12437 1211623 -207573 -213797 990473 432262
7389D32262L70613o30705n5497O42762j649095K726396k253911J502540L82291
$$ 432262 802875 172170 116673 759435 -889660 1836736 -417175 1085365 1467656
7380A467656p58572N61792j739942J625175K24891k302973K17218J083846O925
$$ 1467656 709084 1270876 -469066 1156109 1381000 -921973 -704755 379091 386016
7371C86016O92524J406569l338780L16736Q38255K006597j388501K51430K30938
$$ 386016 1078540 2485109 -853671 -536935 301320 2307917 919416 1170846 1401784
7362A401784j322792M35194M97708l18862M1404J76563j046915J950595n50629
$$ 1401784 78992 514186 1011894 693032 734436 910999 -135916 1814679 1264050
7353A264050M27279j393182q40248J385088M28689j01171N39950k19449q69661
$$ 1264050 1691329 298147 -542101 842987 1271676 1170505 1710455 1491006 621345
7344F21345j065583N84990J939809J467517l737453J046849L08409O68793k077085
$$ 621345 -444238 140752 2080561 3548078 -189375 857474 1165883 1834676 -242409
7335b42409J136505J096737p15857r59727J49164J08167J287555L21937j253830
$$ -242409 894096 1990833 1274976 315249 464413 572580 1860135 2182072 928242
7326I28242r11609J69005R85782P67662j327063O49664j2448j67224J157518J8056
$$ 928242 16633 185638 1171420 1939082 612019 1261683 1249235 1082011 2239529 2257585
7316B257585j573930n52905J384418j108033J899040j58498n87902p68674j102598
$$ 2257585 683655 130750 1515168 407135 2306175 2147677 1559775 791101 -311497
7307c11497K543027P34713j975774k89050K33456J415588l67813q69436j105365
$$ -311497 2231530 2966243 990469 701419 934875 2350463 1982650 1113214 7849
7298G849O68202Q79670M59482m05198j378387J622614n97083n47113J024443J249144
$$ 7849 676051 1555721 2015203 1610005 231618 1854232 1257149 710036 1734479 2983623
7288B983623j108581j639839L25321O92945p53276M66833J007075O12256r58829
$$ 2983623 1875042 235203 560524 1253469 500193 967026 1974101 2586357 1627528
7279A627528j38550J47009N39737n39859j230941J746527o17850j05025Q30809
$$ 1627528 1488978 1635987 2175724 1635865 404924 2151451 1533601 1428576 2259385
7270B259385j54941j456425J99247J226293j73290j50506N23510Q0602m44042
$$ 2259385 2104444 648019 847266 2073559 1900269 1749763 2273273 2353875 1909833
7261A909833k517266L250165r18149O35087N76902m70104p98829J206818q3516
$$ 1909833 -607433 2642732 1724583 2359670 2936572 2466468 1667639 2874457 2790941
7252B790941m38511N53064q99647P09369o5128R4325K76984K2579J84316j472612
$$ 2790941 2352430 2905494 2005847 2715216 2650088 2744413 3021397 3043976 3228292 1755680
7242A755680J085367l87136J12437L94549k30588r51075J084028K06022j02888
$$ 1755680 2841047 2453911 2566348 2960897 2730309 1779234 2863262 3069284 2966396
7233B966396K10923j80347p46534j69454K095242k98943j734265n00221R05132
$$ 2966396 3177319 2996972 2250438 2080984 4176226 3877283 2143018 1642797 2547929
7224B547929O46824n77873J121152j345572n6632l86783O70000N11104J734614
$$ 2547929 3194753 2616880 3738032 2392460 2335828 1949045 2619045 3130149 4864763
7215D864763j704138J319594k685990J145293N23718K99052p76287J835207k01065
$$ 4864763 3160625 4480219 1794229 2939522 3463240 3762292 2986005 4821212 4620147
7206D620147j365010k27366J17650M38213J032797j963958J830823K6226n10960
$$ 4620147 3255137 3027771 3145421 3583634 4616431 2652473 4483296 4509522 3998562
7197C998562J40460j018573J383162k17552J42175l45473O36446q81350l38433
$$ 3998562 4139022 3120449 4503611 4286059 4428234 4082761 4719207 3837857 3499424
7188C499424J068195l88066O56079K72147k214412N80664j53957K136240p56393
$$ 3499424 4567619 4179553 4835632 5107779 2893367 3474031 3320074 5456314 4699921
7179D699921L99259o15318j290400N69165N17948J272264p32933R90433j81212
$$ 4699921 5099180 4483862 3193462 3762627 4280575 5552839 4819906 5810339 5629127
7170E629127j832062N79649J367619O21684l351132R10986N09765k07548L11396
$$ 5629127 3797065 4376714 5744333 6366017 3014885 3925871 4435636 4228088 4539484
7161D539484m87206P42474M42292j75630k29567O1418O06994j69081J04279j229208
$$ 4539484 4052278 4794752 5237044 5061414 4831847 4893265 5500259 5331178 5435457 4206249
7151D206249R19375K136709k29710j819827R61605N39307j167369L69550q15740
$$ 4206249 5125624 7262333 7032623 5212796 6174401 6713708 5546339 5915889 5100149
7142E100149J726591k109950J648610J062314K82849j598801k6116q98023Q27546
$$ 5100149 6826740 4716790 6365400 7427714 7710563 6111762 6085646 5187623 6015169
7133F015169N44873J044482j29192p05217o09575j008531J294814Q05339K01509
$$ 6015169 6560042 7604524 7475332 6770115 6160540 5152009 6446823 7252162 7453671
7124G453671p45722J54508J40383p13532o88363K093168L63414j277387j43648
$$ 7453671 6707949 6862457 7002840 6289308 5600945 7694113 8057527 6780140 6636492
7115F636492K97547R28118n46668J37310l14608J747669k306441J355115k96701
$$ 6636492 6934039 7862157 7315489 7452799 7138191 8885860 6579419 7934534 7637833
7106G637833n0461m88140R0969J055877P7337q60651j39742K3238J598389q23471
$$ 7637833 7587372 7099232 7190201 8246078 8323415 7462764 7323022 7346260 8944649 8121178
7096H121178j34832M09151m71925p14173N75166M91955J393628j156828k32428
$$ 8121178 7986346 8395497 7923572 7209399 7784565 8276520 9670148 8513320 8280892
7087H280892J54151P90927p13703m76950L28895R04847P64938l36763j037303
$$ 8280892 8435043 9225970 8512267 8035317 8364212 9269059 10033997 9697234 8659931
7078H659931J268691j443712j35202R12016J175929o38107J273376r09443q4194
$$ 8659931 9928622 8484910 8349708 9261724 10437653 9799546 11072922 10163479 10079285
7069A0079285m76256J19522M32657r40242J589317O47318j207271J808210o81732
$$ 10079285 9603029 9722551 10155208 9214966 10804283 11451601 10244330 12052540 11370808
7060A1370808o32408M48974l93177L94444J127594o71753k02708n73885O22873
$$ 11370808 10738400 11187374 10794197 11188641 12316235 11644482 11441774 10867889 11490762
7051A1490762J057881j291495n35928Q48082K110796j359410J113111j501504
$$ 11490762 12548643 11257148 10721220 11569302 13680098 12320688 13433799 11932295
7043A1932295K51641M34713K972137j817084J283236r42124N05036l57566O48346
$$ 11932295 12183936 12618649 15590786 13773702 15056938 14114814 14619850 14262284 14910630
7034A4910630o34573J266717J717673j099463j66587K8131J252152p78856p81899
$$ 14910630 14276057 15542774 17260447 16160984 15994397 16022528 17274680 16495824 15713925
7025A5713925J684698J706113k114324Q57987J61949p84957K220270j277037R65559
$$ 15713925 17398623 19104736 16990412 17848399 18010348 17225391 19445661 18168624 19134183
7016A9134183q74636Q86228O4687J68470P87985P68497o56113M37185P81022L61654
$$ 19134183 18259547 19145775 19210462 19378932 20166917 20935414 20279301 20716486 21497508 21859162
7006B1859162K7750L01607K294691r78120M84159j065378J226502M33140J374498
$$ 21859162 21886912 22188519 24483210 23505090 23989249 22923871 24150373 24583513 25958011
6997B5958011j749302J89876J435001N37700J392740K04585J746772L99950j713148
$$ 25958011 24208709 24398585 25833586 26371286 27764026 27968611 29715383 30115333 28402185
6988B8402185J372394K15212O04607j78299J353020J772643J267095j567708J276081
$$ 28402185 29774579 29989791 30594398 30416099 31769119 33541762 34808857 33241149 34517230
6979C4517230K030471r49899R36553K213634l16841M99134L03030L743198n74937
$$ 34517230 36547701 35597802 36534355 38747989 38431148 38930282 39233312 42976510 42401573
6970D2401573m6956K392015k86189K584419O4662J887021n90649K308980J198622
$$ 42401573 42354617 44746632 44460443 47044862 47109524 48996545 48405896 50714876 51913498
6961E1913498K223008K3134J313952J284617p97423K680430K480832J386787q81869
$$ 51913498 54136506 54159640 55473592 56758209 55960786 58641216 61122048 62508835 61626966
6952F1626966J893921J2570L262144K677686J007258K409684J732377J801483
$$ 61626966 63520887 63533457 66795601 69473287 70480545 72890229 74622606 76424089
6944G6424089J867563K994072N64420K070488K30585M155131J557159K64126J674348
$$ 76424089 78291652 81285724 81850144 83920632 84151217 88306348 89863507 90127633 91801981
6935I1801981J506758K511488L10165N338562K784285J800444J468998J413989
$$ 91801981 93308739 95820227 96130392 101468954 104253239 106053683 107522681 108936670
6927A08936670L594466J112929K225246L408110K79235K381487J565350J516545
$$ 108936670 112531136 113644065 115869311 119277421 119556656 121938143 123503493 125020038
6919A25020038M008040k78173L320591J699371L307770K432982K040244K063599
$$ 125020038 129028078 128749905 132070496 133769867 137077637 139510619 141550863 143614462
6911A43614462K410454P59462L836708K193492P41300K860918L600586K768574
$$ 143614462 146024916 146784378 150621086 152814578 153555878 156416796 160017382 162785956
6903A62785956J938550K290276K378590R46005L549617K063766M23160R0805k08493
$$ 162785956 164724506 167014782 169393372 170339377 173888994 175952760 176375920 176466725 176258232
6894A76258232J851183k48817J532464N217524L165178J578194J280412J999135
$$ 176258232 178109415 177860598 179393062 184610586 187775764 189353958 190634370 192633505
6886A92633505L794372K357635J748000J291823J094123r80464j870599R39914
$$ 192633505 196427877 198785512 200533512 201825335 202919458 201938994 200068395 201008309
6878B01008309O8870J466505J24579m40562J301616J938428J015687J895843J657758
$$ 201008309 201077179 202543684 202668263 202227701 203529317 205467745 206483432 208379275 210037033
6869B10037033q19210K250564J397861J13520L018583m65675Q91305l66638k2765
$$ 210037033 209217823 211468387 212866248 212979768 215998351 215532676 216423981 216057343 216034578
6860B16034578j70712k145616J78646P75022k980496K35596j00376n08377Q64870
$$ 216034578 215863866 213718250 213896896 214671918 211691422 211927018 211826642 211318265 212183135
6851B12183135J598212l40549J319182J230067l0453j035047M69300m09696j897439
$$ 212183135 213781347 213440798 214759980 215990047 215959594 214924547 215393847 214984151 213086712
6842B13086712l7679j409081l86717j742706j216906K000145J262068O57860k28637
$$ 213086712 213049033 211639952 211253235 209510529 208293623 210293768 211555836 212213696 211985059
6833B11985059Q41703K25059j033757k332324k79708k085605l357586j627937
$$ 211985059 212826762 213051821 212018064 209685740 209406032 207320427 203962841 202334904
6825B02334904q84122p56787k492285Q52140j82533K22810j350381j667903L53208
$$ 202334904 201450782 200693995 198201710 199053850 198871317 199094127 197743746 196075843 196429051
6816A96429051l26688k915827m496521k583300k000196l791210n086678j192941
$$ 196429051 196102363 193186536 188690015 186106715 184106519 180315309 175228631 174035690
6808A74035690k317263l109891k708052j081216l922503J086025j242838J812386
$$ 174035690 171718427 168608536 165900484 164819268 160896765 161982790 160739952 162552338
6800A62552338j563598j053568j722752J120972Q5798j726512J00096m008128
$$ 162552338 160988740 159935172 158212420 159333392 159419190 157692678 157792774 153784646
6792A53784646j581992n409627k480161j150510k105304k717963j094954l383162
$$ 153784646 152202654 146793027 144312866 143162356 141057052 138339089 137244135 133860973
6784A33860973n82962j629509m93334k28314j160825k477528k556935r50130m840166
$$ 133860973 133278011 131648502 131155168 130926854 129766029 127288501 124731566 123781436 118941270
6775A18941270l709836l500190l067613j391192m150739k960785m74489l412199
$$ 118941270 115231434 111731244 108663631 107272439 103121700 100160915 99686426 96274227
6767I6274227l195521k53354j626577j782391m446139k26447l464624j296583
$$ 96274227 93078706 92825352 91198775 89416384 84970245 84743798 81279174 79982591
6759G9982591k546497j911072j655151l435301k001001r02222j520295k11517
$$ 79982591 77436094 75525022 73869871 70434570 68433569 67531347 66011052 65799535
6751F5799535l871087n71224k405835k898645l79780j299876r45339j521437k232461
$$ 65799535 61928448 61357224 58951389 56052744 55672964 54373088 53427749 51906312 49673851
6742D9673851k401749j498395J62994o19332m466059K091908k582587j989700
$$ 49673851 47272102 45773707 45936701 45317369 40851310 42943218 40360631 38370931
6734C8370931j507415l08564J31041j949807j596276L73428N1582q38101k037660
$$ 38370931 36863516 36554952 36685993 34736186 33139910 33513338 33564920 32726819 30689159
6725C0689159J785571k847614k057704p4303M38644j167197j472404j455722L596781
$$ 30689159 32474730 29627116 27569412 27495109 27933753 26766556 25294152 23838430 27435211
6716B7435211j657748l005369l70429J318445k309003j328749R90693J481405
$$ 27435211 25777463 22772094 22401665 23720110 21411107 20082358 21073051 22554456
6708B2554456l79653j893341j276458J531691n92821j598445R99802N34362k133647
$$ 22554456 22174803 20281462 19005004 20536695 19943874 18345429 19345231 19879593 17745946
6699A7745946L08798p32170k57103l28193O13541l81926j55652j691857J558564
$$ 17745946 18054744 17322574 17065471 16737278 17350819 16968893 16813241 15121384 16679948
6690A6679948j648345O90283r67514j81165m10383j313993N40708J549591k162068
$$ 16679948 15031603 15721886 14754372 14573207 14162824 12848831 13389539 14939130 12777062
6681A2777062P4118N21698p02110J06417k92737j80299O67312p60505l61146o69097
$$ 12777062 12851180 13372878 12670768 12777185 12484448 12304149 12971461 12210956 11849810 11180713
6671A1180713m01676J445568P79627j128102q45585j201232R46226K64919K61678
$$ 11180713 10779037 12224605 13004232 11876130 11030545 9829313 10775539 11040458 11302136
6662A1302136j890115L28836J939368j580243m06739n25130J02471K40590j423838
$$ 11302136 9412021 9740857 11680225 10099982 9693243 9168113 9270584 9511174 8087336
6653H087336K146404m23721J494671k196572r80418O85650N65602m46752m40786
$$ 8087336 10233740 9810019 11304690 9108118 8127700 8813350 9378952 8932200 8491414
6644H491414M17778m13925j448355J920151j51483q2411M07396r18788O3724P74925
$$ 8491414 8909192 8495267 7046912 8967063 8815580 8733169 9140565 8221777 8285501 9060426
6634I060426j501374J183407j689034M1815Q77545o55336k19408r13891J751970
$$ 9060426 7559052 8742459 7053425 7095240 7972785 7317449 7098041 6184150 7936120
6625G936120m57778J28479k86042Q12993o0736m67527J343573r15467j292920
$$ 7936120 7478342 7606821 7320779 8133772 8073036 7605509 8949082 8033615 6740695
6616F740695j168876P53288R48597O29978p21977L83202m02354j038072J031665
$$ 6740695 5571819 6325107 7273704 7903682 7181705 7564907 7162553 6124481 7156146
6607G156146K52689j62961O6467j11211j484049J73242P49322R44296m67914J336955
$$ 7156146 7408835 7245874 7312341 7201130 5717081 5890323 6639645 7583941 7116027 8452982
6597H452982k038215k46380R1645O21429q08812n23911J617311L33555K54494
$$ 8452982 6414767 6168387 6260032 6881461 6072649 5548738 7166049 7499604 7754098
6588G754098j845637J383131j112116k14722J015364O83650j160478q01899R14938
$$ 7754098 5908461 7291592 6179476 5964754 6980118 7663768 6503290 5701391 6616329
6579F616329l28328M37162k308127J386219K030726n33790l73884P50560j10002
$$ 6616329 6288001 6725163 4417036 5803255 7833981 7300191 6926307 7676867 7566865
6570G566865k00692j204404r11570J184233P28616j530925L50729l62344J938500
$$ 7566865 7366173 6161769 5250199 6434432 7163048 5632123 5982852 5620508 7559008
6561G559008j715716j99350J635033k87979P95340j105047O0266k642407J213003
$$ 7559008 5843292 5643942 7278975 6990996 7786336 6681289 6741555 4099148 5312151
6552E312151J449026J525310l44228l365967K555238j89988o42496j343311K071385
$$ 5312151 6761177 8286487 7942259 4576292 7131530 6941542 6299046 4955735 7027120
6543G027120k06815K08252J67085P61137R17864k132990J4217j087235J716473
$$ 7027120 6820305 7028557 7195642 7956779 8874643 6741653 6755870 5668635 7385108
6534G385108P0930p15670Q3721j190429J149789N8990M80868K92345p85456k171809
$$ 7385108 7456038 6740368 6824089 5633660 6783449 6842439 7323307 7615652 6830196 4658387
6524D658387k93436J473072K938536j079304j279050J18205l14493n61575J139895
$$ 4658387 4364951 5838023 8776559 7697255 6418205 6536410 6221917 5660342 6800237
6515F800237M84918j126566l96568J004674J134361J34682j232707n93898J900010
$$ 6800237 7285155 6158589 5762021 6766695 7901056 8035738 6803031 6209133 8109143
6506H109143r79783q175j663504J984895J71919j824048j90596J693843O09030
$$ 8109143 7129360 7121185 5457681 7442576 7614495 5790447 5599851 7293694 7902724
6497G902724j569342j073365L94916J21988L73975j46655J202631R18748k739656
$$ 7902724 6333382 5260017 5654933 5776921 6150896 6004241 7206872 8125620 5385964
6488E385964Q06420J221880l03545j771938l56250N72239J328212M21614k77977
$$ 5385964 6192384 7414264 7110719 5338781 4982531 5554770 6882982 7304596 7026619
6479G026619m47759n28302n24562J53661r43489L14558J406152k40210Q08062
$$ 7026619 6578860 6050558 5525996 5679657 4736168 5050726 6456878 6216668 7024730
6470G024730j380474j197137K280224L81835r33405K5249o83255J024685n12479
$$ 7024730 5644256 4447119 6727343 7109178 6175773 6201022 5517767 6542452 6029973
6461F029973J038644j519629J33886J341267k27787n07717J135592j900797N43059
$$ 6029973 7068617 5548988 5682874 7024141 6796354 6288637 7424229 5523432 6066491
6452F066491K23278m2241n92684J267222j36761n26844p62157j04984K1702Q2879
$$ 6066491 6289769 6247528 5654844 6922066 6785305 6258461 5496304 5391320 5413022 5495901
6442E495901P8496J580429Q10210l29158r55355J58869M27760m31071Q9384k079747
$$ 5495901 5574397 7154826 7965036 7635878 6680523 6839392 7267152 6836081 6925465 4845718
6432D845718J900222Q13492k29672j52994Q35272j539686R04783j96789M60159
$$ 4845718 6745940 7559432 7329760 7176766 8012038 6472352 7377135 7180346 7640505
6423G640505Q51865j122706J280j206538J512729L31032r26350j26518J829494
$$ 7640505 8492370 7369664 7370944 6164406 7677135 8008167 7081817 6955299 8784793
6414H784793j213743j407274L63137K416834O50443j583192j52617r97466J613363
$$ 8784793 7571050 6163776 6526913 8943747 9594190 8010998 7858381 6860915 8474278
6405H474278J335416k320071Q64679j12622K35343L50482m48q41091P56821o49878
$$ 8474278 9809694 7489623 8354302 8241680 8477023 8827505 8827057 7985966 8742787 8092909
6395H092909R98345N47563q82116p3185O55593J112812j186825J183414j95035
$$ 8092909 9091254 9638817 8756701 8683516 9339109 10451921 9265096 10448510 10253475
6386A0253475M92998N0541N34063M94455q85693Q6872J500899j857941J995811
$$ 10253475 10746473 10797014 11331077 11825532 10939839 11026711 12527610 10669669 12665480
6377A2665480k619401O95680J343632N43638q44181O65606L78208J600557k016095
$$ 12665480 10046079 10741759 12085391 12629029 11784848 12450454 12828662 14429219 12413124
6368A2413124J068431j523079J718068J52168l39441O84061M01232n85008R63308
$$ 12413124 13481555 11958476 13676544 13828712 13489271 14173332 14574564 13989556 14952864
6359A4952864J302550k37280j794240Q51780J582621j61884Q36853j046874J48246
$$ 14952864 16255414 16018134 14223894 15075674 16658295 16496411 17333264 16286390 16434636
6350A6434636m09485o46646J595744J702171r61029J192515j227796P91488l69703
$$ 16434636 16025151 15378505 16974249 18676420 17715391 18907906 17680110 18471598 18101895
6341A8101895M90281J139247J917600k06659m49000j422904R50637J049976M66205
$$ 18101895 18592176 19731423 21649023 21442364 20993364 19570460 20521097 21571073 22037278
6332B2037278Q97242J852394O3491r20580L39015J165641J489720o60098J45271
$$ 22037278 22934520 24786914 24850405 23929825 24268840 25434481 26924201 26264103 26409374
6323B6409374Q01642K499847r85219R52951J822517j07991P12694J41375j88443
$$ 26409374 27211016 29710863 28725644 29678595 31501112 31393121 32105815 32247190 32058747
6314C2058747K612643M0412N29090j85855K056751J717425N27473J130897K380451
$$ 32058747 34671390 34711802 35240892 35055037 37111788 38829213 39356686 40487583 42868034
6305D2868034M65660O7652J624551K254982Q53950Q92660J966371K692440K851852
$$ 42868034 43333694 43401346 45025897 47280879 48134829 49027489 50993860 53686300 56538152
6296E6538152J72080J875243J426110K008207M97330L835026K935680K427067
$$ 56538152 56710232 58585475 60011585 62019792 62517122 66352148 69287828 71714895
6288G1714895Q31177K684561J725165K744707K828708K9126L224229R85818K247827
$$ 71714895 72546072 75230633 76955798 79700505 82529213 82558339 85782568 86768386 89016213
6279H9016213J846346K581142L5143J094531J549175M88209L052511p77646J258045
$$ 89016213 90862559 93443701 93478844 94573375 96122550 96610759 99663270 98885624 100143669
6270A00143669K574912K397158l226926L285945P95209J031304K163660O07279
$$ 100143669 102718581 105115739 101888813 105174758 105969967 107001271 109164931 109772210
6262A09772210K690206J832047j98767J678170K305660L350205J422873R77880
$$ 109772210 112462416 114294463 114095696 115773866 118079526 121429731 122852604 123830484
6254A23830484L039207J308272J689741r05675K647855l05395n04191R18069j699826
$$ 123830484 126869691 128177963 129867704 128962029 131609884 131304489 130800298 131718367 130018541
6245A30018541o34426k663824l291674j730952j413199j29576k245556J275523
$$ 130018541 129384115 126720291 123428617 121697665 120284466 120154890 117909334 119184857
6237A19184857j318875q0275k389724p71052J511623k634230j953322J066469
$$ 119184857 117865982 117785707 115395983 114624931 116136554 113502324 111549002 112615471
6229A12615471j629023M24992p39967r86735q97059k086970k05368J691549k35703
$$ 112615471 110986448 111411440 110671473 109684738 108787679 106700709 106495341 108186890 107951187
6220A07951187p53894j304460J49296j94688l980210j01820L37912n35844j897919
$$ 107951187 107197293 105892833 106042129 105847441 101867231 101765411 102103323 101567479 99669560
6211I9669560j841557j162944j49423j555191j228301O56651p58819K73687j535832
$$ 99669560 97828003 96665059 96515636 94960445 93732144 94388795 93629976 93903663 92367831
6202I2367831j093401L583814q31281J508973J056899K496077Q61838L537085
$$ 92367831 91274430 94858244 94026963 95535936 96592835 99088912 99950750 103487835
6194A03487835R23560L234384J858639N712316L791399K200923L081943L393728
$$ 103487835 104411395 107645779 109504418 115216734 119008133 121209056 124290999 127684727
6186A27684727M219795M46222K240339J625032j410529Q5556n06488l651894m397543
$$ 127684727 131904522 132350744 134591083 136216115 134805586 134891142 134384654 130732760 126335217
6177A26335217j731093l274891n123843l796111k491759l777697n069843n009427
$$ 126335217 124604124 121329233 116205390 112409279 109917520 106139823 101069980 96060553
6169I6060553k332873n436173l173185m580019r80452l492998m554401k989469
$$ 96060553 93727680 88291507 85118322 80538303 79557851 76064853 71510452 68520983
6161F8520983k942016j998496k172966j593597k628384j028288k364462k453247
$$ 68520983 65578967 63580471 61407505 59813908 57185524 56157236 53792774 51339527
6153E1339527r45947l95942j304177l354378j228487M98231k214507q87594j107055
$$ 51339527 50393580 49997638 48693461 45339083 44110596 44608827 42394320 41506726 40399671
6144D0399671j600756j121755k287007k52687j136845P05084j637455j092841
$$ 40399671 38798915 37677160 35390153 35137466 34000621 34705705 33068250 31975409
6136C1975409o81659j556555k84204q42821p4150k834239N53823o14925N51024
$$ 31975409 31293750 29737195 29452991 28610170 28536020 25701781 26255604 25640679 26191703
6127B6191703j128693l26436r04885j406927J824581j110220M48997j020313M2479
$$ 26191703 25063010 24736574 23831689 22424762 24249343 23139123 23588120 22567807 22610286
6118B2610286j826124l80063R8580J42592k727280L02870k53613N53760Q62476
$$ 22610286 20784162 20404099 20502679 20645271 17917991 18220861 17967248 18521008 19383484
6109A9383484m96513k65219j90895j569051l30739J097284k085384J598535l72206
$$ 19383484 18886971 18621752 18430857 16861806 16531067 17628351 15542967 17141502 16769296
6100A6769296j253884p92959J622221J02875j321609n10453R23687l07540j014886
$$ 16769296 15515412 14722453 16344674 16447549 15125940 14615487 15539174 15231634 14216748
6091A4216748R33525j520734Q1230J052861o61873r86273j17081K27918j82671
$$ 14216748 15150273 13629539 13710769 14763630 14101757 13115484 12998403 13226321 13043650
6082A3043650j783375J792423J114249n04666j742276l13956L13740L10271J75044
$$ 13043650 11260275 13052698 14166947 13662281 11920005 11606049 11919789 12230060 12405104
6073A2405104k15508L99509o78194j648015J227090K43889J239720j744061j302815
$$ 12405104 12189596 12589105 11910911 10262896 11489986 11733875 12973595 11229534 9926719
6064I926719q44658J279217M06285j515463J508220j130439P95041Q11181k2197
$$ 9926719 9082061 10361278 10767563 9252100 10760320 9629881 10424922 11236103 11213906
6055A1213906k366710J422848n99746J019578j038982j302504R87564J022032
$$ 11213906 8847196 10270044 9670298 10689876 9650894 8348390 9335954 10357986
6047A0357986R4708j757472M94616J652856j739788j33576L36582J735912j498975
$$ 10357986 10452694 8695222 9189838 10842694 9102906 8969330 9305912 11041824 9542849
6038I542849N55104m96757J652824m44658l126891J322315J269788Q91375j408506
$$ 9542849 10097953 9601196 11254020 10809362 7682471 9004786 10274574 11165949 9757443
6029I757443j035401K18192N82023l5493M25318K57538R834k42424M74837j602889
$$ 9757443 8722042 8940234 9522257 9486764 9912082 10169620 10179454 9937030 10411867 8808978
6019H808978R4972J481840K13110j085643j185394j28870R74203J148487k292300
$$ 8808978 8903950 10385790 10598900 9513257 8327863 8198993 9173196 10321683 8029383
6010H029383J423811P66720j173921m20301j279369L442244k324683O17009P98373
$$ 8029383 9453194 10219914 9045993 8625692 7346323 10788567 8463884 9080893 9879266
6001I879266M99105j712396o44605m09279K193722l96637M6824k97056j678086
$$ 9879266 10378371 8665975 8021370 7612091 9805813 9409176 9456000 9158944 7480858
5992G480858m7799J135262Q30795K26137J98122L21712j487292L92431n45745
$$ 7480858 7433059 8568321 9399116 9625253 9823375 10145087 8657795 9050226 8504481
5983H504481J463750Q7559N64886n89771q55659m77504J502650j313959L07024
$$ 8504481 9968231 10055790 10620676 10030905 9175246 8697742 10200392 8886433 9193457
5974I193457M54542J005217q85096j6310J68360O09473j68160m65174O02267Q3574
$$ 9193457 9647999 10653216 9768120 9751810 9920170 10529643 10361483 9896309 10498576 10582150
5964A0582150r03461o24550J059458m34064R89090K89051o05495N70134J48181
$$ 10582150 9678689 9054139 10113597 9679533 10668623 10957674 10352179 10922313 11070494
5955A1070494P3382j272338M67636n55285l51257N77734J339084k9339j59620
$$ 11070494 11143876 9871538 10339174 9783889 9432632 10010366 11349450 11320111 11160491
5946A1160491j9675n05374q33354p54095K099415k5630N4939n72345N44471L06150
$$ 11160491 11140816 10635442 9802088 9047993 11147408 11121778 11176717 10604372 11148843 11454993
5936A1454993P25083l180509J160426J316060j17627J787886j978489O2357m28519
$$ 11454993 12180076 8999567 10159993 11476053 11358426 13146312 11167823 11230180 10801661
5927A0801661M55543J923095j392015j96511R00039L2984l95246J326397j660408
$$ 10801661 11257204 13180299 11788284 11591773 12491812 12524796 12129550 13455947 11795539
5918A1795539J845378q64611J265562m52197r21274J34746M549J495525k08914
$$ 11795539 13640917 12776306 14041868 13589671 12668397 12803143 12807692 14303217 14094303
5909A4094303j057599M26928L49066P15965K07983K86991j719269M45987j355594
$$ 14094303 13036704 13463632 13812698 14528663 14736646 15023637 13304368 13750355 12394761
5900A2394761L735074N0756r9190k296404J493943j5878n32161R74954M7466j68526
$$ 12394761 16129835 16180591 16081401 13784997 15278940 15263062 14730901 15705855 15753321 15584795
5890A5584795K82243K096332k209426J173467q64551L69880J02608L06110n03331
$$ 15584795 15867038 17963370 15753944 16927411 16062860 16432740 16535348 16841458 16338127
5881A6338127J306525N77535k28636M07736n695J110502K12890j182679j53375
$$ 16338127 17644652 18222187 17993551 18401287 18395592 19506094 19718984 18536305 18382930
5872A8382930k39276K848600P7409j025242j364958J374752p51013N97704O89731
$$ 18382930 18143654 20992254 21069663 20044421 18679463 20054215 19303202 19900906 20590637
5863B0590637J167854j858421J66385J225260l14593J07660p8695O33891N45992
$$ 20590637 21758491 19900070 20066455 21291715 20977122 21084782 21006087 21639978 22185970
5854B2185970m68908j34577J552037N02047m29633Q5822J726904o84428N73917
$$ 22185970 21717062 21582485 23134522 23636569 23206936 23292758 25019662 24335234 24909151
5845B4909151J594905j009133j325536j749588K881817m06718j954394Q94170
$$ 24909151 26504056 25494923 24169387 22419799 25301616 24894898 22940504 23834674
5837B3834674l33700R5084j93546O31078J59662o28163J302598J154165K18971
$$ 23834674 23500974 23596058 23402512 24033590 24193252 23565089 24867687 26021852 26240823
5828B6240823j590554j328123P36154O43312L10686K021Q57686j132171P80378
$$ 26240823 24650269 23322146 24058300 24701612 25012298 25014319 25872005 24739834 25520212
5819B5520212j983466K822642O08186L74535k102229K102191L32315j914575N97067
$$ 25520212 23536746 26359388 26967574 27342109 25239880 27342071 27674386 25759811 26356878
5810B6356878o20540K261266j115583j392210K692665K1324k285880K147637J318770
$$ 26356878 25736338 27997604 26882021 25489811 28182476 28203800 25917920 28065557 29384327
5801B9384327p97740r60862Q36381K511609j102007R48751R12485J207843j307268
$$ 29384327 28586587 27625725 28462106 30973715 29871708 30820459 31732944 32940787 31633519
5792C1633519q63021L61740K449124P16198M54518N75523J148323q09553K449357
$$ 31633519 30770498 31132238 33581362 34297560 34752078 35327601 36475924 35666371 38115728
5783C8115728o59266N81127K420081j324858P22859J409134N4072j734489J237354
$$ 38115728 37456462 38037589 40457670 39132812 39855671 41264805 41318877 39584388 40821742
5774D0821742m89307P37430o89246J290388r70999L60862M38910o00797J509596
$$ 40821742 40332435 41069865 40380619 41671007 40700008 41060870 41499780 40898983 42408579
5765D2408579K22059j372890J545696J410081j317523M03806K37427J707296L228293
$$ 42408579 42630638 41257748 42803444 44213525 42896002 43299808 43537235 45244531 48472824
5756D8472824j340208k24294K037820R15246l96877K00371n74957L348462j64923
$$ 48472824 47132616 46908322 48946142 49861388 49464511 49664882 49089925 52438387 52273464
5747E2273464n17526K717635J766937q45569L63838J735482P76827J385069J405845
$$ 52273464 51755938 54473573 56240510 55394941 55758779 57494261 58271088 59656157 61062002
5738F1062002J633232P21530K8750M02096K882254J844040l08088J027070K354208
$$ 61062002 62695234 63416764 63445514 63847610 66729864 68573904 68265816 69292886 71647094
5729G1647094N56798K527136K446833K109210R43106J607096K578049L476052
$$ 71647094 72203892 74731028 77177861 79287071 80230177 81837273 84415322 87891374
5721H7891374O85935J510321K582663K357545J893044K215973L193563L026341
$$ 87891374 88577309 90087630 92670293 95027838 96920882 99136855 102330418 105356759
5713A05356759L491540L576039J172894N333650K572385K263608M815877L777642
$$ 105356759 108848299 112424338 113597232 118930882 121503267 123766875 128582752 132360394
5705A32360394M013449M167588L210422M742207L863430L701780J260669N359500
$$ 132360394 136373843 140541431 143751853 148494060 152357490 156059270 157319939 162679439
5697A62679439M457666L866875L628662L271415M066901L068951L056652L027871
$$ 162679439 167137105 171003980 174632642 177904057 181970958 185039909 188096561 191124432
5689A91124432L354349K280949M489031J383293R04184K920521L746164K228315
$$ 191124432 194478781 196759730 201248761 202632054 203536238 206456759 210202923 212431238
5681B12431238K154951J267680K183301L483277J921450K059298K248993L927356
$$ 212431238 214586189 215853869 218037170 221520447 223441897 225501195 227750188 231677544
5673B31677544K999973K525190J042783K652015L818016K717253L637468J078428
$$ 231677544 234677517 237202707 238245490 240897505 244715521 247432774 251070242 252148670
5665B52148670K569624L378986N40536J099942Q89438R43626j641267j771534
$$ 252148670 254718294 258097280 258637816 259737758 260627196 261570822 259929555 258158021
5657B58158021j627091J74455m774211m156695r689n53691k494399j081049m76751
$$ 258158021 256530930 256705385 251931174 247774479 247764790 247211099 244716700 243635651 243158900
5648B43158900R05001l030020p39974q97255l502421J56842m122990O78998k023113
$$ 243158900 244063901 241033881 240293907 239396652 235894231 236051073 231928083 232607081 230583968
5639B30583968j946297j05807K414421l252168j122385j045287J754640l494975
$$ 230583968 228637671 228531864 230946285 227694117 226571732 225526445 227281085 223786110
5631B23786110l046o97122j182955j023739m465631J655861K12291l051086j470600
$$ 223786110 223783064 223085942 221902987 220879248 216413617 218069478 218281769 215230683 213760083
5622B13760083j862418K8712q47867j919173m42369J135545J675268j287258K118703
$$ 213760083 211897665 211926377 211078510 209159337 208716968 209852513 211527781 210240523 212359226
5613B12359226K738323J741631J296737p0484K657793M055220N333577L426861
$$ 212359226 215097549 216839180 218135917 218065433 220723226 224778446 230112023 233538884
5605B33538884K494607N016831N994967K459158M725384M582791N321332K335426
$$ 233538884 236033491 241050322 247045289 249504447 254229831 258812622 264133954 266469380
5597B66469380L954083K311752l83511Q50680j985343j784828o540184n625471
$$ 266469380 270423463 272735215 272351704 273202384 271217041 269432213 262892029 257266558
5589B57266558k895322n208106n598593o237302m560501n989992q868963o228162
$$ 257266558 254371236 249163130 243564537 237327235 232766734 226776742 217907779 211679617
5581B11679617m137762o978974p176195o689663k890241n312830o116555l644341
$$ 211679617 207541855 200562881 193386686 186697023 183806782 178493952 172377397 168733056
5573A68733056l971204m631154k531921l724233l076478k430620k915594k493056
$$ 168733056 164761852 160130698 157598777 153874544 150798066 148367446 145451852 142958796
5565A42958796l541165q50041j534475l426457j232839m064661q68366o20825
$$ 142958796 139417631 138567590 137033115 133606658 132373819 128309158 127440792 126819967
5557A26819967m36473l242149j462345j485902o67489r78339r66836J381821j497899
$$ 126819967 126383494 123141345 121679000 120193098 119525609 118547270 117580434 118962255 117464356
5548A17464356p76525q9886Q19029L36773r3406q3518Q01969n9092k90483N83878
$$ 117464356 116687831 116597945 117416974 117753747 117660341 117576823 118378792 118319700 118029217 118613095
5538A18613095N52548J117482j37179J335014J683039K015292K261645J647348
$$ 118613095 119165643 120283125 120145946 121480960 123163999 125179291 127440936 129088284
5530A29088284n92747J233786M189495M493605K999115M224414K995151N20998
$$ 129088284 128495537 129729323 133918818 138412423 141411538 145635952 148631103 149152101
5522A49152101M084423J204177L212274J411241K159283K415564N375218L407391
$$ 149152101 153236524 154440701 157652975 159064216 161223499 163639063 169014281 172421672
5514A72421672N193738M501163M206794M41930Q24699L81557J264419K348820
$$ 172421672 177615410 182116573 186323367 186765297 187589996 187971553 189235972 191584792
5506A91584792K866441R34119l46566j736481K442181K98178K173657J798405
$$ 191584792 194451233 195385352 195038786 193302305 195744486 196042664 198216321 200014726
5498B00014726K924150K971529K382014M251999K037079K415276K415517M498470
$$ 200014726 202938876 205910405 208292419 212544418 214581497 216996773 219412290 223910760
5490B23910760N103251K705627M111857N490737N123058M152592J982161N410737
$$ 223910760 229014011 231719638 235831495 241322232 246445290 250597882 252580043 257990780
5482B57990780M796277M123887N747591J801267n951137j2007835j3635093n458729
$$ 257990780 262787057 266910944 272658535 274459802 268508665 256500830 242865737 237407008
5474B37407008k119429k44383L982231L416179M618664K991419O260079P238351
$$ 237407008 235287579 235043196 239025427 242441606 247060270 250051689 256311768 263550119
5466B63550119O119021k699359k061063J090346l460206J779744J448481J689640
$$ 263550119 269669140 266969781 264908718 265999064 262538858 264318602 265767083 267456723
5458B67456723Q10000L088905L559294N446069M122101N661827K814496J486367
$$ 267456723 268266723 271355628 274914922 280360991 284483092 290144919 292959415 294445782
5450B94445782J785379J183016l08580k056628p64624j009990j224046j335119
$$ 294445782 296231161 297414177 297105597 295048969 294284345 293274355 292050309 290715190
5442B90715190k857953m360757k93991K463556J004404O16164K456938J567594
$$ 290715190 287857237 283496480 283202489 285666045 286670449 287286613 289743551 291311145
5434B91311145M499519K578468O953151N191761M238095M121568K768850N349260
$$ 291311145 295810664 298389132 305342283 310534044 314772139 318893707 321662557 327011817
5426C27011817P692799R265292J3523328J0995236J0106947O119376Q655099P910314
$$ 327011817 334704616 343969908 357493236 368488472 378595419 384714795 393369894 401280208
5418D01280208J0878766O888425L38182q488987j2912140j0816275r344309j0267498
$$ 401280208 412158974 419047399 419385581 410896594 397984454 387168179 377823870 367556372
5410C67556372r871304p252411n372267r258626n378306m747830p929794p649938
$$ 367556372 357685068 350432657 345060390 335801764 330423458 325675628 317745834 310095896
5402C10095896j0503888q563764q813887r875073p407499m947885l992374k857076
$$ 310095896 299592008 291028244 282214357 272339284 264931785 259983900 255991526 253134450
5394B53134450k669444k162623k806870n042393j046792o517215k936262l806768
$$ 253134450 250465006 248302383 245495513 240453120 239406328 232889113 229952851 226146083
5386B26146083k559557l586667n234191n591671m154612m171414o730102k254376
$$ 226146083 223586526 219999859 214765668 209173997 205019385 200847971 194117869 191863493
5378A91863493k525654j295950m175989k958976K29295M90722q14743L051561
$$ 191863493 189337839 188041889 183865900 180906924 181136219 181626941 180812198 183863759
5370A83863759k31660K16150L84082J530310K196287L999843M710755O456654
$$ 183863759 183632099 183848249 184232331 185762641 187958928 191958771 196669526 203126180
5362B03126180N330507M100938P383041L254975O079081P041840Q185149O635347
$$ 203126180 208456687 212557625 219940666 223195641 229274722 236316562 244501711 251137058
5354B51137058M59660m001538n875804p929858r902215j0402130o777727q867784
$$ 251137058 251596718 247595180 241719376 233789518 223887303 213485173 206707446 197839662
5346A97839662q177087n338852p084094m635667p164971n314523o813572p266808
$$ 197839662 189662575 184323723 177239629 172603962 165438991 160124468 153310896 146044088
5338A46044088n348934m751614n631065m747366n204081n798690k762187l197506
$$ 146044088 140695154 135943540 130312475 125565109 120361028 114562338 111800151 108602645
5330A08602645j668475k665418m489274l916822l181653k553598j100727k791574
$$ 108602645 106934170 104268752 99779478 95862656 92681003 90127405 89026678 86235104
5322H6235104k053134k282788l741159l513530m31932j685454k600316k610658
$$ 86235104 84181970 81899182 78158023 74644493 74212561 72527107 69926791 67316133
5314F7316133j010071k872419p53634k152369j357048j288278k157236j565291
$$ 67316133 66306062 63433643 62680009 60527640 59170592 57882314 55725078 54159787
5306E4159787j015079q57239p13921j398926j249721j428536j304822n5556m10674
$$ 54159787 53144708 52287469 51573548 50174622 48924901 47496365 46191543 46135987 45725313
5297D5725313k480298k14978k430710J772100j862611k028830J290721j976663
$$ 45725313 43245015 43030037 40599327 42371427 40508816 38479986 39770707 37794044
5289C7794044M5184L14972k347089K16458j455319P22903j417089o88986k05507
$$ 37794044 37839228 38154200 35807111 36023569 34568250 35291153 33874064 33185078 32979571
5280C2979571J6226j521738O6170n72309O50181o25659j461781P83786m14458
$$ 32979571 32995797 31474059 31540229 30967920 31618101 30992442 29530661 30314447 29899989
5271B9899989p34672r80047k21413K94694j72645k173795J18484O41765j533117
$$ 29899989 29165317 28185270 27963857 28258551 28085906 25912111 26030595 26672360 25139243
5262B5139243j63568n26345M22453o06274j795700K255975k153658Q75666j336752
$$ 25139243 24975675 24449330 24871783 24265509 22469809 24725784 22572126 23447792 22111040
5253B2111040J344261j162657q33196J099651j327602l5367j276695M30061p92916
$$ 22111040 23455301 22292644 21459448 22559099 21231497 21196130 19919435 20349496 19556580
5244A9556580L87485M9826p7933o67131j272071K10377J490488r15085j27473
$$ 19556580 19944065 19993891 19915958 19248827 17976756 18187133 19677621 18762536 18635063
5235A8635063K88679j884230Q18950j366993K75484m27027Q74997k86480K00499
$$ 18635063 18923742 17039512 17858462 16491469 16766953 16339926 17214923 16928443 17128942
5226A7128942J32542l63212p60791P59388O67956j951596r49401k64419N83688
$$ 17128942 17261484 16898272 16137481 16896869 17564825 15613229 14663828 14399409 14983097
5217A4983097N82569j464308m90626J415339j74684m29467j947631J863490m73637
$$ 14983097 15565666 14101358 13610732 15026071 14851387 14421920 12474289 14337779 13864142
5208A3864142j315687J065697l04894R88012m79973O84127J65666j944468r79182
$$ 13864142 12548455 13614152 13309258 14297270 13817297 14501424 14667090 12722622 11743440
5199A1743440p42724J957701k6692m19319J59017m67044R54764j910495j20597
$$ 11743440 11000716 12958417 12931725 12512406 12671423 12204379 13159143 11248648 11128051
5190A1128051J364035J91176r30275n05275k14571k17207k38926q90089K127961
$$ 11128051 12492086 12683262 11752987 11247712 11033141 10815934 10577008 9686919 11814880
5181A1814880P57427k165292J051510l17187o57409Q1951P89845J39556M02708
$$ 11814880 12572307 10407015 11458525 11141338 10483929 10565880 11355725 11495281 11897989
5172A1897989k240287L85873L78892m42059K99070N25784J13843j8952J19264
$$ 11897989 9657702 10043575 10422467 9980408 10279478 10805262 10919105 10900153 11019417
5163A1019417j597111M96813Q81008r93461j553127O26511J180880M33615j301672
$$ 11019417 9422306 9919119 10800127 9806666 8253539 8880050 10060930 10494545 9192873
5154I192873L47036N96910O74899k567220L11531J458303O00933j784168L489638
$$ 9192873 9539909 10136819 10811718 8244498 8556029 10014332 10615265 8831097 12320735
5145A2320735k481981j203727n10417Q57256J253264q51706J39860J069863r98561
$$ 12320735 9838754 8635027 8124610 8981866 10235130 9383424 9523284 10593147 9594586
5136I594586j244889M54312J574337O84699j835617L10067q20181P03658j606074
$$ 9594586 8349697 8804009 10378346 11063045 9227428 9537495 8717314 9420972 7814898
5127G814898j063311K305044R15244k357134M34936J731064O0035m00902k664241
$$ 7814898 6751587 9056631 9971875 7614741 8049677 9780741 9840776 9439874 6775633
5118F775633J833919J93019j334799Q07245m71374R14346j080026j265708K820307
$$ 6775633 8609552 8802571 7467772 8275017 7803643 8717989 7637963 6372255 9192562
5109I192562j862987O50760l12139O54122k89328R1374J552615k626448m95149
$$ 9192562 7329575 7980335 7668196 8322318 8032990 8124364 9676979 7050531 6555382
5100F555382Q39062K190609j967795k80857k06289J395182j174674O81285L49191
$$ 6555382 7394444 9585053 7617258 7336401 7130112 8525294 7350620 8031905 8381096
5091H381096M43445o03111O34786o29591J74282j541308J395484J577827j785015
$$ 8381096 8824541 8221430 8856216 8226625 8400907 6859599 8255083 9832910 8047895
5082H047895P24852K007334k313781m33299l46306M50248L38927o95967j871864
$$ 8047895 8772747 10780081 8466300 8033001 7686695 8136943 8475870 7779903 5908039
5073E908039J396861O80626l79962j441785J646897M63967q23115j66107L42501
$$ 5908039 7304900 7985526 7605564 6163779 7810676 8274643 7451528 7285421 7627922
5064G627922K16427J202386j170931Q73139l72542j790169J751092j605293Q54947
$$ 7627922 7844349 9046735 7875804 8748943 8376401 6586232 8337324 6732031 7586978
5055G586978J765531l30230j263010m94691m95514J684597j226382j30664J244457
$$ 7586978 9352509 9022279 7759269 7264578 6769064 8453661 7227279 7096615 8341072
5046H341072J641471j582765j283603Q90631K85504J140162q62364j431717J752936
$$ 8341072 9982543 8399778 7116175 8006806 8292310 9432472 8570108 7138391 8891327
5037H891327j500621P40347q6725J162207J76126p80537L45289n59249J046706
$$ 8891327 7390706 8131053 8044328 9206535 9382661 8602124 8947413 8388164 9434870
5028I434870r30508O89306l56689L1312k71836J26533q71893J251837k33925J785679
$$ 9434870 8504362 9193668 8836979 8868291 8596455 8722988 7851095 9102932 8869007 10654686
5018A0654686p69594j729303p8888Q92584J573903o99746J91734Q69090p55961
$$ 10654686 9885092 8155789 8076901 8969485 10543388 9843642 10035376 10904466 10148505
5009A0148505K9795o91940n0398J653296M28147L19579Q435J9866k106235J070197
$$ 10148505 10178300 9486360 9435962 11089258 11517405 11836984 11845419 11865285 9759050 10829247
4999A0829247q15706J861225k13093k44514L95479o89744J4672R31351P08252
$$ 10829247 10013541 11874766 11661673 11417159 11812638 11122894 11137566 12068917 12777169
4990A2777169N97579l44501q6931j304820K04674J549694o80235K78579J368134
$$ 12777169 13374748 13030247 12943316 11638496 11843170 13392864 12712629 12991208 14359342
4981A4359342M80835k261406K832914n18730j677557m55497J415727P43972J561837
$$ 14359342 14840177 12578771 15411685 14892955 13215398 12759901 14175628 14919600 16481437
4972A6481437j236735N10800J74562R68947j652507J516789L40307j88693p39619
$$ 16481437 15244702 15755502 15930064 16899011 15246504 16763293 17103600 16914907 16175288
4963A6175288J70820J447952J015248j703060r95562L034899P13559j840199R82476
$$ 16175288 16346108 17794060 18809308 17106248 16110686 19145585 19859144 18018945 19001421
4954A9001421J896267J118929p62699J0357N38707K34150l57502l1344J878332
$$ 19001421 20897688 22016617 21253918 21264275 21802982 22037132 21679630 21648286 23526618
4945B3526618j27051J268232j385305J584042J909277j801223L83961J938973
$$ 23526618 23399567 24667799 23282494 24866536 26775813 24974590 25358551 27297524
4937B7297524J69351J77696m81204K546763Q78791j580734L77257J189330M71925
$$ 27297524 27466875 27644571 27163367 29710130 30588921 29008187 29385444 30574774 31046699
4928C1046699J910107N37716J189243J040825j460543j246485L045491J893370
$$ 31046699 32956806 33494522 34683765 35724590 34264047 33017562 36063053 37956423
4920C7956423k97225M36921J801592p59051j01278k17749J434211M97393N71955
$$ 37956423 37659198 38096119 39897711 39138660 39037382 38819633 40253844 40751237 41323192
4911D1323192K85304J463713R8952l73522L31210R49826J56121L46539K187199
$$ 41323192 41608496 43072209 43171161 42797639 43128849 44078675 44234796 44581335 46768534
4902D6768534J47788j447745k25490P13497J923748J329141o47863n78240N12337
$$ 46768534 46916322 45468577 45243087 45956584 47880332 49209473 48561610 47983370 48495707
4893D8495707J040467O14500L50232j899328J265922J072660M70812j348635J482261
$$ 48495707 49536174 50150674 50500906 48601578 49867500 50940160 51410972 50062337 51544598
4884E1544598j338142K02470L24433J336799j322238P290R18952J364333k575737
$$ 51544598 50206456 50408926 50733359 52070158 50747920 50755210 51674162 53038495 50462758
4875E0462758j666397Q26559J359970K43807r53631L90238r9522j652471K287740
$$ 50462758 48796361 49622920 50982890 51226697 50273066 50663304 50563782 48911311 51199051
4866E1199051k852511J684451j050723N59721n00205j08053n37336r98216l90109
$$ 51199051 48346540 50030991 48980268 49539989 49039784 48931731 48394395 47396179 47006070
4857D7006070m27968K247013l2024k70391n76920q50232j259663j295499K038178
$$ 47006070 46578102 48825115 48793091 48522700 47945780 47095548 45835885 44540386 46578564
4848D6578564j26613J09038n63529j181230q10436K51613J663223o08092n95213
$$ 46578564 46451951 46560989 45997460 44816230 44005794 44257407 45920630 45312538 44717325
4839D4717325n15601j269429K192374N86678J406759k607605J860697j077519
$$ 44717325 44201724 42932295 45124669 45711347 47118106 44510501 46371198 45293679
4831D5293679P82819j24718J536491k459370J754141l10130J117980p49769o204
$$ 45293679 46076498 45951780 47488271 45028901 46783042 46472912 47590892 46841123 46834919
4822D6834919J101381N7399J61380O8710r51438Q47956j459314k404103J279571
$$ 46834919 47936300 47993699 48155079 48223789 47272351 48120307 46660993 44256890 45536461
4813D5536461J69527n33477m06145k18570j688154m52098J1492L25299j145158
$$ 45536461 45705988 45172511 44766366 44547796 42859642 42407544 42419036 42744335 41599177
4804D1599177j363527l35925o37496r45981j56496k903655j793251O66999K57133
$$ 41599177 40235650 39899725 39262229 38316248 38159752 35256097 33462846 34129845 34386978
4795C4386978j900273j088831n9868k224041R5944q1613M48583k110773l37907
$$ 34386978 32486705 31397874 31338006 29113965 29209909 29128296 29576879 27466106 27128199
4786B7128199L73041J47593j206539j293759M93226l08991k912942j40384J064652
$$ 27128199 27501240 27648833 26442294 25148535 25641761 25332770 22419828 22279444 23344096
4777B3344096o24799r61863m75913n46308q65378j294540N82050K27634n98218
$$ 23344096 22719297 21757434 21281521 20735213 19869835 18575295 19157345 19384979 18786761
4768A8786761j798517m40803p55244K183141p33803j321573J017244p6757N79763
$$ 18786761 16988244 16547441 15792197 17975338 17241535 15919962 16937206 16860449 17440212
4759A7440212j396055q86492j104822O5908J528301J211075m987160J225831K21231
$$ 17440212 16044157 15157665 14052843 14118751 15647052 16858127 11870967 13096798 13318029
4750A3318029J379059j487335r38117P03916M47027k69518j804759k59625J321657
$$ 13318029 14697088 13209753 12271636 12975552 13422579 13153061 11348302 11088677 12410334
4741A2410334n16989O13646j315781o46229j129508J662043R71381p73792q89826
$$ 12410334 11893345 12506991 11191210 10544981 9415473 11077516 12048897 11275105 10385279
4732A0385279L08706n36294L16707r74027J098348r38469J54967l77653J136078
$$ 10385279 10693985 10157691 10474398 9500371 10598719 9660250 9815217 9437564 10573642
4723A0573642j434574j380474J955252N78652r32236r11678J062022r88682M24506
$$ 10573642 9139068 7758594 9713846 10292498 9360262 8448584 9510606 8521924 8946430
4714H946430K68944j105015j483339J618972M72354j3490j941502j19210j4014
$$ 8946430 9215374 8110359 6627020 8245992 8718346 8704856 6763354 6644144 6630130
4705F630130R28142L02057j38501M02782o54434M17481N20621Q01814o31280n90178
$$ 6630130 7558272 7860329 7721828 8124610 7470176 7887657 8408278 9210092 8578812 7988634
4695G988634L43202k65950O09354j701817n03862J01047K8595J364473p24014
$$ 7988634 8331836 8065886 8675240 6973423 6469561 6570608 6599203 7963676 7239662
4686G239662j560535J147917O23382N85363q89551r4323N89054p10755m54277
$$ 7239662 5679127 6827044 7450426 8035789 7146238 7051915 7640969 6930214 6475937
4677F475937p48313J389876j71867k25813j496444K39366J557022k616n31334
$$ 6475937 5727624 7117500 6945633 6719820 5223376 5462742 7019764 7017148 6485814
4668F485814J263424j441956l5869j077574N79975J850149j002505q84045j15593
$$ 6485814 7749238 6307282 6271413 5193839 5773814 7623963 6621458 5737413 5621820
4659E621820m56297L391J593011k345321J198652l76808J554065j195088R72840
$$ 5621820 5165523 5168914 6761925 4416604 5615256 5238448 6792513 5597425 6570265
4650F570265k067281P77469J111659Q0787j519194P35545N57332k87107k58831
$$ 6570265 4502984 5280453 6392112 6472899 4953705 5689250 6246582 5959475 5700644
4641E700644M40992o96064j087203n07879L29440J492288m73847J147199j789332
$$ 5700644 6141636 5445572 4358369 3850490 4179930 5672218 5198371 6345570 4556238
4632D556238O61408K15262j259400n2471J197275N69182K37500j544389J785190
$$ 4556238 5217646 5432908 4173508 4121037 5318312 5887494 6124994 4580605 6365795
4623F365795o80864J017413j612332k054087J689828M41386Q58029k743374J288888
$$ 6365795 5684931 6702344 5090012 3035925 4725753 5167139 6025168 3281794 4570682
4614D570682M64937l96612K55639o59183J624499P6811q70376o36553j446589
$$ 4570682 5035619 4639007 4894646 4235463 5859962 5936773 5066397 4429844 2983255
4605B983255K560324m21941o33848p27504J597613Q53050j088260j054618o7414
$$ 2983255 5543579 5121638 4487790 3760286 5357899 6210949 5122689 4068071 4000657
4596D000657K162330j098981P14541p28223J01912J09625q03847j99133n94692
$$ 4000657 6162987 5064006 5778547 5050324 5152236 5261861 4458014 4258881 3664189
4587C664189J784292R30805j873816j058290K095820o02032j905436P81878J208491
$$ 3664189 5448481 6379286 4505470 3447180 5543000 4940968 3035532 3817410 5025901
4578E025901j069991L21364M07503L36522j918612K524089j169350Q62433K28519
$$ 5025901 3955910 4277274 4684777 5021299 3102687 5626776 4457426 5319859 5548378
4569E548378q35513j71795m5411M90494j279285J329569m5692K54940L55707j265158
$$ 5548378 4712865 4541070 4495659 4986153 3706868 5036437 4990745 5245685 5601392 4336234
4559D336234j081983J269558K28203J129303l60739j222462N23338n49815J27987
$$ 4336234 3254251 4523809 4752012 5881315 5520576 4298114 4821452 4271637 4399624
4550D399624k827k43806R89043j87707p42659j926831K537504J031110k70423
$$ 4399624 4396797 4152991 5142034 4954327 4211668 2284837 4822341 5853451 5583028
4541E583028j124017o4188Q25986k30452n8413K71637o13875K44361n43164N46522
$$ 5583028 4459011 4394823 5220809 4990357 4931944 5203581 4589706 4834067 4290903 4837425
4531D837425l53024r7582J186242k441008P82849m54983J934295n36268r31984
$$ 4837425 4484401 4386819 5573061 3132053 3914902 3459919 5394214 4857946 3925962
4522C925962K842757j663177k26677J04083j043O28949q64613J287407Q6367k729387
$$ 3925962 6768719 5105542 4878865 4982948 4981905 5610854 4746241 6033648 6120015 3390628
4512C390628O48224k87182J869908n6676L63983j122506q89303Q85172m12504
$$ 3390628 4038852 3751670 5621578 5564902 5928885 4806379 3917076 4802248 4389744
4503D389744p79076N98758r67262K339385Q29137j144639m72000j435275K81465
$$ 4389744 3610668 4209426 3242164 5581549 6410686 5266047 4794047 3358772 3640237
4494C640237L060793j518442p20210J110785L63453k229700J757935r29536M71537
$$ 3640237 6701030 5182588 4462378 5573163 5936616 3706916 5464851 4535315 5006852
4485E006852L27189p4216M54506P30092j162554R59347m8487q73333J96115J014627
$$ 5006852 5334041 5259825 5714331 6444423 5281869 6241216 6192729 5319396 5515511 6530138
4475F530138p68445p7515j057989J942666m3460j069403J007680P71415k257381
$$ 6530138 5761693 5684178 4626189 6568855 6525395 5455992 6463672 7235087 4977706
4466D977706N1069J830887l2983j072778J139430j741949R3711J159744M81462
$$ 4977706 5028775 6859662 6826679 5753901 6893331 5151382 5245093 6404837 6886299
4457F886299n12554l85224N6830J080585L66587j224073p21057K058363k70130
$$ 6886299 6373745 5988521 6045351 7125936 7492523 6268450 5547393 7605756 7335626
4448G335626m96561M93281Q18501o42549N48195p81679M88572l44622j11335J15059
$$ 7335626 6839065 7332346 8150847 7508298 8056493 7274814 7763386 7418764 7307429 7422488
4438G422488J954262k643573J261813j845972J880769o3900J271748j149175J526240
$$ 7422488 9376750 6733177 7994990 6149018 8029787 7965887 9237635 8088460 9614700
4429I614700K48771j709911L75679M18174k3909j79104N07883J015138j916836
$$ 9614700 9863471 8153560 8529239 8947413 8923504 8744400 9252283 10267421 8350585
4420H350585J350179j115869N58828P55143j90471K289242j493577J30844p39804
$$ 8350585 9700764 8584895 9143723 9898866 9708395 11997637 10504060 10634904 9895100
4411I895100p09822L04743P34170J422008j58789l23061P3706q79118J605484
$$ 9895100 9185278 9490021 10224191 11646199 11487410 11164349 11238055 10358937 11964421
4402A1964421K65574K28610p19198K31545p0397M43644p41636p3386P12909j330015
$$ 11964421 12229995 12458605 11739407 11970952 11900555 12344199 11602563 11529177 12242086 10912071
4392A0912071O43974P25873m01807J229903n81532o76211M12108o49171J049706
$$ 10912071 11556045 12281918 11880111 13110014 12528482 11852271 12264379 11615208 12664914
4383A2664914l21541o43772l83416J77452J683601o50247j417911J488951p90961
$$ 12664914 12343373 11699601 11316185 11493637 13177238 12526991 11109080 12598031 11807070
4374A1807070j090708O45071L05234K548j256352J97861l07031K006367j441151
$$ 11807070 10716362 11361433 11666667 11669215 10412863 10610724 10303693 12310060 10868909
4365A0868909R65132K61291j265667J132566K56843j597359R0496J5919R0224
$$ 10868909 11834041 12095332 10829665 11962231 12219074 10621715 10712211 10728130 10818354
4356A0818354K314112j116239n32016j462912l62942J755776j292755K036372
$$ 10818354 13132466 12016227 11484211 10021299 9658357 11414133 10121378 12157750
4348A2157750k050577j52866N7575R54725J105384J017535j764300k58773k07107
$$ 12157750 10107173 9954307 10011882 10966607 12071991 13089526 11325226 11066453 10859346
4339A0859346N50482l08785M32349K53904j031751q42508J56718J905292p10990
$$ 10859346 11409828 11101043 11533392 11787296 10755545 9913037 10069755 11975047 11264057
4330A1264057n52520M8481k30499J398346o24982N28640j779421j077406K119406
$$ 11264057 10711537 10760018 10529519 11927865 11302883 11831523 10052102 8974696 11094102
4321A1094102J188638P4376j53732r61651j459905P56877R30496j732009P84221
$$ 11094102 12282740 12357116 12203384 11241733 9781828 10538705 11469201 9737192 10521413
4312A0521413J00410l10567J69701j195693J286100m39428j287883K21803J299242
$$ 10521413 10621823 10311256 10480957 9285264 10571364 10131936 8844053 9065856 10365098
4303A0365098j541950K85704J65815j607155k65554J425721O34444l13261J1439
$$ 10365098 8823148 9108852 9274667 7667512 7401958 8827679 9462123 9148862 9160301
4294I160301j302088o63049L47811j037054Q08798J098865l67043p9277j361689
$$ 9160301 7858213 7195164 7542975 6505921 7314719 8413584 8046541 7967264 6605575
4285F605575Q70484p51882p7319m51879O9886R56720L1739j129817L59794O28638
$$ 6605575 7476059 6724177 6646858 6194979 6264865 7221585 7253324 6123507 6483301 7111939
4275G111939J68360j209023j89622p2747q0974M86654P98025j416538O13187J128199
$$ 7111939 7280299 6071276 5881654 5808907 5727933 6214587 7012612 5596074 6209261 7337460
4265G337460l59690J13006k778482j71041K274376n2277p6068j166241R44346
$$ 7337460 6977770 7090776 4312294 4141253 6415629 6363352 6287284 5121043 6065389
4256F065389j650466L71316j68149R82963j257211M27956M23090k52457J373410
$$ 6065389 4414923 4786239 4618090 5601053 4343842 4771798 5194888 4942431 6315841
4247F315841j208110q07099O2449M2677Q23078j045940J464343r51845j873j001130
$$ 6315841 5107731 4300632 4363081 4405758 5228836 4182896 5647239 4695394 4693521 3692391
4237C692391L76580M57002J253908j167321M940r34800J145765L71691N21222
$$ 3692391 4068971 4525973 5779881 4612560 4617500 3682700 4828465 5200156 5721378
4228E721378k35931j678607J094323P17363o14085j051372n51380M24831J356883
$$ 5721378 5485447 3806840 4901163 5618526 5004441 3953069 3401689 3826520 5183403
4219E183403j370616J221186j026240K049235k633828j020283N40613K317640
$$ 5183403 3812787 5033973 4007733 6056968 3423140 2402857 2943470 5261110
4211E261110o02574o54607o80175J645776n88005j788618K311510O87455j761408
$$ 5261110 4658536 4003929 3323754 4969530 4381525 2592907 4904417 5591872 3830464
4202C830464Q73355j226085J716120p64098k681474K303586P16794L28300k28221
$$ 3830464 4703819 3477734 5193854 4429756 1748282 4051868 4768662 5096962 4868741
4193D868741N42486j465041j422912J049362J194298J075416l010016N33878J399625
$$ 4868741 5411227 3946186 2523274 3572636 4766934 5842350 2832334 3366212 4765837
4184D765837J075534j142931j301376N94207n95190O10019j073004J430013M77306
$$ 4765837 5841371 4698440 3397064 3991271 3396081 4006100 2933096 4363109 4840415
4175D840415j186026l2742J565202p45693j591177k13986K023708m47106n27993
$$ 4840415 3654389 3621647 5186849 4441156 2849979 2635993 4659701 4212595 3684602
4166C684602N85816P40363j125760r59756O85364j13491J083806Q96242o86958
$$ 3684602 4270418 5010781 3885021 2925265 3610629 3497138 4580944 5477186 4790228
4157D790228J5825j341275K61203J704071J06014J601p27193m13067j164039K705904
$$ 4790228 4806053 3464778 3725981 5430052 5536066 5537667 4810474 4397407 3233368 5939272
4147E939272k276323J267188r09301K219381j610690q17748J524762n96841j33215
$$ 5939272 3662949 4930137 4020836 6240217 4629527 3811779 5336541 4739700 4606485
4138D606485m25549P85293k57294l18835j040132R93123J460199r29592q90528
$$ 4606485 4180936 4966229 4708935 4390100 3349968 4343091 5803290 4873698 3983170
4129C983170J43402O15277P61119m97867J176419J541653k396820k17564J112774
$$ 3983170 4126572 4741849 5502968 5005101 6181520 7723173 5326353 5108789 6221563
4120F221563k077211N56282Q08747J419044j637585k83423k24512M58077N85823
$$ 6221563 4144352 4700634 5509381 6928425 5290840 5007417 4782905 5240982 5826805
4111E826805n15166J423302l08977j893625J105879k81742R14301j19184N7997
$$ 5826805 5311639 6734941 6425964 4532339 5638218 5356476 6270777 6151593 6209590
4102F209590P91521m58451q64964r35072Q94009P86427J23126p31713J138040
$$ 6209590 7001111 6542660 5677696 4742624 5636633 6423060 6546186 5814473 6952513
4093F952513k07833n17842R42491j542446p8852J194855L21605n20160k30269
$$ 6952513 6744680 6226838 7169329 5626883 5548031 6742886 7064491 6544331 6314062
4084F314062J8634K544546j422888j441893o38090J436142j240192J728929j439447
$$ 6314062 6332696 8877242 7454354 6012461 5374371 6810513 5570321 7299250 5859803
4075E859803K032764K45183k380601l26903J266079k35978J26560J566586Q22561
$$ 5859803 7892567 8137750 5757149 5430246 6696325 6460347 6586907 8153493 8976054
4066H976054l057249r75477M87958R81249J384332Q23833Q29570l473916O04168
$$ 8976054 5918805 4943328 5431286 6412535 7796867 8620700 9450270 5976354 6580522
4057F580522j409603K071622n99033o08605P47215O28046j76796j701296q54094
$$ 6580522 5170919 7242541 6643508 6034903 6782118 7410164 7233368 5532072 4677978
4048D677978K318232l19456P74215N81314j106161p95645J307031j404678K60145
$$ 4677978 6996210 6676754 7450969 8032283 6926122 6130477 7437508 6032830 6292975
4039F292975M89802m82758q94285K021818p88213j243140Q44054P21558K281177
$$ 6292975 6782777 6300019 5405734 7427552 6639339 5396199 6240253 6961811 9242988
4030I242988j215621j822492m69260M59208J782297j276792P58886j533628L66221
$$ 9242988 8027367 6204875 5735615 6194823 7977120 6700328 7459214 5925586 6291807
4021F291807K49930m71044P98201k510269R03300L92330J079213m30694j611751
$$ 6291807 6541737 6070693 6868894 4358625 5261925 5654255 6733468 6302774 4691023
4012D691023J847478J94701j383008R38929j058652l53443L00221J179084L37462
$$ 4691023 6538501 6733202 5350194 6289123 5230471 4877028 5177249 6356333 6693795
4003F693795n49588j222508M77047r81052J139263j756995J4298K235899j078342
$$ 6693795 6144207 4921699 5398746 4417694 5556957 3799962 3814260 6050159 4971817
3994D971817o15547j204087J824406J170243J4067j497434L52370j66862j747805
$$ 4971817 4356270 3152183 4976589 6146832 6160899 4663465 5015835 4848973 3101168
3985C101168J36261J302252J303727l24502j008430J735005k441552q14454J480380
$$ 3101168 3237429 4539681 5843408 5518906 4510476 6245481 3803929 2989475 4469855
3976D469855P97954p07853o78927m28351L26001j630437J637246k001353K130150
$$ 4469855 5267809 4559956 3881029 3452678 3778679 2148242 3785488 1784135 3914285
3967C914285L03473j069112l24043R31400K75776j019861j565556L058076j14727
$$ 3914285 4217758 3148646 2824603 3756003 4031779 3011918 1446362 4504438 4389711
3958D389711k779364o21222P69208K478333j621091q81p56935J280561j285374
$$ 4389711 1610347 989125 1758333 4236666 2615575 2614694 1857759 3138320 1852946
3949A852946k75373J422470k36982J65552n37716K76118p91988p5904N12971M88369
$$ 1852946 1577573 3000043 2763061 2928613 2390897 2667015 1875027 1799123 2312094 2800463
3939B800463K25529k500678K388781j6273J004188k110794J208653J08703j959773
$$ 2800463 3025992 525314 2914095 2897822 3902010 1791216 2999869 3108572 1148799
3930A148799J443060K64881j141234M64577l35158l13447j69044K106601j814397
$$ 1148799 2591859 2856740 1715506 2180083 1844925 1531478 1362434 3469035 1654638
3921A654638l92051O22040J924956k434099M54694O77884j203386J930686j303382
$$ 1654638 1262587 1884627 3809583 1375484 1830178 2508062 1304676 3235362 1931980
3912A931980N90211j91081M66320j820969j416985Q64217K450418L701j674863
$$ 1931980 2522191 2331110 2797430 976461 -440524 423693 2874111 2877812 1202949
3903A202949K757618p72368k370348j6701J568609K8390N18496j178647j93241
$$ 1202949 3960567 3188199 817851 801150 2369759 2398149 2916645 1737998 1544757
3894A544757R31745j790393M25286K187141j308821p21230j75769O15070m19099
$$ 1544757 2476502 686109 1111395 3298536 1989715 1268485 1092716 1707786 1288687
3885A288687l00700N74903J649678k025877q95757J210394R10288j533743N47544
$$ 1288687 987987 1562890 3212568 1186691 290934 1501328 2411616 877873 1425417
3876A425417o1683R27585r09623k74866O71395m63213q64462Q49432j96224L45311
$$ 1425417 1363734 2291319 1381696 1106830 1778225 1315012 450550 1299982 1103758 1449069
3866A449069J9107L18J106867j232739K69704J00568O85530j216034l39062J063233
$$ 1449069 1468176 1468494 2575361 1342622 1612326 1712894 2398424 1182390 843328 1906561
3856A906561k6946j389208L78804j38151J69214P81311Q45861r04603J0854q38240
$$ 1906561 1879615 490407 869211 731060 900274 1681585 2527446 1622843 1633697 795457
3846G95457k09135Q21476j542328K583636m3307j289974O4091j213182K452104
$$ 795457 586322 1407798 -134530 2449106 2405799 1115825 1179916 -33266 2418838
3837B418838j346627j89107l54429Q48310n42424M02772j310905J674789m67496
$$ 2418838 1072211 883104 528675 1376985 834561 1237333 -73572 1601217 1133721
3828A133721R84867R23983n89248k774003J506645J4830J746331k509303P73312
$$ 1133721 2118588 3042571 2453323 -320680 1185965 1200795 2947126 437823 1211135
3819A211135J041247l13501n38318K38959J46922k5164j261038J06164J436315
$$ 1211135 2252382 1938881 1400563 1639522 1786444 1761280 500242 606406 2042721
3810B042721l40335k34634p30414J067393r98605p06572R82735j86118J367861
$$ 2042721 1702386 1467752 737338 1804731 806126 99554 1082289 896171 2264032
3801B264032j204026n41327N50690p33683O79899m63207k20495J997187j04601
$$ 2264032 1060006 518679 1069369 335686 1015585 552378 331883 2329070 2224469
3792B224469p56090O5030Q24626r18163M51794o2335K3763j969433J102179K53213
$$ 2224469 1468379 1533409 2358035 1439872 1891666 1829331 1853094 -116339 985840 1239053
3782A239053O88579k53576J419619j677814j122643k80557m93220K107971K59561
$$ 1239053 1927632 1674056 3093675 1415861 293218 12661 -480559 1627412 1886973
3773A886973M7714n56597k54904O55342p3853j624250J740736K18684j167788
$$ 1886973 1934687 1378090 1123186 1778528 1704675 80425 1821161 2039845 872057
3764H72057Q06178k29840R47448j310281J15682M71849O77006j059584j04603
$$ 872057 1678235 1448395 2395843 1085562 1201244 1673093 2350099 1290515 1185912
3755A185912N36513j196185M57181J734053j204494N73558q53339J78252o10224
$$ 1185912 1722425 526240 983421 2717474 1512980 2086538 1233199 1411451 801227
3746H01227J098479J67025r29706J166002q57162j363184J029530N83513j027804
$$ 801227 1899706 2066731 1137025 2303027 1445865 82681 1112211 1695724 667920
3737F67920L020374j381861p72581j35157J118445n36685Q09484p03460j417496
$$ 667920 3688294 2306433 1533852 1398695 2517140 1980455 2789939 2086479 668983
3728F68983J33102P22970m43529J367285M78852j384657J137203J17241j18903
$$ 668983 802085 1525055 1081526 2448811 2927663 1543006 2680209 2797450 2678547
3719B678547k528500J499526L53541j017793J426896L98959j053418J400110j391691
$$ 2678547 150047 1649573 2003114 985321 2412217 2811176 1757758 3157868 1766177
3710A766177l63588J445971j81428j325490J57010l87726l06849J240801m64196
$$ 1766177 1402589 2848560 2667132 1341642 1498652 1110926 804077 2044878 1580682
3701A580682O65192P56976r38904r46975J020265J493256j701444L20842J125700
$$ 1580682 2245874 3002850 2063946 1116971 2137236 3630492 1929048 2249890 3375590
3692C375590r94467R0765P48088o78081l35577j3731r48901N41697R44156l56204
$$ 3375590 2381123 2471888 3219976 2541895 2206318 2192587 1243686 1785383 2729539 2373335
3682B373335P4578M99426n64816J4091Q09611n80263j67220k14235M4235J349274
$$ 2373335 2447913 2947339 2382523 2396614 3206225 2625962 2458742 2244507 2288742 3638016
3672C638016j045088j99758r15752K37645m7253R30752P09985n97291J124968
$$ 3638016 2592928 2393170 1477418 1715063 1667810 2598562 3308547 2711256 3836224
3663C836224m37384j156627Q73333q7291m4443p58050m74211p19823Q50008M81011
$$ 3836224 3398840 2242213 3115546 3028255 2983812 2225762 1751551 1031728 1881736 2362747
3653B362747n49357Q13030J075824N76729j025322j37216R43607k197958J570292
$$ 2362747 1813390 2626420 3702244 4278973 3253651 3116435 4060042 1862084 3432376
3644C432376j480448J233220P75346l87121l59750r81494O93565m3680K19129
$$ 3432376 1951928 3185148 3960494 3573373 3213623 2232129 2925694 2882014 3101143
3635C101143J216528p94496J53996R317o01411N32978o55770K8106L43088j673061
$$ 3101143 4317671 3523175 3677171 3686488 3085077 3618055 2962285 2990391 3333479 1660418
3625A660418J899219N28850M4350j713848J310537J073320p49092j713038J547758
$$ 1660418 3559637 4088487 4132837 2418989 3729526 4802846 4053754 2340716 3888474
3616C888474k62899j59336q64691m8530L79986J394423M43641p91563N12525j275028
$$ 3888474 3625575 3466239 2601548 2553018 2933004 4327427 4771068 3979505 4492030 3217002
3606C217002j190401J681371p57521r6698N01085L96485m71271Q75154m35192
$$ 3217002 2026601 3707972 2950451 2853753 3354838 3751323 3280052 4155206 3720014
3597C720014J56344Q68900k898J91391K00695m81275q40059J196540j748801J493260
$$ 3720014 3876358 4745258 4742360 4933751 5134446 4653171 3813112 5009652 3260851 4754111
3587D754111N43055r33115J17339p6293j162798J288005L06485J153560j743590
$$ 4754111 5297166 4364051 4481390 4405097 3242299 4530304 4836789 5990349 4246759
3578D246759r097N59572j086482K159533j376420R33349J59716L47653k14120
$$ 4246759 4237662 4797234 3710752 5870285 4493865 5427214 5586930 5934583 5720463
3569E720463j509410J59061l59198k29912J243828J415529o94751K10844j309688
$$ 5720463 4211053 4370114 4010916 3781004 5024832 6440361 5745610 5956454 4646766
3560D646766k74690N83819K192080r48908o88004j710665J278063J729374j883428
$$ 4646766 4372076 4955895 7147975 6199067 5511063 3800398 5078461 6807835 4924407
3551D924407J879010m2773j624558L65707L31849L6200j017054K296965o83282
$$ 4924407 6803417 6760644 5136086 5501793 5833642 5869842 4852788 7149753 6466471
3542F466471j97602Q3541Q50224K14950j206790j132006O00923K592697n24528
$$ 6466471 6268869 6352410 7202634 7417584 6210794 5078788 5679711 8272408 7747880
3533G747880o47567Q93078m21598O81127j766634J266183R7292L34768j340205
$$ 7747880 7100313 7993391 7571793 8252920 6486286 7752469 7849761 8184529 6844324
3524F844324Q18381J13730O39539n786J108511L03142r78999N21618m85647l9665
$$ 6844324 7662705 7776435 8415974 8410188 9518699 9821841 8842842 9364460 8878813 8839148
3514H839148J345682K69503n85172q91840J149710O69334m59266n09225K056366
$$ 8839148 10184830 10454333 9869161 8977321 10127031 10796365 10337099 9827874 11884240
3505A1884240j364566j368626L051365L70565j100473K05626r02387m32519R35580
$$ 11884240 10519674 9151048 12202413 12572978 11472505 11678131 10775744 10343225 11278805
3496A1278805l20645N54940K70514J357250k61287r758J36810L0833K59163J762921
$$ 11278805 10958160 11513100 11783614 13140864 12879577 12869819 13006629 13037462 13296625 15059546
3486A5059546r46817k60150L17750m27477J773885O0663J322458P79872K16418
$$ 15059546 14112729 13852579 14170329 13742852 15516737 15577400 16899858 17679730 17896148
3477A7896148j337072j386247L327676j008364O98511Q15219J134104P75564j148347
$$ 17896148 16559076 15172829 18500505 17492141 18190652 19005871 20139975 20915539 19767192
3468A9767192l32883Q54328K4995k73097J430944J230210J396217j086630O86492
$$ 19767192 19434309 20288637 20313632 20040535 21471479 22701689 24097906 23011276 23697768
3459B3697768O86566J178823J176636j26595m96174J664577Q81905J749621J206130
$$ 23697768 24384334 25563157 26739793 26613198 26117024 27781601 28663506 30413127 31619257
3450C1619257l0074M26202r3615O02320J027575K255168J853967L27227J202576
$$ 31619257 31589183 32015385 31921770 32524090 33551665 35806833 37660800 37988027 39190603
3441C9190603o92465K977033L313847K455411J684518K177333J810208J137934
$$ 39190603 38498138 41475171 44789018 47244429 48928947 51106280 52916488 54054422
3433E4054422K141124Q07415J196590l75077K988886l04954J594020M237668J030478
$$ 54054422 56195546 57002961 58199551 57824474 60813360 60508406 62102426 66340094 67370572
3424F7370572L536949L83280L555396K17433m12926o20140L539353R19960j701464
$$ 67370572 70907521 71290801 74846197 75063630 74650704 74030564 77569917 78489877 76788413
3415G6788413n67719K222547o23521n27935J233848J572092J186144R83704J319587
$$ 76788413 76220694 78443241 77819720 77291785 78525633 80097725 81283869 82267573 83587160
3406H3587160O58582O6354J623317M278449K062609n83789J565906J147678K176148
$$ 83587160 84245742 84312096 85935413 90213862 92276471 91692682 93258588 94406266 96582414
3397I6582414L026028M2760L002080J297018J056050K467559K956176k585295
$$ 96582414 99608442 99651202 102653282 103950300 105006350 107473909 110430085 107844790
3389A07844790m885390r790815m299215m310853p58833J153443r41223Q67127
$$ 107844790 102959400 93168585 88869370 84558517 83799684 84953127 84011904 84879031
3381H4879031K584990O85921K774394K495985q45186o615792j688137k092577
$$ 84879031 87464021 88149942 90924336 93420321 92575135 85959343 84271206 82178629
3373H2178629l84314o44468q45973j441561j270161J603271L78952J246113O6998
$$ 82178629 81794315 81149847 80303874 78862313 77592152 79195423 79574375 80820488 80887486
3364H0887486j600061n43724J18304k30189P9220j516631k12355k828402l25649
$$ 80887486 79287425 78743701 78862005 78631816 78711036 77194405 76982050 74153648 73827999
3355G3827999j013788j443651l093034l68215r82263o43969j8996j197665J300527
$$ 73827999 72814211 71370560 68277526 67909311 66927048 66283079 66264083 65066418 66366945
3346F6366945O07462P76594O88226L808450K097170J29806Q6036K99465m3003
$$ 66366945 66974407 67751001 68439227 72247677 74344847 74474653 74560689 74860154 74817151
3337G4817151K906650L966119P417316L177053K046812L620260K127190O162343
$$ 74817151 77723801 81689920 89107236 92284289 94331101 97951361 100078551 106240894
3329A06240894P706974O798302K031150j670059j321617k970660o820516l338650
$$ 106240894 113947868 120746170 122777320 121107261 119785644 116814984 109994468 106655818
3321A06655818p356017m924717m516142l368611k061286k629023l159265k282663
$$ 106655818 99299801 94375084 89858942 86490331 84429045 81800022 78640757 76358094
3313G6358094m088793k723237k778666l026964m227318l745774k170463q38596
$$ 76358094 72269301 69546064 66767398 63740434 59513116 55767342 53596879 52758283
3305E2758283j613251l336688p96467k472915K91646j929634o79874k562740l23986
$$ 52758283 51145032 47808344 47011877 44538962 44830608 42900974 42221100 39658360 39334374
3296C9334374k372418p9377j618330j755374j693766j447854J36507Q73690l191614
$$ 39334374 36961956 36882579 35264249 33508875 31815109 30367255 30503762 31377452 28185838
3287B8185838m15656m95656j396309j537967q6404j80386q15219k19477l9781
$$ 28185838 27770182 27274526 25878217 24340250 24253846 24073460 23258241 23038764 22998983
3278B2998983l412918J368247l79914k97218j455336p95937R66759j317719p32823
$$ 22998983 19586065 20954312 20574398 20277180 18821844 18025907 18992666 17674947 16942124
3269A6942124j20733r18914j142941r12412J178199O77034k562445J753729O19274
$$ 16942124 16821391 15902477 14759536 13847124 15025323 15702357 13139912 14893641 15512915
3260A5512915l96262k069044k7336o62402K52m08840j087048K228620m00420k586825
$$ 15512915 15116653 13047609 13020273 12357871 12358123 11949283 10862235 13090855 12690435 10103610
3250A0103610O43690J247035k001161r483J343644Q66945n43361j282883q63228
$$ 10103610 10747300 11994335 9993174 9983691 11327335 12194280 11650919 10368036 9504808
3241I504808J522720J76867o85315k94066q22692j150481k29752J10686K483874
$$ 9504808 11027528 11204395 10519080 10225014 9402322 8251841 8022089 8132775 10616649
3232A0616649j725776o25619j619528J893132q9196j132156l04179P33445j427773
$$ 10616649 8890873 8265254 6645726 8538858 8449662 7317506 7013327 7746772 6318999
3223F318999J231308l44605L44537j046027R54092o416k666957L53121J198609
$$ 6318999 7550307 7205702 7550239 6504212 7458304 7451888 4784931 5138052 6336661
3214F336661J415858j424136j015070k81322K5519J151261n23264k72379m92759
$$ 6336661 7752519 6328383 5313313 5031991 5057510 6208771 5685507 5413128 4920369
3205D920369N13779M17522r53432J54395N74107j233607N65714n06945M17965
$$ 4920369 5434148 5851670 4898238 5052633 5626740 4393133 4958847 4451902 4869867
3196D869867N72905p06255p02394M5917m65508K399472j237768j02527K98555
$$ 4869867 5442772 4736517 4034123 4080040 3614532 6014004 4776236 4673709 4972264
3187D972264r82304n59723J794583K69586j22946k049434Q35249P08279R80414
$$ 4972264 3989960 3430237 5224820 5494406 5371460 3322026 4157275 4865554 5845968
3178E845968m97732l69470n27781m99896K16857l20030J503728j231612L38225
$$ 5845968 5348236 4978766 4450985 3951089 4167946 3847916 5351644 4120032 4458257
3169D458257J02843K89280j803415l48235J072459p0729j390568K020549R4764
$$ 4458257 4561100 4850380 3046965 2698730 3771189 3700460 2309892 4330441 4425205
3160D425205k072642k37528K232994Q78801j119883j294840O98337N58075N37667
$$ 4425205 2352563 2115035 4348029 5226830 4106947 2812107 3510444 4068519 4606186
3151D606186j846835R94568n67764r10855M30906J040279j554264J451509q8070
$$ 4606186 2759351 3753919 3186155 2275300 2706206 3746485 2192221 3643730 3555660
3142C555660l45004N81401n87165n17609J337865j330572Q39259j398932j384413
$$ 3555660 3210656 3792057 3204892 2687283 4025148 2694576 3533835 2134903 750490
3133G50490J148409J251899k233599L139963j534750K79007n81391j060684J956071
$$ 750490 1898899 3150798 917199 4057162 2522412 2801419 2220028 1159344 3115415
3124C115415p94198Q05994k35127Q94394p02011N35228l03021o76657J15122p59037
$$ 3115415 2321217 3127211 2892084 3786478 3084467 3619695 3316674 2640017 2755139 1996102
3114A996102n34795L4924O30124N96419j512142Q74728J54544m11100R28787p58031
$$ 1996102 1461307 1496231 2126355 2722774 1210632 2085360 2239904 1828804 2757591 1999560
3104A999560j01616l73210J586024j23335p5041j561427J92927J677427r72970
$$ 1999560 1897944 1524734 3110758 2987423 2912382 1350955 1543882 3221309 2248339
3095B248339r26251N37807M02494L13074j264409J677149n18421J057609k785342
$$ 2248339 1322088 1859895 2262389 2575463 1311054 2988203 2469782 3527391 742049
3086G42049O13530K848827l440869P64745Q48971k82785j120458M1807j133355
$$ 742049 1355579 4204406 763537 1528282 2377253 2094468 974010 1015817 -117538
3077a17538K380627q88974j78695q23775J369695J313640j250691M44535k89897
$$ -117538 2263089 1374115 1195420 371645 1741340 3054980 1804289 2248824 1958927
3068A958927P1332o62857M80919n64968m65549r06152J352357J626380j158045
$$ 1958927 2030259 1367402 1848321 1283353 817804 -88348 1264009 2890389 1732344
3059A732344l38433Q17548M9173p05041j285361L14865O31251Q28590j122608
$$ 1732344 1393911 2211459 2260632 1555591 270230 585095 1216346 2044936 922328
3050I22328J758462K16907j469819j427829J702575J57133N7887j497349J07939
$$ 922328 2680790 2897697 1427878 49 1702624 1859757 1917644 420295 528234
3041E28234J139780K79186n72473J36309R35814j9390j008270j298182o06545
$$ 528234 1668014 1947200 1374727 1511036 2446850 2427460 1419190 121008 -485537
3032d85537R75350M28884P7813J363661j517665m47250J702642j893572K21674
$$ -485537 489813 918697 996510 2360171 842506 395256 2097898 204326 426000
3023D26000K056542j13160j265789J01585l87127O51130L01232R77265j889320
$$ 426000 2482542 2369382 1103593 1205178 818051 1469181 1770413 2747678 858358
3014H58358L35957o37954o01519J875894J332167j424852j27458J73214r41593
$$ 858358 1194315 556361 -45158 1830736 3162903 1738051 1610593 1783807 842214
3005H42214j106619J328941N20490l48627J283623j405024J032838l56774k240706
$$ 842214 -264405 1064536 1585026 1236399 2520022 1114998 2147836 1791062 -449644
2996d49644J289860P96861l04509K85491r31649J48013Q13460n94327n41049J531036
$$ -449644 840216 1637077 1332568 1618059 686410 834423 1647883 1053556 512507 2043543
2986B043543J40407l98911k005802Q70824K60768K62715K71037O82346j236528
$$ 2043543 2183950 1785039 -220763 650061 910829 1173544 1444581 2126927 890399
2977H90399j195407Q99220j356666J646391o36928K403515o31760k02723r92700
$$ 890399 -305008 594212 -762454 883937 247009 2650524 2018764 1816041 823341
2968H23341n98124J010254K39440q33658M45998j44076k31273m23689J032065
$$ 823341 225217 1235471 1474911 641253 1087251 943175 711902 288213 1320278
2959A320278J934954K09074k481527j848339R11437M70136J39334J498249o45144
$$ 1320278 3255232 3464306 982779 -865560 45877 516013 655347 2153596 1508452
2950A508452M09777o12555q82878K78945O69126j001421K235146j547339J02924
$$ 1508452 1918229 1305674 422796 701741 1370867 369446 2604592 1057253 1160177
2941A160177M01873j860196J186267J136681n81026n65901O6126m93039k074571
$$ 1160177 1562050 -298146 888121 2024802 1443776 877875 944001 450962 -1623609
2932a623609J721576Q51152P80067O93627j024637J25814m16857m62467N35815
$$ -1623609 97967 949119 1729186 2422813 1398176 1523990 1107133 644666 1180481
2923A180481m7476J386926j685417j108923J155509j347163J486771J440871o26444
$$ 1180481 1133005 2519931 834514 -274409 881100 -466063 1020708 2461579 1835135
2914A835135o96464l46717K41861r09356J314974n86588J406147j29555k671112
$$ 1835135 1138671 791954 1033815 124459 1439433 852845 2258992 2129437 -541675
2905e41675n59716Q07511Q79469J614855P74288k053260q73163J75970P09277
$$ -541675 -1101391 -293880 585589 2200444 2974732 921472 48309 224279 933556
2896I33556l44679J156181J144494k731277M95391O06150P47329j325597m57945
$$ 933556 588877 1745058 2889552 158275 653666 1259816 2007145 681548 223603
2887B23603K94930J002535l74856o2450j463338Q61766p25877J598542O45045
$$ 223603 518533 1521068 1146212 1083762 -379576 482190 -243687 1354855 1999900
2878A999900l1371m99430j824048R84860R93844m85719P17791p87335M3096M56972
$$ 1999900 1968529 1469099 -354949 629911 1623755 1138036 1855827 1068492 1111588 1568560
2868A568560r77223J145584J126194j423448j596580m16649J078439n143m78053
$$ 1568560 591337 1736921 2863115 1439667 -156913 -573562 504877 499734 21681
2859B1681J678343J796547k121281j784023O7258Q47293P30511L6237L95712R42604
$$ 21681 1700024 3496571 1375290 -408733 -341475 505818 1236329 1272566 1668278 2610882
2849B610882k658108j022860J137619J781459j529090R11619O40017p12981j670467
$$ 2610882 -47226 -1070086 67533 1848992 319902 1231521 1871538 1158557 -511910
2840e11910K82441J193693j264798J239590R78949j637619J595971r88877p15434
$$ -511910 -229469 964224 -300574 939016 1917965 280346 1876317 887440 172006
2831A72006N18291O22160m17040P08171j591810J238202m47365M705M76098j740653
$$ 172006 690297 1312457 895417 1603588 11778 1249980 802615 807320 1283418 -457235
2821d57235J348848o24319Q53472k26845n09711P75307n89155P8968K69026r34063
$$ -457235 891613 267294 1120766 893921 384210 1159517 570362 649330 918356 -15707
2811a5707J007014q0079o93458O80342O42034K74449j173201j677966J231073
$$ -15707 991307 911228 217770 898112 1540146 1814595 641394 -1036572 194501
2802A94501O74731N99585n96568Q23542r68573L35050m74792R58651K17981J40423
$$ 194501 869232 1468817 872249 1695791 727218 1062268 587476 1546127 1764108 1904531
2792A904531j392151j624713J999781n65273j34037L37200O25440k77019j456438
$$ 1904531 512380 -1112333 887448 322175 188138 525338 1150778 873759 -582679
2783e82679K019478L44803j356299j49745J394548k783664J588452K6425J302839
$$ -582679 1436799 1781602 425303 275558 1670106 -1113558 474894 501319 1804158
2774A804158o77908J15176K03491p51389J031302r75362J994838j044230p31033
$$ 1804158 1126250 1241426 1444917 693528 1724830 749468 2744306 1700076 969043
2765I69043m9219l94028J084091j104059o76065k97894J336771J59106J01607
$$ 969043 919824 525796 1609887 505828 -170237 -468131 868640 1027746 1129353
2756A129353K04778j103860o22232m55996J106468J897593l40671m11018k149590
$$ 1129353 1334131 230271 -391961 -847957 258511 2156104 1815433 1404415 -745175
2747g45175M07026J490131O24534R7984j086172p93280Q31179j710183J647904
$$ -745175 -338149 1151982 1776516 1874500 788328 -4952 826227 -883956 763948
$$ [...]
##END NTUPLES=NMR SPECTRUM
##END=
