##TITLE=abcd
##JCAMPDX= 6.0         $$ Bruker NMR JCAMP-DX V2.0
##DATA TYPE= NMR SPECTRUM
##DATA CLASS= NTUPLES
##ORIGIN= UXNMR, Bruker Analytische Messtechnik GmbH
##OWNER= root
$$ XWIN-NMR		Version 3.5
$$ Fri Oct 24 18:33:54 2025 Russian Standard Time (UT+4h)  servis@DPX200
##.OBSERVE FREQUENCY= 200.131235884673
##.OBSERVE NUCLEUS= ^1H
##.ACQUISITION MODE= SIMULTANEOUS
##.ACQUISITION SCHEME= undefined
##.AVERAGES= 16
##.DIGITISER RES= 18
##SPECTROMETER/DATA SYSTEM= spect
##.PULSE SEQUENCE= zg
##.SOLVENT NAME= CDCl3
##.SHIFT REFERENCE= (INTERNAL, CDCl3, 0, 16.4885)
##AUDIT TRAIL= $$ (NUMBER, WHEN, WHO, WHERE, WHAT)
$$ ##TITLE= Audit trail, XWIN-NMR		Version 3.5
$$ ##JCAMPDX= 5.01
$$ ##ORIGIN= Bruker BioSpin GmbH
$$ ##OWNER= servis
$$ F:\spectra/data/av/nmr/H1/1/pdata/1/auditp.txt
$$ ##AUDIT TRAIL=  $$ (NUMBER, WHEN, WHO, WHERE, WHAT)
(   1,<2025-10-24 18:33:16.42 +0400>,<servis>,<DPX200>,
      <created by zg, POWCHK disabled, PULCHK disabled
       terminated by command 'halt'
       configuration hash MD5:
       00 E9 B6 7A A2 85 ED C7 34 08 36 98 17 FE 4E 26
       data hash MD5: 32K
       5F 7B EA 65 D4 C2 1D 47 2D 0F 33 6D 4D 5B 4E A7>)
(   2,<2025-10-24 18:33:18.26 +0400>,<servis>,<DPX200>,
      <Start of raw data processing
       efp BC_mod = 2 LB = 0.05 FT_mod = 6 PKNL = 1 PHC0 = -270.9076 PHC1 = 6.501565 SI = 16K 
       data hash MD5: 16K
       91 96 A9 B1 E4 2F 1A 5C BF 05 A6 9E 8D 56 5A CA>)
(   3,<2025-10-24 18:33:28.59 +0400>,<servis>,<DPX200>,
      <pk PHC0 = 2.8 PHC1 = 0 
       data hash MD5: 16K
       7C 6C CE D6 FB B2 34 D9 D6 4E A0 57 29 BE 74 F9>)
$$ ##END=
$$ 
$$ hash MD5
$$ 50 49 39 57 3D 23 FC 8A C4 9C 1A 7E 5F C0 53 CF
##$RELAX= 
##$RELAX= 
##$RELAX= 
##$RELAX= 
##$RELAX= 
##$RELAX= 
##$RELAX= 
##$RELAX= 
$$ Bruker specific parameters
$$ --------------------------
##$DU= <F:\spectra>
##$EXPNO= 1
##$NAME= <H1>
##$PROCNO= 1
##$TYPE= <nmr>
##$USER= <av>
##$AMP= (0..31)
100 100 100 100 100 100 100 100 100 100 100 100 100 100 100 100 100 100 
100 100 100 100 100 100 100 100 100 100 100 100 100 100 
##$AQSEQ= 0
##$AQ_mod= 1
##$AUNM= <au_zg>
##$AUTOPOS= <>
##$BF1= 200.13
##$BF2= 200.13
##$BF3= 200.13
##$BF4= 200.13
##$BF5= 500.13
##$BF6= 500.13
##$BF7= 500.13
##$BF8= 500.13
##$BYTORDA= 1
##$CFDGTYP= 0
##$CFRGTYP= 5
##$CHEMSTR= <none>
##$CNST= (0..31)
1 1 145 1 1 1 1 1 1 1 1 1 1 1 1 1 1 1 1 1 1 1 1 1 1 1 1 1 1 1 1 1 
##$CPDPRG= <>
##$CPDPRG1= <>
##$CPDPRG2= <>
##$CPDPRG3= <>
##$CPDPRG4= <mlev>
##$CPDPRG5= <mlev>
##$CPDPRG6= <mlev>
##$CPDPRG7= <mlev>
##$CPDPRG8= <mlev>
##$CPDPRGB= <>
##$CPDPRGT= <>
##$D= (0..31)
0 2 0 0 0 0 0 0 0 0.06 0 0 0 0 0 0 0.0002 0 0 0 0 0 0 0 0 0 0 0 0 0 0 
0 
##$DATE= 1761316396
##$DBL= (0..7)
120 120 120 120 120 120 120 120 
##$DBP= (0..7)
150 150 150 150 150 150 150 150 
##$DBP07= 0
##$DBPNAM0= <>
##$DBPNAM1= <>
##$DBPNAM2= <>
##$DBPNAM3= <>
##$DBPNAM4= <>
##$DBPNAM5= <>
##$DBPNAM6= <>
##$DBPNAM7= <>
##$DBPOAL= (0..7)
0.5 0.5 0.5 0.5 0.5 0.5 0.5 0.5 
##$DBPOFFS= (0..7)
0 0 0 0 0 0 0 0 
##$DE= 6
$$ [...]
##$SUBNAM4= <"">
##$SUBNAM5= <"">
##$SUBNAM6= <"">
##$SUBNAM7= <"">
##$SUBNAM8= <"">
##$SUBNAM9= <"">
##$SW= 20.6817932712277
##$SWIBOX= (0..15)
0 0 3 0 0 0 0 0 0 0 0 0 0 0 0 0 
##$SW_h= 4139.07284768212
##$TD= 32768
##$TD0= 1
##$TE= 0
##$TE2= 300
##$TE3= 300
##$TEG= 300
##$TL= (0..7)
0 120 120 120 120 120 120 120 
##$TP= (0..7)
150 150 150 150 150 150 150 150 
##$TP07= 0
##$TPNAME0= <>
##$TPNAME1= <>
##$TPNAME2= <>
##$TPNAME3= <>
##$TPNAME4= <>
##$TPNAME5= <>
##$TPNAME6= <>
##$TPNAME7= <>
##$TPOAL= (0..7)
0.5 0.5 0.5 0.5 0.5 0.5 0.5 0.5 
##$TPOFFS= (0..7)
0 0 0 0 0 0 0 0 
##$TUNHIN= 0
##$TUNHOUT= 0
##$TUNXOUT= 0
##$USERA1= <user>
##$USERA2= <user>
##$USERA3= <user>
##$USERA4= <user>
##$USERA5= <user>
##$V9= 5
##$VALIST= <valist>
##$VCLIST= <CCCCCCCCCCCCCCC>
##$VD= 0
##$VDLIST= <DDDDDDDDDDDDDDD>
##$VPLIST= <PPPPPPPPPPPPPPP>
##$VTLIST= <TTTTTTTTTTTTTTT>
##$WBST= 1024
##$WBSW= 30
##$XGAIN= (0..3)
0 0 0 0 
##$XL= 0
##$YL= 0
##$YMAX_a= 1947726
##$YMIN_a= -1663931
##$ZGOPTNS= <>
##$ZL1= 120
##$ZL2= 120
##$ZL3= 120
##$ZL4= 120
##$ABSF1= 0
##$ABSF2= 0
##$ABSG= 0
##$ABSL= 0
##$ALPHA= 0
##$AQORDER= 0
##$ASSFAC= 0
##$ASSFACI= 0
##$ASSFACX= 0
##$ASSWID= 0
##$AUNMP= <proc_1d>
##$AZFE= 0.1
##$AZFW= 0.1
##$BCFW= 0
##$BC_mod= 2
##$BYTORDP= 0
##$COROFFS= 0
##$CY= 18.4799938201904
##$DATMOD= 1
##$DC= 0
##$DFILT= <>
##$DTYPP= 0
##$F1P= 9.9274215381318
##$F2P= -0.165520771350173
##$FCOR= 1
##$FTSIZE= 16384
##$FT_mod= 6
##$GAMMA= 0
##$GB= 0
##$INTBC= 1
##$INTSCL= 4.127829e-11
##$ISEN= 128
##$LB= 0.05
##$LEV0= 0
##$LPBIN= 0
##$MAXI= 10000
##$MC2= 0
##$MEAN= 0
##$ME_mod= 0
##$MI= 50
##$NCOEF= 0
##$NC_proc= -4
##$NLEV= 6
##$NOISF1= 3.799351
##$NOISF2= 2.8
##$NSP= 0
##$NTH_PI= 0
##$NZP= 0
##$OFFSET= 16.48848
##$PC= 4
##$PHC0= -268.1076
##$PHC1= 6.501565
##$PH_mod= 1
##$PKNL= yes
##$PPARMOD= 0
##$PSCAL= 4
##$PSIGN= 0
##$REVERSE= no
##$SF= 200.130005582386
##$SI= 16384
##$SIGF1= 3
##$SIGF2= 2
##$SINO= 400
##$SIOLD= 16384
##$SREGLST= <1H.CDCl3>
##$SSB= 0
##$STSI= 16384
##$STSR= 0
##$SW_p= 4139.07284768211
##$SYMM= 0
##$S_DEV= 0
##$TDeff= 32768
##$TDoff= 0
##$TI= <>
##$TILT= no
##$TM1= 0
##$TM2= 0
##$TOPLEV= 0
##$USERP1= <user>
##$USERP2= <user>
##$USERP3= <user>
##$USERP4= <user>
##$USERP5= <user>
##$WDW= 1
##$XDIM= 16384
##$YMAX_p= 416961614
##$YMIN_p= -1434019
$$ End of Bruker specific parameters
$$ ---------------------------------
##NTUPLES= NMR SPECTRUM
##VAR_NAME=  FREQUENCY,     SPECTRUM/REAL,   SPECTRUM/IMAG
##SYMBOL=    X,             R,               I
##VAR_TYPE=  INDEPENDENT,   DEPENDENT,       DEPENDENT
##VAR_FORM=  AFFN,          ASDF,            ASDF
##VAR_DIM=   16384,         16384,           16384
##UNITS=     HZ,            ARBITRARY UNITS, ARBITRARY UNITS
##FACTOR=    0.252644378177508, 1,           1
##FIRST=     3299.83951724647, 0,            0
##LAST=      -839.233330435636, 0,           0
##MIN=       -839.233330435636, -1434019,    0
##MAX=       3299.83951724647, 416961614,    0
$$ Real data points
##PAGE= N=1
##DATA TABLE= (X++(R..R)), XYDATA
$$ [...]
7228a049181M7680j0203L8116J7374j4350L4179p821K2567L060J8476o376M2542
$$ -1049181 -1001501 -1011704 -973588 -956214 -970564 -936385 -944206 -921639 -918579 -900103 -906479 -863937
7216h63937l1281J7370K6595n214p653p160L1667o3753l6386K5976k0219k3268
$$ -863937 -895218 -877848 -851253 -856467 -864120 -871280 -839613 -903366 -939752 -913776 -933995 -957263
7204i57263l3420k3935r820p254r796p6524M9847K3889l3722J775m7494l502K8719
$$ -957263 -990683 -1014618 -1024438 -1031692 -1041488 -1118012 -1068165 -1044276 -1077998 -1076223 -1123717 -1127219 -1098500
7191a098500j6751K378j8202M8729l0200J3992l0617M0004k958k4491O8638J0150
$$ -1098500 -1115251 -1112873 -1131075 -1082346 -1112546 -1098554 -1129171 -1089167 -1092125 -1116616 -1047978 -1037828
7179a037828j1570L9778j5307M9691k2644j924J03432n2508J8697M6120J1680
$$ -1037828 -1049398 -1009620 -1024927 -975236 -997880 -999804 -896372 -948880 -930183 -884063 -872383
7168h72383j634M8594l5087k5733p765L6924j2028l617J6929j5982M1547m7712
$$ -872383 -874017 -825423 -860510 -886243 -894008 -857084 -869112 -872729 -855800 -871782 -830235 -877947
7156h77947r951j748n7181J3787n9345K6509n9083J4652j1631j0250m834m2068
$$ -877947 -887898 -889646 -946827 -933040 -992385 -965876 -1024959 -1010307 -1021938 -1032188 -1037022 -1079090
7144a079090J2714J626m8831J9423M4046k6272j2017J0656k8796K8928k6473J3524
$$ -1079090 -1066376 -1064750 -1113581 -1094158 -1050112 -1076384 -1088401 -1077745 -1106541 -1077613 -1104086 -1090562
7132a090562K2068j2795o004J4851j3332j6852M0625J5715k4006L5823K2881K1780
$$ -1090562 -1068494 -1081289 -1087293 -1072442 -1085774 -1102626 -1062001 -1046286 -1070292 -1034469 -1011588 -989808
7120i89808m0206M1073l0898N2843K677k5721M0672j0284r909J6151P619K0882
$$ -989808 -1030014 -988941 -1019839 -966996 -964319 -990040 -949368 -959652 -969561 -953410 -945791 -924909
7108i24909j9618j0680N972k3450K3560p609J6602l582j5349P195j9067L7484
$$ -924909 -944527 -955207 -949235 -972685 -949125 -956734 -940132 -943714 -959063 -951868 -970935 -933451
7096i33451j4683L7394j9053k3288M054l4788J4348M858n884n98K6623l630J6394
$$ -933451 -948134 -910740 -929793 -953081 -949027 -983815 -969467 -964609 -970493 -971091 -944468 -948098 -931704
7083i31704l7678K5922K7683j6046P238J4394k237J2524j1217p206J2798K8560
$$ -931704 -969382 -943460 -915777 -931823 -924585 -910191 -912428 -899904 -911121 -918327 -905529 -876969
7071h76969K9732j0646k5646O0712j6589P782M022K6603R279J5645m436M7499
$$ -876969 -847237 -857883 -883529 -822817 -839406 -831624 -827602 -800999 -791720 -776075 -780511 -733012
7059g33012l2471j32K9182J1325J3762j0713L2761l322K9022l600o767O7566k1157
$$ -733012 -765483 -765615 -736433 -725108 -711346 -722059 -689298 -692620 -663598 -667198 -673965 -606399 -627556
7046f27556P3766k438K9448k076J3410N690O261N1691L688J1785L2882L417K5620
$$ -627556 -553790 -556228 -526780 -528856 -515446 -509756 -503495 -451804 -448116 -436331 -403449 -400032 -374412
7033c74412q397M8725j312L3316L3653R1952O4402P5121O7690J23907J05142J27874
$$ -374412 -382809 -334084 -335396 -302080 -268427 -176475 -112073 -36952 30738 154645 259787 387661
7021C87661Q9568J56581J29428R8265J86283J91328J57536K20675K90915K60314
$$ 387661 477229 633810 763238 861503 1047786 1239114 1396650 1617325 1908240 2168554
7011B168554L31545K89039L74989L96096M61644L94873M77186M47432L35771K09730
$$ 2168554 2500099 2789138 3164127 3560223 4021867 4416740 4893926 5341358 5677129 5886859
7001E886859J49051q2446j01238k30848k79724l33135l69629l30010m22497m03135
$$ 5886859 6035910 5953464 5852226 5621378 5341654 5008519 4638890 4308880 3886383 3483248
6991C483248l47248l60200l67939l54112l21700k55716k89100k14237l03688j65428
$$ 3483248 3136000 2775800 2407861 2053749 1732049 1476333 1187233 972996 669308 503880
6981E03880j69420j53502j18893j36934j07302q2883l6348p6518n2803p6209k0401
$$ 503880 334460 180958 62065 -74869 -182171 -265054 -301402 -377920 -430723 -506932 -527333
6970e27333o2978l479m9104k007k0337J8239k9085l7626n2976N6019j0675J8878
$$ -527333 -590311 -593790 -642894 -644901 -665238 -646999 -676084 -713710 -766686 -710667 -721342 -702464
6958g02464j4767k2822j2455j7065j1414K9888k445K0479m8918L9109l1291O451
$$ -702464 -717231 -740053 -752508 -769573 -780987 -751099 -753544 -733065 -781983 -742874 -774165 -767714
6946g67714O4603k7737l68j4830K9291L502M1838k9799K1572J0050n283l4243
$$ -767714 -703111 -730848 -731216 -746046 -716755 -713253 -671415 -701214 -679642 -669592 -674875 -709118
6934g09118o363j2723J8089k941j6073k3753J1954j4066M0644l1489m608J0975
$$ -709118 -715481 -728204 -710115 -713056 -729129 -752882 -740928 -754994 -714350 -745839 -750447 -739472
6922g39472k1133J7199M8020j3679J3329l6606J1252J5765j7143k2328J9600l5440
$$ -739472 -760605 -743406 -695386 -709065 -695736 -732342 -721090 -705325 -722468 -744796 -725196 -760636
6910g60636L7855l3856m4793R88q444K0868o590k6451J0396j8118n2L553L0716
$$ -760636 -722781 -756637 -801430 -800442 -808886 -788018 -794608 -821059 -810663 -828781 -828833 -825280 -794564
6897g94564l1116K281l1654M2811J7871m8448M953K3341o4800N6139m1586L0489
$$ -794564 -825680 -823399 -855053 -812242 -794371 -842819 -837866 -814525 -879325 -823186 -864772 -834283
6885h34283J7701K0003j3001k9688M604J5337K2997j9959j4415J5602L857k5062
$$ -834283 -816582 -796579 -809580 -839268 -834664 -819327 -796330 -816289 -830704 -815102 -811245 -836307
6873h36307J9142L919l800k504j3875L30K679q453J8913n409P921Q167K7122n0418
$$ -836307 -817165 -813246 -817046 -819550 -833425 -833095 -830416 -838869 -819956 -825365 -817444 -809277 -782155 -832573
6859h32573J7636P970O60K5093k8724L1236m3602J8451K0671j9922K9429j950
$$ -832573 -814937 -806967 -806307 -781214 -809938 -778702 -822304 -803853 -783182 -803104 -773675 -775625
6847g75625k3670K1134L6252j2143L584k6209M8745m8713M1705M696K2822J0393
$$ -775625 -799295 -778161 -741909 -754052 -750468 -776677 -727932 -776645 -734940 -730244 -707422 -697029
6835f97029k4581L1242j1006k524r102j2947K1605O019J833J1812M1227J4247
$$ -697029 -721610 -690368 -701374 -703898 -713000 -725947 -704342 -698323 -696490 -684678 -643451 -629204
6823f29204p4223L6823L5763k2887K5803K0633j0731L4281k665J4169K3849j1571
$$ -629204 -703427 -666604 -630841 -653728 -627925 -607292 -618023 -583742 -586407 -572238 -548389 -559960
6811e59960j524M2080J3753k8405R5041J2684J533k2634P88M2583l362O045M3451
$$ -559960 -561484 -519404 -505651 -534056 -439015 -426331 -424798 -447432 -446644 -404061 -407423 -401378 -357927
6798c57927k8757K6519j829M9521j0265Q86J0923K6506j0271j070K6646pN37J7687
$$ -357927 -386684 -360165 -361994 -312473 -322738 -321852 -310929 -284423 -294694 -295764 -269118 -269125 -268588 -250901
6784b50901M7395K3827p216K4987j0954M1871j8810M7623j0191L2817l0864M0400
$$ -250901 -203506 -179679 -186895 -161908 -172862 -130991 -149801 -102178 -112369 -79552 -110416 -70016
6772g0016j0520N0220L2410O3224J1751K4354Q4952K6594K290J2249J00049R352
$$ -70016 -80536 -30316 2094 65318 77069 101423 186375 212969 215259 227508 327557 336909
6760C36909L140P1387K1003L8871N3883R8878n833J0444M9228M5160O12j9734
$$ 336909 340049 411436 432439 471310 525193 624071 618238 628682 677910 723070 723682 703948
6748G03948N4806L1882L9237n118J1461L0601J056M0992J8841K908O2334k3161
$$ 703948 758754 790636 829873 824755 836216 866817 867873 908865 927706 930614 992948 969787
6736I69787J4291M6778O6551j9476L4563L4569M8931N2987N2884L9857R1396O7152
$$ 969787 984078 1030856 1097407 1077931 1112494 1147063 1195994 1248981 1301865 1341722 1433118 1500270
6724A500270P9466L6939O6373Q5792P8016O2200N6864J07901Q8208N3555R2110
$$ 1500270 1579736 1616675 1683048 1768840 1846856 1909056 1965920 2073821 2162029 2215584 2307694
6713B307694J18793P5366J37332J16687J26807J79338J29399J97245J84598J82532
$$ 2307694 2426487 2501853 2639185 2755872 2882679 3062017 3191416 3388661 3573259 3755791
6703C755791K03472J94450K49647K18380K26346K76220K75222K53139K35588K59554
$$ 3755791 3959263 4153713 4403360 4621740 4848086 5124306 5399528 5652667 5888255 6147809
6693F147809J99423K26355K35412J62783J81952J77130J32196J74170J76142J49819
$$ 6147809 6347232 6573587 6808999 6971782 7153734 7330864 7463060 7637230 7813372 7963191
6683G963191J64875K21213J64870K08113J71911J80536K72519K80395L01818L98662
$$ 7963191 8128066 8349279 8514149 8722262 8894173 9074709 9347228 9627623 9929441 10328103
6673A0328103M68513O19163P46437Q94460J009989J127826J211587J340125J421062
$$ 10328103 10796616 11415779 12162216 13056676 14066665 15194491 16406078 17746203 19167265
6664A9167265J608315J745580J849173K026295K169090K372577K585974K839446
$$ 19167265 20775580 22521160 24370333 26396628 28565718 30938295 33524269 36363715
6656C6363715L214158L662404M141578M609090N267812N798810O334895O873660
$$ 36363715 39577873 43240277 47381855 51990945 57258757 63057567 69392462 76266122
6648G6266122P481862P690481P428063O001980L798642J321562r54261k788301
$$ 76266122 83747984 91438465 98866528 104868508 108667150 109988712 109034451 106246150
6640A06246150m034836m713180n245194n771762o304364o505802o315354o084057
$$ 106246150 102211314 97498134 92252940 86481178 80176814 73671012 67355658 61271601
6632F1271601n806072n543877n183644m884683m700254m325139l982657l560900
$$ 61271601 55465529 49921652 44738008 39853325 35153071 30827932 26845275 23284375
6624B3284375l080609k600872k256771j889381j622492j456816j178794j012569
$$ 23284375 20203766 17602894 15346123 13456742 11834250 10377434 9198640 8186071
6616H186071q77051p35472o88267n70874m82082m83416l92037l41437l82285k34854
$$ 8186071 7309020 6573548 5885281 5314407 4832325 4348909 3956872 3615435 3233150 2998296
6606B998296k75449k54015j67886k43111j99063j54842j32730j52244j52506j17780
$$ 2998296 2722847 2468832 2300946 2057835 1858772 1703930 1571200 1418956 1266450 1148670
6596A148670j15030j32981q6231j18731p7186l4175q8043p8787l4366o2559o6874
$$ 1148670 1033640 900659 814428 695697 618511 584336 496293 417506 383140 320581 253707
6585B53707l9702l4906o2868l8581j2073m4456l9509j2928n6969J3606l1077O208
$$ 253707 214005 179099 116231 77650 65577 21121 -18388 -31316 -88285 -74679 -105756 -99548
6573i9548m0406m1637J0136l5208J0600m6944K4409m6578K2309m4694J2340L4014
$$ -99548 -139954 -181591 -171455 -206663 -196063 -243007 -218598 -265176 -242867 -287561 -275221 -241207
6561b41207j8201j331J9834q011q322M2757k9279j1702q233r999j5535Q19J6976
$$ -241207 -259408 -260739 -240905 -248916 -257238 -214481 -243760 -255462 -263695 -273694 -289229 -288410 -271434
6548b71434j3157K0302k0205J2971N7963j1388M3520L4728J4201K3629N9270M3880
$$ -271434 -284591 -264289 -284494 -271523 -213560 -224948 -181428 -146700 -132499 -108870 -49600 -5720
6536e720J5328L9536k352K5991L1119J2033L7128L8866R444N6153M8969N3123
$$ -5720 9608 49144 46792 72783 103902 115935 153063 191929 201373 257526 306495 359618
6524C59618J14168R2931J09574J39581J29433J33508J78930J79154K07826K30086
$$ 359618 473786 566717 676291 815872 945305 1078813 1257743 1436897 1644723 1874809
6514A874809K49199K67232L03255L41328L30762L88778M09897L91335M56833L71286
$$ 1874809 2124008 2391240 2694495 3035823 3366585 3755363 4165260 4556595 5013428 5384714
6504E384714L76014L11349J59113P9490n5381j36052k17696k55526l24882l46234
$$ 5384714 5760728 6072077 6231190 6310680 6255299 6119247 5901551 5646025 5321143 4974909
6494D974909l82862l78586m48350l62049l62771l20529l14981l69648k34073k97687
$$ 4974909 4592047 4213461 3765111 3403062 3040291 2719762 2404781 2035133 1801060 1503373
6484A503373k96240k11930j78913j78949j41302j19058j22165r3551q0287r2007
$$ 1503373 1207133 995203 816290 637341 496039 376981 254816 161265 80978 -11029
6474a1029o4880o5103m0905o1834M488q6856m5222l5452J1459k2975l1196j8474
$$ -11029 -75909 -141012 -181917 -243751 -239263 -326119 -371341 -406793 -395334 -418309 -449505 -467979
6462d67979K214j8395l1325l3876K905p4373K8596R846J0798l5692L1085l2666
$$ -467979 -465765 -484160 -515485 -549361 -546456 -620829 -592233 -582387 -571589 -607281 -576196 -608862
6450f08862J2149L9114l4701l8212L4366k0554J0659n0077O8423r0699N3185l1802
$$ -608862 -596713 -557599 -592300 -630512 -596146 -616700 -606041 -656118 -587695 -678394 -625209 -657011
6438f57011K193J0417M4744l4891j3882j5503L1953l6633K8555n2997J2331K1081
$$ -657011 -654818 -644401 -599657 -634548 -648430 -663933 -631980 -668613 -640058 -693055 -680724 -659643
6426f59643l0251J1776q671L7277l3849J2918J7546r843j0151k333J7865L4643
$$ -659643 -689894 -678118 -686789 -649512 -683361 -670443 -652897 -662740 -672891 -675224 -657359 -622716
6414f22716k9726k6078M5936J6823J219m119J9169J0913n258L6415r547L7650
$$ -622716 -652442 -678520 -632584 -615761 -614542 -618661 -599492 -588579 -593837 -557422 -566969 -529319
6402e29319K401N8181O034J7897J3489M7528K4358J0207m886P4637O307K6235
$$ -529319 -526918 -468737 -462703 -444806 -431317 -383789 -359431 -349224 -354110 -279473 -273166 -246931
6390b46931p883R294Q627k19J449l0683J3040o3528M953j869k0716l1003O808
$$ -246931 -254814 -245520 -236893 -237112 -235663 -266346 -253306 -316834 -311881 -313750 -334466 -365469 -358661
6377c58661J4051J6541j787J609j3033j0041M3481j3709j7378M4848j4720O288
$$ -358661 -344610 -328069 -329856 -328247 -341280 -351321 -307840 -321549 -338927 -294079 -308799 -302511
6365c02511N704j0968J5159l8493j890p241J5901k0878K1604j6639J0339m6577
$$ -302511 -296807 -307775 -292616 -331109 -332999 -340240 -324339 -345217 -323613 -340252 -329913 -376490
6353c76490K9459M126L61O72J9959N463j6584M1471j1949L1113k2784N9740l7763
$$ -376490 -347031 -342905 -342544 -341872 -321913 -316450 -333034 -291563 -303512 -272399 -295183 -235443 -273206
6340b73206P011K379P201k9174L0935J7870o4920k8106J7099n62L1107m1258k961
$$ -273206 -266195 -263816 -256615 -285789 -254854 -236984 -301904 -330010 -312911 -313473 -282366 -323624 -326585
6327c26585q88q338J4168l6135K2766l0841J6501L524L2730q225Q440K789J2472
$$ -326585 -327473 -335811 -321643 -357778 -335012 -365853 -349352 -345828 -313098 -321323 -312883 -310094 -297622
6314b97622N302j2268r161N801M912k6894J7637k8413J8561K7971n4801o916K4270
$$ -297622 -292320 -304588 -313749 -307948 -303036 -329930 -312293 -340706 -322145 -294174 -348975 -355891 -331621
6301c31621r803L4295l4508j8381j3160K8421J2570J4143j2637n09J3931J3799
$$ -331621 -341424 -307129 -341637 -360018 -373178 -344757 -332187 -318044 -330681 -331190 -317259 -303460
6289c03460J1874m4843O3133K7869R315J5742k1813J2005J9199L213j4634P2620
$$ -303460 -291586 -336429 -273296 -245427 -236112 -220370 -242183 -230178 -210979 -207766 -222400 -149780
6277a49780K0680O645J776M9203K44j3981N9240J2200L5632J8994N4668J61N6441
$$ -149780 -129100 -122455 -120679 -71476 -71232 -85213 -25973 -13773 21859 40853 95521 95682 152123
6264A52123m415J6760L9900J9592M4192Q373L0369L7986j9812L0414L3753M2886
$$ 152123 147708 164468 204368 223960 268152 276525 306894 344880 325068 355482 389235 432121
6252D32121n792L5097O1333J9819K4106o40N7697O143J7728O1103L1409J3408
$$ 432121 426329 461426 522759 542578 566684 566044 623741 629884 647612 708715 740124 753532
6240G53532M0159K8304L8762M3215P5382J9041K1716M892j1219J4594L0285J4685
$$ 753532 793691 821995 860757 903972 979354 998395 1020111 1025003 1013784 1028378 1058663 1073348
6228A073348K671L2552K3849M0318o683K8255N121O3266K5018J03292O4891P0292
$$ 1073348 1076019 1108571 1132420 1172738 1166055 1194310 1199431 1262697 1287715 1391007 1455898 1526190
6216A526190J00545R1219O5269R7899J48048J90443J23131J57190J94801J79320
$$ 1526190 1626735 1717954 1783223 1881122 2029170 2219613 2342744 2499934 2694735 2874055
6206B874055J98957J65535K33187K43360K20871K66743K89379K61497K67837L26249
$$ 2874055 3073012 3238547 3471734 3715094 3935965 4202708 4492087 4753584 5021421 5347670
6196E347670L47605L13889L21023L23522L43506K74039L55898K83078K48273K17175
$$ 5347670 5695275 6009164 6330187 6653709 6997215 7271254 7627152 7910230 8158503 8375678
6186H375678K24990J49744J11652O8648O847k3626p0705j4558j03835j01287l4439
$$ 8375678 8600668 8750412 8862064 8930712 8937559 8913933 8843228 8828670 8724835 8623548 8589109
6175H589109m4432n048N9514O5998J41236K37694K53284L36683M05136M24779
$$ 8589109 8544677 8539629 8599143 8665141 8806377 9044071 9297355 9634038 10039174 10463953
6165A0463953L69812J39843L955j81850k76731k18403k06298k49407j80710k34440
$$ 10463953 10833765 10973608 10977563 10795713 10518982 10300579 10094281 9844874 9664164 9429724
6155I429724j72143j6615n672J32366J72055L25840L21011M85254N64473O85116
$$ 9429724 9257581 9240966 9235294 9367660 9539715 9865555 10186566 10671820 11236293 11921409
6145A1921409Q34034R63463J061073J231566J423991J603282J735005J936558
$$ 11921409 12755443 13718906 14779979 16011545 17435536 19038818 20773823 22710381
6137B2710381K141003K280816K416012K506534K560401K560741K494519K335966
$$ 22710381 24851384 27132200 29548212 32054746 34615147 37175888 39670407 42006373
6129D2006373K049223J584289J048461M38110j72715o60677j098949j532877j836504
$$ 42006373 44055596 45639885 46688346 47126456 46953741 46293064 45194115 43661238 41824734
6120D1824734k110375k374921k471401k514588k542775k496432k416990k346734
$$ 41824734 39714359 37339438 34868037 32353449 29810674 27314242 24897252 22550518
6112B2550518k235982k133957j912654j841338j661344j480621j357425j155950
$$ 22550518 20314536 18180579 16267925 14426587 12765243 11284622 9927197 8771247
6104H771247j030645q95287q52343o68571o09241n60254m49817m19138l29624
$$ 8771247 7740602 6845315 5992972 5324401 4715160 4154906 3705089 3285951 2956327
6095B956327l20455k53003k23584k40215j81227j15802k14696j37263j30581r6648
$$ 2956327 2635872 2382869 2159285 1919070 1737843 1622041 1407345 1270082 1139501 1042853
6085A042853j21954j00773n6466j10641q4471l8295l0126p0876p3621r4368k5173
$$ 1042853 920899 820126 763660 653019 568548 530253 500127 429251 355630 261262 236089
6074B36089k9178o6615l2224n1284n1816O56k6024m2674l7209j8603l5866n024
$$ 236089 206911 140296 108072 56788 4972 5628 -20396 -63070 -100279 -118882 -154748 -159772
6062a59772r0194m570P074j5874l6249K1338m8336K3176l8943m1797K1015j2230
$$ -159772 -249966 -254536 -247462 -263336 -299585 -278247 -326583 -303407 -342350 -384147 -363132 -375362
6050c75362l4427K2137j7514q880m552K2943n8649K1040M0227j2561l82j2733
$$ -375362 -409789 -387652 -405166 -414046 -418598 -395655 -454304 -433264 -393037 -405598 -405980 -418713
6038d18713O2901M251o793K0034j1924L1263N148J5562q155N0075o160O935L2860
$$ -418713 -355812 -351561 -358354 -338320 -350244 -318981 -313833 -298271 -306426 -256351 -262511 -255576 -222716
6025b22716J3618l93L2120K5823L8846K6904O867M8573L627n462J6693o184L580
$$ -222716 -209098 -209491 -177371 -151548 -112702 -85798 -78931 -30358 -26731 -32193 -15500 -21684 -18104
6012a8104m5265P744r971l9791l508k1956q786k6044r025l8224O350k6548l551
$$ -18104 -63369 -55625 -65596 -105387 -108895 -130851 -139637 -165681 -174706 -212930 -206580 -233128 -236679
5999b36679j9367l0245l1611L8274l0144j3842K3262l4970L2409r638m3005K5037
$$ -236679 -256046 -286291 -317902 -279628 -309772 -323614 -300352 -335322 -302913 -312551 -355556 -330519
5987c30519q890k269J677m5497K805j7396L969J3821J637k5960K325p816K977
$$ -330519 -339409 -341678 -340001 -385498 -382693 -400089 -396120 -382299 -380662 -406622 -404297 -412113 -409136
5974d09136j2929L5639m0150K111L508j3902R151O198r244l0368q017L7839n366
$$ -409136 -422065 -386426 -426576 -424465 -420957 -434859 -425708 -419510 -428754 -459122 -467139 -429300 -434666
5961d34666k9720J8966j7795J387m509J9692j4682j9941L0492j1007o04j3815
$$ -434666 -464386 -445420 -463215 -461828 -466337 -446645 -461327 -481268 -450776 -461783 -462387 -476202
5949d76202q108N741Q424j2769j0190k5984P2566n7723J2426k3980J0622o984
$$ -476202 -484310 -478569 -470145 -482914 -493104 -519088 -446522 -504245 -491819 -515799 -505177 -512161
5937e12161O403m545q664k5657N1800j7084m4951K6333J751M7143k2856J2807
$$ -512161 -505758 -510303 -518967 -544624 -492824 -509908 -554859 -528526 -526775 -479632 -502488 -489681
5925d89681J2271k1067J8241j0528Q600J7735M119k419K4948L2187l7918M3771
$$ -489681 -477410 -498477 -480236 -490764 -482164 -464429 -460310 -462729 -437781 -405594 -443512 -399741
5913c99741k4110K4358q927m45M88N2195m1957o625m907L0054q560J5980L0497
$$ -399741 -423851 -399493 -408420 -408865 -408377 -356182 -398139 -404764 -409671 -379617 -388177 -372197 -341700
5900c41700j7715J0767l8575M3255N580l3293J0862K4156M6211l0394M2200P647
$$ -341700 -359415 -348648 -387223 -343968 -338388 -371681 -360819 -336663 -290452 -320846 -278646 -270999
5888b70999M6866j2722o954L0792L8502l444J8780K3749J0275L9855L2318M8175
$$ -270999 -224133 -236855 -243809 -213017 -174515 -177959 -159179 -135430 -125155 -85300 -52982 -4807
5876d807L6417L7066K4649Q1259n102L5178N8460K3327J0968J6962M5441k3426
$$ -4807 31610 68676 93325 174584 169482 204660 263120 286447 297415 314377 359818 336392
5864C36392n997O4659k1360m793J3517k5037J2009j1530L6241m2934j0802M4806
$$ 336392 330395 395054 373694 368901 382418 357381 369390 357860 394101 351167 340365 385171
5852C85171m1382K6873O391K0873k6516M3375j3288K8701N3873K0246O4638K2944
$$ 385171 343789 370662 377053 397926 371410 414785 401497 430198 484071 504317 568955 591899
5840E91899Q2523O3167Q0015P4163O1630P8075J03586J25916J04395M7291J04536
$$ 591899 674422 737589 817604 891767 953397 1031472 1135058 1260974 1365369 1412660 1517196
5829A517196P4674O5977N3295M8100Q5670M5150M3724N2576Q8358K9119M9511
$$ 1517196 1591870 1657847 1711142 1759242 1844912 1890062 1933786 1986362 2074720 2103839 2153350
5818B153350N5029j3763P1468m6819K6053l1494m1150k3794O964k7635L1247k9635
$$ 2153350 2208379 2194616 2266084 2219265 2245318 2213824 2172674 2148880 2155844 2128209 2159456 2129821
5806B129821L8327L9244K0743J15327M7805J16738J19785J19193J37416J35663
$$ 2129821 2168148 2207392 2228135 2343462 2391267 2508005 2627790 2746983 2884399 3020062
5796C020062J60407J35794J48191J91175J40993J71806J70874J59241J53899J21429
$$ 3020062 3180469 3316263 3464454 3655629 3796622 3968428 4139302 4298543 4452442 4573871
5786D573871J51258O3671J01641N993L8972k4122n0375k8361r6262k1484l8700
$$ 4573871 4725129 4788800 4890441 4896434 4935406 4911284 4860909 4832548 4736286 4714802 4676102
5775D676102m6316k9175K2348J6772M2256O0066J22972J04835J48284J34480J05318
$$ 4676102 4629786 4600611 4622959 4639731 4681987 4742053 4865025 4969860 5118144 5252624 5357942
5764E357942J42329N2419J10669N9765O713k9060m936n2998p4816n1410p4143
$$ 5357942 5500271 5552690 5663359 5723124 5729837 5700777 5695841 5642843 5568027 5516617 5442474
5753E442474r4419n5632j02240p8291j02081q4085n7067q0553m2423o7009o4875
$$ 5442474 5348055 5292423 5190183 5111892 5009811 4925726 4868659 4788106 4745683 4678674 4613799
5742D613799m5964p7402j7487m3141k0139p752o0696l6094k3046L7713k3990K199
$$ 4613799 4567835 4490433 4472946 4429805 4409666 4401914 4341218 4305124 4282078 4319791 4295801 4298000
5730D298000l0991K8038o792j6631l8725k3327q7726p4200q1544j44399r9405
$$ 4298000 4267009 4295047 4288255 4271624 4232899 4209572 4121846 4047646 3966102 3821703 3722298
5719C722298j24103j23873j37336j17722j56439j14305j32548j21940r4885j36639
$$ 3722298 3598195 3474322 3336986 3219264 3062825 2948520 2815972 2694032 2599147 2462508
5709B462508r2443n1652p4479p5049j14542m4022l1839m5931k5788k3175j5277
$$ 2462508 2370065 2318413 2243934 2168885 2054343 2010321 1978482 1932551 1906763 1883588 1868311
5698A868311m3796J6341r104J9651j1545k8316P155k683K8861O779r229J2672
$$ 1868311 1824515 1840856 1831752 1851403 1839858 1811542 1818697 1816014 1844875 1851654 1842425 1855097
5686A855097J7934J0317L4689J0569p215J7055M8722L8302J3520L5680M6255J2436
$$ 1855097 1873031 1883348 1918037 1928606 1921391 1938446 1987168 2025470 2038990 2074670 2120925 2133361
5674B133361K8866M4731O2042Q652J8191P0057L1418L6249N7734J7117N6153K6552
$$ 2133361 2162227 2206958 2269000 2277652 2295843 2365900 2397318 2433567 2491301 2508418 2564571 2591123
5662B591123O0569k963O4287M3264K1458Q0467M6004K7473P3473P4894K6944O5014
$$ 2591123 2651692 2648729 2713016 2756280 2777738 2858205 2904209 2931682 3005155 3080049 3106993 3172007
5650C172007Q5434R1044P7522P4159Q8920O5754J24940N1254J37556P5213O8907
$$ 3172007 3257441 3348485 3426007 3500166 3589086 3654840 3779780 3831034 3968590 4043803 4112710
5639D112710R9493J01931Q9577P8599Q8052P3477J05102J19600N7625R1741J50870
$$ 4112710 4212203 4314134 4403711 4482310 4570362 4643839 4748941 4868541 4926166 5017907 5168777
5628E168777J38027J55658J67051J88525J78681K03835K20562K56790K40845K44893
$$ 5168777 5306804 5462462 5629513 5818038 5996719 6200554 6421116 6677906 6918751 7163644
5618G163644K08184K16510J63922J44332J83607J20266J71040J97341K06319K04643
$$ 7163644 7371828 7588338 7752260 7896592 8080199 8200465 8371505 8568846 8775165 8979808
5608H979808K74586K46809L37498L51592K96250K94426L04065K79735K52844K39781
$$ 8979808 9254394 9501203 9838701 10190293 10486543 10780969 11085034 11364769 11617613 11857394
5598A1857394K12374K33545K11128K05220J90673K04288J81145J83241J59339
$$ 11857394 12069768 12303313 12514441 12719661 12910334 13114622 13295767 13479008 13638347
5589A3638347J52172J73456K23960J95282K89366K40483L60408L68138M75824
$$ 13638347 13790519 13963975 14187935 14383217 14672583 14913066 15273474 15641612 16117436
5580A6117436M55813M95427M83386N34840M44209L78406L66286J91718J22645
$$ 16117436 16573249 17068676 17552062 18086902 18531111 18909517 19275803 19467521 19590166
5571A9590166J5673p9088k03150k56419l13663l59636k92567k94174l00322k00136
$$ 19590166 19605839 19526751 19323601 19067182 18753519 18393883 18101316 17807142 17506820 17306684
5561A7306684k42261j99190j56426j24653j17006n2668m5610P0749Q2676K12040
$$ 17306684 17064423 16865233 16708807 16584154 16467148 16414480 16368870 16439619 16522295 16734335
5551A6734335K95171L79158N30838O67749Q50824R42453J093215J254887J392396
$$ 16734335 17029506 17408664 17939502 18607251 19458075 20400528 21493743 22748630 24141026
5542B4141026J620357J806513K000722K219297K584114K799784L144095L562695
$$ 24141026 25761383 27567896 29568618 31787915 34372029 37171813 40315908 43878603
5534D3878603L958536M442378M887513N333939N818246O057256O154913N973446
$$ 43878603 47837139 52279517 57167030 62500969 68319215 74376471 80531384 86504830
5526H6504830N405874M611186L543304K263946R43622l47127j522735k582713
$$ 86504830 91910704 96521890 100065194 102329140 103272762 102925635 101402900 98820187
5518I8820187l462123m166232m684432n057661n283320n307020n369708n191588
$$ 98820187 95358064 91191832 86507400 81449739 76166419 70859399 65489691 60298103
5510F0298103n139081m877768m624518m349160m006322l732388l394761k988197
$$ 60298103 55159022 50281254 45656736 41307576 37301254 33568866 30174105 27185908
5502B7185908k676731k368606k096526j774237j555853j348233j189924r92056
$$ 27185908 24509177 22140571 20044045 18269808 16713955 15365722 14175798 13183742
5494A3183742q72906p19524o03650n73216m71371m36412l46938l19398l16962
$$ 13183742 12310836 11591312 10987662 10414446 9943075 9506663 9159725 8840327 8523365
5485H523365k83529k09821j93213j53575k19674q7146j40271m5547l7510o3410
$$ 8523365 8239836 8030015 7836802 7683227 7463553 7376407 7236136 7190589 7153079 7089669
5475G089669m4849P627J1020J4388R2253J4026L6794P2005K1955j260P5133L4989
$$ 7089669 7044820 7052447 7063467 7077855 7170108 7184134 7220928 7292933 7314888 7313628 7388761 7423750
5463G423750L8276N613Q033K1554L2423l2650N8110J7526O0046m159J6239j066
$$ 7423750 7462026 7467639 7475672 7497226 7529649 7496999 7555109 7572635 7632681 7628522 7644761 7643695
5451G643695L1371l8317n6282m2690m9173n5690o8532n9545r6688m5469p4019
$$ 7643695 7675066 7636749 7580467 7537777 7488604 7432914 7364382 7304837 7208149 7162680 7088661
5440G088661o7631m0359m8461o3963n8354k0136j15665l7030o0814r8419k8101
$$ 7088661 7021030 6980671 6932210 6868247 6809893 6789757 6674092 6637062 6576248 6477829 6449728
5429F449728j12186j40339l8190j28031p6390q5518m3355m8591l9713j5257l2964
$$ 6449728 6337542 6197203 6159013 6030982 5954592 5869074 5825719 5777128 5737415 5722158 5689194
5418E689194m3246l089J2350l6691J3412R988M3953K8971j1136P1949N6478Q4293
$$ 5689194 5645948 5642859 5655209 5618518 5631930 5641918 5685871 5714842 5703706 5775655 5832133 5916426
5406E916426J01286J33717J19119J35824J44852J81149K25069J96722K45996K66104
$$ 5916426 6017712 6151429 6270548 6406372 6551224 6732373 6957442 7154164 7400160 7666264
5396G666264K54311K50020K65738K87293K33563K59743J81587K51388J78312J78544
$$ 7666264 7920575 8170595 8436333 8723626 8957189 9216932 9398519 9649907 9828219 10006763
5386A0006763J78701K05537J69246J91536K16639K19224K50436K98716L11777
$$ 10006763 10185464 10391001 10560247 10751783 10968422 11187646 11438082 11736798 12048575
5377A2048575L57422L95140M98767M47485N49741O09039O41725O76617P02777
$$ 12048575 12405997 12801137 13299904 13747389 14297130 14906169 15547894 16224511 16927288
5368A6927288P59902P35649P13242O83530P47475P79880Q53218Q92937J055075
$$ 16927288 17687190 18422839 19136081 19819611 20567086 21346966 22200184 23093121 24148196
5359B4148196J093333J250854J465110J692618J845476K036385K184126K341210
$$ 24148196 25241529 26492383 27957493 29650111 31495587 33531972 35716098 38057308
5351C8057308K453833K840955L035066L193166L325402L678010L933638M305357
$$ 38057308 40511141 43352096 46387162 49580328 52905730 56583740 60517378 64822735
5343F4822735M693161N145871N622561N679250N283969M003821K299851P20562
$$ 64822735 69515896 74661767 80284328 85963578 91247547 95251368 97551219 98271781
5335I8271781q21484j910520k390125k685125l105860l772032m334890m557420
$$ 98271781 97450297 95539777 93149652 90464527 87358667 83586635 79251745 74694325
5327G4694325m634597m670937m609866m465713m235405m163498m030629l736385
$$ 74694325 70059728 65388791 60778925 56313212 52077807 47914309 43883680 40147295
5319D0147295l552072l140593k894402k529511k402872k172554j970764j762258
$$ 40147295 36595223 33454630 30560228 28030717 25627845 23455291 21484527 19722269
5311A9722269j592253j483667j279452j133730r85900r38200p69561o85914o30211
$$ 19722269 18130016 16646349 15366897 14233167 13247267 12309067 11539506 10853592 10223381
5302A0223381n35400m75536l86069l68869k86465k21293k24176r6081j13306j4986
$$ 10223381 9687981 9212445 8826376 8457507 8171042 7949749 7725573 7629492 7516186 7501200
5292G501200n2111Q113N3169J0307R2012Q9878N8087R6343J18147Q5803J41555
$$ 7501200 7449089 7457202 7510371 7520678 7612690 7702568 7760655 7856998 7975145 8060948 8202503
5281H202503Q6657N2413O4053k1201J210N59J1743l0965N3027J3449L4601J01155
$$ 8202503 8289160 8341573 8405626 8384425 8385635 8386194 8397937 8366972 8419999 8433448 8468049 8569204
5269H569204N6851J45284K00147K13739K20498K90539L15330L13343L48958L29934
$$ 8569204 8626055 8771339 8971486 9185225 9405723 9696262 10011592 10324935 10673893 11003827
5259A1003827L60841L39894K96968L27892L61147L69725M10242M08171M71017
$$ 11003827 11364668 11704562 12001530 12329422 12690569 13060294 13470536 13878707 14349724
5250A4349724N61249N56238N52040O57760O59788P95814P64646Q31917Q21909
$$ 14349724 14910973 15467211 16019251 16677011 17336799 18132613 18897259 19729176 20551085
5241B0551085Q44575P95701O35651M85715L82530K70428K83983K18336L46948
$$ 20551085 21395660 22191361 22827012 23312727 23695257 23965685 24249668 24468004 24814952
5232B4814952M11959M90511O50938Q19509R91375J079397J222253J321445J459301
$$ 24814952 25226911 25717422 26368360 27187869 28179244 29258641 30480894 31802339 33261640
5223C3261640J501422J466287J045823K50099l05444r59975j411093j550972j620551
$$ 33261640 34763062 36229349 37275172 37525271 37219827 36259852 34848759 33297787 31677236
5214C1677236j657159j754256j909201j911451j723048j601630j540481j453043
$$ 31677236 30020077 28265821 26356620 24445169 22722121 21120491 19580010 18126967
5206A8126967j283005j203142j076480j084234q57842p56436n43072l98899k18151
$$ 18126967 16843962 15640820 14564340 13480106 12622264 11865828 11322756 10923857 10705706
5197A0705706p8552R9324K93146M24254N92495O92227Q79602R73842J054786J263724
$$ 10705706 10627154 10726478 11019624 11443878 12036373 12728600 13608202 14582044 15636830 16900554
5187A6900554J309840J425434J531491J592018J802542J993157K167494K479638
$$ 16900554 18210394 19635828 21167319 22759337 24561879 26555036 28722530 31202168
5179C1202168K812895L170658L571603M082594M553205N053131N519603N853933
$$ 31202168 34015063 37185721 40757324 44839918 49393123 54446254 59965857 65819790
5171F5819790N878172N592127M654179L397491J906215L20031j188163k347796
$$ 65819790 71697962 77290089 81944268 85341759 87247974 87568005 86379842 84032046
5163H4032046l285984l811689m259270m446043m590054m529008m389414m248469
$$ 84032046 80746062 76934373 72675103 68229060 63639006 59109998 54720584 50472115
5155E0472115l983606l766415l496222l231080l010185k826562k691167k543280
$$ 50472115 46488509 42722094 39225872 35994792 32984607 30158045 27466878 24923598
5147B4923598k305130k066427j902529j695761j388984j331058j179452j133619
$$ 24923598 22618468 20552041 18649512 16953751 15564767 14233709 13054257 11920638
5139A1920638r42917q64840p83470p38614o68058o47694n87002n76935n00154
$$ 11920638 10977721 10112881 9329411 8590797 7922739 7275045 6688043 6111108 5610954
5130E610954m70344l73674m03353l26391k75792k23590k47252j52642k07825j32025
$$ 5610954 5140610 4766936 4363583 4037192 3761400 3537810 3290558 3137916 2930091 2798066
5120B798066j45754j57978j09909j37450j00748j06182j04144j19194j14798o9147
$$ 2798066 2652312 2494334 2384425 2246975 2146227 2040045 1935901 1816707 1701909 1632762
5110A632762j16900l7136q6035n7062r1057o4796k1732m0923p1326m0063j7570
$$ 1632762 1515862 1478726 1392691 1335629 1244572 1179776 1158044 1117121 1045795 1005732 988162
5099I88162m425q3184j3470n3450J2524o0308j9842K8920n3550J4100r623M735
$$ 988162 983737 900553 887083 833633 846157 785849 766007 794927 741377 755477 745854 750589
5087G50589k3747K0490M326l871O4833k8975O2489K5175J3461J7120N0770K6512
$$ 750589 726842 747332 751658 747787 812620 783645 846134 871309 884770 901890 952660 979172
5075I79172N1280o172p469k655j4220n4779j9205k9542p6664M4930p4448n6714
$$ 979172 1030452 1024280 1016811 1014156 999936 945157 925952 896410 819746 864676 790228 733514
5063G33514q465m3656k4021n3431K1492n7263J8726o5928o415J3316k4570q879
$$ 733514 725049 681393 657372 603941 625433 568170 586896 520968 514553 527869 503299 494420
5051D94420L1010M537R195J4108O2146K1609O0913L3460Q5673J26899Q039N1744
$$ 494420 525430 529967 539162 553270 615416 637025 697938 731398 817071 943970 952009 1003753
5039A003753M8918j1310n3719J5590n3111l1334m6200l6233k2778m6405n431n3783
$$ 1003753 1052671 1041361 987642 1003232 950121 918787 872587 836354 813576 767171 761740 707957
5027G07957l6698J955o9694j0149l6048k5907m2342l860O618O496j8380k6534
$$ 707957 671259 673214 603520 593371 557323 531416 489074 485214 491832 498328 479948 453414
5015D53414K9054l9697J9718k1532Q225L9618j2012J5893K589j038J9431m372
$$ 453414 482468 442771 462489 440957 449182 488800 476788 492681 495270 494232 513663 509291
5003E09291K6614L8319k662K7410l192L5597L4474k2918J7579n147J7786M4928
$$ 509291 535905 574224 571562 598972 595780 631377 665851 642933 660512 655365 673151 718079
4991G18079k8344L3176K5249O3140L238O6135K1804K0642M2129N3467J1428P8510
$$ 718079 689735 722911 748160 811300 814538 880673 902477 923119 965248 1018715 1030143 1108653
4979A108653Q2272N1784N8571M5742M8992K9761N8609N6663O311k8103K0201L1185
$$ 1108653 1190925 1242709 1301280 1347022 1396014 1425775 1484384 1541047 1547358 1519255 1539456 1570641
4967A570641J3970K0872m0054N2848k7974J6341K0778k3231O4412L5759J0638
$$ 1570641 1584611 1605483 1565429 1618277 1590303 1606644 1627422 1604191 1668603 1704362 1715000
4956A715000K8672L8704N0922R2477K8580M4404Q7657N4288Q8502R6518J11162
$$ 1715000 1743672 1782376 1833298 1925775 1954355 1998759 2086416 2140704 2229206 2325724 2436886
4945B436886J05210R1378P5099Q2102J10420P1505M6677N4015P3808l0P1353n403
$$ 2436886 2542096 2633474 2708573 2790675 2901095 2972600 3019277 3073292 3147100 3147070 3218423 3213020
4933C213020Q1830M1834Q7858O6700J15397J19182J34223J50073J70145J47565
$$ 3213020 3294850 3336684 3424542 3491242 3606639 3725821 3860044 4010117 4180262 4327827
4923D327827K04943J49618K00537P5705J45104P9192L8520k2188J1694k5726l1824
$$ 4327827 4532770 4682388 4882925 4958630 5103734 5182926 5221446 5199258 5210952 5185226 5153402
4912E153402n1063j02414k8960j00510l7997l3749l9142J1096m4245K2406k6615
$$ 5153402 5102339 4999925 4970965 4870455 4832458 4798709 4759567 4770663 4726418 4748824 4722209
4901D722209L2473m746J9493L2421K0701L4215J4709K5095Q6406M3853J6843R7664
$$ 4722209 4754682 4749936 4769429 4801850 4822551 4856766 4871475 4896570 4982976 5026829 5043672 5141336
4889E141336j593P2585K3373j3971o650j0422K3148n0850J5075j4680o2862o540
$$ 5141336 5139743 5212328 5235701 5221730 5215080 5204658 5227806 5176956 5192031 5177351 5114489 5107949
4877E107949o4241J9757m6264j6671J6686l218k7330k529q651J7821j0351n9801
$$ 5107949 5043708 5063465 5017201 5000530 5017216 5013998 4986668 4984139 4975488 4993309 4982958 4923157
4865D923157Q767o2822l9452m6111k5399k5131j9978o7238l6178J310k573l4541
$$ 4923157 4931924 4869102 4829650 4783539 4758140 4733009 4713031 4645793 4609615 4610925 4608352 4573811
4853D573811j3702K7527j9106N681n511M4677J7679O4210M6436J8691O3809j3859
$$ 4573811 4560109 4587636 4568530 4574211 4568700 4613377 4631056 4695266 4741702 4760393 4824202 4810343
4841D810343N5024K5426K9093j792K5747k4339P774j9078n4845k1780n6005m2933
$$ 4810343 4865367 4890793 4919886 4918094 4943841 4919502 4927276 4908198 4853353 4831573 4775568 4732635
4829D732635j2594m2385l1707j59l124m5689j1371j4135K1206O542k3341n169
$$ 4732635 4720041 4677656 4645949 4645790 4642666 4596977 4585606 4571471 4592677 4599219 4575878 4570709
4817D570709J5777M964J4106J1401L7868m427N0728n430j0897N1812L8309R000
$$ 4570709 4586486 4591450 4605556 4616957 4654825 4650398 4701126 4695696 4684799 4736611 4774920 4783920
4805D783920P8673j2037K4212L2942J3897M1288L9479K181Q298N9666O1035L7102
$$ 4783920 4862593 4850556 4874768 4907710 4921607 4962895 5002374 5004555 5012853 5072519 5133554 5170656
4793E170656O1545M117K3764Q2730M9952M4512K3960K92O7285M245J05500L3337
$$ 5170656 5232201 5236318 5260082 5342812 5392764 5437276 5461236 5461528 5528813 5533058 5638558 5671895
4781E671895M2342J0721J00394L9548M9612L5167J19914N9690M1255O6253N5931
$$ 5671895 5714237 5724958 5825352 5864900 5914512 5949679 6069593 6129283 6170538 6236791 6292722
4770F292722P5955N9909R5054O1188J09419J14017M2154Q4268P9185J48088R7442
$$ 6292722 6368677 6428586 6523640 6584828 6694247 6808264 6850418 6934686 7013871 7161959 7259401
4759G259401N0396Q4875J18986R5110M2008J16807J04765J07529P3294J05737
$$ 7259401 7309797 7394672 7513658 7608768 7650776 7767583 7872348 7979877 8053171 8158908
4749H158908R3870Q6820J35997Q1957J13207P3255J36170J25622J18184P9367
$$ 8158908 8252778 8339598 8475595 8557552 8670759 8744014 8880184 9005806 9123990 9203357
4739I203357J44234R2461J04226J59709J04413R9142J35060J56253J20345J31462
$$ 9203357 9347591 9440052 9544278 9703987 9808400 9907542 10042602 10198855 10319200 10450662
4729A0450662J77292J41846J37901J38892J83882J54534K00291J25752J83082
$$ 10450662 10627954 10769800 10907701 11046593 11230475 11385009 11585300 11711052 11894134
4720A1894134J95072J70100J73107J73133J69758J27971J53215J69227J60554
$$ 11894134 12089206 12259306 12432413 12605546 12775304 12903275 13056490 13225717 13386271
4711A3386271J13313J56116J45540J30342J77451J08752J18252J52358J18778
$$ 13386271 13499584 13655700 13801240 13931582 14109033 14217785 14336037 14488395 14607173
4702A4607173J16496J12534Q1245J44816N3214J44851O0050Q6800P2328J08463
$$ 14607173 14723669 14836203 14917448 15062264 15115478 15260329 15320379 15407179 15479507 15587970
4692A5587970L0462P6146Q4160M3121k543P6561N4955O9497L594L0446L4389M7654
$$ 15587970 15618432 15694578 15778738 15821859 15819316 15895877 15950832 16020329 16023923 16054369 16088758 16136412
4680A6136412K3620n730K1481J6236M1104O222L7991j690M5931L7470P9158N731
$$ 16136412 16160032 16154302 16175783 16192019 16233123 16239345 16277336 16275646 16321577 16359047 16438205 16443936
4668A6443936L9259K2853M6417O2639J02691K0964K4411Q1981M2390M9173O6185
$$ 16443936 16483195 16506048 16552465 16615104 16717795 16738759 16763170 16845151 16887541 16936714 17002899
4657A7002899P3840K1537l5263N5904L1809O7094m637k8993J1452k3935o1490
$$ 17002899 17076739 17098276 17063013 17118917 17150726 17217820 17213183 17184190 17195642 17171707 17110217
4646A7110217j3854j3564o8962o2078n8474l9731o9352q8118j02189n5152q7622
$$ 17110217 17096363 17082799 17013837 16951759 16893285 16853554 16784202 16696084 16593895 16538743 16451121
4635A6451121o5959j11372n9100m9849j19176k7448r4896q0948p1907k2946p6656
$$ 16451121 16385162 16273790 16214690 16164841 16045665 16018217 15923321 15842373 15770466 15747520 15670864
4624A5670864o2583l8641k8511o4111k0190q670n4177j9622N238j5060P659l135
$$ 15670864 15608281 15569640 15541129 15477018 15456828 15448158 15393981 15374359 15379597 15364537 15372196 15369061
4612A5369061o345m669L9244o054N7212O4880L0610J1489M5586J5269R0523M2670
$$ 15369061 15362716 15358047 15397291 15391237 15448449 15513329 15543939 15555428 15601014 15616283 15706806 15749476
4600A5749476P4555O2071Q9161M9406O0613Q4325Q1452O2293N9880J09688N1672
$$ 15749476 15824031 15886102 15975263 16024669 16085282 16169607 16251059 16313352 16373232 16482920 16534592
4589A6534592R3298P8864Q0707Q2387R1662N5018O5291J13145P4010R9973J23250
$$ 16534592 16627890 16706754 16787461 16869848 16961510 17016528 17081819 17194964 17268974 17368947 17492197
4578A7492197M7111J39734J14393J09984J66458Q0658J19849J58613J32710J22076
$$ 17492197 17539308 17679042 17793435 17903419 18069877 18150535 18270384 18428997 18561707 18683783
4568A8683783J26143J13551J14765J16755J31233Q6977Q9010Q6632M6145J25389
$$ 18683783 18809926 18923477 19038242 19154997 19286230 19373207 19462217 19548849 19594994 19720383
4558A9720383O5678K4358O8481P2817N4330O759R9022l269P9628P5962J2133J05475
$$ 19720383 19786061 19810419 19878900 19951717 20006047 20012806 20111828 20108559 20188187 20264149 20276282 20381757
4546B0381757R5847O9823J04533M8996R2156P7962Q9040O5094O9884P9211P5667
$$ 20381757 20477604 20547427 20651960 20700956 20793112 20871074 20960114 21025208 21095092 21174303 21249970
4535B1249970K1172J8147K7389J3081k4479Q1887l8463L8252K310N0868M323L5328
$$ 21249970 21271142 21289289 21316678 21329759 21305280 21387167 21348704 21386956 21389266 21440134 21444457 21479785
4523B1479785N1769O0696R2662M4471N2313R3721O5069J06822P5329J03202R7645
$$ 21479785 21531554 21592250 21684912 21729383 21781696 21875417 21940486 22047308 22122637 22225839 22323484
4512B2323484L9131J20717O0936M4719O7666O7571L6160N1300L4656R2273N9264
$$ 22323484 22362615 22483332 22544268 22588987 22656653 22724224 22760384 22811684 22846340 22938613 22997877
4501B2997877M2067J06713L6589O3580J34293P2915R6010R9578J10363Q7338J28571
$$ 22997877 23039944 23146657 23183246 23246826 23381119 23454034 23550044 23649622 23759985 23847323 23975894
4490B3975894O8760J60552R6501J49746J33988Q4415J33881Q5417J12221J41142
$$ 23975894 24044654 24205206 24301707 24451453 24585441 24669856 24803737 24889154 25001375 25142517
4480B5142517J05268R0084J53196J18644J24207J17147J77397J34874J73505J92068
$$ 25142517 25247785 25337869 25491065 25609709 25733916 25851063 26028460 26163334 26336839 26528907
4470B6528907J44664J85694K03092K12321K16555K20143K86793J92507K96806
$$ 26528907 26673571 26859265 27062357 27274678 27491233 27711376 27998169 28190676 28487482
4461B8487482K66545K92808K62742L24690K85704K67134L75624K95523L10487
$$ 28487482 28754027 29046835 29309577 29634267 29919971 30187105 30562729 30858252 31168739
4452C1168739L89873L04997L43589L30551L22554L54336L52408L50692L45805
$$ 31168739 31558612 31863609 32207198 32537749 32860303 33214639 33567047 33917739 34263544
4443C4263544L55210L72097L53110M02423L76926M14885L59580L89047M04554
$$ 34263544 34618754 34990851 35343961 35746384 36123310 36538195 36897775 37286822 37691376
4434C7691376M09033L73019M27360M53364M02950M60831M47061M48609M37136
$$ 37691376 38100409 38473428 38900788 39354152 39757102 40217933 40664994 41113603 41550739
4425D1550739M83814M67799M57627N27919N10381N42857N36363N02712N85573
$$ 41550739 42034553 42502352 42959979 43487898 43998279 44541136 45077499 45580211 46165784
4416D6165784N70849O22806O23213O39077O83872O80439O69985P51045P06782
$$ 46165784 46736633 47359439 47982652 48621729 49305601 49986040 50656025 51407070 52113852
4407E2113852Q06182P20509Q30775Q41230Q52670Q99985Q90552R25702R88987
$$ 52113852 52920034 53640543 54471318 55312548 56165218 57065203 57955755 58881457 59870444
4398E9870444J031303J002860J107542J119046J173878J181705J228203J317843
$$ 59870444 60901747 61904607 63012149 64131195 65305073 66486778 67714981 69032824
4390F9032824J305315J351589J419318J464312J556802J531886J650226J725552
$$ 69032824 70338139 71689728 73109046 74573358 76130160 77662046 79312272 81037824
4382H1037824J723267J797984J847701J881810J938167J983550J963186K013073
$$ 81037824 82761091 84559075 86406776 88288586 90226753 92210303 94173489 96186562
4374I6186562K059495K064361K140646K180192K204013K346102K410481K564561
$$ 96186562 98246057 100310418 102451064 104631256 106835269 109181371 111591852 114156413
4366A14156413K670005K856957L048124L299015L540912L871717M210841M558569
$$ 114156413 116826418 119683375 122731499 126030514 129571426 133443143 137653984 142212553
4358A42212553M961590N291652N675461O130600O531723O994111P515283Q090404
$$ 142212553 147174143 152465795 158141256 164271856 170803579 177797690 185312973 193403377
4350A93403377Q680477R218593R909983J0533137J1341039J2086773J2843252
$$ 193403377 202083854 211302447 221212430 231745567 243086606 255173379 268016631
4343B68016631J3672514J4350046J4923365J5315165J5488878J5329896J4737421
$$ 268016631 281689145 296039191 310962556 326277721 341766599 357096495 371833916
4336C71833916J3575611J1925126R501418O525248L375102K25193k576002n052428
$$ 371833916 385409527 397334653 406836071 413361319 416736421 416961614 414385612 409333184
4328D09333184p031058q564897r911796j0954051j1702696j2081435j2296167
$$ 409333184 402302126 393737229 383825433 372871382 361168686 349087251 336791084
4321C36791084j2282974j2187926j1962254j1623612j1238886j0727202j0206824
$$ 336791084 324508110 312320184 300357930 288734318 277495432 266768230 256561406
4314B56561406r562355q950783q286500p750770p144882o740672o272079n941559
$$ 256561406 246999051 238048268 229761768 222010998 214866116 208125444 201853365 195911806
4306A95911806n636946n387935n192159n034266m913181m740862m649144m573267
$$ 195911806 190274860 184886925 179694766 174660500 169747319 165006457 160357313 155784046
4298A55784046m405516m259693m181608m086022l920422l817045l646384l541239
$$ 155784046 151378530 147118837 142937229 138851207 134930785 131113740 127467356 123926117
4290A23926117l382577l196790l033184k920771k781047k600282k508110k306234
$$ 123926117 120543540 117346750 114313566 111392795 108611748 106011466 103503356 101197122
4282A01197122k188722k071306k005389j821107j774269j688519j638560j490070
$$ 101197122 99008400 96937094 94931705 93110598 91336329 89647810 88009250 86519180
4274H6519180j523990j482250j345758j313270j255347j195527j170753j116360
$$ 86519180 84995190 83512940 82167182 80853912 79598565 78403038 77232285 76115925
4266G6115925j043318j028391r77185r03696r62934q04256q85162p99851p85315
$$ 76115925 75072607 74044216 73067031 72163335 71200401 70396145 69510983 68711132 67925817
4257F7925817p44112p43605p40005o08721o59907n96945o12420o01309n58935
$$ 67925817 67181705 66438100 65698095 65089374 64429467 63832522 63220102 62618793 62059858
4248F2059858o14521n69413n87082o73790n68923o25767n84274o36443o03646
$$ 62059858 61445337 60875924 60288842 59615052 59046129 58420362 57836088 57199645 56595999
4239E6595999n69189n90880n71326n76802n44891n87212n67570m94090n51629
$$ 56595999 56026810 55435930 54864604 54287802 53742911 53155699 52588129 52094039 51542410
4230E1542410m53219m84584m79199m35620m69031m13560l55270l82412l89171
$$ 51542410 51089191 50604607 50125408 49689788 49220757 48807197 48451927 48069515 47680344
4221D7680344l42222m02365l11093l25165k89893l36903k91504k56667k76182
$$ 47680344 47338122 46935757 46624664 46299499 46009606 45672703 45381199 45124532 44848350
4212D4848350k09311l00112k08550k18183k00819k29499k01184j91322j85687
$$ 44848350 44639039 44338927 44130377 43912194 43711375 43481876 43280692 43089370 42903683
4203D2903683k27042j21343j71197j48468j89597q8670j99406r7181j55550j44547
$$ 42903683 42676641 42555298 42384101 42235633 42046036 41957366 41757960 41660779 41505229 41360682
4193D1360682j55115j96656j77665j92265j49019k09150k60877k14704k15113
$$ 41360682 41205567 41008911 40831246 40638981 40489962 40280812 40019935 39805231 39590118
4184C9590118k48498k46208k61414k64386k76136k39588k49164k64152k56260
$$ 39590118 39341620 39095412 38833998 38569612 38293476 38053888 37804724 37540572 37284312
4175C7284312k34561k16374k41260k84585k37517k37753k56112j91003k40379
$$ 37284312 37049751 36833377 36592117 36307532 36070015 35832262 35576150 35385147 35144768
4166C5144768k18869j79301k77513k48044k70352k45095k48877k97904k52881
$$ 35144768 34925899 34746598 34469085 34221041 33950689 33705594 33456717 33158813 32905932
4157C2905932k90058k71933l16484k54548l44198l04949k61060l00501k23657
$$ 32905932 32615874 32343941 32027457 31772909 31428711 31123762 30862702 30562201 30338544
4148C0338544k29296j90305k22692k16884j86100j85500j76217j63917j64748
$$ 30338544 30109248 29918943 29696251 29479367 29293267 29107767 28931550 28767633 28602885
4139B8602885j49070p9622j33126n3065j22927k9451m6227l9155j838m0730k116
$$ 28602885 28453815 28374193 28241067 28188002 28065075 28035624 27989397 27950242 27948404 27907674 27905558
4128B7905558J1622K2425r708P983P2465N2160R7709J25370J58173J81062K17555
$$ 27905558 27917180 27939605 27929897 27937880 28010345 28062505 28160214 28285584 28443757 28624819 28842374
4117B8842374J98253K11832K66474K51476K30607K69254K55230K75104K90286
$$ 28842374 29040627 29252459 29518933 29770409 30001016 30270270 30525500 30800604 31090890
4108C1090890K92206K78913L85584L32041L58218L92312M18911M03278M17014
$$ 31090890 31383096 31662009 32047593 32379634 32737852 33130164 33549075 33952353 34369367
4099C4369367M20244L75262L72622L87013L92868L85404M04007M26309M47279
$$ 34369367 34789611 35164873 35537495 35924508 36317376 36702780 37106787 37533096 37980375
4090C7980375M16738M61760N24888N09241N43054N87375O22761O84087P42955
$$ 37980375 38397113 38858873 39383761 39893002 40436056 41023431 41646192 42330279 43073234
4081D3073234Q13999Q81134R46445R95876J080698J132878J254005J260698J378700
$$ 43073234 43887233 44768367 45714812 46710688 47791386 48924264 50178269 51438967 52817667
4072E2817667J431393J524705J613502J691989J805630J912100J985061K021342
$$ 52817667 54249060 55773765 57387267 59079256 60884886 62796986 64782047 66803389
4064F6803389K227500K267794K301842K380341K386689K412882K411425K308281
$$ 66803389 69030889 71298683 73600525 75980866 78367555 80780437 83191862 85500143
4056H5500143K326033K288862K244990K235345K326500K356461K443466K562886
$$ 85500143 87826176 90115038 92360028 94595373 96921873 99278334 101721800 104284686
4048A04284686K677846K937755L106592L395066L670358L987442M256642M500207
$$ 104284686 106962532 109900287 113006879 116401945 120072303 124059745 128316387 132816594
4040A32816594M758114M889023M981162M984803M712941M388167L737043K946410
$$ 132816594 137574708 142463731 147444893 152429696 157142637 161530804 165267847 168214257
4032A68214257K016136J189125N46334M2847k37215l22191l64480k98154j77545
$$ 168214257 170230393 171419518 171965852 172008699 171771484 171449293 171084813 170786659 170609114
4023A70609114J5574M30278O91552J010931J224336J475280J594184J687812J700876
$$ 170609114 170624688 171054966 171746518 172757449 173981785 175457065 177051249 178739061 180439937
4014A80439937J592108J418592J065344N98493Q1601m94960j065430j680680k303708
$$ 180439937 182032045 183450637 184515981 185114474 185196075 184701115 183635685 181955005 179651297
4005A79651297k808609l232920l520877l678125l674263l598632l447174l299241
$$ 179651297 176842688 173609768 170088891 166410766 162736503 159137871 155690697 152391456
3997A52391456l111870k887969k739301k623369k512624k613755k700214k853387
$$ 152391456 149279586 146391617 143652316 141028947 138516323 135902568 133202354 130348967
3989A30348967k946243l292742l482531l734327l954454m064937m234151m203036
$$ 130348967 127402724 124109982 120627451 116893124 112938670 108873733 104639582 100436546
3981A00436546m183361m217619m169906m011421l904088l714613l551243l359495
$$ 100436546 96253185 92035566 87865660 83854239 79950151 76235538 72684295 69324800
3973F9324800l155080k965440k776299k625190k383379k224926k154379j933318
$$ 69324800 66169720 63204280 60427981 57802791 55419412 53194486 51040107 49106789
3965D9106789j913161j789926j757995j615520j618332j500908j462411j382561
$$ 49106789 47193628 45403702 43645707 42030187 40411855 38910947 37448536 36065975
3957C6065975j315997j287117j224639j158234j115983j047010r80127r67012
$$ 36065975 34749978 33462861 32238222 31079988 29964005 28916995 27936868 26969856
3949B6969856r15340q65617q12050q04789p16911o54284o15945n57013n48603
$$ 26969856 26054516 25188899 24376849 23572060 22855149 22200865 21584920 21027907 20479304
3940B0479304m93718m22616m25827l94004l82596l63902l61818l18227l32433
$$ 20479304 19985586 19562970 19137143 18743139 18360543 17996641 17634823 17316596 16984163
3931A6984163l40544l41825l06652l89536l09885l71059l40334l51983l29243
$$ 16984163 16643619 16301794 15995142 15605606 15295721 14924662 14584328 14232345 13903102
3922A3903102l59957l72564l22709k61474l18679k65417j91049k86714k04112
$$ 13903102 13543145 13170581 12847872 12586398 12267719 12002302 11811253 11524539 11320427
3913A1320427k00939j97206j63442j73767j53665j64435j90933j58399k04462
$$ 11320427 11119488 10922282 10758840 10585073 10431408 10266973 10076040 9917641 9713179
3904I713179j87216j65726k26120k04864j63990j89955k25212j62772j98218j97969
$$ 9713179 9525963 9360237 9134117 8929253 8765263 8575308 8350096 8187324 7989106 7791137
3894G791137j98273j64890j52020k12098j70791j23658k00743j25062r5863j67208
$$ 7791137 7592864 7427974 7275954 7063856 6893065 6769407 6568664 6443602 6347739 6180531
3884F180531j01313j22347j19042o8930j42883r6045p8820r4844q2765j34742
$$ 6180531 6079218 5956871 5837829 5768899 5626016 5529971 5451151 5356307 5273542 5138800
3874E138800n4184m9118n3925j01850m8117p4840m5718n5390R228n5024p5107
$$ 5138800 5084616 5035498 4981573 4879723 4831606 4756766 4711048 4655658 4664886 4609862 4534755
3863D534755J8830n6756l6146k8351k8004l7341n564l8433m8849l8487J2749m631
$$ 4534755 4553585 4496829 4460683 4432332 4404328 4366987 4361423 4322990 4274141 4235654 4248403 4243772
3851D243772o5777l2592k3339k0894k7499l7939n0366m6129j353m1650j7230j3886
$$ 4243772 4177995 4145403 4122064 4101170 4073671 4035732 3985366 3939237 3937884 3896234 3879004 3865118
3839C865118l3742n0282q791n2631n637l6087l4027k3032j7902j3448j3827n5169
$$ 3865118 3831376 3781094 3772303 3719672 3714035 3677948 3643921 3620889 3602987 3589539 3575712 3520543
3827C520543M6727m0291m1787k2992K4914k0916k5820l6414J4695j3621k8165
$$ 3520543 3567270 3526979 3485192 3462200 3487114 3466198 3440378 3403964 3418659 3405038 3376873
3816C376873N753n2232J7364l3743o811k3128l157k2414J1265m9764J4386J0591
$$ 3376873 3382626 3330394 3347758 3314015 3307204 3284076 3280919 3258505 3269770 3220006 3234392 3244983
3804C244983k1910m5139l8790k4713L5228r691q019P688m108j8318P364k549L1554
$$ 3244983 3223073 3177934 3139144 3114431 3149659 3139968 3131949 3139637 3135529 3117211 3124575 3122026 3153580
3791C153580j9472j098M1808m3428n084K3984k33l0822j1469j556k5080n8709
$$ 3153580 3134108 3133010 3174818 3131390 3126306 3150290 3150057 3119235 3107766 3106210 3081130 3022421
3779C022421K679j6794k469k3897l0367L507j4904L7538n6344L0282j5180j4348
$$ 3022421 3025100 3008306 3005837 2981940 2951573 2955080 2940176 2977714 2921370 2951652 2936472 2922124
3767B922124K6588J311m9623K7140j0875j7343j3376n2710j760j5864k7631l1129
$$ 2922124 2948712 2950023 2900400 2927540 2916665 2899322 2885946 2833236 2831476 2815612 2787981 2756852
3755B756852m6198k8862N097m0222o4868l3696l2203k9521k19k9732J22m7806
$$ 2756852 2710654 2681792 2686889 2646667 2581799 2548103 2515900 2486379 2486160 2456428 2456550 2408744
3743B408744n8957j5602K676m9807k7377M970p5187o6230m7777j1137k5940m9941
$$ 2408744 2349787 2334185 2336861 2287054 2259677 2264647 2189460 2123230 2075453 2064316 2038376 1988435
3731A988435l4960m5784l2570m9017O321k3667o9799j6961l914r335l0347l0571
$$ 1988435 1953475 1907691 1875121 1826104 1832425 1808758 1738959 1721998 1718084 1708749 1678402 1647831
3719A647831K2157M341k7536j6709j1286l640m7671J5198k3220J1430m907l9832
$$ 1647831 1669988 1674329 1646793 1630084 1618798 1615158 1567487 1582685 1559465 1570895 1565988 1526156
3707A526156j8237O751j515j2574l4673k4102j544j4946k0117l6209r237J7300
$$ 1526156 1507919 1514670 1513155 1500581 1465908 1441806 1440262 1425316 1405199 1368990 1359753 1377053
3695A377053p0959L0734m6564o6386L3808k1234m6644M882m4911O385k1409l2943
$$ 1377053 1306094 1336828 1290264 1223878 1257686 1236452 1189808 1194690 1149779 1156164 1134755 1101812
3683A101812j6396k0615k6767l8053N5899o3348q384m427k8463j2270p565K5882
$$ 1101812 1085416 1064801 1038034 999981 1055880 992532 984148 979721 951258 938988 931423 957305
3671I57305k1980j4308j6495n582j0921K1991l7110o951N126k3183K2847m2695
$$ 957305 935325 921017 904522 898940 888019 910010 872900 865949 871075 847892 870739 828044
3659H28044k8018Q4k215r981k3443O103m1937R547k5997n585k5792K334l7335
$$ 828044 800026 800110 797895 787914 764471 770574 728637 738184 712187 706602 680810 683144 645809
3646F45809m861k9735p138m0146L0872o1237k9367p569l3987m8714N837M397j5351
$$ 645809 640948 611213 604075 563929 594801 533564 504197 496628 462641 413927 419764 424161 408810
3633D08810m5994l504j3690k9053k0705m1463K5161l0975L5090m3007j5770l7722
$$ 408810 362816 359312 345622 316569 295864 254401 279562 248587 283677 240670 224900 187178
3621A87178M0590j9038q769l2449m001l2511J0019m0400J8273l858m3347J934
$$ 187178 227768 208730 199961 167512 163511 131000 141019 100619 118892 115034 71687 73621
3609G3621j2601j900k3061n6913N7256N885k5331O955p2852Q648K2191l3048j7929
$$ 73621 61020 59120 36059 -20854 36402 42287 16956 23911 -48941 -40293 -18102 -51150 -69079
3596f9079k4851L8857o5628L5046j6781J2410m9503m6l1860O884J1516j9127j1157
$$ -69079 -93930 -55073 -120701 -85655 -102436 -90026 -139529 -139575 -171435 -164551 -153035 -172162 -183319
3583a83319m473l8449l002N556j5692L6402p2020L8668j9232M1379m3807K5628
$$ -183319 -187792 -226241 -229243 -223687 -239379 -202977 -274997 -236329 -255561 -214182 -257989 -232361
3571b32361k8743L7862k7321k5543J1461k9339p911R665l4244j4465M0463k1778
$$ -232361 -261104 -223242 -250563 -276106 -264645 -293984 -301895 -292230 -326474 -340939 -300476 -322254
3559c22254l5932O422l746K1708l8607L0892k1058l3883p501K9335j9838n677
$$ -322254 -358186 -351764 -355510 -333802 -372409 -341517 -362575 -396458 -403959 -374624 -394462 -400139
3547d00139J0313j350l6163l140J5309j2201K042J1863j4143R355j8139K6328
$$ -400139 -389826 -391176 -427339 -430479 -415170 -427371 -425329 -413466 -427609 -418254 -436393 -410065
3535d10065j9988j0496Q593J7789k8417k781m2453J1215J5705j0654J8575Q052
$$ -410065 -430053 -440549 -431956 -414167 -442584 -445365 -487818 -476603 -460898 -471552 -452977 -444925
3523d44925l54l0764K3507l4710j8476J0604j4997M509k0167L5935M735l278k0368
$$ -444925 -445279 -476043 -452536 -487246 -505722 -495118 -510115 -505606 -525773 -489838 -485103 -488381 -508749
3510e08749K768R116q997K1674o661l4449J7647j8190L3011m3273M7528k4842
$$ -508749 -505981 -496865 -505862 -484188 -490849 -525298 -507651 -525841 -492830 -536103 -488575 -513417
3498e13417K3214n3351K4099K6284k2559q135J8889p869j2063L3019p0470J5577
$$ -513417 -490203 -543554 -519455 -493171 -515730 -523865 -504976 -512845 -524908 -491889 -562359 -546782
3486e46782j8082k2979L7954L2750l4932M427j4607P015n34K9314l1541K646j5326
$$ -546782 -564864 -587843 -549889 -517139 -552071 -547644 -562251 -555236 -555770 -526456 -557997 -555351 -570677
3473e70677K2810k7098J8632J8571l5956K9776Q179l6019J4850J0638l0139N9294
$$ -570677 -547867 -574965 -556333 -537762 -573718 -543942 -535763 -571782 -556932 -546294 -576433 -517139
3461e17139l4598J7300j7153j6733K1022n3109M6934j9055J0031J8560j1744q697
$$ -517139 -551737 -534437 -551590 -568323 -547301 -600410 -553476 -572531 -562500 -543940 -555684 -564381
3449e64381J2059J1654j4770J1875l779j7417j0306M3739p396l2833L4238n505
$$ -564381 -552322 -540668 -555438 -543563 -547342 -564759 -575065 -531326 -538722 -571555 -537317 -542822
3437e42822q724k0919K3764k993l5592M9730k3094L2846k6984L9749m0424k677
$$ -542822 -551546 -572465 -548701 -551694 -587286 -537556 -560650 -527804 -554788 -515039 -555463 -558140
3425e58140L6068m8904K2508j329L1814j7293k1982J2717N2196m3631K2753k5357
$$ -558140 -522072 -570976 -548468 -549797 -517983 -535276 -557258 -544541 -492345 -535976 -513223 -538580
3413e38580J9537J2666k531K6111L232p622o750p114L9774k4799Q015R451K8390
$$ -538580 -519043 -506377 -508908 -482797 -479565 -487187 -493937 -501051 -461277 -486076 -478061 -468610 -440220
3400d40220j4434K5544k6105J2519J3800k6189K1612m6589L5220l4497O7155m9333
$$ -440220 -454654 -429110 -455215 -442696 -428896 -455085 -433473 -480062 -444842 -479339 -412184 -461517
3388d61517J7677l775L0360k4638J9397J4026K4168L101j2044L351K8255l741
$$ -461517 -443840 -447615 -417255 -441893 -422496 -408470 -384302 -381201 -393245 -389894 -361639 -365380
3376c65380N669o279P350K741M6484j6755K4125M769K9775N906q061P2018K3636
$$ -365380 -359711 -365990 -358640 -355899 -309415 -326170 -302045 -297276 -267501 -261595 -269656 -197638 -174002
3363a74002Q1825L0618J14296Q3499J24441O5681J13875J23043J93788J53360
$$ -174002 -92177 -61559 52737 136236 260677 326358 440233 563276 757064 910424
3353I10424J85652J40506K46951J88522K49488K86830K74741L69628M60816M78240
$$ 910424 1096076 1236582 1483533 1672055 1921543 2208373 2483114 2852742 3313558 3791798
3343C791798M71102N67865P10552P57876Q65264Q70154K13465J65368j19819m47286
$$ 3791798 4262900 4830765 5541317 6299193 7164457 8034611 8248076 8413444 8293625 7846339
3333G846339m03833l58033m43642l78318o76680n68728n23044m57544m25003m57184
$$ 7846339 7442506 7084473 6640831 6262513 5585833 5017105 4494061 4036517 3611514 3154330
3323C154330l88584m19098l76351l66504l22424k84250k39942k09758j71295j44750
$$ 3154330 2765746 2346648 1970297 1603793 1281369 997119 757177 547419 376124 231374
3313B31374j22163j03359r6652o6029k1963o9187m9781p2483o371k3308k7689
$$ 231374 109211 5852 -90800 -156829 -178792 -247979 -297760 -370243 -376614 -399922 -427611
3302d27611n4203j48m3961k4976R681q882j172n1935M86K1533k1463J7957p2911
$$ -427611 -481814 -481962 -525923 -550899 -541218 -550100 -551272 -603207 -602721 -581188 -602651 -584694 -657605
3289f57605j356P609j8078n043N879k366J0970q364j8332n804j702q751J8160
$$ -657605 -658961 -651352 -669430 -674473 -668594 -670960 -659990 -668354 -686686 -692490 -694192 -702943 -684783
3276f84783m0167L140J5010k3791J5695J3204l1205J0223k112j9034L6386l6481
$$ -684783 -724950 -721810 -706800 -730591 -714896 -701692 -732897 -722674 -724786 -743820 -707434 -743915
3264g43915K4314N273m2452J7909k9845K0231q452K4264k0150j11J3396m7159
$$ -743915 -719601 -714328 -756780 -738871 -768716 -748485 -756937 -732673 -752823 -752934 -739538 -786697
3252g86697M0746Q033k3135J0758J3945j0000K2472m5094J7000R767j0412j5498
$$ -786697 -745951 -737918 -761053 -750295 -736350 -746350 -723878 -768972 -751972 -742205 -752617 -768115
3240g68115J680K092j8252K0865P919m001k903k570j5262J927K3924o466o204
$$ -768115 -766435 -764343 -782595 -761730 -753811 -757812 -760715 -763285 -778547 -776620 -752696 -759162 -765366
3227g65366k0974j5156J7246m040k572J7029L2268n3838L1023l2043M5324p681
$$ -765366 -786340 -801496 -784250 -788290 -790862 -773833 -741565 -795403 -764380 -796423 -751099 -758780
3215g58780k3853K5475j0673j0741q663K2301J097j993k8331M1263J2485R162
$$ -758780 -782633 -757158 -767831 -778572 -787235 -764934 -763837 -765830 -794161 -752898 -740413 -731251
3203g31251m4682J2755R269J3163j5319j5359k9168K5388K6017j2203j1446l98
$$ -731251 -775933 -763178 -753909 -740746 -756065 -771424 -800592 -775204 -749187 -761390 -772836 -773234
3191g73234k3501M6913l0358N4975n9982K173M22J0114P486R322k9274M1456l1330
$$ -773234 -796735 -749822 -780180 -725205 -785187 -783014 -782592 -772478 -764992 -755670 -784944 -743488 -774818
3178g74818L873k6472J0972K9474l2882O374l815L332p173K851K879K639K3709
$$ -774818 -770945 -797417 -786445 -756971 -789853 -783479 -787294 -783962 -791135 -788284 -785405 -782766 -759057
3165g59057l6743K557K1921k4115p767O6041n6102J5078p214k5769K1553o793
$$ -759057 -795800 -793243 -771322 -795437 -803204 -737163 -793265 -778187 -785401 -811170 -789617 -796410
3153g96410k3544N6404K7624l4702l784m3232M8846k7225K5254J2292l8489L6155
$$ -796410 -819954 -763550 -735926 -770628 -774412 -817644 -768798 -796023 -770769 -758477 -796966 -760811
3141g60811l9304P734K9631k6506j2082q645J8094J5654j4920k6703J7293K2765
$$ -760811 -800115 -792381 -762750 -789256 -801338 -809983 -791889 -776235 -791155 -817858 -800565 -777800
3129g77800j7057J3303j0621P831l0822M1197K209k859k899m547l14P274j2718
$$ -777800 -794857 -781554 -792175 -784344 -815166 -773969 -771760 -774619 -777518 -782065 -782379 -775105 -787823
3116g87823L8042k1280l9376K7847L574k2004J6014L1941m7670J7121M4845j9025
$$ -787823 -749781 -771061 -810437 -782590 -779016 -801020 -785006 -753065 -800735 -783614 -738769 -757794
3104g57794J3645j0210j1789J6747l3028J2892L2765J1358n9127j6283J2776L2416
$$ -757794 -744149 -754359 -766148 -749401 -782429 -769537 -736772 -725414 -784541 -800824 -788048 -755632
3092g55632m8984n855L3449j1947m831J4466p274n6437L5735K6380j0776m972
$$ -755632 -804616 -810471 -777022 -788969 -793800 -779334 -786608 -843045 -807310 -780930 -791706 -796678
3080g96678K239q605l0131M483K6766j072J1414l5957j3738r03K8858k4726L0488
$$ -796678 -794439 -803044 -833175 -828692 -801926 -802998 -791584 -827541 -841279 -842182 -813324 -838050 -807562
3067h07562n001J6581K4692n0184L745K0005n70j6145j4417j6338J9636J5349
$$ -807562 -812563 -795982 -771290 -821474 -817729 -797724 -798294 -814439 -828856 -845194 -825558 -810209
3055h10209k6450K7005k5331K5368m75m115j2928L3812n3901J3856J4102J8809
$$ -810209 -836659 -809654 -834985 -809617 -810092 -814207 -827135 -793323 -847224 -833368 -819266 -800457
3043h00457o620P076k8602r906Q527K7380r434o749J3630n921O800l7400K1130
$$ -800457 -807077 -800001 -828603 -838509 -829982 -802602 -812036 -818785 -805155 -811076 -804276 -841676 -820546
3030h20546Q020j1108J4354M928K3784l0597J1246L67m385l7891L0779j947j318
$$ -820546 -812526 -823634 -809280 -804352 -780568 -811165 -799919 -799552 -803937 -841828 -811049 -812996 -814314
3017h14314L820J624k2575J4978k8127L5556K1892l2370k408m822o490p79K0272
$$ -814314 -810494 -808870 -831445 -816467 -844594 -809038 -787146 -819516 -821924 -826746 -833236 -834015 -813743
3004h13743k1477K8934l2977L3221j5047o252M5528m4003k0351K5902j54l757
$$ -813743 -835220 -806286 -839263 -806042 -821089 -827341 -781813 -825816 -846167 -820265 -820419 -824176
2992h24176j1827K565k1726L6381k9916J8684j6020p438M6356p9009M7208P503
$$ -824176 -836003 -833438 -855164 -818783 -848699 -830015 -846035 -853473 -807117 -886126 -838918 -831415
2980h31415j5762J9394k1514K1573J6651l3542L2976l4349M5388k4188n0517M7472
$$ -831415 -847177 -827783 -849297 -827724 -811073 -844615 -811639 -845988 -800600 -824788 -875305 -827833
2968h27833j440l846P587q845J2878J4058l4705L3593k1241j0717L711N931P338
$$ -827833 -829273 -833119 -825532 -834377 -821499 -807441 -842146 -808553 -829794 -840511 -836800 -830869 -823531
2955h23531l1472J005J5816j742L221l3835L7733j7499j2049J9038k3825J6007
$$ -823531 -855003 -853998 -838182 -839924 -836703 -870538 -832805 -850304 -862353 -843315 -867140 -851133
2943h51133L8828o4401M0500P655n5478N2743j8534J3740L3035m7759J0924j5762
$$ -851133 -812305 -876706 -836206 -828551 -884029 -831286 -849820 -836080 -803045 -850804 -839880 -855642
2931h55642M3289m6071J8681l496M174j8560R648j0467K4360r514K2670j9592
$$ -855642 -812353 -858424 -839743 -843239 -839065 -857625 -847977 -858444 -834084 -843598 -820928 -840520
2919h40520J5640k9555L8665j8049k4425l3282L4396M3569k5276K7176m8333L8421
$$ -840520 -824880 -854435 -815770 -833819 -858244 -891526 -857130 -813561 -838837 -811661 -859994 -821573
2907h21573k055M27M059j5169l0156N1882k2087k1774J3082Q477r279j9224Q05
$$ -821573 -823628 -823201 -819142 -834311 -864467 -812585 -834672 -856446 -843364 -834887 -844166 -863390 -862585
2894h62585k473J1698K0269k1824J437J3214L3304l5088L17j0797J710j552N735
$$ -862585 -865058 -853360 -833091 -854915 -853478 -840264 -806960 -842048 -841731 -852528 -850818 -852370 -846635
2881h46635j8194O303K429m811K9820l6119K7228k335k3129k673R587l948N723
$$ -846635 -864829 -858526 -856097 -860908 -831088 -867207 -839979 -842314 -865443 -868116 -858529 -862477 -856754
2868h56754r659O824L575j1478L7966j0848K4736o4575M0367M879j6931L799K9787
$$ -856754 -866413 -859589 -856014 -867492 -829526 -840374 -815638 -880213 -839846 -834967 -851898 -848099 -818312
2855h18312j3276m8238L6938K2806j9708J6985K7255m3194j5299j084j6237P187
$$ -818312 -831588 -879826 -842888 -820082 -839790 -822805 -795550 -838744 -854043 -855127 -871364 -864177
2843h64177K8728n0885Q90N6387m3972M5647n952k7234k2568J9102j4666O3597
$$ -864177 -835449 -886334 -885444 -829057 -873029 -827382 -833334 -860568 -883136 -864034 -878700 -815103
2831h15103j4741j3148k3555J9469Q010j8472L4724l2000j9953K9141L215L707
$$ -815103 -829844 -842992 -866547 -847078 -839068 -857540 -822816 -854816 -874769 -845628 -842413 -838706
2819h38706r205k3854p10k1618K9881K3840Q44q076j8081K0830K571m6178M0133
$$ -838706 -847911 -871765 -872475 -894093 -864212 -840372 -839528 -847604 -865685 -844855 -842284 -888462 -848329
2806h48329k2702J2998j0975O728j1769R122K7597l9714N0624n7426L0183j2444
$$ -848329 -871031 -858033 -869008 -862280 -874049 -864927 -837330 -877044 -826420 -883846 -853663 -866107
2794h66107M4994n8776M392R582Q296J7987l0247J4487j1088O063J2264j8456
$$ -866107 -821113 -879889 -875497 -865915 -857619 -839632 -869879 -855392 -866480 -860417 -848153 -866609
2782h66609L9270j4790j3502J0824k5304K161R424j0577l833K6394K321j2469
$$ -866609 -827339 -842129 -855631 -844807 -870111 -867950 -858526 -869103 -872936 -846542 -844221 -856690
2770h56690j4690M0395o5582L2625L2156j6413k7941J1379k871J2895j805J7899
$$ -856690 -871380 -830985 -896567 -863942 -831786 -848199 -876140 -864761 -867632 -854737 -856542 -838643
2758h38643m9853K3961J2502K5043l6463q211J8630q819n068L685J3840M82l539
$$ -838643 -888496 -864535 -852033 -826990 -863453 -871664 -853034 -861853 -866921 -863236 -849396 -848914 -852453
2745h52453k0608J3550p905O894J0119r207j1524K6499l7388L1332J7209k8906
$$ -852453 -873061 -859511 -867416 -860522 -850403 -859610 -871134 -844635 -882023 -850691 -833482 -862388
2733h62388P449M2831n0999j6349M5794k4415K2670n715k4876K0176j3435N020
$$ -862388 -854939 -812108 -863107 -879456 -833662 -858077 -835407 -841122 -865998 -845822 -859257 -854237
2721h54237q20m5478M0735m144j8132J0647J3299j2978l141O093k0402J3989k3447
$$ -854237 -855057 -900535 -859800 -863944 -882076 -871429 -858130 -871108 -874249 -868156 -888558 -874569 -898016
2708h98016N2694l5442K516k511M2879k6611L27K854j9005m411J2456j3761N3857
$$ -898016 -845322 -880764 -878248 -880759 -837880 -864491 -864164 -861310 -880315 -884726 -872270 -886031 -832174
2695h32174n6314K364K7264l011L24O039j5665J836N856j5247K6814k64M262j2804
$$ -832174 -888488 -886124 -858860 -861871 -861547 -855508 -871173 -869337 -863481 -878728 -851914 -852178 -847916 -860720
2681h60720q038K0948n0260O3616l6137j6607K1714K8080m950J4699j3145r668
$$ -860720 -868758 -847810 -898070 -834454 -870591 -887198 -865484 -837404 -842354 -827655 -840800 -850468
2669h50468j2496R200j8229O105m2502J9788L1553l4696L9098j5761M2321n0560
$$ -850468 -862964 -853764 -871993 -865888 -908390 -888602 -857049 -891745 -852647 -868408 -826087 -876647
2657h76647L0586l8687O424p564Q001q236K2267k697q398l544j368O848J1029
$$ -876647 -846061 -884748 -878324 -885888 -877887 -886123 -863856 -866553 -874951 -878495 -879863 -873015 -861986
2644h61986j0072r375J7621p573j6043J5859R713L0861j3845k3182J2894O670
$$ -861986 -872058 -881433 -863812 -871385 -887428 -871569 -861856 -830995 -844840 -868022 -855128 -848458
2632h48458o289l628m4080M2081K15K7286p8417K8000J1778k4206N0098k4721
$$ -848458 -854747 -858375 -902455 -860374 -860159 -832873 -911290 -883290 -871512 -895718 -845620 -870341
2620h70341M173q424Q166N868j0652k4413N3398j3147k974l8560L3602K5191l9608
$$ -870341 -866168 -874592 -866426 -860558 -871210 -895623 -842225 -855372 -858346 -896906 -863304 -838113 -877721
2607h77721J8547j922j2756L319j425J3859J2823k8468J6472l5173J3339J1770
$$ -877721 -859174 -861096 -873852 -870533 -871958 -858099 -845276 -873744 -857272 -892445 -879106 -867336
2595h67336j6779L1083k3065l103K4073k6251m177J4394j4430K9068k1316l0383
$$ -867336 -884115 -853032 -876097 -879200 -855127 -881378 -885555 -871161 -885591 -856523 -877839 -908222
2583i08222L8682j0554K369l68K4439j6386j0489K1433j608n019k1182l78K9742
$$ -908222 -869540 -880094 -877725 -878093 -853654 -870040 -880529 -859096 -860704 -865723 -886905 -887283 -857541
2570h57541j5731j0238J3207j8328K3561R365j7646L193j7131J1557k3450K1309
$$ -857541 -873272 -883510 -870303 -888631 -865070 -855705 -873351 -870158 -887289 -875732 -899182 -877873
2558h77873M119j993n334P627r299p866O223j30j2405J5708j8018K0882K416K8589
$$ -877873 -873754 -875747 -881081 -873454 -882753 -890619 -884396 -884526 -896931 -881223 -899241 -878359 -875943 -847354
2544h47354o859l2526L4195k2440j0310J1167k8374M4454k3982J5528k8767K1651
$$ -847354 -854213 -886739 -852544 -874984 -885294 -874127 -902501 -858047 -882029 -866501 -895268 -873617
2532h73617k7958M1811l4143L0532o7346Q5287k8655j5569K5527k4852Q470O602
$$ -873617 -901575 -859764 -893907 -863375 -930721 -845434 -874089 -889658 -864131 -888983 -880513 -873911
2520h73911J3171l0600O140K0048l2696L2456k8006J6324j0988K8811m979k853
$$ -873911 -860740 -891340 -885200 -865152 -897848 -865392 -893398 -877074 -888062 -859251 -864230 -867083
2508h67083j7507O4057l8494l2820M0155m9294K0404l4446N4638m4518L2063J5975
$$ -867083 -884590 -820533 -859027 -891847 -851692 -900986 -880582 -915028 -860390 -904908 -872845 -856870
2496h56870k1974p309K5547j9944J8835m1124l833M1064l3722J5331J8269p619
$$ -856870 -878844 -886153 -860606 -880550 -861715 -902839 -906672 -865608 -899330 -883999 -865730 -873349
2484h73349o542n486K6807r194j2442O728j711l762k2968L1687l1536J4444J3016
$$ -873349 -879891 -885377 -858570 -867764 -880206 -873478 -875189 -878951 -901919 -870232 -901768 -887324 -874308
2471h74308n796k5751M4350l8623Q311L3487j7551J343k4193J8649R804j0977
$$ -874308 -880104 -905855 -861505 -900128 -891817 -858330 -875881 -874538 -898731 -880082 -870278 -881255
2459h81255J544k2317K4770j1808M0127m8934L807o158o289J8165K5584j8594
$$ -881255 -879711 -902028 -877258 -889066 -848939 -897873 -894066 -900224 -906513 -888348 -862764 -881358
2447h81358M250N241P900m7232L4264m1010L0817J1022p988j4658O494K8684k0457
$$ -881358 -877108 -871867 -863967 -911199 -876935 -917945 -887128 -876106 -884094 -898752 -892258 -863574 -884031
2434h84031K1210j1420l9250K2793r86J0643N556K9480k8528K2649l7509q926
$$ -884031 -862821 -874241 -913491 -890698 -891684 -881041 -875485 -846005 -874533 -851884 -889393 -898319
2422h98319J0364J6946l3217L2570l5515J5542N126j580k3112K549K7767k4487
$$ -898319 -887955 -871009 -904226 -871656 -907171 -891629 -886503 -888083 -911195 -908646 -880879 -905366
2410i05366L8843k6259M142J7537q083K4724p23l0777L95K8195k6907l445R397
$$ -905366 -866523 -892782 -888640 -871103 -879186 -854462 -855185 -885962 -885567 -857372 -884279 -887724 -878327
2397h78327k1080J8362k0883R910J2069r79K3286k9703L0382o521l739m180j1477
$$ -878327 -899407 -881045 -901928 -892018 -879949 -880928 -857642 -887345 -856963 -863484 -867223 -871403 -882880
2384h82880O332M5606o6671J9330j5037k57R453J5439O617j6804J1623J547k6379
$$ -882880 -876548 -830942 -897613 -878283 -893320 -893577 -884124 -868685 -862068 -878872 -867249 -865702 -892081
2371h92081k7133J3329L9463j5865m957o695L648l896L0764k8801J020J5596M918
$$ -892081 -919214 -905885 -866422 -882287 -887244 -893939 -890291 -894187 -863423 -892224 -891204 -875608 -870690
2358h70690j1158k2696L6122J1467l4481M553j184j4360L4445l5250q743L7303
$$ -870690 -881848 -904544 -868422 -856955 -891436 -886883 -888067 -902427 -867982 -903232 -911975 -874672
2346h74672r359m358L2295r532k2642k2010O201j2696J6279K7982k9387l1907
$$ -874672 -884031 -888389 -856094 -865626 -888268 -910278 -904077 -916773 -900494 -872512 -901899 -933806
2334i33806N8388k9402K8591k6069K7322m0731J474L3932l361l274K3065k2898
$$ -933806 -875418 -904820 -876229 -902298 -874976 -915707 -914233 -880301 -883662 -886936 -863871 -886769
2322h86769J1749k7723j7175K9158P134j8082k294K4689k5316j2641J9974l8345
$$ -886769 -875020 -902743 -919918 -890760 -883626 -901708 -904002 -879313 -904629 -917270 -897296 -935641
2310i35641M3348J0479k6935Q854M192J4606K414R218k3739j4010j1905J2265
$$ -935641 -892293 -881814 -908749 -899895 -895703 -881097 -878683 -869465 -893204 -907214 -919119 -906854
2298i06854K8688l598K7576m3372m676J6201j8795j4678N0991k2137j5584M1982
$$ -906854 -878166 -881764 -854188 -897560 -902236 -886035 -904830 -919508 -868517 -890654 -906238 -864256
2286h64256m1730K0356K5973l4434O260J1766l0002J0976J4877K6617l7101l2197
$$ -864256 -905986 -885630 -859657 -894091 -887831 -876065 -906067 -895091 -880214 -853597 -890698 -922895
2274i22895O0499j8033k1389L486K1339j7733K3992k8148K231J5758q726m894
$$ -922895 -862396 -880429 -901818 -898332 -876993 -894726 -870734 -898882 -896651 -880893 -889619 -894513
2262h94513Q689l5995K3630R687J3896k6191K789J3086l5233M1924j5584K477
$$ -894513 -885824 -921819 -898189 -888502 -874606 -900797 -898008 -884922 -920155 -878231 -893815 -891338
2250h91338J971j6410L3146M562p778m1773L6887j9455J519L334Q069n369K791
$$ -891338 -889367 -905777 -872631 -868069 -875847 -917620 -880733 -900188 -898669 -895335 -887266 -892635 -889844
2237h89844K0330k551p435k3897K9777n2089N4381n129l5664J7631R12j9384O9965
$$ -889844 -869514 -872065 -879500 -903397 -873620 -925709 -871328 -876457 -912121 -894490 -893578 -912962 -842997
2224h42997o7539Q427l806q215K7404J5473n260l0273L080n182Q841j87j3696
$$ -842997 -910536 -902109 -905915 -914130 -886726 -871253 -876513 -906786 -903706 -908888 -900047 -900234 -913930
2211i13930J0419j6893L2031k0303M4019j1894q801J014j4634j3948n890L6183
$$ -913930 -903511 -920404 -888373 -908676 -864657 -876551 -885352 -884338 -898972 -912920 -918810 -882627
2199h82627J837q435N171k471k3542M54N600K480K291k1693L4328p446J2389l4006
$$ -882627 -880790 -889225 -884054 -886525 -910067 -909613 -904013 -901533 -899242 -920935 -886607 -894053 -881664 -915670
2185i15670L7059j7553J3677k3826K7067l5219j820J5336m516J2779p207K5471
$$ -915670 -878611 -896164 -882487 -906313 -879246 -914465 -916285 -900949 -905465 -892686 -899893 -874422
2173h74422q337K734j0087M803J921j3030k7395L0592K2144k4771j687P828J5896
$$ -874422 -882759 -880025 -890112 -885309 -883388 -896418 -923813 -893221 -871077 -895848 -897535 -889707 -873811
2160h73811m61j9169K6979k7203K6015m0160J3024L0947p574k6343L4427m7381
$$ -873811 -874272 -893441 -866462 -893665 -867650 -907810 -894786 -863839 -871413 -897756 -863329 -910710
2148i10710J9475J308j1323J7247l1996L2812l715j1781L0400l0126L4477l4005
$$ -910710 -891235 -889927 -901250 -884003 -915999 -883187 -886902 -898683 -868283 -898409 -863932 -897937
2136h97937J4205J9J43j7356J8355J9827n9286J3006P356j065J4201k795o866
$$ -897937 -883732 -883713 -883570 -900926 -882571 -862744 -922030 -909024 -901668 -902733 -888532 -891327 -898193
2123h98193K4508o1036R4317n4741J029j05j875M2302l5045J259Q013j2360k5819
$$ -898193 -873685 -934721 -840404 -895145 -894116 -894221 -896096 -853794 -888839 -887580 -879567 -891927 -917746
2110i17746P425j3876O1335k4960J9274k5454K7551m8815J1115l707M0121j7708
$$ -917746 -910321 -924197 -862862 -887822 -868548 -894002 -866451 -915266 -904151 -907858 -867737 -885445
2098h85445n17j7677p596J9982j9799L6899l3109K3529k16n285K056k4828L5526
$$ -885445 -885962 -903639 -911235 -891253 -911052 -874153 -907262 -883733 -883949 -889234 -887178 -912006 -876480
2085h76480k4007m8894L5900K5977J4226n1600J7732K5022m4690K1329R880P211
$$ -876480 -900487 -949381 -913481 -887504 -873278 -924878 -907146 -882124 -926814 -905485 -895605 -888394
2073h88394k3559L3393j0684k0548L6938k9321K6150j4239k3831J7785l1588L1809
$$ -888394 -911953 -878560 -889244 -909792 -872854 -902175 -876025 -890264 -914095 -896310 -927898 -896089
2061h96089Q567K5595m2133M4553n2956n82K7960m254k0551n439Q764m023j0945
$$ -896089 -887522 -861927 -904060 -859507 -912463 -913045 -885085 -889339 -909890 -915329 -906565 -910588 -921533
2048i21533K4522J7726l376j8571l3427M1288J1667l5061K7038K728j0264J7319
$$ -921533 -897011 -879285 -882661 -901232 -934659 -893371 -881704 -916765 -889727 -886999 -897263 -879944
2036h79944l4356L5985j7777k1186L3079L82m1046M9476m414j6966k7700O5444
$$ -879944 -914300 -878315 -896092 -917278 -884199 -883817 -924863 -875387 -879801 -896767 -924467 -859023
2024h59023m778k9244k2974j4678J9105O2232k1110l5654n501K3521k1249n428
$$ -859023 -863801 -893045 -916019 -930697 -911592 -849360 -870470 -906124 -911625 -888104 -909353 -914781
2012i14781K5989k370n567P2Q9j560j2254K2323k9794K9267j4876K3864p734J741
$$ -914781 -888792 -891162 -896729 -896657 -896568 -898128 -910382 -888059 -917853 -888586 -903462 -879598 -887332 -885591
1998h85591k1109K1729J3375n2221K9196o105L5028m325J1527l8703P432J1004
$$ -885591 -906700 -884971 -871596 -923817 -894621 -900726 -865698 -870023 -858496 -897199 -889767 -878763
1986h78763j572J4173k3998O273k9905N6360l0300K6117m5973M700J2678q704
$$ -878763 -880335 -866162 -890160 -883887 -913792 -857432 -887732 -861615 -907588 -902888 -890210 -898914
1974h98914k1979L4073m724J8428l7720J783K3921O185j8745J3246q568M029M868
$$ -898914 -920893 -886820 -891544 -873116 -910836 -909053 -885132 -878947 -897692 -884446 -893014 -888985 -884117
1961h84117N37p225N753K1494j4431L0019m9557M0583p0520L9909j1271J003J2789
$$ -884117 -883580 -890805 -885052 -863558 -877989 -847970 -897527 -856944 -927464 -887555 -898826 -897823 -885034
1948h85034k0150j0084Q340M0887m4011K4302j5372m402M6245l6753K1210q020
$$ -885034 -905184 -915268 -906928 -866041 -910052 -885750 -901122 -905524 -859279 -896032 -874822 -882842
1936h82842o719k032K5800l4484k099K7447l4035J8397O439j1980m4567N8136
$$ -882842 -889561 -891593 -865793 -900277 -902376 -874929 -908964 -890567 -884128 -896108 -940675 -882539
1924h82539j3594P752p918m2761J4402N6378m9196K6899J0746m7529M0476l1430
$$ -882539 -896133 -888381 -896299 -939060 -924658 -868280 -917476 -890577 -879831 -927360 -886884 -918314
1912i18314L4427j1764J1336k893k2701K3632o73p366R323l9525O7176l4149R793
$$ -918314 -883887 -895651 -884315 -887208 -909909 -886277 -886950 -894316 -884993 -924518 -857342 -891491 -881698
1899h81698k4606K9113p081l2088M8361J194l8859K9266r362o754k720j4920L0509
$$ -881698 -906304 -877191 -884272 -916360 -867999 -866805 -905664 -876398 -885760 -892514 -895234 -910154 -879645
1886h79645l0770j3254M0858N072k1398K8136l8148J7125L048j0919q837K2238
$$ -879645 -910415 -923669 -882811 -877739 -899137 -871001 -909149 -892024 -888976 -899895 -908732 -886494
1874h86494r015R680K4346k1334K1312l8865O347M2722n2933K3352j9225n8318
$$ -886494 -895509 -885829 -861483 -882817 -861505 -900370 -894023 -851301 -904234 -880882 -900107 -958425
1862i58425P9363O513k7238L3150k0093p180j4365L8906j7306j7912J9699l0325
$$ -958425 -879062 -872549 -899787 -866637 -886730 -893910 -908275 -869369 -886675 -904587 -884888 -915213
1850i15213J9697M0565l9012K0911j4079k113k4779L0881J6996j7010K238M048
$$ -915213 -895516 -854951 -893963 -873052 -887131 -889244 -914023 -883142 -866146 -883156 -880918 -876870
1838h76870m1642J8933j6081K0208Q256j843j3469m924J7016j5260J5720j2797
$$ -876870 -918512 -899579 -915660 -895452 -887196 -889039 -902508 -907432 -890416 -905676 -889956 -902753
1826i02753j3336p923L3434n2176M5898J1341l5618N5496l0927N554J4287J147
$$ -902753 -916089 -924012 -890578 -942754 -896856 -885515 -921133 -865637 -896564 -891010 -876723 -875576
1814h75576n4364J740M5363k1233K226o220J3377k851j3122M3124m026l2106O596
$$ -875576 -929940 -928200 -882837 -904070 -901844 -908064 -894687 -897538 -910660 -867536 -871562 -903668 -897072
1801h97072K4352k4023Q360R009k5853L403K3083j7870m2597O9975P710o6132
$$ -897072 -872720 -896743 -888383 -879374 -905227 -901824 -878741 -896611 -939208 -869233 -861523 -927655
1789i27655J7703j1077j2091M5337k4543J7951K8378p888k1253r02R794M767m0106
$$ -927655 -909952 -921029 -933120 -887783 -912326 -894375 -865997 -873885 -895138 -896040 -886246 -881479 -921585
1776i21585M7756l7150K3355m860j4110k797L9434m0903L1121k2551K3209l3903
$$ -921585 -873829 -910979 -887624 -892484 -906594 -909391 -869957 -910860 -879739 -902290 -879081 -912984
1764i12984J6160K3699m2237Q173J3247O374O335j0562O075L9130l6997k1573
$$ -912984 -896824 -873125 -915362 -907189 -893942 -887568 -881233 -891795 -885720 -846590 -883587 -905160
1752i05160r532K7172j0716J6116J0787l894n090l3647K1582j2921L6368k7104
$$ -905160 -914692 -887520 -898236 -882120 -871333 -875227 -880317 -913964 -892382 -905303 -868935 -896039
1740h96039j7501K3255O4396p5906J779q018J0578L323j6029L5412q271m397J7961
$$ -896039 -913540 -890285 -825889 -901795 -900016 -908034 -897456 -894133 -910162 -874750 -883021 -887418 -869457
1727h69457m5213L0914L082m1400J1782L7488N098j2742j60L285k5394J2553k6061
$$ -869457 -914670 -883756 -880674 -922074 -910292 -872804 -867706 -880448 -880608 -877323 -902717 -890164 -916225
1714i16225p328M0386l0507K3270k105k0891J4088J5422j7134k7046L4548j1820
$$ -916225 -923553 -883167 -913674 -890404 -892509 -913400 -899312 -883890 -901024 -928070 -893522 -905342
1702i05342O658l3429J9319K5005k6960M5536J0584k2867J2797k6365J2153l8454
$$ -905342 -898684 -932113 -912794 -887789 -914749 -869213 -858629 -881496 -868699 -895064 -882911 -921365
1690i21365L9918n759K1127k8952J5451q427J2566j6083j2426J283L282J3821
$$ -921365 -881447 -887206 -866079 -895031 -879580 -888007 -875441 -891524 -903950 -902667 -899385 -885564
1678h85564K1486l4910k393J6290j9138p063K4431J4368j0299J925l7714P558
$$ -885564 -864078 -898988 -901381 -885091 -904229 -911292 -886861 -872493 -882792 -880867 -918581 -911023
1666i11023M0502j605J5620l0550p997J8059k6270J2118J1502j5862K6388j8980
$$ -911023 -870521 -872126 -856506 -887056 -895053 -876994 -903264 -891146 -879644 -895506 -869118 -888098
1654h88098J1172M025j8170J5703l0817J6835j3320J5049j0699J4296J9945n1222
$$ -888098 -876926 -872901 -891071 -875368 -906185 -889350 -902670 -887621 -898320 -884024 -864079 -915301
1642i15301M3565k9414j706M951q57K322L9178j9152r883r852r325J6909P320
$$ -915301 -871736 -901150 -902856 -897905 -898762 -896440 -857262 -876414 -886297 -896149 -905474 -888565 -881245
1629h81245K3137m1997K8801j0134R937K1672k4225l3625M5318m4144j8543K5341
$$ -881245 -858108 -900105 -871304 -881438 -871501 -849829 -874054 -907679 -862361 -906505 -925048 -899707
1617h99707J7157o540j2957K5275r314q493P86O805K0217m8744K2637J6575j3285
$$ -899707 -882550 -889090 -902047 -876772 -886086 -894579 -893793 -886988 -866771 -915515 -892878 -876303 -889588
1604h89588l9412L1512j0616N4090n1165j1025M3256k2163k4214j7996J2534N6521
$$ -889588 -929000 -897488 -908104 -854014 -905179 -916204 -872948 -895111 -919325 -937321 -924787 -868266
1592h68266j4920M054O993Q95l1851L2483M138k0409K6911l9448j2132J5303n956
$$ -868266 -883186 -879132 -872139 -871244 -903095 -870612 -866474 -886883 -859972 -899420 -911552 -896249 -902205
1579i02205J9372j3993j2759L0860j1878J2626k347l308n054o99k9673J4284L1093
$$ -902205 -882833 -896826 -909585 -878725 -890603 -877977 -880324 -883632 -888686 -889385 -919058 -904774 -873681
1566h73681O014l2385j954Q663j4869J1043j465j0274k407J6835K518N51l803
$$ -873681 -867667 -900052 -902006 -893343 -908212 -897169 -898634 -908908 -911315 -894480 -891962 -891411 -895214
1553h95214O411j4030K720M4814r201l9470L9922k6103J4919k2231j0753K1150
$$ -895214 -888803 -902833 -900113 -855299 -864500 -903970 -864048 -890151 -875232 -897463 -908216 -887066
1541h87066j6225J2908j4654l517K3186j7028J4394P704l31Q84M290k1213K8420
$$ -887066 -903291 -890383 -905037 -908554 -885368 -902396 -888002 -880298 -880629 -879745 -875455 -896668 -868248
1528h68248J3140n3716J8224j7448j0790K5294K0528p79j1190K657l7472K460
$$ -868248 -855108 -908824 -890600 -908048 -918838 -893544 -873016 -873795 -884985 -882328 -919800 -917340
1516i17340M3026o0643O1708k7366J0319K1019k0659J1387j5896k908M0712m6924
$$ -917340 -874314 -934957 -873249 -900615 -890296 -869277 -889936 -878549 -894445 -897353 -856641 -903565
1504i03565m834M6517j8571k4321J0835q86J8260l1602J8238J7917m6092L4362
$$ -903565 -908399 -861882 -880453 -904774 -893939 -894825 -876565 -908167 -889929 -872012 -918104 -883742
1492h83742k1774R631m978K1718k2615L6979l6733K3159k3110J5630j6567Q61
$$ -883742 -905516 -895885 -900863 -879145 -901760 -864781 -901514 -878355 -901465 -885835 -902402 -901541
1480i01541j491K4871k5911j670k207k374O6820p5758M7085l9258O324j666N8027
$$ -901541 -903032 -878161 -904072 -905742 -907949 -910323 -843503 -919261 -872176 -911434 -905110 -906776 -848749
1467h48749l0438j5768l2408J4341L8532j6884M212J2984O72l8325m272Q921J5543
$$ -848749 -879187 -894955 -927363 -913022 -874490 -891374 -887162 -874178 -873506 -911831 -916103 -907182 -891639
1454h91639K428j4379K5921P639l4697K869j356K9059k1138P540j5515J1426m60
$$ -891639 -889211 -903590 -877669 -870030 -904727 -901858 -903214 -874155 -895293 -887753 -903268 -891842 -892302
1441h92302j0m77M6065m0318J2029j6127k4168K4907j6441L6498L416j1531K3743
$$ -892302 -892312 -892789 -846724 -887042 -875013 -891140 -915308 -890401 -906842 -870344 -866928 -878459 -854716
1428h54716j3979k9609K556K9283n5580L3131k7518J0238o82K8412j1294o773
$$ -854716 -868695 -898304 -895748 -866465 -922045 -888914 -916432 -906194 -906876 -878464 -889758 -896531
1416h96531J0240l434Q583K3165m1478L972j9104L667j97N4997k8411j5322K2476
$$ -896531 -886291 -889725 -881142 -857977 -899455 -895483 -914587 -910920 -911117 -856120 -884531 -899853 -877377
1403h77377l7192J0873J9939L715J500K709l2649K625o872K0929O754K0345l7150
$$ -877377 -914569 -903696 -883757 -880042 -878542 -875833 -908482 -905857 -912729 -891800 -885046 -864701 -901851
1390i01851M230M476J174J7732n7825M4701k3333l708J1123J2063j9468J3712
$$ -901851 -897621 -893145 -891971 -874239 -932064 -887363 -910696 -914404 -903281 -891218 -910686 -896974
1378h96974L4388m8713j432M2379m0179J9810l7054M1971k8076R079L6456l2365
$$ -896974 -862586 -911299 -912731 -870352 -910531 -890721 -927775 -885804 -913880 -904801 -868345 -900710
1366i00710K2837q678K1219Q584n2031M0354J1008j4675j0635r841n740J2737
$$ -900710 -877873 -886551 -865332 -856748 -908779 -868425 -857417 -872092 -882727 -892568 -898308 -885571
1354h85571l0144J1542J0808n057L2048m8273L9326L232R714n3772j4441M5161
$$ -885571 -915715 -904173 -893365 -898422 -866374 -914647 -875321 -872089 -862375 -916147 -930588 -885427
1342h85427K0102k0138K1145l2130K8021m8569K2388J8606l198J5387l3218o689
$$ -885427 -865325 -885463 -864318 -896448 -868427 -916996 -894608 -876002 -879200 -863813 -897031 -903720
1330i03720O362K0627K1698m7718K0937j96J6342k0410J597O31m954k861k652
$$ -903720 -897358 -876731 -855033 -902751 -881814 -882010 -865668 -886078 -884481 -883850 -888804 -891665 -894317
1317h94317J9265J793j6631j9596M2619l0445k138J5990k436o746j104j3084K3010
$$ -894317 -875052 -873259 -889890 -909486 -866867 -897312 -899450 -883460 -885896 -892642 -893746 -906830 -883820
1304h83820j4801o964K5138k8997O0436k6381N076l990r695l0239N4061j9693
$$ -883820 -898621 -905585 -880447 -909444 -849008 -875389 -870313 -874303 -883998 -914237 -860176 -879869
1292h79869l0883K2835J0794N467j4702J4951j9427J3502k6742O931M2497k3214
$$ -879869 -910752 -887917 -877123 -871656 -886358 -871407 -890834 -877332 -904074 -897143 -854646 -877860
1280h77860R447k3165o120R723R166m36m293k3117K0447K0681j5082O031K531
$$ -877860 -868413 -891578 -897698 -887975 -878809 -879245 -883538 -906655 -886208 -865527 -880609 -874578 -872047
1267h72047j8747j6548j6219O6991k6467k8258K3866r426K778O500R827k9560
$$ -872047 -890794 -907342 -923561 -856570 -883037 -911295 -887429 -896855 -894077 -887577 -877750 -907310
1255i07310N2741J3198m2391k8140K4236L3051n8395J1238n114K3249n354P065
$$ -907310 -854569 -841371 -883762 -911902 -887666 -854615 -913010 -901772 -906886 -883637 -888991 -881926
1243h81926M2392q2711M2892J6548k8333j8084N940J2761m585l2170K9716n414
$$ -881926 -839534 -922245 -879353 -862805 -891138 -909222 -903282 -890521 -895106 -927276 -897560 -902974
1231i02974J4260l0763P2214l8567N690k7885P670L6470l0744J733K0038l68L411
$$ -902974 -888714 -919477 -847263 -885830 -880140 -908025 -900355 -863885 -894629 -892896 -872858 -873226 -869815
1218h69815L498k9446J2475m457K5410j6173K7802p2912N9144j0353K4799k4047
$$ -869815 -866317 -895763 -883288 -887745 -862335 -878508 -850706 -923618 -864474 -874827 -850028 -874075
1206h74075j5223K5765p471m2936J6802j4811M3980M06m422k9940j2182L8522
$$ -874075 -889298 -863533 -871004 -913940 -897138 -911949 -867969 -867563 -871985 -901925 -914107 -875585
1194h75585J6495k9628r81j317R119j5839K5228l9397K6179J3122j5425l7430
$$ -875585 -859090 -888718 -889699 -891016 -881897 -897736 -872508 -911905 -885726 -872604 -888029 -925459
1182i25459O6815l3612K823j8130K2684l312j0321L6439j0891m704J0088j9205
$$ -925459 -858644 -892256 -889433 -907563 -884879 -888191 -898512 -862073 -872964 -877668 -867580 -886785
$$ [...]
##END NTUPLES=NMR SPECTRUM
##END=
