##TITLE=abcd
##JCAMPDX= 6.0         $$ Bruker NMR JCAMP-DX V2.0
##DATA TYPE= NMR SPECTRUM
##DATA CLASS= NTUPLES
##ORIGIN= UXNMR, Bruker Analytische Messtechnik GmbH
##OWNER= root
$$ XWIN-NMR		Version 3.5
$$ Fri Oct 24 18:25:35 2025 Russian Standard Time (UT+4h)  servis@DPX200
##.OBSERVE FREQUENCY= 200.131235884673
##.OBSERVE NUCLEUS= ^1H
##.ACQUISITION MODE= SIMULTANEOUS
##.ACQUISITION SCHEME= undefined
##.AVERAGES= 16
##.DIGITISER RES= 18
##SPECTROMETER/DATA SYSTEM= spect
##.PULSE SEQUENCE= zg
##.SOLVENT NAME= CDCl3
##.SHIFT REFERENCE= (INTERNAL, CDCl3, 0, 16.4885)
##AUDIT TRAIL= $$ (NUMBER, WHEN, WHO, WHERE, WHAT)
$$ ##TITLE= Audit trail, XWIN-NMR		Version 3.5
$$ ##JCAMPDX= 5.01
$$ ##ORIGIN= Bruker BioSpin GmbH
$$ ##OWNER= servis
$$ F:\spectra/data/av/nmr/H1/1/pdata/1/auditp.txt
$$ ##AUDIT TRAIL=  $$ (NUMBER, WHEN, WHO, WHERE, WHAT)
(   1,<2025-10-24 18:25:04.59 +0400>,<servis>,<DPX200>,
      <created by zg, POWCHK disabled, PULCHK disabled
       terminated by command 'halt'
       configuration hash MD5:
       00 E9 B6 7A A2 85 ED C7 34 08 36 98 17 FE 4E 26
       data hash MD5: 32K
       89 C9 87 EA 3D 28 A5 C0 76 21 D0 CE 0A E9 C2 13>)
(   2,<2025-10-24 18:25:06.40 +0400>,<servis>,<DPX200>,
      <Start of raw data processing
       efp BC_mod = 2 LB = 0.05 FT_mod = 6 PKNL = 1 PHC0 = -270.9076 PHC1 = 6.501565 SI = 16K 
       data hash MD5: 16K
       42 9C 57 6C 3C C0 4C F5 48 FF 56 F2 AF D6 58 26>)
$$ ##END=
$$ 
$$ hash MD5
$$ 4A 90 5B 8B BA 47 4A 4B 17 BA C4 55 1F 1C 83 03
##$RELAX= 
##$RELAX= 
##$RELAX= 
##$RELAX= 
##$RELAX= 
##$RELAX= 
##$RELAX= 
##$RELAX= 
$$ Bruker specific parameters
$$ --------------------------
##$DU= <F:\spectra>
##$EXPNO= 1
##$NAME= <H1>
##$PROCNO= 1
##$TYPE= <nmr>
##$USER= <av>
##$AMP= (0..31)
100 100 100 100 100 100 100 100 100 100 100 100 100 100 100 100 100 100 
100 100 100 100 100 100 100 100 100 100 100 100 100 100 
##$AQSEQ= 0
##$AQ_mod= 1
##$AUNM= <au_zg>
##$AUTOPOS= <>
##$BF1= 200.13
##$BF2= 200.13
##$BF3= 200.13
##$BF4= 200.13
##$BF5= 500.13
##$BF6= 500.13
##$BF7= 500.13
##$BF8= 500.13
##$BYTORDA= 1
##$CFDGTYP= 0
##$CFRGTYP= 5
##$CHEMSTR= <none>
##$CNST= (0..31)
1 1 145 1 1 1 1 1 1 1 1 1 1 1 1 1 1 1 1 1 1 1 1 1 1 1 1 1 1 1 1 1 
##$CPDPRG= <>
##$CPDPRG1= <>
##$CPDPRG2= <>
##$CPDPRG3= <>
##$CPDPRG4= <mlev>
##$CPDPRG5= <mlev>
##$CPDPRG6= <mlev>
##$CPDPRG7= <mlev>
##$CPDPRG8= <mlev>
##$CPDPRGB= <>
##$CPDPRGT= <>
##$D= (0..31)
0 2 0 0 0 0 0 0 0 0.06 0 0 0 0 0 0 0.0002 0 0 0 0 0 0 0 0 0 0 0 0 0 0 
0 
##$DATE= 1761315904
##$DBL= (0..7)
120 120 120 120 120 120 120 120 
##$DBP= (0..7)
150 150 150 150 150 150 150 150 
##$DBP07= 0
##$DBPNAM0= <>
##$DBPNAM1= <>
##$DBPNAM2= <>
##$DBPNAM3= <>
##$DBPNAM4= <>
##$DBPNAM5= <>
##$DBPNAM6= <>
##$DBPNAM7= <>
##$DBPOAL= (0..7)
0.5 0.5 0.5 0.5 0.5 0.5 0.5 0.5 
##$DBPOFFS= (0..7)
0 0 0 0 0 0 0 0 
##$DE= 6
##$DECBNUC= <off>
##$DECIM= 32
##$DECNUC= <off>
##$DECSTAT= 4
##$DIGMOD= 1
##$DIGTYP= 9
##$DL= (0..7)
0 120 120 120 120 120 120 120 
##$DP= (0..7)
$$ [...]
##$SUBNAM4= <"">
##$SUBNAM5= <"">
##$SUBNAM6= <"">
##$SUBNAM7= <"">
##$SUBNAM8= <"">
##$SUBNAM9= <"">
##$SW= 20.6817932712277
##$SWIBOX= (0..15)
0 0 3 0 0 0 0 0 0 0 0 0 0 0 0 0 
##$SW_h= 4139.07284768212
##$TD= 32768
##$TD0= 1
##$TE= 0
##$TE2= 300
##$TE3= 300
##$TEG= 300
##$TL= (0..7)
0 120 120 120 120 120 120 120 
##$TP= (0..7)
150 150 150 150 150 150 150 150 
##$TP07= 0
##$TPNAME0= <>
##$TPNAME1= <>
##$TPNAME2= <>
##$TPNAME3= <>
##$TPNAME4= <>
##$TPNAME5= <>
##$TPNAME6= <>
##$TPNAME7= <>
##$TPOAL= (0..7)
0.5 0.5 0.5 0.5 0.5 0.5 0.5 0.5 
##$TPOFFS= (0..7)
0 0 0 0 0 0 0 0 
##$TUNHIN= 0
##$TUNHOUT= 0
##$TUNXOUT= 0
##$USERA1= <user>
##$USERA2= <user>
##$USERA3= <user>
##$USERA4= <user>
##$USERA5= <user>
##$V9= 5
##$VALIST= <valist>
##$VCLIST= <CCCCCCCCCCCCCCC>
##$VD= 0
##$VDLIST= <DDDDDDDDDDDDDDD>
##$VPLIST= <PPPPPPPPPPPPPPP>
##$VTLIST= <TTTTTTTTTTTTTTT>
##$WBST= 1024
##$WBSW= 30
##$XGAIN= (0..3)
0 0 0 0 
##$XL= 0
##$YL= 0
##$YMAX_a= 572962
##$YMIN_a= -338915
##$ZGOPTNS= <>
##$ZL1= 120
##$ZL2= 120
##$ZL3= 120
##$ZL4= 120
##$ABSF1= 0
##$ABSF2= 0
##$ABSG= 0
##$ABSL= 0
##$ALPHA= 0
##$AQORDER= 0
##$ASSFAC= 0
##$ASSFACI= 0
##$ASSFACX= 0
##$ASSWID= 0
##$AUNMP= <proc_1d>
##$AZFE= 0.1
##$AZFW= 0.1
##$BCFW= 0
##$BC_mod= 2
##$BYTORDP= 0
##$COROFFS= 0
##$CY= 18.4799938201904
##$DATMOD= 1
##$DC= 0
##$DFILT= <>
##$DTYPP= 0
##$F1P= 9.9274215381318
##$F2P= -0.165520771350173
##$FCOR= 1
##$FTSIZE= 16384
##$FT_mod= 6
##$GAMMA= 0
##$GB= 0
##$INTBC= 1
##$INTSCL= 4.127829e-11
##$ISEN= 128
##$LB= 0.05
##$LEV0= 0
##$LPBIN= 0
##$MAXI= 10000
##$MC2= 0
##$MEAN= 0
##$ME_mod= 0
##$MI= 50
##$NCOEF= 0
##$NC_proc= -6
##$NLEV= 6
##$NOISF1= 3.799351
##$NOISF2= 2.8
##$NSP= 0
##$NTH_PI= 0
##$NZP= 0
##$OFFSET= 16.48848
##$PC= 4
##$PHC0= -270.9076
##$PHC1= 6.501565
##$PH_mod= 1
##$PKNL= yes
##$PPARMOD= 0
##$PSCAL= 4
##$PSIGN= 0
##$REVERSE= no
##$SF= 200.130005582386
##$SI= 16384
##$SIGF1= 3
##$SIGF2= 2
##$SINO= 400
##$SIOLD= 16384
##$SREGLST= <1H.CDCl3>
##$SSB= 0
##$STSI= 16384
##$STSR= 0
##$SW_p= 4139.07284768211
##$SYMM= 0
##$S_DEV= 0
##$TDeff= 32768
##$TDoff= 0
##$TI= <>
##$TILT= no
##$TM1= 0
##$TM2= 0
##$TOPLEV= 0
##$USERP1= <user>
##$USERP2= <user>
##$USERP3= <user>
##$USERP4= <user>
##$USERP5= <user>
##$WDW= 1
##$XDIM= 16384
##$YMAX_p= 352643309
##$YMIN_p= -942689
$$ End of Bruker specific parameters
$$ ---------------------------------
##NTUPLES= NMR SPECTRUM
##VAR_NAME=  FREQUENCY,     SPECTRUM/REAL,   SPECTRUM/IMAG
##SYMBOL=    X,             R,               I
##VAR_TYPE=  INDEPENDENT,   DEPENDENT,       DEPENDENT
##VAR_FORM=  AFFN,          ASDF,            ASDF
##VAR_DIM=   16384,         16384,           16384
##UNITS=     HZ,            ARBITRARY UNITS, ARBITRARY UNITS
##FACTOR=    0.252644378177508, 1,           1
##FIRST=     3299.83951724647, 0,            0
##LAST=      -839.233330435636, 0,           0
##MIN=       -839.233330435636, -942689,     0
##MAX=       3299.83951724647, 352643309,    0
$$ Real data points
##PAGE= N=1
##DATA TABLE= (X++(R..R)), XYDATA
$$ [...]
8177E9463Q2600j21872P2173j8063O3917K4570M9724P1689j25043m0222p1183
$$ 59463 142063 20191 92364 74301 138218 162788 212512 284201 159158 118936 47753
8166D7753J28391m0169J36933n6888r5946j14208N7062J31555J46603j50446M8889
$$ 47753 176144 135975 272908 216020 120074 5866 62928 194483 341086 190640 239529
8155B39529m2633k0052l0276l5790J39102q0332N5555M6486j33715P4555J2318
$$ 239529 196896 176844 146568 110778 249880 169548 225103 271589 137874 212429 224747
8144B24747Q1092r3250r2740P4513j75163L7694K4661l947m7728o493k5168l4195
$$ 224747 305839 212589 119849 194362 19199 56893 81554 77607 29879 23386 -1782 -35977
8132c5977J94050n4573r5973J73334q5705M3579j57375J66279q8609O7192m5817
$$ -35977 158073 103500 7527 180861 95156 138735 -18640 147639 59030 126222 80405
8121H0405O3614J31745j07580N0393o690k4767J15702p8473O3660m3554o7897
$$ 80405 144019 275764 168184 218577 211887 187120 302822 224349 288009 244455 176558
8110A76558L4649K1220j59359r1833J66613o6121J02682j46378J64577k27573
$$ 176558 211207 232427 73068 -18765 147848 81727 184409 38031 202608 -24965
8100b4965K325K71852j34679k52M4357m5317K7655L1438o9820J86707k206K5614
$$ -24965 -22640 249212 114533 114281 158638 113321 140976 172414 102594 289301 287095 312709
8088C12709j52285J21292R8795q8198J10596K2130N0255j43445K0567J513L7008
$$ 312709 160424 281716 380511 292313 402909 425039 475294 331849 352416 353929 390937
8077C90937j10387J14390r6887J5136K6155J23933k33164J22335j4874M4496L6202
$$ 390937 280550 394940 298053 313189 339344 463277 230113 352448 337574 382070 418272
8066D18272N1825j2122L2387L9221N3465n6647M3464r377J69638p6938l2362J50373
$$ 418272 470097 457975 490362 529583 583048 526401 569865 560488 730126 653188 620826 771199
8054G71199R632J06550j67997J01535Q5538K0637j04700o3887Q0557P1993m7465
$$ 771199 780831 887381 719384 820919 906457 927094 822394 758507 839064 911057 863592
8043H63592p1802J06224o4412J56231j16424J22917j4422J76820k6539n5511P3135
$$ 863592 791790 898014 833602 989833 873409 996326 981904 1158724 1132185 1076674 1149809
8032A149809j7277O9273n0988J6099j82722k4186J98876n4219k15711j20397J50475
$$ 1149809 1132532 1201805 1150817 1166916 984194 960008 1158884 1104665 888954 768557 919032
8021I19032j74897J19538k3721l1856n309l1135l3043Q1181j30869j2930r8486
$$ 919032 744135 863673 839952 808096 802787 771652 738609 819790 688921 675991 577505
8010E77505P9281J1068j83033P3733j6462M4983j54580o4312j0157J341L6725
$$ 577505 656786 667854 484821 558554 542092 587075 432495 368183 358026 359367 396092
7999C96092K1960j18034J9356q3650L5159k5732j42047J10876p734O3821j40549
$$ 396092 418052 300018 319374 235724 270883 245151 103104 213980 206246 270067 129518
7988A29518M7584Q2012j15124J59902p1435L1052K1436N2938j96644O3433J16040
$$ 129518 177102 259114 143990 303892 232457 263509 284945 337883 141239 204672 320712
7977C20712q9924k5166L7942K8520m5707q387P5799j59826J01816J5013j58396
$$ 320712 230788 205622 243564 272084 226377 217990 293789 133963 235779 250792 92396
7966I2396J03588j46190J50243K6838j05100O9923n9432j26226J49881J22505
$$ 92396 195984 49794 200037 226875 121775 191698 132266 6040 155921 278426
7956B78426j52532N2706Q691R333J0649p4645n6074K42505j51007N0018j2507
$$ 278426 125894 178600 187291 196624 207273 132628 76554 319059 168052 218070 205563
7945B05563l2741Q2344J8667J08320Q1800k1603j32706J07938j10697J39921j8215
$$ 205563 172822 255166 273833 382153 463953 442350 309644 417582 306885 446806 428591
7934D28591J77420J1450m1632o7382O9110J35165p3417P3882o6646N0802J2657
$$ 428591 606011 617461 575829 508447 577557 712722 639305 713187 646541 697343 710000
7923G10000M2017K22089m2836j03155K4034q1681R5864m5115j6614o6669J0719
$$ 710000 752017 974106 931270 828115 852149 770468 866332 821217 804603 737934 748653
7912G48653K6663J32317q0612J01688K3175r6627K6316P6270K18332o5478J14166
$$ 748653 775316 907633 827021 928709 951884 855257 881573 957843 1176175 1110697 1224863
7901A224863j16278J08202J2707k1880J01166j3054j70383K48642O4358k47023
$$ 1224863 1108585 1216787 1229494 1207614 1308780 1295726 1125343 1373985 1438343 1191320
7891A191320m7982N4894k49750J15112L203n8155k1877m0321j68053P7941k322
$$ 1191320 1143338 1198232 948482 1063594 1066797 1008642 986765 946444 778391 856332 854010
7880H54010j37305J32657l7863R3290k1988j14329o3945k3324J71435j34820J26024
$$ 854010 716705 849362 811499 904789 882801 768472 704527 681203 852638 717818 843842
7869H43842r0357m4085l2757Q6078j43789P1352J17023l6102k95554J12888k14671
$$ 843842 753485 709400 676643 762721 618932 690284 807307 771205 475651 588539 373868
7858C73868J62504Q336P1020j77606Q6789R21j66802N42108j008562P55904j90930
$$ 373868 536372 544708 615728 438122 524911 525832 359030 901138 -107424 648480 457550
7847D57550p0537q8380k4874R3878P175l9955J26802j59305J2199Q8181j57164
$$ 457550 387013 298633 273759 367637 374812 334857 461659 302354 314553 402734 245570
7836B45570N5057K1177p1140K9184J20535j43169K7158k7891m2018J2351J03665
$$ 245570 300627 321804 250664 279848 400383 257214 284372 256481 214463 226814 330479
7825C30479j41210K1020M168N3107j9223K4332L8616m1655J6657o4826P0516q326
$$ 330479 189269 210289 214457 267564 248341 272673 311289 269634 286291 221465 291981 283655
7813B83655o684k3799l7720R7978j29985J60580N1646j23599j7360L5079p0613
$$ 283655 276971 253172 215452 313430 183445 344025 395671 272072 254712 289791 219178
7802B19178R257R5894p6766J82425m8566p6313l8037L4714j42076J77737j6072
$$ 219178 228435 324329 247563 429988 381422 305109 267072 301786 159710 337447 321375
7791C21375j78515P3624R1229J245R9310r818p6803m4146J29006m0565k4185M9765
$$ 321375 142860 216484 307713 308958 408268 398450 321647 277501 406507 365942 341757 391522
7779C91522m6049Q8366j32031K8009O8434l7286M0453O5268j45135l9837J15290
$$ 391522 345473 433839 301808 329817 398251 360965 401418 466686 321551 281714 397004
7768C97004k2406O4842r0920L7229J48614l5854j64765P1979M1528m1866J37988
$$ 397004 374598 439440 348520 385749 534363 498509 333744 405723 447251 405385 543373
7757E43373q4868J22602p4280M5581k2139J4963l1955J56052m3861p6512K16764
$$ 543373 458505 581107 506827 552408 530269 545232 513277 669329 625468 548956 765720
7746G65720M415L3746k3207J61191m2627K25539j6369K60531k53094M649J02382
$$ 765720 770135 803881 780674 941865 899238 1124777 1108408 1368939 1115845 1120494 1222876
7735A222876j90010R0907J3052j6922j30575k8833j87874j5170o6712K1077m4927
$$ 1222876 1032866 1123773 1136825 1119903 989328 960495 772621 757451 690739 711816 666889
7724F66889J9172q9814j8049J7243O4040q5756l1640J15874j70919N4109R2867
$$ 666889 686061 596247 578198 595441 659481 573725 542085 657959 487040 541149 634016
7713F34016N0490j99282P8868O6547r9509P2020J1704n1961J635M356j6049k9846
$$ 634016 684506 485224 564092 630639 531130 603150 614854 562893 564528 568884 552835 522989
7701E22989J25739j7920n5076j163l6794M3090j19102L4679J16948o0366Q7456
$$ 522989 648728 630808 575732 574569 537775 580865 461763 496442 613390 553024 640480
7690F40480n5031J70522j00777l5391J76607j49148Q5422l2967J00965k5844k2422
$$ 640480 585449 755971 655194 619803 796410 647262 732684 699717 800682 774838 752416
7679G52416l1575n8792L6465m4357K0341P6850N3861o5454J3035J18630Q1828
$$ 752416 720841 662049 698514 654157 674498 751348 805209 739755 752790 871420 953248
7668I53248n0532r425N7361j5311n0240O1071j6442N9306j56713K36803L1755
$$ 953248 902716 893291 950652 935341 885101 946172 929730 989036 832323 1069126 1100881
7657A100881j45629O378M9633R6164j98923K59072o1809p179j8728N2517J24150
$$ 1100881 955252 961630 1011263 1107427 908504 1167576 1105767 1098588 1079860 1132377 1256527
7646A256527l4534L7562O6796n2221L2033j06929j3628R6317O8516P6851o24q1781
$$ 1256527 1221993 1259555 1326351 1274130 1306163 1199234 1185606 1281923 1350439 1427290 1426666 1344885
7634A344885P3570J40700n7785J13765J6257P4934n7793J46140J02873o356J27233
$$ 1344885 1418455 1559155 1501370 1615135 1631392 1706326 1648533 1794673 1897546 1891190 2018423
7623B018423N4182J00562P7329n3741J78325R9066L03205o5967J18922K72385
$$ 2018423 2072605 2173167 2250496 2196755 2375080 2474146 2777351 2711384 2830306 3102691
7613C102691J28084J54560K66086J82335J78648J68133M26013K82149K56137K82576
$$ 3102691 3230775 3385335 3651421 3833756 4012404 4180537 4606550 4888699 5144836 5427412
7603E427412M19410M77474M59500L40181M07740P23711K47631L74636O59482N47044
$$ 5427412 5846822 6324296 6783796 7123977 7531717 8255428 8503059 8877695 9537177 10084221
7593A0084221M60371M00123N40407L23708M13484M99749J54076K79734J27283
$$ 10084221 10544592 10944715 11485122 11808830 12222314 12722063 12876139 13155873 13283156
7584A3283156j0057j9698j80657l11533j51188m19838m60192m82201m73099o22864
$$ 13283156 13273099 13253401 13072744 12761211 12610023 12190185 11729993 11247792 10774693 10151829
7574A0151829o00230n05809m88405m71378n60469m75298m26365o09859k81196
$$ 10151829 9551599 9045790 8557385 8086007 7525538 7050240 6623875 6014016 5732820
7565E732820l63667m82824j19689l00680k29054k78011k17132j54122k90225j47071
$$ 5732820 5369153 4886329 4766640 4465960 4236906 3958895 3741763 3587641 3297416 3150345
7555C150345k19994k53501K4119k41013k1680j2620k69256J2502o9461j59821
$$ 3150345 2930351 2676850 2700969 2459956 2438276 2425656 2156400 2168902 2099441 1939620
7545A939620j43667k7918R7537m0150q6229j79981j28378J92886r0324P1716k7114
$$ 1939620 1795953 1768035 1865572 1825422 1739193 1559212 1430834 1623720 1533396 1605112 1577998
7534A577998j35726l385M0396j08305Q4009k6849j14866L1487j1071M0147k37795
$$ 1577998 1442272 1438887 1479283 1370978 1454987 1428138 1313272 1344759 1333688 1373835 1136040
7523A136040R6084j90119J70045R9029j04695j99171N0106Q647N2738o541l2386
$$ 1136040 1232124 1042005 1212050 1311079 1206384 1007213 1057319 1065966 1118704 1112163 1079777
7512A079777M2112j04201P7677N6389m8535J8494L0901m0730K42351k44512J64078
$$ 1079777 1121889 1017688 1095365 1151754 1103219 1121713 1152614 1111884 1354235 1109723 1273801
7501A273801L2787k559J33071K3150K41969n7764Q1895N8221J75295K35835k6831
$$ 1273801 1306588 1304029 1437100 1460250 1702219 1644455 1726350 1784571 1959866 2195701 2168870
7490B168870J97132N6860J65959L2758L5792J50872J21463K0928M0463J4020Q1247
$$ 2168870 2366002 2422862 2588821 2621579 2657371 2808243 2929706 2950634 2991097 3005117 3086364
7479C086364j82956n0064j11714m5545j16454j48598q7520n1785J05231k33512
$$ 3086364 2903408 2853344 2741630 2696085 2579631 2431033 2343513 2291728 2396959 2163447
7469B163447r4581j67405r3810J61965l44672N0230j8970k21914R0433m0221l8434
$$ 2163447 2068866 1901461 1807651 1969616 1624944 1675174 1656204 1434290 1524723 1484502 1446068
7458A446068J4729l6593R1006o3290R3536j63014N3104O0913L6708R7640K80719
$$ 1446068 1460797 1424204 1515210 1451920 1545456 1382442 1435546 1496459 1533167 1630807 1911526
7447A911526j93320n2635n3490N504o8829o6488l43679J68034k79311R1307l0354
$$ 1911526 1718206 1665571 1612081 1617585 1548756 1482268 1138589 1306623 1027312 1118619 1088265
7436A088265k79389Q9742l966J42581j79247P2332k6929N6550q5171r2574J45460
$$ 1088265 808876 898618 894652 1037233 857986 930318 903389 959939 874768 782194 927654
7425I27654J13860j01488L992J19419o8561j37106J51122j7802K3609j31640J12219
$$ 927654 1041514 940026 944018 1063437 994876 857770 1008892 991090 1014699 883059 995278
7414I95278m2144O0304J25846o8306n5938M3473j22140n3028J84950j3707j4326
$$ 995278 953134 1013438 1139284 1070978 1015040 1058513 936373 883345 1068295 1054588 1040262
7403A040262r4227N7986J40116R1499m8831J50782J05626J04109J4426K08951
$$ 1040262 946035 1004021 1144137 1235636 1186805 1337587 1443213 1547322 1561748 1770699
7393A770699J59936K65733J23129M46223J07475n8120K06029j02803m4624K33477
$$ 1770699 1930635 2196368 2319497 2765720 2873195 2815075 3021104 2918301 2873677 3107154
7383C107154j38254p9439K27524J37667N2427p8750k65872m9304j48268p8014
$$ 3107154 2968900 2889461 3116985 3254652 3307079 3228329 2962457 2913153 2764885 2686871
7373B686871l33597k10952j69552k74674N5166j91620k65893Q5789j30970j82304
$$ 2686871 2353274 2142322 1972770 1698096 1753262 1561642 1295749 1381538 1250568 1068264
7363A068264J96844m0429l72469K50305j5970q3979N6328J68012j18849J22613
$$ 1068264 1265108 1224679 852210 1102515 1086545 1002566 1058894 1226906 1108057 1230670
7353A230670j8159l2954P8252J54600o1160J77072p6116L745L09794Q1932K28644
$$ 1230670 1212511 1179557 1257809 1412409 1351249 1528321 1452205 1455950 1765744 1847676 2076320
7342B076320L5770J4817J73867L77390J80923K40497L13342j1712l0118K00P8339
$$ 2076320 2112090 2126907 2300774 2678164 2859087 3099584 3412926 3401214 3371096 3371296 3449635
7331C449635M7697J38514j32274J03414q6430K02539k1503o7399k72649j94813
$$ 3449635 3497332 3635846 3503572 3606986 3520556 3723095 3701592 3634193 3361544 3166731
7321C166731k54640n2673l62850o2237k61950j95924j49349k18487J0205j45294
$$ 3166731 2912091 2859418 2496568 2434331 2172381 1976457 1827108 1608621 1618826 1473532
7311A473532q0251K2413n5032p2312R8719J31476j15758j18788M7989m86K4474
$$ 1473532 1393281 1415694 1360662 1288350 1387069 1518545 1402787 1283999 1331988 1331502 1355976
7300A355976L3282j8567j87797J12385j59272O1991n1757p7311p7398Q372J00380
$$ 1355976 1389258 1370691 1182894 1295279 1136007 1197998 1146241 1068930 991532 999904 1100284
7289A100284j6455j14386j855P7185q1581p7485R697J23099j28195l4061o731
$$ 1100284 1083829 969443 967588 1044773 963192 885707 895404 1018503 890308 856247 849516
7278H49516J01851j2392N8218N7409j37592K7107L8303n5148L2464J65463L4922
$$ 849516 951367 938975 997193 1054602 917010 944117 982420 927272 959736 1125199 1160121
7267A160121p568l1764l0066O3015L0998j45248J95492l7565J90917m9232K2501
$$ 1160121 1152553 1120789 1090723 1153738 1184736 1039488 1234980 1197415 1388332 1339100 1361601
7256A361601N834J7850j03460J018J7157j54807J5917m9719M31m4990m486n2459
$$ 1361601 1367435 1385285 1281825 1282843 1300000 1145193 1161110 1111391 1111822 1066832 1062346 1009887
7244A009887j14585M8722K1508M8882J01o6207k0541k0840K7J08287N148l6838
$$ 1009887 895302 944024 965532 1014414 1014515 948308 927767 906927 906954 1015241 1020389 983551
7232I83551L969O9839J0949j50489K2288O8857L9159m3036P2979l8580R280J70084
$$ 983551 987520 1057359 1068308 917819 940107 1008964 1048123 1005087 1078066 1039486 1048766 1218850
7220A218850R0354j11615P3816J98820o7071j1568j06388J07215k3277J15781
$$ 1218850 1309204 1197589 1271405 1470225 1403154 1391586 1285198 1392413 1369136 1484917
7210A484917k16732N8757q499j2881J27509j03964o554j15814N8142J0936J08656
$$ 1484917 1268185 1326942 1318443 1305562 1433071 1329107 1322553 1206739 1264881 1275817 1384473
7199A384473q1246k07305K24601j34427k8276L8081o1880J02025P4877j98458
$$ 1384473 1303227 1095922 1320523 1186096 1157820 1195901 1134021 1236046 1310923 1112465
7189A112465K19201M3654L770Q9289o2813M8220M0910M4170J89796l5774J46514
$$ 1112465 1331666 1375320 1379090 1468379 1405566 1453786 1494696 1538866 1728662 1692888 1839402
7178A839402J42060J35239K06313J51399K98005J77300L82929K55235J86789K64029
$$ 1839402 1981462 2116701 2323014 2474413 2772418 2949718 3332647 3587882 3774671 4038700
7168D038700j596J03147j3036J22197O9641j17664J86776K55922o5432r5821N7755
$$ 4038700 4037104 4140251 4127215 4249412 4319053 4201389 4388165 4644087 4578655 4482834 4540589
7157D540589j65664M7207K5910r5109k7289p2874L2266K36128J30507L46308J83002
$$ 4540589 4374925 4422132 4448042 4352933 4325644 4252770 4285036 4521164 4651671 4997979 5180981
7146E180981k6135q3122j44269l3129J22268j59842k38106P1045j94898J07260
$$ 5180981 5154846 5071724 4927455 4894326 5016594 4856752 4618646 4689691 4494793 4602053
7136D602053o4334k91128j27447j71046n9648l94171m9902k70596k17168p1690
$$ 4602053 4537719 4246591 4119144 3948098 3888450 3494279 3444377 3173781 2956613 2884923
7126B884923k08075j59603k60424o5183n9630j5972o0823k30910Q9870j09828
$$ 2884923 2676848 2517245 2256821 2191638 2132008 2116036 2055213 1824303 1914173 1804345
7116A804345j41038J88102N5911N3344L0918m8041M9859O7644J35566M1195o5728
$$ 1804345 1663307 1851409 1907320 1960664 1991582 1943541 1993400 2061044 2196610 2237805 2172077
7105B172077j17571R9868O0818j11821O2665L2068j66764n9097j0478r1326M6618
$$ 2172077 2054506 2154374 2215192 2103371 2166036 2198104 2031340 1972243 1961765 1870439 1917057
7094A917057Q8631r8451J40010k75963K26700P5883J83424j02078O7773J25493
$$ 1917057 2005688 1907237 2047247 1771284 1997984 2073867 2257291 2155213 2222986 2348479
7084B348479J00466j81420J15932J085J810j1149k3981l3797J31848j1896o4056
$$ 2348479 2448945 2267525 2383457 2384542 2386352 2375203 2351222 2317425 2449273 2437377 2373321
7073B373321M5962J53925M0558j44833O2872j05299K40679o6357K7113l8066J47349
$$ 2373321 2419283 2573208 2613766 2468933 2531805 2426506 2667185 2600828 2627941 2589875 2737224
7062B737224l7464J12199J61169p1629L1368J93193M0619j19476M5399K3601k1721
$$ 2737224 2699760 2811959 2973128 2901499 2932867 3126060 3166679 3047203 3092602 3116203 3094482
7051C094482J00217l7670P3169Q361r750m6064r569K36327k12818J03884K76563
$$ 3094482 3194699 3157029 3230198 3238559 3228809 3182745 3173176 3409503 3196685 3300569 3577132
7040C577132l7180J17162J09873J48656j5629R7586M4948j1783J8916J86370j34997
$$ 3577132 3539952 3657114 3766987 3915643 3900014 3997600 4042548 4030765 4049681 4236051 4101054
7029D101054O1692k2244J54340j19775J56821K71860j2977L9115K69411M7696
$$ 4101054 4162746 4140502 4294842 4175067 4331888 4603748 4590771 4629886 4899297 4946993
7019D946993L30369K94844L57432L67864M48490O42874P16036O26150J053270
$$ 4946993 5277362 5572206 5929638 6297502 6745992 7388866 8104902 8731052 9784322
7010I784322P10304R49868M75047N64624K41624j06820j09150m59781m91505n20053
$$ 9784322 10494626 11444494 11919541 12484165 12725789 12618969 12509819 12050038 11558533 11038480
7000A1038480o88991o39963p18037n37824n68183l02857k70977m44633k89332
$$ 11038480 10349489 9709526 8991489 8453665 7885482 7582625 7311648 6867015 6577683
6991F577683l02005k47572k71404j41602l25632k31536k31590j45064k04139k78933
$$ 6577683 6275678 6028106 5756702 5615100 5289468 5057932 4826342 4681278 4477139 4198206
6981D198206J03130k15669J7437j48671k0430o0122k2117k15583j5326l7514j09835
$$ 4198206 4301336 4085667 4103104 3954433 3934003 3873881 3851764 3636181 3620855 3583341 3473506
6970C473506P3112K081k0169l7987J6309j34436J21142J4356R4158O989K25N6169
$$ 3473506 3546618 3548699 3528530 3490543 3506852 3372416 3493558 3507914 3602072 3609061 3609286 3665455
6958C665455q68K653j9819P286j3181M3447J47697J3083N7324k328N9012J07174
$$ 3665455 3664587 3667240 3647421 3654707 3641526 3684973 3832670 3845753 3903077 3900749 3959761 4066935
6946D066935k0565M8914O2944N3209J7415l7353J82658o098O6450n0551J60591
$$ 4066935 4046370 4095284 4158228 4211437 4228852 4191499 4374157 4368059 4434509 4383958 4544549
6935D544549j0567K6822O875K99349n3311J95095N6681J05817p9062K77704Q0475
$$ 4544549 4533982 4560804 4567679 4867028 4813717 5008812 5065493 5171310 5092248 5369952 5450427
6924E450427K05455J78999R4689K09711K60521R7651K10264N8829K27263K7920
$$ 5450427 5655882 5834881 5929570 6139281 6399802 6497453 6707717 6766546 6993809 7021729
6914G021729L64837r8172L09705J57968J28814M2006J04457K09357J15118J19260
$$ 7021729 7386566 7288394 7598099 7756067 7884881 7926887 8031344 8240701 8355819 8475079
6904H475079O1663K41924J82881l9457K89535m7624L2055K63363k8342J66232
$$ 8475079 8536742 8778666 8961547 8922090 9211625 9164001 9196056 9459419 9431077 9597309
6894I597309J67142K19578K77144J14886J39895L20280K41941M27338K02173M53896
$$ 9597309 9764451 9984029 10261173 10376059 10515954 10836234 11078175 11505513 11707686 12161582
6884A2161582L49982K59054L08494M48462J15620J79460L73356K7974K36068J29155
$$ 12161582 12511564 12770618 13079112 13527574 13643194 13822654 14196010 14223984 14460052 14589207
6874A4589207M06590K29238M40237J80912N35552O33881J093042J368782J344594
$$ 14589207 14995797 15225035 15665272 15846184 16381736 17015617 18108659 19477441 20822035
6865B0822035J727415J741497K055514K195331K718102K767079L536767M216925
$$ 20822035 22549450 24290947 26346461 28541792 31259894 34026973 37563740 41780665
6857D1780665N468179P206681P682404Q440673R416687J1077450J4362292J8466198
$$ 41780665 47248844 54455525 62137929 70578602 79995289 91072739 105435031 123901229
6849A23901229J6372249J0504288J040623j919951l848951l537539o223110j0632199
$$ 123901229 140273478 150777766 151818389 149898438 146049487 142511948 136288838 125656639
6841A25656639j4284189j1531520q754951p293062o971182o764470m745498l420319
$$ 125656639 111372450 99840930 91085979 83792917 76821735 70057265 65311767 61891448
6833F1891448k491671j979011j567895j063260o82346k11229J24460L95535N07631
$$ 61891448 59399777 57420766 55852871 54789611 54107265 53896036 54020496 54416031 54923662
6824E4923662M79066Q34888P85615J369758J690110K288486K730505L410845M039660
$$ 54923662 55402728 56237616 57023231 58392989 60083099 62371585 65102090 68512935 72552595
6815G2552595N200600N420023N502913M261778K230071O92196m38274j415352
$$ 72552595 77753195 83173218 88676131 92937909 95167980 95860176 95421902 94006550
6807I4006550j816336k496935k890792k456695j677277l15484R81735K024846
$$ 94006550 92190214 89693279 86802487 84345792 82668515 82353031 83334766 85359612
6799H5359612L403993M006869M017945L784150L145355K326814M47939j230192
$$ 85359612 88763605 92770474 96788419 100572569 103717924 106044738 106492677 105262485
6791A05262485l112051m275174n073607n211430n582793n525037n213043m390025
$$ 105262485 102150434 97875260 92801653 87590223 82007430 76482393 71269350 66879325
6783F6879325l283718k244806j129652k06658Q57101J867998K985415L823394
$$ 66879325 63595607 61350801 60221149 60014491 60871592 62739590 65725005 69548399
6775F9548399N223763N994048N885456N555432M596062L559646K181552O06691
$$ 69548399 74772162 80766210 86651666 92207098 96803160 100362806 102544358 103151049
6767A03151049j350005k529526l886700m166073m096742l751062l476428k613699
$$ 103151049 101801044 99271518 95384818 91218745 87122003 83370941 79894513 77280814
6759G7280814j455016k28671J002680J776126K743592K504626J556277N2752j098481
$$ 77280814 75825798 75597127 76599807 78375933 81119525 83624151 85180428 85233180 84134699
6750H4134699k166565k732702l823363m268590m914026m657967m104475l426330
$$ 84134699 81968134 79235432 75412069 71143479 66229453 61571486 57467011 54040681
6742E4040681k914201k675374k432160k221061j854198j771208j355442j258287
$$ 54040681 51126480 48451106 46018946 43797885 41943687 40172479 38817037 37558750
6734C7558750j214297j212061j168848j273950j302160j184429j154750j051882
$$ 37558750 36344453 35132392 33963544 32689594 31387434 30203005 29048255 27996373
6726B7996373r85221j107551j154751j282080j344010j270369j411010j433102
$$ 27996373 27011152 25903601 24748850 23466770 22122760 20852391 19441381 18008279
6718A8008279j402013j363809j245969r81877j019580q27092q12158m23329o10632
$$ 18008279 16606266 15242457 13996488 13014611 11995031 11167939 10355781 9932452 9321820
6709I321820m45704k04323l18040j42420l87706l67k44795Q2815M231o1071R2515
$$ 9321820 8876116 8671793 8353753 8211333 7823627 7823260 7578465 7661280 7665511 7604440 7696955
6698G696955m7235J06061M6038p2408J5618M3039p9639O5523r9914L2020M500
$$ 7696955 7649720 7755781 7801819 7729411 7745029 7788068 7708429 7773952 7674038 7706058 7710558
6687G710558j09840j15903J68758k3201m9710j47799P7287j49847Q1219j59463
$$ 7710558 7600718 7484815 7653573 7630372 7580662 7432863 7510150 7360303 7441522 7282059
6677G282059k2713L8138k35987K51141k96064l1412j0751k4509l02329L7949r8431
$$ 7282059 7259346 7297484 7061497 7312638 7016574 6985162 6974411 6949902 6647573 6685522 6587091
6666F587091Q7147j01260J7691j34458k3050P239j65985j60557j27377j03783
$$ 6587091 6674238 6572978 6590669 6456211 6433161 6440400 6274415 6113858 5986481 5882698
6656E882698m14106j63936j92630l07069j85463l14969k16702r1499k30986k38852
$$ 5882698 5468592 5304656 5112026 4804957 4619494 4304525 4087823 3996324 3765338 3526486
6646C526486j46705J65263j83627o3210j78384N0916r5175j50153K41709k83256
$$ 3526486 3379781 3545044 3361417 3298207 3119823 3170739 3075564 2925411 3167120 2883864
6636B883864j46724r9833J51980k00656l9685r559M5297j92085J2342r0393m815
$$ 2883864 2737140 2637307 2789287 2588631 2548946 2539387 2584684 2392599 2404941 2314548 2309733
6625B309733K8662p3491M9538j27545J33100l5486M1136j85690O2424R1873P3876
$$ 2309733 2338395 2264904 2314442 2186897 2319997 2284511 2325647 2139957 2202381 2294254 2368130
6614B368130m7401J36980j30775J14618P572K6484P3920j16293m0935R8180J37926
$$ 2368130 2320729 2457709 2326934 2441552 2449124 2475608 2549528 2433235 2392300 2490480 2628406
6603B628406q250j8711J10067p3145J371L3227r6168J44505R9449p6298o7475
$$ 2628406 2620156 2601445 2711512 2638367 2639738 2672965 2576797 2721302 2820751 2744453 2676978
6592B676978Q0428R4538j78577K02775j67875J4760J80920L9147J12412o0947
$$ 2676978 2757406 2851944 2673367 2876142 2708267 2723027 2903947 2943094 3055506 2994559
6582B994559k2585K05265M3856J49499K9274J48826L04088k3343j0173J99745
$$ 2994559 2971974 3177239 3221095 3370594 3399868 3548694 3852782 3829439 3819266 4019011
6572D019011m9857q2420J54642r2565J27711j1476r8236N3193p5478j04190J34359
$$ 4019011 3969154 3886734 4041376 3948811 4076522 4065046 3966810 4020003 3944525 3840335 3974694
6561C974694k16961K95193j5170j46554P65O6555n5449J9646O4850j2008L2188
$$ 3974694 3757733 4052926 4037756 3891202 3891967 3958522 3903073 3922719 3987569 3975561 4007749
6550D007749P8241K36296q7160J93786K34733N2170K0083P1219J31767J79023
$$ 4007749 4085990 4322286 4235126 4428912 4663645 4715815 4735898 4807117 4938884 5117907
6540E117907p554P5519p4760p4912ll3374m3781J17138j0715k25483p2224K46663
$$ 5117907 5110353 5185872 5111112 5036200 5036197 5002823 4959042 5076180 5065465 4839982 4767758 5014421
6528E014421l15752J34789j62665r0970M566J04248J77168j49179J06427o1066
$$ 5014421 4698669 4833458 4670793 4579823 4584389 4688637 4865805 4716626 4823053 4761987
6518D761987K44061K62328J83075K23550L69563K34266J43864L66605M12717L24782
$$ 4761987 5006048 5268376 5451451 5675001 6044564 6278830 6422694 6789299 7202016 7526798
6508G526798L42401N56885L05808M94297M84650N51992P16062N03972O32511M21132
$$ 7526798 7869199 8426084 8731892 9226189 9710839 10262831 10978893 11482865 12115376 12536508
6498A2536508N16757K74732j00711N7614k49629l77959n50140n00613n18677n47708
$$ 12536508 13053265 13327997 13227286 13284900 13035271 12657312 12107172 11606559 11087882 10540174
6488A0540174n40808n58553k16768l58266m64456k11981j38450l92732l06626
$$ 10540174 9999366 9440813 9224045 8865779 8401323 8189342 8050892 7658160 7351534
6479G351534L4019l52818j09855j15314l49919q0500k05059j41444M6815q2832
$$ 7351534 7385553 7032735 6922880 6807566 6457647 6377147 6172088 6030644 6077459 5994627
6469E994627j62551o3545j31235k5310N9075n6440m4796J25661J05582J08977
$$ 5994627 5832076 5768531 5637296 5611986 5671061 5614621 5569825 5695486 5801068 5910045
6459E910045j11087J12593J33049N1622J96407J61463N9429J38712J07044J34913
$$ 5910045 5798958 5911551 6044600 6096222 6292629 6454092 6513521 6652233 6759277 6894190
6449F894190o1548K07238P9372J54449j18152P9613j6255J75597j15678R8409
$$ 6894190 6832642 7039880 7119252 7273701 7155549 7235162 7218907 7394504 7278826 7377235
6439G377235J94035m9283J58339K23992J38767K02139J06964K95633J8137J43707
$$ 7377235 7571270 7521987 7680326 7904318 8043085 8245224 8352188 8647821 8665958 8809665
6429H809665N499M2382L6158m4496j39073o3479j70961j09317k84329l77958j30860
$$ 8809665 8815164 8857546 8893704 8849208 8710135 8646656 8475695 8366378 8082049 7704091 7573231
6418G573231k15133l67401j41023j46127k03332k22382r4903j02185J1996j36244
$$ 7573231 7358098 6990697 6849674 6703547 6500215 6277833 6182930 6080745 6092741 5956497
6408E956497N9274m3826P0457j09242n4726j60001P9899j38908q4349q1821l1488
$$ 5956497 6015771 5971945 6042402 5933160 5878434 5718433 5798332 5659424 5575075 5493254 5461766
6397E461766M9434j5186j37364Q8050n204J44136j35869p0062J32278J80509j52301
$$ 5461766 5511200 5496014 5358650 5446700 5441496 5585632 5449763 5379701 5511979 5692488 5540187
6386E540187J39560J37463l9598n2258J31490k4449O3886O874M8760J57578J8752
$$ 5540187 5679747 5817210 5777612 5725354 5856844 5832395 5896281 5903155 5951915 6109493 6128245
6375F128245M090K19103M2983J97305O6369l0829M6147j9775K13091R8146p0059
$$ 6128245 6132335 6351438 6394421 6591726 6658095 6627266 6673413 6653638 6866729 6964875 6894816
6364F894816O4704j7774J373l4569J64586r3700J84853j729r1543j16631J7661
$$ 6894816 6959520 6941746 6943119 6908550 7073136 6979436 7164289 7162560 7071017 6954386 6972047
6353F972047j12700k54893l4496o8500k73427j09836r3829m7338n8910j25115
$$ 6972047 6859347 6604454 6569958 6501458 6228031 6118195 6024366 5977028 5918118 5793003
6343E793003K5128k6017M0243j13891L5519j45567j19328r305K6613L3205N5432
$$ 5793003 5818131 5792114 5832357 5718466 5753985 5608418 5489090 5479785 5506398 5539603 5595035
6332E595035J26143R6612J2506N7414K61523O3182J98050L2966l5008K4915Q1921
$$ 5595035 5721178 5817790 5830296 5887710 6149233 6212415 6410465 6443431 6408423 6433338 6515259
6321F515259l0307P0018o9697n2590k7553J24176j43025J20148J04379K075K6304
$$ 6515259 6484952 6554970 6485273 6432683 6405130 6529306 6386281 6506429 6610808 6612883 6639187
6310F639187Q765n0956N6016n6710M6289j26628q2030n7551l5770k647L602o4335
$$ 6639187 6647952 6596996 6653012 6596302 6642591 6515963 6433933 6376382 6340612 6337965 6341567 6277232
6298F277232l605J6187j4613p7416N6335L01283J20314k8045J55223j68901J90279
$$ 6277232 6273627 6289814 6275201 6197785 6254120 6555403 6675717 6647672 6802895 6633994 6824273
6287F824273J64211J3098M0062m5210n7470K25766j13469K82718k1833J6798J02984
$$ 6824273 6988484 7001582 7041644 6996434 6938964 7164730 7051261 7333979 7312146 7328944 7431928
6276G431928J83679J61772K12028K53036Q3405L39437M7413K95697L05372L43848
$$ 7431928 7615607 7777379 7989407 8242443 8325848 8665285 8712698 9008395 9313767 9657615
6266I657615K63580O221L40275K7947m9712J68048l3119q0328K33204k80054P9058
$$ 9657615 9921195 9927416 10267691 10295638 10245926 10413974 10380855 10300527 10533731 10253677 10332735
6255A0332735K12910K2678P084J17805J25486K67949J66568J7681N9925K19760
$$ 10332735 10545645 10568323 10575407 10693212 10818698 11086647 11253215 11270896 11330821 11550581
6245A1550581K34847Q9116J04967K80995J90360K98774L61159L53152K02822K6558
$$ 11550581 11785428 11874544 11979511 12260506 12450866 12749640 13110799 13463951 13666773 13693331
6235A3693331K2854q7477M25j79032k39847j50324m3718l27J51841K20177J15505
$$ 13693331 13716185 13628708 13629133 13450101 13210254 13059930 13016212 13015885 13167726 13387903 13503408
6224A3503408J28650L09380M17509M51480K86071M81754O56836M61174N74268
$$ 13503408 13632058 13941438 14358947 14810427 15096498 15578252 16235088 16696262 17270530
6215A7270530N64711P51088M68833R10594P57379P83890O93300K31660N78408
$$ 17270530 17835241 18586329 19055162 19965756 20723135 21507025 22200325 22431985 23010393
6206B3010393N21136N40671M42869N44374N40513O09153P72256P64443J136046
$$ 23010393 23531529 24072200 24515069 25059443 25599956 26209109 26981365 27745808 28881854
6197B8881854J285152J238235J631352J762501K128755K249328K741133K804403
$$ 28881854 30167006 31405241 33036593 34799094 36927849 39177177 41918310 44722713
6189D4722713L325542L683032M132307M880343N422770O212516O863363Q003621
$$ 44722713 48048255 51731287 55863594 60743937 66166707 72379223 79242586 87246207
6181H7246207Q650758R851579J0612678J1374000J2051855J2171639J1961406
$$ 87246207 95896965 105748544 116361222 127735222 139787077 151958716 163920122
6174A63920122J1250475R765054P803413N146140K408184k11745k694735n404867
$$ 163920122 175170597 184935651 192739064 197885204 200293388 200081643 197386908 191982041
6166A91982041p640895r816479j1133358j1998690j2382038j2271390j1957114
$$ 191982041 184341146 174524667 163391309 151392619 139010581 126739191 114782077
6159A14782077j1477461j0771697r774315r016328p841242p006750n838742n374748
$$ 114782077 103304616 92532919 82758604 73742276 65901034 58894284 53055542 47680794
6151D7680794m317576l982120l072676k900771k379050k070813j727302j493287
$$ 47680794 43363218 39381098 36308422 33407651 31028601 28957788 27230486 25737199
6143B5737199j422257r89041j234499r87412r38926o03627q79881p66239p99723
$$ 25737199 24314942 23325901 22091402 21103990 20165064 19561437 18681556 17915317 17115594
6134A7115594o27328o17580o64007m82355m20241n08151k74974m47969m23292
$$ 17115594 16488266 15870686 15206679 14724324 14304083 13795932 13520958 13072989 12649697
6125A2649697l90060l19752m77686l09090l72503l03281m50347j67133k70439
$$ 12649697 12259637 11939885 11462199 11153109 10780606 10477325 10026978 9859845 9589406
6116I589406k24778l46261j36748p0247m45964R4740J15868l37846K7397l7365
$$ 9589406 9364628 9018367 8881619 8811372 8365408 8460148 8576016 8238170 8265567 8228202
6106H228202k68230l3168J7596l8089j75326n847l5340K9855n6194o8548Q6189
$$ 8228202 7959972 7926804 7944400 7906311 7730985 7725138 7689798 7719653 7663459 7594911 7681100
6095G681100q0623L6852M4004o2360j24226J08435j89403j42118j3989j17177
$$ 7681100 7600477 7637329 7681333 7618973 7494747 7603182 7413779 7271661 7257672 7140495
6085G140495j31282j60647j57921j39671q1284k17476j0245j82325j67920j54238
$$ 7140495 7009213 6848566 6690645 6550974 6469690 6252214 6241969 6059644 5891724 5737486
6075E737486j04789k80049j90299Q8384l7333j58137l41338J37435k64764N8916
$$ 5737486 5632697 5352648 5162349 5250733 5213400 5055263 4713925 4851360 4586596 4645512
6065D645512k7397j83000o9383j15999J08132r3127k2661j980L2536l1301m0048
$$ 4645512 4618115 4435115 4365732 4249733 4357865 4264738 4242077 4240097 4272633 4241332 4201284
6054D201284L0114R5313l7493R031K00209K02643N5194L1572P7690n3924K20386
$$ 4201284 4231398 4326711 4289218 4298249 4498458 4701101 4756295 4787867 4865557 4811633 5032019
6043E032019L41149r3443R7418L09359J29173k6428K62201L95427J87838P6284
$$ 5032019 5373168 5279725 5377143 5686502 5815675 5789247 6051448 6446875 6634713 6710997
6033F710997J30699N1504j3620K57640j03005J34871P5043J50573J51519Q1912
$$ 6710997 6841696 6893200 6879580 7137220 7034215 7169086 7244129 7394702 7546221 7628133
6023G628133N01337K72919M06321M85462M66700J07468P0919j61747J8538j22335
$$ 7628133 8129470 8402389 8808710 9294172 9760872 9868340 9939259 9777512 9796050 9673715
6013I673715l50589k65184m99901k77232m82696m06599l81530k98907k68379r8071
$$ 9673715 9323126 9057942 8558041 8280809 7798113 7391514 7009984 6711077 6442698 6344627
6003F344627j65925l36703j89588j16436r6024r0339l6319O5326P5942j05879
$$ 6344627 6178702 5841999 5652411 5535975 5439951 5349612 5313293 5378619 5454561 5348682
5993E348682r4019l369m2148P476n2685M2561j07802p1146j29306j50866J62690
$$ 5348682 5254663 5251294 5209146 5216622 5163937 5206498 5098696 5027550 4898244 4747378 4910068
5982D910068p9469j97114J82974l45968r4679n4146n0256M6995k54762J7929J0354
$$ 4910068 4830599 4633485 4816459 4470491 4375812 4321666 4271410 4318405 4063643 4081572 4091926
5971D091926J26961j32590r9502j35918j9914M7215j06251j26035L6768J44986
$$ 4091926 4218887 4086297 3986795 3850877 3830963 3878178 3771927 3645892 3682660 3827646
5961C827646j97756J95690l6066m1753r0708K9447o7483k0203J33115J08815j31342
$$ 3827646 3629890 3825580 3789514 3747761 3657053 3686500 3619017 3598814 3731929 3840744 3709402
5950C709402L4405j6508l8053O4533N6520p0146p0862J82816k3956M6468j53582
$$ 3709402 3743807 3727299 3689246 3753779 3810299 3740153 3669291 3852107 3828151 3874619 3721037
5939C721037N4652K08798j38619M1893J10239O4199j8330P7688J30125o8100k455
$$ 3721037 3775689 3984487 3845868 3887761 3998000 4062199 4043869 4121557 4251682 4183582 4181127
5928D181127p184m4077J16219O2177L2979j21761K0899j74161K73164P341q0692
$$ 4181127 4173943 4129866 4246085 4308262 4341241 4219480 4240379 4066218 4339382 4346723 4266031
5917D266031M1830Q1883N9865J68332L5426N8295K73192M6139L4427J69125J49826
$$ 4266031 4307861 4389744 4449609 4617941 4653367 4711662 4984854 5030993 5065420 5234545 5384371
5906E384371J24692J40193J99795Q3559K49432J482J96442L7353J88159j17200
$$ 5384371 5509063 5649256 5849051 5932610 6182042 6183524 6379966 6417319 6605478 6488278
5896F488278P4380k7563k06489O0034k2972j73771j34357o352J0961n4710j06096
$$ 6488278 6562658 6535095 6328606 6388640 6365668 6191897 6057540 6051188 6062149 6007439 5901343
5885E901343j66794R1705J29563j55818K01979N1319l6547K50181K06934L34121
$$ 5901343 5734549 5826254 5955817 5799999 6001978 6053297 6016750 6266931 6473865 6807986
5875F807986J41964M17003J10993L75874K94908M21242L04767L22510K93791J69400
$$ 6807986 6949950 7366953 7477946 7853820 8148728 8569970 8874737 9197247 9491038 9660438
5865I660438P1454N9597R6048o2498m66287k33531l26029k27306j11319k66628
$$ 9660438 9731892 9791489 9887537 9825039 9358752 9125221 8799192 8571886 8460567 8193939
5855H193939j38132l2329j26907Q3589L6569M9388N7901L57610O7093J98092M28413
$$ 8193939 8055807 8023478 7896571 7980160 8016729 8066117 8124018 8481628 8548721 8746813 9175226
5844I175226L60129K97601K97944L26885N31540L68684M43675M00085L89394K35585
$$ 9175226 9535355 9832956 10130900 10457785 10989325 11358009 11801684 12201769 12591163 12826748
5834A2826748K62005K19439m626Q3847J76146K67413P6915J76752K86696R7844
$$ 12826748 13088753 13308192 13303566 13387413 13563559 13830972 13907887 14084639 14371335 14469179
5824A4469179K96832J11426K99846K05750K8236L4957j12463r8561q9153j81177
$$ 14469179 14766011 14877437 15177283 15383033 15411269 15446226 15333763 15235202 15146049 14964872
5814A4964872o7559M2801j81530K61796J25515J47532K35225L72135N05652N11104
$$ 14964872 14897313 14940114 14758584 15020380 15145895 15293427 15528652 15900787 16406439 16917543
5804A6917543O07718N15885Q00066O47192Q01047P81054Q72247O39525R21170
$$ 16917543 17525261 18041146 18841212 19488404 20289451 21070505 21942752 22582277 23503447
5795B3503447J021250Q28628Q82226R22974O06784O52889N10643O30566K26910
$$ 23503447 24524697 25353325 26235551 27158525 27765309 28418198 28928841 29559407 29786317
5786B9786317K37770J25779O1726O8363J67506N02572R48221J586365J907413
$$ 29786317 30024087 30149866 30211592 30279955 30447461 30950033 31898254 33484619 35392032
5777C5392032K206550K644752L445225M057559M397017N364760O032200P116722
$$ 35392032 37598582 40243334 43688559 47746118 52143135 57507895 63540095 70656817
5769G0656817Q871572J1746813J1914757J2716221J3643269J5665313K0073191
$$ 70656817 79528389 91275202 103189959 115906180 129549449 145214762 165287953
5762A65287953K7371524K5524071J8072430K279623k034889m017097n169327o710794
$$ 165287953 192659477 218183548 236255978 238535601 236500712 232483615 227314288 220603494
5754B20603494j6461877k4166473k2194053j8249541j4947771j5054367j6011650
$$ 220603494 204141617 179975144 157781091 139531550 124583779 109529412 93517762
5747I3517762j3476680j0905800q731141p252419o806659n738417m286068l430147
$$ 93517762 80041082 69135282 60404141 53151722 46345063 40606646 36320578 32890431
5739C2890431k736667k308060j795988j365884j155574r30812p66840o92110o12034
$$ 32890431 30153764 27845704 26049716 24683832 23528258 22597446 21830606 21138496 20526462
5730B0526462n33899n89075o95106l80743o39722m70171k94182k56873n67054
$$ 20526462 19992563 19403488 18708382 18327639 17687917 17217746 16923564 16666691 16099637
5721A6099637m22704k69307q4473l24614j76963k04213l55666l3171j40323j19821
$$ 16099637 15676933 15407626 15323153 14998539 14821576 14617363 14261697 14228526 14088203 13968382
5711A3968382l75818j104k76998J76890j67500L7726O5757j0138J00516L17053
$$ 13968382 13592564 13591460 13314462 13491352 13323852 13361578 13427335 13417197 13517713 13834766
5701A3834766L70691K63247J99946J86520L1307o4407K03877j55959m3645j05423
$$ 13834766 14205457 14468704 14668650 14855170 14886477 14822070 15025947 14869988 14826343 14720920
5691A4720920j53339J6313p7746p8439M6714q4421O0742K85613k5363Q5001J94583
$$ 14720920 14567581 14583894 14506148 14427709 14474423 14390002 14450744 14736357 14710994 14795995 14990578
5680A4990578J63197J02618J25148L41169M7110M62248J87996K18559J81527J90644
$$ 14990578 15153775 15256393 15381541 15722710 15769820 16232068 16420064 16638623 16820150 17010794
5670A7010794K37232J30840J07584K86088L17495R9154O28814L82872M83088N07333
$$ 17010794 17248026 17378866 17486450 17772538 18090033 18189187 18818001 19200873 19683961 20191294
5660B0191294O35968P08671O39549M23292M35598L77203N94899K97232M65977
$$ 20191294 20827262 21535933 22175482 22598774 23034372 23411575 24006474 24303706 24769683
5651B4769683M84356M26011O27404Q30157O08677L30351J60642J67010M7183J91458
$$ 24769683 25254039 25680050 26307454 27137611 27746288 28076639 28237281 28404291 28451474 28642932
5641B8642932K37993k52374J7866K32678J86932L60231L84742M43702K15352N30431
$$ 28642932 28880925 28628551 28646417 28879095 29066027 29426258 29811000 30254702 30470054 31000485
5631C1000485N53376N04417M64249O15417O62403N12082O76821N51622O15149
$$ 31000485 31553861 32058278 32522527 33137944 33800347 34312429 34989250 35540872 36156021
5622C6156021Q23776O29979O31264P57961Q60268R40077J073605J041234J153843
$$ 36156021 36979797 37609776 38241040 38999001 39859269 40799346 41872951 42914185 44068028
5613D4068028J287905J497392J826829J630922K008664K158821K274933K484241
$$ 44068028 45355933 46853325 48680154 50311076 52319740 54478561 56753494 59237735
5605E9237735K819079L287786L603552L820153M660184N328910N796978O792690
$$ 59237735 62056814 65344600 68948152 72768305 77428489 82757399 88554377 95347067
5597I5347067P451567Q320143R353038J0389988J1551725J2903716J4553539J5338956
$$ 95347067 102798634 111118777 120471815 130861803 142413528 155317244 169870783 185209739
5589A85209739J6369316J7128468J7696654J7685286J7364080J6104685J3017820
$$ 185209739 201579055 218707523 236404177 254089463 271453543 287558228 300576048
5582C00576048R715458N751935J974418j747901n281917r063523j2583057j5577139
$$ 300576048 310291506 316043441 318017859 316269958 310988041 301924518 289341461 273764322
5574B73764322j7618995j8579122j8910103j8816260j7926993j7007564j5639058
$$ 273764322 256145327 237566205 218656102 199839842 181912849 164905285 149266227
5567A49266227j3996623j2337326j0749448r309516p769468o965588n751046n054835
$$ 149266227 135269604 122932278 112182830 102873314 95103846 88138258 82387212 77332377
5559G7332377m551424l663495l509272l206812k799696k438770k168551j737568
$$ 77332377 72780953 69117458 65608186 62401374 59601678 57162908 54994357 53256789
5551E3256789j477856j022035p80542l29199O7744L46623Q06682J303984J584583
$$ 53256789 51778933 50756898 49976356 49647157 49714901 50061524 50868206 52172190 53756773
5542E3756773K051026K359155K925543L277587L942165L918653M291859M377410
$$ 53756773 55807799 58166954 61092497 64370084 68312249 72230902 76522761 80900171
5534H0900171M383261M444332L984738K937528K026441R05954k06973j275700
$$ 80900171 85283432 89727764 93712502 96650030 98676471 99582425 99375452 98099752
5526I8099752k323694l539261m335592m828797n123623n121365n296571n097109
$$ 98099752 95776058 92236797 87901205 83072408 77948785 72827420 67530849 62433740
5518F2433740m797601m330892l930754l691288l135712k788594k320834k162658
$$ 62433740 57636139 53305247 49374493 45683205 42547493 39758899 37438065 35275407
5510C5275407j839896j531237j315104j359032j000314q20023p68694o85285n51611
$$ 35275407 33435511 31904274 30589170 29230138 28229824 27409801 26641107 25955822 25404211
5501B5404211p29295m56092m91657m20940k42197m82237k94785j10743j53951
$$ 25404211 24674916 24218824 23727167 23306227 23064030 22581793 22287008 22176265 22022314
5492B2022314j34331q7846J55268O6474Q0184J66525L72350K81302K79356M59264
$$ 22022314 21887983 21800137 21955405 22021879 22102063 22268588 22640938 22922240 23201596 23660860
5482B3660860P3379K37231p7114J74848r7951J64579r5932L5522j64118K48510
$$ 23660860 23734239 23971470 23894356 24069204 23971253 24135832 24039900 24075422 23911304 24159814
5472B4159814j61239K09865J35319R2273O2115K20384K92921J21824L05845L03166
$$ 24159814 23998575 24208440 24343759 24436032 24498147 24718531 25011452 25133276 25439121 25742287
5462B5742287J69414N3708L28655K01628m9617J45058J72472j74023M393j13840
$$ 25742287 25911701 25965409 26294064 26495692 26446075 26591133 26763605 26589582 26593975 26480135
5452B6480135n3357N8591O02n5456L4803j7070K83738R6724J38767L62646J62954
$$ 26480135 26426778 26485369 26485971 26430515 26465318 26448248 26731986 26828710 26967477 27330123 27493077
5441B7493077M82403M09530M43323K37460N12470N96538L99133N18411M43812
$$ 27493077 27975480 28385010 28828333 29065793 29578263 30174801 30573934 31092345 31536157
5432C1536157L62963L51846J87600L05258K79154K07740M79848L47277N82056
$$ 31536157 31899120 32250966 32438566 32743824 33022978 33230718 33710566 34057843 34639899
5423C4639899N79436O86343R09595J527956K029645K683191L016007L585235L666842
$$ 34639899 35219335 35905678 36815273 38343229 40372874 43056065 46072072 49657307 53324149
5414E3324149M333865M912027N672929O462379P602965R098069J1714159J6036567
$$ 53324149 57658014 62570041 68242970 74705349 82308314 91406383 103120542 119157109
5406A19157109J7498320J9216172K1415761K5277938L3467949L9790983L6003116
$$ 119157109 136655429 155871601 177287362 202565300 236033249 275824232 311827348
5399C11827348J7767023J348238m920581j0247190j1489719j6948419k7324997
$$ 311827348 329594371 330942609 326022028 315774838 304285119 287336700 260011703
5392B60011703l3249201k8877203k3102637j9416070j9360520j6984995j2948158
$$ 260011703 226762502 197885299 174782662 155366592 136006072 119021077 106072919
5385A06072919j0388782q394546o812694n064766m044924k532015j448000r64477
$$ 106072919 95684137 87289591 80476897 75412131 71367207 68835192 67387192 66422715
5377F6422715k29505P7443M27491M60870K653K69250L36160L26123O22523J049182
$$ 66422715 66193210 66270653 66698144 67159014 67161667 67430917 67767077 68093200 68715723 69764905
5367F9764905J156479K112764K835548L608361L790300M010171M190882M461267
$$ 69764905 70921384 73034148 75869696 79478057 83268357 87278528 91469410 95930677
5359I5930677M971346N615089O446701P653571R135069J1710033J4524932J6967206
$$ 95930677 100902023 106517112 112963813 120617384 129752453 141462486 155987418 172954624
5351A72954624J9069697K1685969K4768957K8877082L0621914K7528356J8103655
$$ 172954624 192024321 213710290 238479247 267356329 297978243 325506599 343610254
5344C43610254Q092920R40135m445061p999486j2281998j7195985j9888309j9561060
$$ 343610254 351703174 352643309 348198248 340198762 327916764 310720779 290832470 271271410
5336B71271410j8248619j7848175j7417528j6313239j4653502j3235344j2818305
$$ 271271410 253022791 235174616 217757088 201443849 186790347 173555003 160736698
5329A60736698j2731094j1777664j0388170q900245q484381q077938p216508o595955
$$ 160736698 148005604 136227940 125839770 116939525 108455144 100377206 93160698 86564743
5321H6564743n779019n222113m570710m214536l523958k921885k442860k089093
$$ 86564743 80785724 75563611 70992901 66778365 63254407 60332522 57889662 55800569
5313E5800569j992410j971291j995493j782749j766344j737848j778838j744756
$$ 55800569 53808159 51836868 49841375 48058626 46292282 44554434 42775596 41030840
5305D1030840j779275j604524j283275j549750j305659r98956q79038o56105p23812
$$ 41030840 39251565 37647041 36363766 34814016 33508357 32509401 31630363 30974258 30250446
5296C0250446l72774m1569m8577K1923L11135M83547M34227M73316O33499M91030
$$ 30250446 29877672 29836103 29787526 29809449 30120584 30604131 31038358 31511674 32145173 32636203
5286C2636203L93258M07270O5915P1935J34972N4781J80509p8811j32255q3939
$$ 32636203 33029461 33436731 33502646 33574581 33709553 33764334 33944843 33866032 33733777 33649838
5276C3649838r4524n4232o4259N1482L54700K13464k89251l92321o72971r38134
$$ 33649838 33555314 33501082 33436823 33488305 33843005 34056469 33767218 33374897 32701926 31763792
5266C1763792p30364q19427q57160r56131j112487n86157l41470m17432k5812
$$ 31763792 31033428 30214001 29356841 28400710 27288223 26702066 26360596 25943164 25917352
5257B5917352K97691M64072R66384R83122J236940J474156J602369J515593J481788
$$ 25917352 26215043 26679115 27645499 28628621 29865561 31339717 32942086 34457679 35939467
5248C5939467J333941J510912J389895J436984J401504J348884J269704J245789
$$ 35939467 37273408 38784320 40174215 41611199 43012703 44361587 45631291 46877080
5240D6877080J233258J019756P87265M79743K78399L86190O34674O87387J012284
$$ 46877080 48110338 49130094 49917359 50397102 50675501 51061691 51696365 52383752 53396036
5231E3396036J406095K587804L652226M689776N508282O374485P556216R044919
$$ 53396036 54802131 57389935 61042161 65731937 71240219 77614704 85170920 94215839
5223I4215839J0198918Q942716N405270P19795k053239l776778n157519o667411
$$ 94215839 104414757 113357473 118762743 119482538 117429299 113652521 108495002 101827591
5215A01827591q906364j0612904j0080222q782553p547026o979844o591947n201768
$$ 101827591 92921227 82308323 72228101 63445548 55898522 48918678 42326731 37124963
5207C7124963m441981l842392l113724k992090k272963j899383j578397j235743
$$ 37124963 32682982 28840590 25726866 22734776 20461813 18562430 16984033 15748290
5199A5748290j042778p68015n95888n77027k91617j45830j79340n151K74478J90019
$$ 15748290 14705512 13937497 13341609 12764582 12472965 12327135 12147795 12142644 12417122 12607141
5189A2607141K78480M57394N07615N27344P01583M87895N31031J55622K9989Q7021
$$ 12607141 12885621 13343015 13850630 14377974 15079557 15567452 16098483 16254105 16284094 16371115
5179A6371115j76734K9526j58649q5377r9393J53007M66423J93252L10347J43434
$$ 16371115 16194381 16223907 16065258 15979881 15880488 16033495 16499918 16693170 17003517 17146951
5169A7146951k45333k59756m33159l51890n31629p49304o06657n08693l33214
$$ 17146951 16901618 16641862 16208703 15856813 15325184 14575880 13969223 13460530 13127316
5160A3127316m43855k58613o6467l14122l8312J2740R8602P0660J38029J88706
$$ 13127316 12683461 12424848 12358381 12044259 12005947 12018687 12117289 12187949 12325978 12514684
5150A2514684P417K53447m1764j13900k79241j87371k99985k39481m96718k71794
$$ 12514684 12522101 12775548 12733784 12619884 12340643 12153272 11853287 11613806 11117088 10845294
5140A0845294k65153l65552m003l39868J52539n1891k13564k21104j92407k81307
$$ 10845294 10580141 10214589 10210586 9870718 10023257 9971366 9757802 9536698 9344291 9062984
5130I062984k54868k75477k92143j00516l50475k21107k9409r5278j16831r6343
$$ 9062984 8808116 8532639 8240496 8139980 7789505 7568398 7538989 7443711 7326880 7230537
5120G230537j79622j1811l15732M3189k05089k45296j10319j51634q05j57979
$$ 7230537 7050915 7039104 6723372 6766561 6561472 6316176 6205857 6054223 6053418 5895439
5110E895439p2027j31934L7229q7602o1901o417L4018q8808J19325O8619P6894
$$ 5895439 5823412 5691478 5728707 5641105 5579204 5572787 5606805 5517997 5637322 5705941 5782835
5099E782835J92656Q1900P2920J35798L14889Q5310N6552j06061J9698j63384
$$ 5782835 5975491 6057391 6130311 6266109 6580998 6666308 6722860 6616799 6636497 6473113
5089F473113k4376k97794p1513k19112k85285r1224o486j15730O5877j13826N3454
$$ 6473113 6448737 6150943 6079430 5860318 5575033 5483809 5477323 5361593 5427470 5313644 5367098
5078E367098k73065j22363Q7954l32675k05637j9814j84895o4606r7894j50550
$$ 5367098 5094033 4971670 5059624 4726949 4521312 4501498 4316603 4251997 4154103 4003553
5068D003553j57667j62305j26347q1185j89361r2525j36425J0488j1757k86106
$$ 4003553 3845886 3683581 3557234 3476049 3286688 3194163 3057738 3068226 3056469 2770363
5058B770363J07657j72533N5491j19365Q4416j88280n6874Q9543j320n0970R2628
$$ 2770363 2878020 2705487 2760978 2641613 2726029 2537749 2480875 2570418 2569098 2518128 2610756
5047B610756N6703j21654J20574p1846P0270p268N5198p5520k8754j3059k1406
$$ 2610756 2667459 2545805 2666379 2594533 2664803 2657535 2712733 2637213 2608459 2595400 2573994
5036B573994O7067j08320k0025K1096q778l9813j65074R500J48639q9504j46393
$$ 2573994 2641061 2532741 2512716 2533812 2525034 2485221 2320147 2329647 2478286 2388782 2242389
5025B242389k2807N170M8978j61841p8531M5116m1254n5995J61759j1211j47396
$$ 2242389 2219582 2224752 2273730 2111889 2033358 2078474 2037220 1981225 2142984 2131773 1984377
5014A984377J35789o3944m219Q7075r3307N9089l4859M8790q5385K9239J22470
$$ 1984377 2120166 2056222 2052003 2139078 2045771 2104860 2070001 2118791 2033406 2062645 2185115
5003B185115r2410N6812m3520m2366K5904O4942Q795K8501J00786q0673p4318
$$ 2185115 2092705 2149517 2105997 2063631 2089535 2154477 2163272 2191773 2292559 2211886 2137568
4992B137568K32174m7343J82909q6533Q439K53718j0512J06322r375K07098J29781
$$ 2137568 2369742 2322399 2505308 2418775 2427214 2680932 2670420 2776742 2767367 2974465 3104246
4981C104246K73885R1905M6397J87427J58892J00166k4616J21604k06696r5910
$$ 3104246 3378131 3470036 3516433 3703860 3862752 3962918 3938302 4059906 3853210 3757300
4971C757300J22150j2409k14407k0885q4338r5454O2098j41694J52168k51395
$$ 3757300 3879450 3867041 3652634 3631749 3547411 3451957 3514055 3372361 3524529 3273134
4961C273134J58930P8748k6410J53281K3274K40645J3038N7477K35222Q8824K56973
$$ 3273134 3432064 3510812 3484402 3637683 3660957 3901602 3914640 3972117 4207339 4296163 4553136
4950D553136J26849M38487J81021K89430K64070J88312J16249K54070n6477K5920
$$ 4553136 4679985 5118472 5299493 5588923 5852993 6041305 6157554 6411624 6355147 6381067
4940F381067j05379r2258k35898r2872r0327p5071m1029M8222K65K65533K10152
$$ 6381067 6275688 6183430 5947532 5854660 5764333 5689262 5648233 5696455 5696720 5962253 6172405
4929F172405M03514M78839N99020M51445N60429M91185O13626K41794K63500J60077
$$ 6172405 6575919 7054758 7653778 8105223 8665652 9156837 9770463 10012257 10275757 10435834
4919A0435834k67442l24350j56874n12234m26431n41871l95596n11933l27618
$$ 10435834 10168392 9844042 9687168 9174934 8748503 8206632 7811036 7299103 6971485
4910F971485m19336p4024j77380M9724l3121J15425K14436J63845P114J60009
$$ 6971485 6552149 6478125 6300745 6350469 6317348 6432773 6647209 6811054 6818168 6978177
4900F978177q305K43373o2352L0724J55375R4466K26522j32988L637J8268P0846
$$ 6978177 6969872 7213245 7150893 7181617 7336992 7431458 7657980 7524992 7528629 7546897 7617743
4889G617743j9560J08315j78628j17220j71673j61466j2916j73449r3871k96876
$$ 7617743 7598183 7706498 7527870 7410650 7238977 7077511 7064595 6891146 6797275 6500399
4879F500399o6939j72165j65041O0442l8431J0434Q1385n2200J03355n602j37067
$$ 6500399 6433460 6261295 6096254 6156696 6118265 6128699 6210084 6157884 6261239 6255637 6118570
4868F118570N5184k88702j25418k92070k25027l23810k63333k21332k75686j71207
$$ 6118570 6173754 5885052 5759634 5467564 5242537 4918727 4655394 4434062 4158376 3987169
4858C987169k59613j44211q7646j3808o0949J60727j55200J2291P8299O5660J88563
$$ 3987169 3727556 3583345 3495699 3481891 3420942 3581669 3426469 3438760 3517059 3582719 3771282
4847C771282J02894J07300J69124J85171J50279J5898J53928p5896K973m0405
$$ 3771282 3874176 3981476 4150600 4335771 4486050 4501948 4655876 4579980 4582953 4542548
4837D542548l3697k70661m6629j51204k25452l47045r9023k50471o4958k71876
$$ 4542548 4508851 4238190 4191561 4040357 3814905 3467860 3368837 3118366 3053408 2781532
4827B781532k01392M4744m8719j14660J81997K6116n2710N084j30855J92567r8008
$$ 2781532 2580140 2624884 2576165 2461505 2643502 2669618 2616908 2621992 2491137 2683704 2585696
4816B585696O8872J05695j9740K4748m9278O2548n2378J4696p1659P3190K5153
$$ 2585696 2654568 2760263 2740523 2765271 2715993 2778541 2726163 2740859 2669200 2742390 2767543
4805B767543M761j03388P9791l121L830j05550M3607P047R53n1841K6123M3162
$$ 2767543 2772304 2668916 2748707 2745586 2749416 2643866 2687473 2694520 2695473 2643632 2669755 2712917
4793B712917J89419m0806R6527k361P3560o7854j66619R0389L3302j14922J0016
$$ 2712917 2902336 2861530 2958057 2955696 3029256 2961402 2794783 2885172 2918474 2803552 2813568
4782B813568J24481k99094K10631j29979K4731o6952J7402j84589R6066k08990
$$ 2813568 2938049 2638955 2849586 2719607 2744338 2677386 2694788 2510199 2606265 2397275
4772B397275K3931m5896J48900m8335j54149J8223j6663k3129m9565l7864m2774
$$ 2397275 2421206 2375310 2524210 2475875 2321726 2339949 2323286 2300157 2250592 2212728 2169954
4761B169954l2227M9215j06872j06934m020k105r2061N5358j45304R1078q0198
$$ 2169954 2137727 2186942 2080070 1973136 1969116 1967011 1874950 1930308 1785004 1876082 1795884
4750A795884p5407J35843j95434J62337j4684n6883m5420J24294j04563p429M8350
$$ 1795884 1720477 1856320 1660886 1823223 1808539 1751656 1706236 1830530 1725967 1718538 1766888
4739A766888p3280J4757P9251L3320J05640j15940J28730J0511m0338J69334k02104
$$ 1766888 1693608 1708365 1787616 1820936 1926576 1810636 1939366 1949877 1909539 2078873 1876769
4728A876769M0556J43753P8319j34976J6149K8394J19416L2451J30010k01502
$$ 1876769 1917325 2061078 2139397 2004421 2020570 2048964 2168380 2200831 2330841 2129339
4718B129339J45986L2591J25829m9142J03257J2683Q9299Q6888J80996o6132K34106
$$ 2129339 2275325 2307916 2433745 2384603 2487860 2500543 2589842 2676730 2857726 2791594 3025700
4707C025700R1328J39190K41659L2661J34816J84233O1391R7535J73792J07007
$$ 3025700 3117028 3256218 3497877 3530538 3665354 3849587 3910978 4008513 4182305 4289312
4697D289312J97445J98669K03185N4687J42933J0266p0472m02o7344o3899j37937
$$ 4289312 4486757 4685426 4888611 4943298 5086231 5096497 5026025 5025623 4958279 4894380 4756443
4686D756443j50000m9776j27539j35550L2606j6678k0969J29499m8629n5091K91908
$$ 4756443 4606443 4556667 4429128 4293578 4326184 4309506 4288537 4418036 4369407 4314316 4606224
4675D606224j6812K54550n6939N0399J85976N2271L5893L43231J3847j06228K26923
$$ 4606224 4589412 4843962 4787023 4837422 5023398 5075669 5111562 5454793 5468640 5362412 5589335
4664E589335r0846M9982j68727m4407q359k95604q7601n03989r0672m2604j40368
$$ 5589335 5498489 5548471 5379744 5335337 5326978 5031374 4943773 4439784 4349112 4306508 4166140
4653D166140j3997j62124J9766j44801j25129K7987l7479k9415P594L4937q5490
$$ 4166140 4152143 3990019 4009785 3864984 3739855 3767842 3730363 3700948 3708542 3743479 3657989
4642C657989O4218j85742J36140q2950n9025l5821J1871j15427p9993P9067O2552
$$ 3657989 3722207 3536465 3672605 3589655 3530630 3494809 3506680 3391253 3311260 3390327 3452879
4631C452879j59096J08559k0894j52337m0444J98789j91517J01503p5784J9506
$$ 3452879 3293783 3402342 3381448 3229111 3188667 3387456 3195939 3297442 3221658 3241164
4621C241164n7229j2269J12953j18060N533j26647J59888p3994N8826L0151l9714
$$ 3241164 3183935 3171666 3284619 3166559 3172092 3045445 3205333 3131339 3190165 3220316 3180602
4610C180602n8984P1605l0183j36607J92494k4157j41682J31631k15124O5868
$$ 3180602 3121618 3193223 3163040 3026433 3218927 3194770 3053088 3184719 2969595 3035463
4600C035463j8393o8358J69126j3115M9574q3041J53420k16202O5335P2332J5458
$$ 3035463 3017070 2948712 3117838 3104723 3154297 3071256 3224676 3008474 3073809 3146141 3161599
4589C161599k2020J23621j06607R6237n099R9579O1753q911R5808r0728R7524
$$ 3161599 3139579 3263200 3156593 3252830 3247731 3347310 3409063 3400152 3495960 3405232 3502756
4578C502756L390M9555l0280n5389J46855q7078L4645R6080k49442L4482n766
$$ 3502756 3506146 3555701 3525421 3470032 3616887 3529809 3564454 3660534 3411092 3445574 3439808
4567C439808N9573N7233j0254l597N019R2348R3581o6371j8899J50254P1555K37913
$$ 3439808 3499381 3556614 3546360 3542763 3547782 3640130 3733711 3667340 3648441 3798695 3870250 4108163
4555D108163J22472m522Q9332p7013R2546p3140j4901j4277r2032J57579j42190
$$ 4108163 4230635 4226113 4315445 4238432 4330978 4257838 4242937 4228660 4136628 4294207 4152017
4544D152017q2226r9089J0392j06855J8197j99256J70254j06201j1246J3507k5517
$$ 4152017 4069791 3970702 3981094 3874239 3892436 3693180 3863434 3757233 3745987 3759494 3733977
4533C733977K94M5820K7299K6617J47683J37186l6136o8945Q2572o277P605q3029
$$ 3733977 3734271 3780091 3807390 3834007 3981690 4118876 4082740 4013795 4096367 4090090 4097695 4014666
4521D014666j07438J24402k5434k89418K9328J1150K4927j61664r9540K3600n7538
$$ 4014666 3907228 4031630 4006196 3716778 3746106 3757256 3782183 3620519 3520979 3544579 3487041
4510C487041J4841j19452O2634j00431J02181j78734m9926J41447n6395J4064
$$ 3487041 3501882 3382430 3445064 3344633 3446814 3268080 3218154 3359601 3303206 3317270
4500C317270p2720J40774k12928K0595J25671j92685O2835k8506q7488k4739O0637
$$ 3317270 3244550 3385324 3172396 3192991 3318662 3125977 3188812 3160306 3072818 3048079 3108716
4489C108716J020m3853k3170L4117N7478p4080O5690K0990P0853O6880q9867P7664
$$ 3108716 3109736 3065883 3042713 3076830 3134308 3060228 3125918 3146908 3217761 3284641 3194774 3272438
4477C272438n1540R3370q8195J07221M768L3679J09946j32044k6166J1597J22301
$$ 3272438 3220898 3314268 3226073 3333294 3338062 3371741 3481687 3349643 3323477 3335074 3457375
4466C457375m0350Q5824j90451J31569j44131J00536N5963M3196j14529J9713
$$ 3457375 3417025 3502849 3312398 3443967 3299836 3400372 3456335 3499531 3385002 3404715
4456C404715J24106L0230m7739j3511R9674O7400L3958p9333K48767k3136J2047
$$ 3404715 3528821 3559051 3511312 3497801 3597475 3664875 3698833 3619500 3868267 3845131 3857178
4445C857178Q3144J20925m2667R9303K4100K0691J04377k1849J15846p5976J30106
$$ 3857178 3940322 4061247 4018580 4117883 4141983 4162674 4267051 4245202 4361048 4285072 4415178
4434D415178r9341l7679J20143L6733q5053J73045J2634O1089J4151p0216J43929
$$ 4415178 4315837 4278158 4398301 4435034 4349981 4523026 4535660 4596749 4610900 4540684 4684613
4423D684613j39703J15046K16974j22593J10667J07455K5805J95401Q8614J85173
$$ 4684613 4544910 4659956 4876930 4754337 4865004 4972459 4998264 5193665 5282279 5467452
4413E467452m22580K15759K579J84010J72112o7874j27960K87059L0623l1232
$$ 5467452 5044872 5260631 5263210 5447220 5619332 5551458 5423498 5710557 5741180 5709948
4403E709948J62646K1418J0896M1903k432J53891J86373p8660K68231n9468J409
$$ 5709948 5872594 5894012 5904908 5946811 5944379 6098270 6284643 6205983 6474214 6414746 6416155
4392F416155K47980L2834J78783j4951J04182K54277K9198P4164O1513J40716
$$ 6416155 6664135 6696969 6875752 6860801 6964983 7219260 7248458 7322622 7384135 7524851
4382G524851L12224J21087J21955K80340R1454L15150M0381K55717K00977L05222
$$ 7524851 7837075 7958162 8080117 8360457 8451911 8767061 8807442 9063159 9264136 9569358
4372I569358J38302O0070J96880K16350K81005K1011L31825K18878K47389K48716
$$ 9569358 9707660 9767730 9964610 10180960 10461965 10482976 10814801 11033679 11281068 11529784
4362A1529784L16596J91432J25170K98071K41784K40412K28119J79421L16942
$$ 11529784 11846380 12037812 12162982 12461053 12702837 12943249 13171368 13350789 13667731
4353A3667731L93921L09917K55352N25551L94521N30173M18755O86536J38611
$$ 13667731 14061652 14371569 14626921 15152472 15546993 16077166 16495921 17182457 17321068
4344A7321068O01814L29875O89402M84780M88627P13881O34615Q28371O54336
$$ 17321068 17922882 18252757 18942159 19426939 19915566 20629447 21264062 22092433 22746769
4335B2746769J114826J241920J059727J299531J397396J634939J819464J940583
$$ 22746769 23861595 25103515 26163242 27462773 28860169 30495108 32314572 34255155
4327C4255155K121063J994935K149956K231556J892650J881643J633065J124819
$$ 34255155 36376218 38371153 40521109 42752665 44645315 46526958 48160023 49284842
4319D9284842N29571J18694l03275o34095j409024j297046j544785j875981j819829
$$ 49284842 49814413 49933107 49629832 48995737 47586713 46289667 44744882 42868901 41049072
4310D1049072j663969j622212j668165j472058j042750j189656q18732j014995
$$ 41049072 39385103 37762891 36094726 34622668 33579918 32390262 31571530 30556535
4302C0556535r15430q96088j207118p35928n37188j003848q91585o90542o31079
$$ 30556535 29641105 28745017 27537899 26801971 26264783 25260935 24369350 23678808 23047729
4293B3047729o05594m20648m75438l96986o17024l75690l96761m04440l35737
$$ 23047729 22442135 22021487 21546049 21149063 20532039 20156349 19759588 19355148 19019411
4284A9019411j33920l42071k06424j76002j19602P4660o1314L57550L22354j09178
$$ 19019411 18885491 18543420 18336996 18160994 18041392 18116052 18054738 18412288 18734642 18625464
4274A8625464k41564m58342m50645k68401o34881n12599q27833n05524m89423
$$ 18625464 18383900 17925558 17474913 17206512 16571631 16059032 15231199 14725675 14236252
4265A4236252m08732n70681l72256l20136k90086j30289l81685k35316l13113
$$ 14236252 13827520 13256839 12884583 12564447 12274361 12144072 11762387 11527071 11213958
4256A1213958L6740l0818k10966o855o5166J81306R0549J38190O4934p8211r6740
$$ 11213958 11250698 11219880 11008914 11002059 10936893 11118199 11208748 11346938 11411872 11333661 11236921
4245A1236921j27163k48020k03761k37277l88922k83810k28212k20389k83610
$$ 11236921 11109758 10861738 10657977 10420700 10031778 9747968 9519756 9299367 9015757
4236I015757j90143j78180l14441q2781k39985q7739j02959p6469j0644j88343
$$ 9015757 8825614 8647434 8332993 8250212 8010227 7922488 7819529 7743060 7732416 7544073
4226G544073m3831j10262l1833j05002r5958R6709j84693N036j57562j68924M5850
$$ 7544073 7500242 7389980 7358147 7253145 7157187 7253896 7069203 7074239 6916677 6747753 6793603
4215F793603j07435j8875j93450l5712j86679l4098j47854q6031j54751K30991
$$ 6793603 6686168 6667293 6473843 6438131 6251452 6217354 6069500 5983469 5828718 6059709
4205F059709j12028k4992Q814j75540P1766r3002Q7678p6496m0641J2082n2168
$$ 6059709 5947681 5922689 5931503 5755963 5827729 5734727 5822405 5745909 5705268 5717350 5665182
4194E665182R7298p5694j17758q0009L2814r6924j29656Q6625o3215j84693J52420
$$ 5665182 5762480 5686786 5569028 5489019 5521833 5424909 5295253 5381878 5318663 5133970 5286390
4183E286390r1895j39680N5849j57753P971n9870Q447J198l1634P8238n4123m9984
$$ 5286390 5194495 5054815 5110664 4952911 4960882 4901012 4909459 4910657 4879023 4957261 4903138 4853154
4171D853154J05229k11139J19893k5991o5419m107j26072l4015K5689r6383K8102
$$ 4853154 4958383 4747244 4867137 4841146 4775727 4771620 4645548 4611533 4637222 4540839 4568941
4160D568941n9946J3485j21234M4538j04065J11310j45199J52068j7798j55029
$$ 4568941 4508995 4522480 4401246 4445784 4341719 4453029 4307830 4459898 4442100 4287071
4150D287071n3261L7241m4984o9622J26592l36585L7660P2007k31909J12842j58007
$$ 4287071 4233810 4271051 4226067 4156445 4283037 3946452 3984112 4056119 3824210 3937052 3779045
4139C779045M0112k39568J17880O384n8781J14634j04142J08223r4259k3858k4643
$$ 3779045 3819157 3579589 3697469 3703853 3645072 3759706 3655564 3763787 3669528 3645670 3621027
4128C621027K44969k78426O3220k0669o8543K8193j12699K4067n0649J3565k0259
$$ 3621027 3865996 3587570 3650790 3630121 3561578 3589771 3477072 3501139 3450490 3464055 3443796
4117C443796O7503j85741J39406r2303K7971m910L9317m2785L5061k8434r984
$$ 3443796 3511299 3325558 3464964 3372661 3400632 3395722 3435039 3392254 3427315 3398881 3388897
4106C388897P0459j7416J22683m6023J45775r7900j4199J4087R8012N9447J00052
$$ 3388897 3459356 3441940 3564623 3518600 3664375 3566475 3552276 3566363 3664375 3723822 3823874
4095C823874J01126K4843r4791J46838L1542j0161J87741l4814P3815P5790J68662
$$ 3823874 3925000 3949843 3855052 4001890 4033432 4023271 4211012 4176198 4250013 4325803 4494465
4084D494465r2314J76421p3629R9437M1397K4215J87018j59677J1436J88233M1027
$$ 4494465 4402151 4578572 4504943 4604380 4645777 4669992 4857010 4697333 4708769 4897002 4938029
4073D938029M5811N1273N3428J57776J4107J92374M6657J56243p3898K64488R9253
$$ 4938029 4983840 5035113 5088541 5246317 5260424 5452798 5499455 5655698 5581800 5846288 5945541
4062E945541J76012J31419K53612R8335L77088J72820K31248J92694O4047L47775
$$ 5945541 6121553 6252972 6506584 6604919 6982007 7154827 7386075 7578769 7642816 7990591
4052G990591L57008K22520K16546M19771J60583K80749J69654K42691K83763P3214
$$ 7990591 8347599 8570119 8786665 9206436 9367019 9647768 9817422 10060113 10343876 10417090
4042A0417090J09124L61651K34550K41643J64710J08028M57519J62807L24468
$$ 10417090 10526214 10887865 11122415 11364058 11528768 11636796 12094315 12257122 12581590
4033A2581590M55082M47245M71253N02927N81177P64882O72263O35238P41852
$$ 12581590 13036672 13483917 13955170 14458097 15039274 15804156 16476419 17111657 17853509
4024A7853509Q43638N30165N29918L15102K10483n8801J4786l07428j90835q8479
$$ 17853509 18697147 19227312 19757230 20072332 20282815 20224014 20238800 19931372 19740537 19652058
4014A9652058m43187k32627l26453n4590l1595k5686J38368K46356K14885K89135
$$ 19652058 19208871 18976244 18649791 18595201 18563606 18537920 18676288 18922644 19137529 19426664
4004A9426664K03847P06008L17567L80067K91326K60928K38562j05077q213l18640
$$ 19426664 19630511 20336519 20654086 21034153 21325479 21586407 21824969 21719892 21711679 21393039
3994B1393039l79173m20021n32112o72180n47218m73430o50916p00105m49565
$$ 21393039 21013866 20593845 20061733 19389553 18842335 18368905 17717989 17017884 16568319
3985A6568319k10354o33685j39944j35229l10212r3470o0554k35446j29402m17585
$$ 16568319 16357965 15724280 15584336 15449107 15138895 15045425 14984871 14749425 14620023 14202438
3975A4202438r4043m60755m07690n08866n91050o05720m50613n76284n66620m84262
$$ 14202438 14108395 13647640 13239950 12731084 12140034 11534314 11083701 10507417 9940797 9456535
3965I456535n92096l35342n51421l87419l60508l16668j79112k46444l32315k31669
$$ 9456535 8864439 8529097 7977676 7590257 7229749 6913081 6733969 6487525 6155210 5923541
3955E923541k00068k16179k57382l53061Q3400j63279j89363j77414j09587j25359
$$ 5923541 5723473 5507294 5249912 4896851 4980251 4816972 4627609 4450195 4340608 4215249
3945D215249j10279j96856k06577j32515p0380k34206q7640p9199m7015j53275
$$ 4215249 4104970 3908114 3701537 3569022 3498642 3264436 3176796 3097597 3050582 2897307
3935B897307j04739j89752O2345j30240j19795k5389p8115k2764K1064j12908
$$ 2897307 2792568 2602816 2665161 2534921 2415126 2389737 2311622 2288858 2309922 2197014
3925B197014l6949p8201l8989q9233J08783p7785j3511r9570J6440p8884n8858
$$ 2197014 2160065 2081864 2042875 1953642 2062425 1984640 1971129 1871559 1887999 1809115 1750257
3914A750257k063m3570j28369o5685n1874L4603j05521j04252j8102q751j7431
$$ 1750257 1748194 1704624 1576255 1510570 1458696 1493299 1387778 1283526 1265424 1256673 1239242
3903A239242N3296k4219j01791O1795n7652J967j79309n2012J54102k12436P9927
$$ 1239242 1292538 1268319 1166528 1228323 1170671 1172638 993329 941317 1095419 882983 962910
3892I62910p1293N7348j53674J94527k07527J39320j88369K29856j64873M3240
$$ 962910 891617 948965 795291 989818 782291 921611 733242 963098 798225 841465
3882H41465n0207K6317k06716J73604j16230o2214p4897j06844L2790j06053J85886
$$ 841465 791258 817575 610859 784463 668233 606019 531122 424278 457068 351015 536901
3871E36901j13604L4478N5085k171j43558P741L66l5064j9662M4809O1865p2774
$$ 536901 423297 457775 512860 510689 367131 374872 375238 340174 320512 365321 427186 354412
3859C54412j28931P8863J76438j71744J05209r1545k26589L48815j20504m6739
$$ 354412 225481 304344 480782 309038 414247 322702 96113 444928 324424 277685
3849B77685r5541K56648j99797J4540J6665o2431M131P6327r8553J29084k518
$$ 277685 182144 438792 238995 253535 270200 207769 211900 288227 189674 318758 316240
3838C16240p2756j21136J39770m2701l2240k1571J4825R933p0149J05533q3545
$$ 316240 243484 122348 262118 219417 187177 165606 180431 190364 120215 225748 142203
3827A42203j06643J0237l8617M2496J23348j17632l5902J56511r5410Q4700l130
$$ 142203 35560 45797 7180 49676 173024 55392 19490 176001 80591 165291 162161
3816A62161j54125J00852P0949N299k4244p9418J28704k6734j38641J71153r2131
$$ 162161 8036 108888 179837 185136 160892 81474 210178 183444 44803 215956 123825
3805A23825N5343j47658k7816J9063J59124p439j45352k4311l8593L6579Q3298
$$ 123825 179168 31510 3694 22757 181881 174442 29090 4779 -33814 2765 86063
3794H6063L5540L7957n1179m6427j0742p456m8377P3675j47329J05688P077J97113
$$ 86063 121603 159560 108381 61954 51212 43756 -4621 69054 -78275 27413 34490 231603
3782B31603j78177L7988j48968J41754r1278J18360j35521K67889j06525r4263
$$ 231603 53426 91414 -57554 84200 -7078 111282 -24239 243650 137125 42862
3772D2862N5517M1130j92194J5543J30455k02772J99008M7549j33168L0635J3619
$$ 42862 98379 139509 -52685 -37142 93313 -109459 89549 137098 3930 34565 48184
3761D8184o0843m4173M9284P8690n2263j27483J02336r110J02404p0802r1690
$$ 48184 -12659 -56832 -7548 71142 18879 -108604 -6268 -15378 87026 16224 -75466
3750g5466M2535L796M4442o7868N0712P2200j51189N9103q175j00418J9357J23378
$$ -75466 -32931 -29135 15307 -52561 -1849 70351 -80838 -21735 -29910 -130328 -110971 12407
3738A2407K1364m7656Q9425j13469L165q4631J68864j95076J02373p3306k7137
$$ 12407 33771 -13885 75540 -37929 -34764 -119395 49469 -145607 -43234 -116540 -143677
3727a43677j6148N4666M2543M3609j69884J20889q0702K06384j45965q5988M1987
$$ -143677 -159825 -105159 -62616 -19007 -188891 -68002 -148704 57680 -88285 -174273 -132286
3716a32286j12556J65935p0713q1779K2944J13098k3103O8792M9941j20434N0586
$$ -132286 -244842 -78907 -149620 -231399 -208455 -95357 -118460 -49668 273 -120161 -69575
3705f9575r1957j17149J88252Q10j7633n9536k7637M8953L3118j05207l5882K25930
$$ -69575 -161532 -278681 -90429 -89619 -107252 -166788 -194425 -145472 -112354 -217561 -253443 -27513
3693b7513j18073o5226J69017j49063J46438j34450R3192j94457J05163l8262
$$ -27513 -145586 -210812 -41795 -190858 -44420 -178870 -85678 -280135 -174972 -213234
3683b13234n5420R8087o8857L4395m2063J7471M0212N4030l9183P82O9262M253
$$ -213234 -268654 -170567 -239424 -205029 -247092 -229621 -189409 -135379 -174562 -173780 -104518 -100265
3671a00265q0053O5300j4514k63880J75817p3656P7355K6369j85681J9417Q3815
$$ -100265 -180318 -115018 -129532 -393412 -217595 -291251 -213896 -187527 -373208 -353791 -269976
3660b69976L9701J9180K1261p7479j54107K88041j00373l886m2032O268N690R5540
$$ -269976 -230275 -211095 -189834 -267313 -421420 -133379 -233752 -237638 -279670 -273402 -267712 -172172
3648a72172J07o2833P067Q9205J1459r2851q0098L1274O2178j07809J2227l1012
$$ -172172 -172065 -234898 -227831 -138626 -127167 -220018 -300116 -268842 -206664 -314473 -302246 -333258
3636c33258J7826O1959M8578l6132Q6387j49735Q7531m203p0233O4002j0663n5899
$$ -333258 -315432 -253473 -204895 -241027 -154640 -304375 -216844 -221047 -291280 -227278 -237941 -293840
3624b93840J16903k39333K54473m8549J9936n8085j53165J96098J5268j39239
$$ -293840 -176937 -416270 -161797 -210346 -190410 -248495 -401660 -205562 -190294 -329533
3614c29533K110J13071j1727n2966J6599K8389j24656P4060J5103j2363k0543
$$ -329533 -327423 -214352 -226079 -279045 -262446 -234057 -358713 -284653 -269550 -281913 -302456
3603c02456j33636J32020O4709N9712m7159M3577j77061K40256j53721N0485M5032
$$ -302456 -436092 -304072 -239363 -179651 -226810 -183233 -360294 -120038 -273759 -223274 -178242
3592a78242j77631K13436j60528N4693k7413N0193m5179m139q3486J22487j78172
$$ -178242 -355873 -142437 -302965 -248272 -275685 -225492 -270671 -274810 -358296 -235809 -413981
3581d13981P0804P7970M638j65669J54986m3814N774r9128J25497N1043j12213
$$ -413981 -343177 -265207 -260569 -426238 -271252 -315066 -309292 -408420 -282923 -231880 -344093
3570c44093O7119j10576J11860L3284P132j17446J46664J00781o2399n2879J23098
$$ -344093 -276974 -387550 -275690 -242406 -235274 -352720 -206056 -105275 -167674 -220553 -97455
3559i7455p4720Q2674K3568m099j1455o1168Q054k15624R8074o0198J79002P6282
$$ -97455 -172175 -89501 -65933 -70032 -81487 -142655 -134601 -350225 -252151 -312349 -133347 -57065
3547e7065k62312N9188J5369r0477M6680q600j4676J5849J2035J08506j38454
$$ -57065 -319377 -260189 -244820 -335297 -288617 -297217 -311893 -296044 -284009 -175503 -313957
3536c13957j7550q2215j4001J27231O3896J1376o5668J30630k29205k003R1416
$$ -313957 -331507 -413722 -427723 -300492 -236596 -225220 -290888 -160258 -389463 -391466 -300050
3525c00050Q011N7330q8936j38562N6237J02770J05422j11678j42556J60791O5918
$$ -300050 -292039 -234709 -323645 -462207 -405970 -303200 -197778 -309456 -452012 -291221 -225303
3514b25303l9409q4208l7059N2401L4622o6474K04185j50000n192j65514K48909
$$ -225303 -264712 -348920 -385979 -333578 -298956 -365430 -161245 -311245 -316437 -481951 -233042
3503b33042j56143K71426k73365J60326j13065l1819J0086P4653L5563K0707m6858
$$ -233042 -389185 -117759 -391124 -230798 -343863 -375682 -365596 -290943 -255380 -234673 -281531
3492b81531M2630q4092P8934p9108j33001J28459m3042n4206L7164O4528K1702
$$ -281531 -238901 -322993 -244059 -323167 -456168 -327709 -370751 -424957 -387793 -323265 -301563
3481c01563p6080N4581l0011P3604j6829N5851l8356P9132j34949k7829R71J32652
$$ -301563 -377643 -323062 -353073 -279469 -296298 -240447 -278803 -199671 -334620 -362449 -361478 -228826
3469b28826j28529Q1856P0291M0638k9113j00748j19015J14760J09149M370k4605
$$ -228826 -357355 -275499 -205208 -164570 -193683 -294431 -413446 -298686 -189537 -185167 -209772
3458b09772n8753j8367R1895j30702R3548Q3284M6265m6454J2613j58595N4472
$$ -209772 -268525 -286892 -194997 -325699 -232151 -148867 -102602 -149056 -136443 -295038 -240566
3447b40566J38632M1847k11359Q8034o965K6438K1352J5564K7229n6985o5959
$$ -240566 -101934 -60087 -271446 -183412 -190377 -163939 -142587 -127023 -99794 -156779 -222738
3436b22738Q6225N3923r2741L9181L154l7565J11988n1570q4920K02914K1459
$$ -222738 -136513 -82590 -175331 -136150 -132996 -170561 -58573 -110143 -195063 7851 29310
3425B9310N002k9023j3033J3696L1686j17191N1203n2859P882K03378r6720P175
$$ 29310 34312 5289 -7744 5952 37638 -79553 -28350 -81209 -73327 130051 33331 40506
3413D0506O4472j14825O0778M0524M5663j02621M6521J6393r5263K30206m2586
$$ 40506 104978 -9847 50931 91455 137118 34497 81018 97411 2148 232354 189768
3402A89768j71990J23766j7296Q5821J4592K7107R2788j96904J72107j31839J27155
$$ 189768 17778 141544 124248 210069 224661 251768 344556 147652 319759 187920 315075
3391C15075p7114K1330K0712K6322N7992r7471K33366j01457k7682Q9605M4558
$$ 315075 237961 259291 280003 306325 364317 266846 500212 398755 371073 460678 505236
3380E05236J0176j06483J62742j20232Q6491L84l8040P8869J02234k4054j653
$$ 505236 515412 408929 571671 451439 537930 538314 500274 579143 681377 657323 655670
3369F55670J13738Q531J52551j3353J02780Q4671k0691N7246R2853k1515J55846
$$ 655670 769408 777939 930490 917137 1019917 1104588 1083897 1141143 1233996 1212481 1368327
3358A368327K13912n7189K19107j19528J36840Q8698J61276N1400P4896R9798
$$ 1368327 1582239 1525050 1744157 1624629 1761469 1850167 2011443 2062843 2137739 2237537
3348B237537J86082J30375L10367L40569L67344N47826N99494O15063O47789Q99742
$$ 2237537 2423619 2553994 2864361 3204930 3572274 4120100 4719594 5334657 5982446 6882188
3338F882188P44140R17569Q32024J025504J529119K093436K451358K509516K831154
$$ 6882188 7626328 8543897 9375921 10401425 11930544 14023980 16475338 18984854 21816008
3329B1816008L496997M606560O080953N947771J360303J67009q75715j444965
$$ 21816008 25313005 29919565 36000518 41948289 43308592 43475601 42599886 41154921
3321D1154921j492699k313617l980269m572612m434253l458256k710375l090234
$$ 41154921 39662222 37348605 33368336 28795724 24361471 20903215 18192840 15102606
3313A5102606k448826j817834j615100j333162j253853j021968p22519p94631
$$ 15102606 12653780 10835946 9220846 7887684 6633831 5611863 4889344 4094713
3305D094713o13445o02285m41076k61919l46973k15330k53047n8772j29052k27737
$$ 4094713 3481268 2878983 2437907 2175988 1829015 1613685 1360638 1301866 1172814 945077
3295I45077n4119k35041j01726j16000J04354n5804o6179n7791j6955j43567k4404
$$ 945077 890958 655917 554191 438191 542545 486741 420562 362771 345816 202249 177845
3284A77845Q29q635J11839j98134Q5185j4263P3775j3650n3597j97939J21315
$$ 177845 178674 170039 281878 83744 168929 154666 228441 214791 161194 -36745 84570
3273H4570j6928j49480K3163J04156j06829L9329k1620j02995K3064m653K8892
$$ 84570 67642 -81838 -58675 45481 -61348 -22019 -43639 -146634 -123570 -128223 -99331
3262i9331j18935O9678J07663P357n3306R6263j30956j41906K7655J16941k3441
$$ -99331 -218266 -148588 -40925 -33568 -86874 9389 -121567 -263473 -235818 -118877 -142318
3251a42318k00949O3471L1371j08447J57785j9824o824M3173j20829N8642m7556
$$ -142318 -343267 -279796 -248425 -356872 -199087 -218911 -225735 -182562 -303391 -244749 -292305
3240b92305J09501j84371J39173j60979J80755r2076L7039J42423k05634J00990
$$ -292305 -182804 -367175 -228002 -388981 -208226 -300302 -263263 -120840 -326474 -225484
3230b25484n1598n3483k5667R064l9047J19446n8360n0844O6801k0446j839j27085
$$ -225484 -277082 -330565 -356232 -347168 -386215 -266769 -325129 -375973 -309172 -329618 -331457 -458542
3218d58542N8666J3245J66026l828o6856r1315P3789r9034P0190m8411q0758R1644
$$ -458542 -399876 -386631 -220605 -224433 -291289 -382604 -308815 -407849 -337659 -386070 -466828 -375184
3206c75184k7375J76097j51714M9274n4816K36381k71604L4168N4803M7205J15623
$$ -375184 -402559 -226462 -378176 -328902 -383718 -147337 -418941 -384773 -329970 -282765 -167142
3195a67142k63999J5286k7806J03045l2774M0622j0177j9442N4818q6086m3357
$$ -167142 -431141 -415855 -443661 -340616 -373390 -332768 -342945 -362387 -307569 -393655 -437012
3184d37012J52010m0922k9820p4759q369J14519P234L9690l1242J971j34538M6125
$$ -437012 -285002 -325924 -355744 -430503 -438872 -324353 -317119 -277429 -308671 -306700 -441238 -395113
3172c95113j8826P3763j67470J30950n0901k7391P5757N5275j05269k38n6359
$$ -395113 -413939 -340176 -507646 -376696 -427597 -454988 -379231 -323956 -429225 -429463 -485822
3161d85822O6025R6543J61436k20621l2900Q812n7929P2503q3196N7022r9748
$$ -485822 -419797 -323254 -161818 -382439 -415339 -406527 -464456 -391953 -475149 -418127 -517875
3150e17875L2816J29067j49274J58790m3217j12066Q8731J83305j72681j0990
$$ -517875 -485059 -355992 -505266 -346476 -389693 -501759 -413028 -229723 -402404 -413394
3140d13394N1211n4704l5003j2364j027Q8398P508j20666J8319J43866j10913
$$ -413394 -362183 -416887 -451890 -464254 -465281 -376883 -369375 -490041 -471722 -327856 -438769
3129d38769P9541o9044M7349o4530P9464m8602j00259J01340o2795N018O0966
$$ -438769 -359228 -428272 -380923 -445453 -365989 -414591 -514850 -413510 -476305 -471287 -410321
3118d10321p2246J48677q7761L8432R4263o5175L7777j15931k7680Q2249K2457
$$ -410321 -482567 -333890 -421651 -383219 -288956 -354131 -316354 -432285 -459965 -377716 -355259
3107c55259j83216J53173k9151m0989Q7065o505K3660J54024r5356o48n9217O2498
$$ -355259 -538475 -385302 -414453 -455442 -368377 -374882 -351222 -197198 -292554 -293202 -352419 -289921
3095b89921O7855K7399j63865M0497J63371J97064r2552q3579n0778j63298J16587
$$ -289921 -222066 -194667 -358532 -318035 -154664 42400 -50152 -133731 -184509 -347807 -231220
3084b31220n4127J54695j54655P7456r3020N7973k30520J42702j11478R2509Q027
$$ -231220 -285347 -130652 -285307 -207851 -300871 -242898 -473418 -330716 -442194 -349685 -341658
3073c41658j34111L7768J00008p192K7843l0324j9128N7618o2495J08836r8283
$$ -341658 -475769 -438001 -337993 -345185 -317342 -347666 -366794 -309176 -371671 -262835 -361118
3062c61118k5774j17576J9815M517J00250P5914o6095j5623k8625O5676j00667
$$ -361118 -386892 -504468 -484653 -480136 -379886 -303972 -370067 -385690 -414315 -348639 -449306
3051d49306q4138K31502m1810n2602k1203J4538R2513j02598O6352j36095Q152
$$ -449306 -533444 -301942 -343752 -396354 -417557 -403019 -310506 -413104 -346752 -482847 -474695
3040d74695J33880j84046N7025o2029L2660J73231o8729Q2522j88890J33454p6316
$$ -474695 -340815 -524861 -467836 -529865 -497205 -323974 -392703 -310181 -499071 -365617 -441933
3029d41933m1539j2408J23011j39698J38687M0915p6419K15628j50402j31083
$$ -441933 -483472 -495880 -372869 -512567 -373880 -332965 -409384 -193756 -344158 -475241
3019d75241J60776q6781J2424M7046q6877P2933k5321K1623k08326K80105j71206
$$ -475241 -314465 -401246 -388822 -341776 -428653 -355720 -381041 -359418 -567744 -287639 -458845
3008d58845o4695J48337r4030J05692K5803k9415q7471J74675q0195n0187k0147
$$ -458845 -523540 -375203 -469233 -363541 -337738 -367153 -454624 -279949 -360144 -410331 -430478
2997d30478R4066k61029J08642J97991k50591Q3134J48O3175J3127r7595N8207
$$ -430478 -336412 -597441 -488799 -290808 -541399 -458265 -458117 -394942 -381815 -479410 -421203
2986d21203j18235K2006R1301K1162P1225k256j13269K3495N6054m9308j814j1454
$$ -421203 -539438 -517432 -426131 -404969 -333744 -336000 -449269 -425774 -369720 -419028 -420842 -432296
2974d32296J32935j48140K0976L8418j7502p5713J5134J17345k1443N5456j4211
$$ -432296 -299361 -447501 -426525 -388107 -405609 -481322 -466188 -348843 -370286 -314830 -329041
2963c29041K1394l4013k4003m9239L3787r2571J99037j30420L4780O4481p1102
$$ -329041 -307647 -341660 -365663 -414902 -381115 -473686 -274649 -405069 -370289 -305808 -376910
2952c76910O2101j22872j439J06161j712j44219R0540m0889O2119l4204k12409
$$ -376910 -314809 -437681 -439120 -332959 -334671 -478890 -388350 -429239 -367120 -401324 -613733
2941f13733K33486J5036l2649n8721l4608R9577j45925K08312q6150r0748J03059
$$ -613733 -380247 -365211 -397860 -456581 -491189 -391612 -537537 -329225 -415375 -506123 -403064
2930d03064j65066J96904R3771k6810j80407J31042R103n9470j22480J86646n8961
$$ -403064 -568130 -371226 -277455 -304265 -484672 -353630 -344527 -403997 -526477 -339831 -398792
2919c98792n6685P271J69998j59054j06911J08294Q4198r6450P0928O021m9220
$$ -398792 -455477 -448206 -278208 -437262 -544173 -435879 -351681 -448131 -377203 -371182 -420402
2908d20402L265J17703p2249r6694J37219j23287K1207j0109m3594J84016m1509
$$ -420402 -417137 -299434 -371683 -468377 -331158 -454445 -433238 -443347 -486941 -302925 -344434
2897c44434M7950j15843l1650J2029N8822n1086Q6099J3968j16504r10k7668R6434
$$ -344434 -296484 -412327 -443977 -431948 -373126 -424212 -338113 -324145 -440649 -441559 -469227 -372793
2885c72793k1755j9012l0086L4704P6509Q2330j32922p1737q0410L1900n8064
$$ -372793 -394548 -413560 -443646 -408942 -332433 -250103 -383025 -454762 -535172 -503272 -561336
2874e61336J23965m5443L7839J33796o5720n2774M4074j42250J43701O7505j14257
$$ -561336 -437371 -482814 -444975 -311179 -376899 -429673 -385599 -527849 -384148 -316643 -430900
2863d30900n0580J81748L6943r9702k23767K53082j25032J03038K8719O5837k96677
$$ -430900 -481480 -299732 -262789 -362491 -586258 -333176 -458208 -355170 -326451 -260614 -557291
2852e57291J93730j34409J42495o1076m0871M4300k6825M7531J9580q4222M5813
$$ -557291 -363561 -497970 -355475 -416551 -457422 -413122 -439947 -392416 -372836 -457058 -411245
2841d11245P6805J4329l8565m6081k6484k17801K81039M2175j47563J43806n1511
$$ -411245 -334440 -320111 -358676 -404757 -431241 -649042 -368003 -325828 -473391 -329585 -381096
2830c81096r648m0644J11729j60581J03295n62L9432L3392N17q8604j0666M5278
$$ -381096 -390744 -431388 -319659 -480240 -376945 -377507 -338075 -304683 -304166 -392770 -403436 -358158
2818c58158k0332P817R1202j81669j07875J50324P454m7887m5703J94006N027
$$ -358158 -378490 -370673 -279471 -461140 -569015 -418691 -411237 -459124 -504827 -310821 -305794
2807c05794n2689o0481K2603O413J06225o6848k0283j17575J429N1918Q6612q7246
$$ -305794 -358483 -418964 -396361 -389948 -283723 -350571 -370854 -488429 -487000 -435082 -348470 -435716
2795d35716N9561n3755K3037N5428j48914J22586k3433K9927p0249J9666O5353
$$ -435716 -376155 -429910 -406873 -351445 -500359 -377773 -401206 -371279 -441528 -421862 -356509
2784c56509K9932j00724j55871J94838M7414p8878r6809M9532K6863K8329j06748
$$ -356509 -326577 -427301 -583172 -388334 -340920 -419798 -516607 -467075 -440212 -411883 -518631
2773e18631J30625K6214m5834N7661K6889n8011n9341J16683K5533j99217L0863
$$ -518631 -388006 -361792 -407626 -349965 -323076 -381087 -440428 -323745 -298212 -497429 -466566
2762d66566J04168J15014k25776J33620j01323o2566K637Q9097n3967O4625k4744
$$ -466566 -362398 -247384 -473160 -339540 -440863 -503429 -500792 -411695 -465662 -401037 -425781
2751d25781L8613J9394n8183J38819j06032k7159N6264j6104n0723m791J23440
$$ -425781 -387168 -367774 -425957 -287138 -393170 -420329 -364065 -380169 -430892 -435683 -312243
2740c12243o9067j31833J76257p1126j8284Q5569p5656M1626l7051O6547Q1068
$$ -312243 -381310 -513143 -336886 -408012 -426296 -340727 -416383 -374757 -411808 -345261 -264193
2729b64193q6176k0505P6192k31036J15798N4317j17058N2819J12945j02860Q2836
$$ -264193 -350369 -370874 -294682 -525718 -409920 -355603 -472661 -419842 -306897 -409757 -326921
2718c26921j9259J20729k70975J27900j7611M8604M8223p0232j83084J44180J15483
$$ -326921 -346180 -225451 -496426 -368526 -386137 -337533 -289310 -359542 -542626 -398446 -282963
2707b82963p6738o3631J65034j13606l9195j09947K24846j23316Q8086K5249j34625
$$ -282963 -359701 -423332 -258298 -371904 -411099 -521046 -296200 -419516 -331430 -306181 -440806
2696d40806r3585j6729K05920M223j2776Q6531j06211R1393q1473m0200N4022
$$ -440806 -534391 -551120 -345200 -340977 -353753 -267222 -373433 -282040 -363513 -403713 -349691
2685c49691o2054l9422M4983J36987j24841k9337L3059k26593J72840p8706O4866
$$ -349691 -411745 -451167 -406184 -269197 -394038 -423375 -390316 -616909 -444069 -522775 -457909
2674d57909K6963K0873k4887n6683J02213j5592n6356J31156j8210p0122m6915
$$ -457909 -430946 -410073 -434960 -491643 -389430 -405022 -461378 -330222 -348432 -418554 -465469
2663d65469O2261r7669J17491Q660J4160n7792m7485J46395m4464M424j56480
$$ -465469 -403208 -500877 -383386 -374726 -360566 -418358 -465843 -319448 -363912 -359488 -515968
2652e15968J00241J0820L7717P2231j42141N9481m632n8575R2224l1603j4620
$$ -515968 -415727 -404907 -367190 -294959 -437100 -377619 -382251 -440826 -348602 -380205 -394825
2641c94825P7733j8621q043p8461J5315P136O4937k37235L8628P4796N9359P5578
$$ -394825 -317092 -335713 -343756 -422217 -406902 -399766 -334829 -572064 -533436 -458640 -399281 -323703
2629c23703j2024l6671P8671j39057K6473J05700n4464j20405J18642p1479O0793
$$ -323703 -335727 -372398 -293727 -432784 -406311 -300611 -355075 -475480 -356838 -428317 -367524
2618c67524Q3236p2062q4685J10709n1043m5198j27470J73046j7296K3141p9986
$$ -367524 -284288 -356350 -441035 -330326 -381369 -426567 -554037 -380991 -398287 -375146 -455132
2607d55132J38820j25626j00733O0750Q300j2904K28595k83056J38613J26789
$$ -455132 -316312 -441938 -542671 -481921 -473621 -486525 -257930 -540986 -402373 -275584
2597b75584j71131m7171Q0248P0378k2891M3189j61082P1454O7897q4476R9868
$$ -275584 -446715 -493886 -413638 -343260 -366151 -322962 -484044 -412590 -344693 -429169 -329301
2586c29301K896k6883n7808L1696k12071J46829n5635J57306j54757K01970j9660
$$ -329301 -326405 -353288 -411096 -379400 -591471 -444642 -500277 -342971 -497728 -295758 -315418
2575c15418j16693J34773k42363Q6016K9090j1962P7783r753n1837J01781l3498
$$ -315418 -432111 -297338 -539701 -453685 -424595 -436557 -358774 -368527 -420364 -318583 -352081
2564c52081k05129J44565O8702J6792m4723Q0193j07592J66116j01285j11647
$$ -352081 -557210 -412645 -343943 -327151 -371874 -291681 -399273 -233157 -334442 -446089
2554d46089J35217o669l3503J150j40446J21052J1775j23074J35954q9772J1689
$$ -446089 -310872 -317541 -351044 -349894 -490340 -369288 -357513 -480587 -344633 -434405 -422716
2543d22716K7562k3199n7635K6118k065j1948N9459k5966K7459j105P7700j82534
$$ -422716 -395154 -418353 -475988 -449870 -451935 -463883 -404424 -430390 -402931 -404036 -326336 -508870
2531e08870K9390M5794J4262k68224K93105P2444q4927K8217m468J13618j25576
$$ -508870 -479480 -433686 -419424 -687648 -394543 -322099 -407026 -378809 -383277 -269659 -395235
2520c95235J02261p9771l4924Q1110j74981J24887K8650J2j00130J0209J31003
$$ -395235 -292974 -372745 -407669 -326559 -501540 -376653 -348003 -347991 -448121 -437912 -306909
2509c06909L84k54156J94167m4425R5639J3284l3463l8600m7616N9871J09887
$$ -306909 -306525 -560681 -366514 -410939 -315300 -302016 -335479 -374079 -421695 -361824 -251937
2498b51937j19143J24626j41427l1099Q0425k540l5422o1578Q178O5368r3608
$$ -251937 -371080 -246454 -387881 -418980 -338555 -341095 -376517 -438095 -429917 -364549 -458157
2487d58157J42594j1726j74193J02175k5536J9182j7151L6736l6378N9584j50197
$$ -458157 -315563 -327289 -501482 -399307 -424843 -405661 -422812 -386076 -422454 -362870 -513067
2476e13067L1925P4222m0509M1113P8144N1527j3315l0876n7394q9283n1123K38129
$$ -513067 -481142 -406920 -447429 -406316 -328172 -276645 -289960 -320836 -378230 -467513 -518636 -280507
2464b80507k27842K15620j14407m7870K9443Q1186l5117l8380j51328J86624o6654
$$ -280507 -508349 -292729 -407136 -455006 -425563 -344377 -379494 -417874 -569202 -382578 -449232
2453d49232M5285j516l6906J0055k643N9115L0630n8410l3707O6165j18486L7059
$$ -449232 -403947 -405463 -442369 -432314 -434957 -375842 -345212 -403622 -437329 -371164 -489650 -452591
2441d52591J25269j2068Q4843j93858r3901J95337J5754p5482j6962J27609k8525
$$ -452591 -327322 -339390 -254547 -448405 -542306 -346969 -331215 -406697 -423659 -296050 -324575
2430c24575J0580k0792J3829j2400k6941M9742j6376r4130N5997J1398l4055o7238
$$ -324575 -313995 -334787 -320958 -333358 -360299 -310557 -326933 -421063 -365066 -353668 -387723 -454961
2418d54961K0662l9170K20785l9163j38040L0754n3818r3913K45405l8055p359
$$ -454961 -434299 -473469 -252684 -291847 -429887 -399133 -452951 -546864 -301459 -339514 -346873
2407c46873L9613j29466Q0650r4021J37540K8519n2409k3383j5135Q8921j91384
$$ -346873 -307260 -436726 -356076 -450097 -312557 -284038 -336447 -359830 -374965 -286044 -477428
2396d77428L8225N4648n4918L7867l3821P7484m1886J22334l4126j1340k4539
$$ -477428 -439203 -384555 -439473 -401606 -435427 -357943 -399829 -277495 -311621 -322961 -347500
2385c47500M424m7724j9102r1129Q3183L5151K4918O075j51295M4141J37112o5693
$$ -347500 -343076 -390800 -409902 -501031 -417848 -382697 -357779 -351704 -502999 -458858 -321746 -387439
2373c87439k575k7547o6366J88022n5568N5169j80111J19953j63693J69634k2298
$$ -387439 -390014 -417561 -483927 -295905 -351473 -296304 -476415 -356462 -520155 -350521 -372819
2362c72819l0279m8018P4484O301L8869l7836r385L2935k5205n1415Q4711r7217
$$ -372819 -403098 -451116 -376632 -370331 -331462 -369298 -378683 -345748 -370953 -422368 -337657 -434874
2350d34874N4516P3877m0465j2321j11714N8283k3899n7082J14109J0983k8918
$$ -434874 -380358 -306481 -346946 -359267 -470981 -412698 -436597 -493679 -379570 -368587 -397505
$$ [...]
##END NTUPLES=NMR SPECTRUM
##END=
