##TITLE=abcd
##JCAMPDX= 6.0         $$ Bruker NMR JCAMP-DX V2.0
##DATA TYPE= NMR SPECTRUM
##DATA CLASS= NTUPLES
##ORIGIN= UXNMR, Bruker Analytische Messtechnik GmbH
##OWNER= root
$$ XWIN-NMR		Version 3.5
$$ Sat Feb 15 11:47:11 2025 Russian Standard Time (UT+4h)  servis@DPX200
##.OBSERVE FREQUENCY= 200.131235884673
##.OBSERVE NUCLEUS= ^1H
##.ACQUISITION MODE= SIMULTANEOUS
##.ACQUISITION SCHEME= undefined
##.AVERAGES= 24
##.DIGITISER RES= 18
##SPECTROMETER/DATA SYSTEM= spect
##.PULSE SEQUENCE= zg
##.SOLVENT NAME= DMSO
##.SHIFT REFERENCE= (INTERNAL, DMSO, 0, 16.4885)
##AUDIT TRAIL= $$ (NUMBER, WHEN, WHO, WHERE, WHAT)
$$ ##TITLE= Audit trail, XWIN-NMR		Version 3.5
$$ ##JCAMPDX= 5.01
$$ ##ORIGIN= Bruker BioSpin GmbH
$$ ##OWNER= servis
$$ F:\spectra/data/av/nmr/H1/1/pdata/1/auditp.txt
$$ ##AUDIT TRAIL=  $$ (NUMBER, WHEN, WHO, WHERE, WHAT)
(   1,<2025-02-15 11:46:41.45 +0400>,<servis>,<DPX200>,
      <created by zg, POWCHK disabled, PULCHK disabled
       terminated by command 'halt'
       configuration hash MD5:
       00 E9 B6 7A A2 85 ED C7 34 08 36 98 17 FE 4E 26
       data hash MD5: 32K
       9B 4D EA 2D B4 BA A8 5B 38 4E E3 12 A4 20 FB C3>)
(   2,<2025-02-15 11:46:43.10 +0400>,<servis>,<DPX200>,
      <Start of raw data processing
       efp BC_mod = 2 LB = 0.05 FT_mod = 6 PKNL = 1 PHC0 = -266.1254 PHC1 = 1.301534 SI = 16K 
       data hash MD5: 16K
       9E 99 B5 A8 97 F1 E9 A1 EF B9 E7 36 36 72 B5 04>)
$$ ##END=
$$ 
$$ hash MD5
$$ 12 4D 2B B1 5F E6 B5 25 38 95 8E 19 30 23 2B 92
##$RELAX= 
##$RELAX= 
##$RELAX= 
##$RELAX= 
##$RELAX= 
##$RELAX= 
##$RELAX= 
##$RELAX= 
$$ Bruker specific parameters
$$ --------------------------
##$DU= <F:\spectra>
##$EXPNO= 1
##$NAME= <H1>
##$PROCNO= 1
##$TYPE= <nmr>
##$USER= <av>
##$AMP= (0..31)
100 100 100 100 100 100 100 100 100 100 100 100 100 100 100 100 100 100 
100 100 100 100 100 100 100 100 100 100 100 100 100 100 
##$AQSEQ= 0
##$AQ_mod= 1
##$AUNM= <au_zg>
##$AUTOPOS= <>
##$BF1= 200.13
##$BF2= 200.13
##$BF3= 200.13
##$BF4= 200.13
##$BF5= 500.13
##$BF6= 500.13
##$BF7= 500.13
##$BF8= 500.13
##$BYTORDA= 1
##$CFDGTYP= 0
##$CFRGTYP= 5
##$CHEMSTR= <none>
##$CNST= (0..31)
1 1 145 1 1 1 1 1 1 1 1 1 1 1 1 1 1 1 1 1 1 1 1 1 1 1 1 1 1 1 1 1 
##$CPDPRG= <>
##$CPDPRG1= <>
##$CPDPRG2= <>
##$CPDPRG3= <>
##$CPDPRG4= <mlev>
##$CPDPRG5= <mlev>
##$CPDPRG6= <mlev>
##$CPDPRG7= <mlev>
##$CPDPRG8= <mlev>
##$CPDPRGB= <>
##$CPDPRGT= <>
##$D= (0..31)
0 2 0 0 0 0 0 0 0 0.06 0 0 0 0 0 0 0.0002 0 0 0 0 0 0 0 0 0 0 0 0 0 0 
0 
##$DATE= 1739605601
##$DBL= (0..7)
120 120 120 120 120 120 120 120 
##$DBP= (0..7)
150 150 150 150 150 150 150 150 
##$DBP07= 0
##$DBPNAM0= <>
##$DBPNAM1= <>
##$DBPNAM2= <>
##$DBPNAM3= <>
##$DBPNAM4= <>
##$DBPNAM5= <>
##$DBPNAM6= <>
##$DBPNAM7= <>
##$DBPOAL= (0..7)
0.5 0.5 0.5 0.5 0.5 0.5 0.5 0.5 
##$DBPOFFS= (0..7)
0 0 0 0 0 0 0 0 
##$DE= 6
##$DECBNUC= <off>
##$DECIM= 32
##$DECNUC= <off>
##$DECSTAT= 4
##$DIGMOD= 1
##$DIGTYP= 9
##$DL= (0..7)
0 120 120 120 120 120 120 120 
##$DP= (0..7)
$$ [...]
##$SUBNAM4= <"">
##$SUBNAM5= <"">
##$SUBNAM6= <"">
##$SUBNAM7= <"">
##$SUBNAM8= <"">
##$SUBNAM9= <"">
##$SW= 20.6817932712277
##$SWIBOX= (0..15)
0 0 3 0 0 0 0 0 0 0 0 0 0 0 0 0 
##$SW_h= 4139.07284768212
##$TD= 32768
##$TD0= 1
##$TE= 0
##$TE2= 300
##$TE3= 300
##$TEG= 300
##$TL= (0..7)
0 120 120 120 120 120 120 120 
##$TP= (0..7)
150 150 150 150 150 150 150 150 
##$TP07= 0
##$TPNAME0= <>
##$TPNAME1= <>
##$TPNAME2= <>
##$TPNAME3= <>
##$TPNAME4= <>
##$TPNAME5= <>
##$TPNAME6= <>
##$TPNAME7= <>
##$TPOAL= (0..7)
0.5 0.5 0.5 0.5 0.5 0.5 0.5 0.5 
##$TPOFFS= (0..7)
0 0 0 0 0 0 0 0 
##$TUNHIN= 0
##$TUNHOUT= 0
##$TUNXOUT= 0
##$USERA1= <user>
##$USERA2= <user>
##$USERA3= <user>
##$USERA4= <user>
##$USERA5= <user>
##$V9= 5
##$VALIST= <valist>
##$VCLIST= <CCCCCCCCCCCCCCC>
##$VD= 0
##$VDLIST= <DDDDDDDDDDDDDDD>
##$VPLIST= <PPPPPPPPPPPPPPP>
##$VTLIST= <TTTTTTTTTTTTTTT>
##$WBST= 1024
##$WBSW= 30
##$XGAIN= (0..3)
0 0 0 0 
##$XL= 0
##$YL= 0
##$YMAX_a= 826485
##$YMIN_a= -545465
##$ZGOPTNS= <>
##$ZL1= 120
##$ZL2= 120
##$ZL3= 120
##$ZL4= 120
##$ABSF1= 0
##$ABSF2= 0
##$ABSG= 0
##$ABSL= 0
##$ALPHA= 0
##$AQORDER= 0
##$ASSFAC= 0
##$ASSFACI= 0
##$ASSFACX= 0
##$ASSWID= 0
##$AUNMP= <proc_1d>
##$AZFE= 0.1
##$AZFW= 0.1
##$BCFW= 0
##$BC_mod= 2
##$BYTORDP= 0
##$COROFFS= 0
##$CY= 18.4799938201904
##$DATMOD= 1
##$DC= 0
##$DFILT= <>
##$DTYPP= 0
##$F1P= 9.9274215381318
##$F2P= -0.165520771350173
##$FCOR= 1
##$FTSIZE= 16384
##$FT_mod= 6
##$GAMMA= 0
##$GB= 0
##$INTBC= 1
##$INTSCL= 4.127829e-11
##$ISEN= 128
##$LB= 0.05
##$LEV0= 0
##$LPBIN= 0
##$MAXI= 10000
##$MC2= 0
##$MEAN= 0
##$ME_mod= 0
##$MI= 50
##$NCOEF= 0
##$NC_proc= -6
##$NLEV= 6
##$NOISF1= 3.799351
##$NOISF2= 2.8
##$NSP= 0
##$NTH_PI= 0
##$NZP= 0
##$OFFSET= 16.48848
##$PC= 4
##$PHC0= -266.1254
##$PHC1= 1.301534
##$PH_mod= 1
##$PKNL= yes
##$PPARMOD= 0
##$PSCAL= 4
##$PSIGN= 0
##$REVERSE= no
##$SF= 200.130005582386
##$SI= 16384
##$SIGF1= 3
##$SIGF2= 2
##$SINO= 400
##$SIOLD= 16384
##$SREGLST= <1H.CDCl3>
##$SSB= 0
##$STSI= 16384
##$STSR= 0
##$SW_p= 4139.07284768211
##$SYMM= 0
##$S_DEV= 0
##$TDeff= 32768
##$TDoff= 0
##$TI= <>
##$TILT= no
##$TM1= 0
##$TM2= 0
##$TOPLEV= 0
##$USERP1= <user>
##$USERP2= <user>
##$USERP3= <user>
##$USERP4= <user>
##$USERP5= <user>
##$WDW= 1
##$XDIM= 16384
##$YMAX_p= 348440303
##$YMIN_p= -1850434
$$ End of Bruker specific parameters
$$ ---------------------------------
##NTUPLES= NMR SPECTRUM
##VAR_NAME=  FREQUENCY,     SPECTRUM/REAL,   SPECTRUM/IMAG
##SYMBOL=    X,             R,               I
##VAR_TYPE=  INDEPENDENT,   DEPENDENT,       DEPENDENT
##VAR_FORM=  AFFN,          ASDF,            ASDF
##VAR_DIM=   16384,         16384,           16384
##UNITS=     HZ,            ARBITRARY UNITS, ARBITRARY UNITS
##FACTOR=    0.252644378177508, 1,           1
##FIRST=     3299.83951724647, 0,            0
##LAST=      -839.233330435636, 0,           0
##MIN=       -839.233330435636, -1850434,    0
##MAX=       3299.83951724647, 348440303,    0
$$ Real data points
##PAGE= N=1
##DATA TABLE= (X++(R..R)), XYDATA
$$ [...]
6507C988951J64536j08428K68690k13882O6790L0386j7324o0027J53151r9111
$$ 3988951 4153487 4045059 4313749 4099867 4166657 4197043 4179719 4119692 4272843 4173732
6497D173732L2145O1088O964J08999j08550K23814q8226K33508k16975R7322l063
$$ 4173732 4205877 4266965 4273929 4382928 4274378 4498192 4409966 4643474 4426499 4523821 4520758
6486D520758P85j3583N5544L31222k46900J68181m6984j4175n7088N1586R6445
$$ 4520758 4521543 4507960 4563504 4894726 4647826 4816007 4769023 4754848 4697760 4749346 4845791
6475D845791j58612K43295M2181q9247J00808R011k3849J89595q7152P9869N9536
$$ 4845791 4687179 4930474 4972655 4883408 4984216 4993227 4969378 5158973 5071821 5151690 5211226
6464E211226J16346o2834l6169J03978J19973j37013j1054J87919j13994K33154
$$ 5211226 5327572 5264738 5228569 5332547 5452520 5315507 5304453 5492372 5378378 5611532
6454E611532n4405L22425j70257N2055N6354o187n12M7241P1383l3890l797K47571
$$ 5611532 5557127 5879552 5709295 5761350 5817704 5811517 5811005 5858246 5929629 5895739 5891942 6139513
6442F139513N965q1290J82099j0098M7600Q9056J26933j431K5845L12008j26706
$$ 6139513 6145478 6064188 6246287 6236189 6283789 6372845 6499778 6498347 6524192 6836200 6709494
6431F709494N6272Q3091J73886j59921k014K05866J38651O0499R8732R4094l1920
$$ 6709494 6765766 6848857 7022743 6862822 6860808 7066674 7205325 7265824 7364556 7458650 7426730
6420G426730J09369J60899M7066M2845K21360J1849K58774O8707k5350J12832
$$ 7426730 7536099 7696998 7744064 7786909 8008269 8020118 8278892 8347599 8322249 8435081
6410H435081O342K06928k5219M23398j85055K03662J88716J74760m8646J28161
$$ 8435081 8441423 8648351 8623132 9046530 8861475 9065137 9253853 9428613 9379967 9508128
6400I508128P8721L77300K0241L64962J2999J46035N7780J32153J64224M6171
$$ 9508128 9586849 9964149 9984390 10349352 10362351 10508386 10566166 10698319 10862543 10908714
6390A0908714L42154J20291J02436L20510J21076J85142L23471o8317L85759L9589
$$ 10908714 11250868 11371159 11473595 11794105 11915181 12100323 12423794 12355477 12741236 12780825
6380A2780825L42517K19914K08396K06909J25951L39453K89810L26505M3272M46393
$$ 12780825 13123342 13343256 13551652 13758561 13884512 14223965 14513775 14840280 14883552 15329945
6370A5329945N11132J23426K72613M01118L06999J83002N34494K77283K80432
$$ 15329945 15841077 15964503 16237116 16638234 16945233 17128235 17662729 17940012 18220444
6361A8220444L41640O61015M42480L87506M54731O81541L41901M74650M56039
$$ 18220444 18562084 19223099 19665579 20053085 20507816 21189357 21531258 22005908 22461947
6352B2461947L78531N06377P22636M92892O27182O41623O67435N93500P91246
$$ 22461947 22840478 23346855 24069491 24562383 25189565 25831188 26498623 27092123 27883369
6343B7883369P03129Q62333N72743Q98324N63225J022198R09479Q38353P76104
$$ 27883369 28586498 29448831 30021574 30919898 31483123 32505321 33414800 34253153 35029257
6334C5029257J194678R71683P65048J200224J026176J003254J332741R18987J413290
$$ 35029257 36223935 37195618 37960666 39160890 40187066 41190320 42523061 43442048 44855338
6325D4855338J072558J382166J381167J268883J334623J257456J499646J414833
$$ 44855338 45927896 47310062 48691229 49960112 51294735 52552191 54051837 55466670
6317E5466670J399190J360211J405771J434617J333039J379215J449454J287903
$$ 55466670 56865860 58226071 59631842 61066459 62399498 63778713 65228167 66516070
6309F6516070J382116J263747J187209J528069Q63985J192994R47620J184846
$$ 66516070 67898186 69161933 70349142 71877211 72741196 73934190 74881810 76066656
6301G6066656J112870P30032Q52459Q64184N79419P75517M55965M80592K65433
$$ 76066656 77179526 77909558 78762017 79626201 80205620 80981137 81437102 81917694 82183127
6292H2183127K22712k6901M2313p2968k27487l00675l62492n96216m98172p65625
$$ 82183127 82405839 82378938 82421251 82348283 82120796 81820121 81457629 80861413 80363241 79597616
6282G9597616j057210p59571j053655q48449j058491j185944j221948j265513
$$ 79597616 78540406 77780835 76727180 75878731 74820240 73634296 72412348 71146835
6274G1146835j085849j197449j338824j294746j302959j502511j288241j475140
$$ 71146835 70060986 68863537 67524713 66229967 64927008 63424497 62136256 60661116
6266F0661116j246301j407090j457958j228835j419941j430958j436915j319461
$$ 60661116 59414815 58007725 56549767 55320932 53900991 52470033 51033118 49713657
6258D9713657j214589j069638j516544j081685j077368j252493j034526r19606
$$ 49713657 48499068 47429430 45912886 44831201 43753833 42501340 41466814 40547208
6250D0547208j178395q56437j040310r00938p77327j057296m82224r38892p29557
$$ 40547208 39368813 38512376 37472066 36571128 35793801 34736505 34254281 33315389 32585832
6241C2585832o25863n74394o81095o30226l95343o58939n44750n44384n43782
$$ 32585832 31959969 31385575 30704480 30074254 29678911 29019972 28475222 27930838 27387056
6232B7387056m00361l12954m97769l94161n39094j14485l21749l90862k30760
$$ 27387056 26986695 26673741 26175972 25781811 25242717 25128232 24806483 24415621 24184861
6223B4184861l20411l25416k04096l54732o5589l55765k61695l0994n12581K8183
$$ 24184861 23864450 23539034 23334938 22980206 22914617 22558852 22297157 22266163 21753582 21781765
6213B1781765j29095J17447l36478m0875p7772j12184k20265l0547j67590p6803
$$ 21781765 21652670 21770117 21433639 21392764 21314992 21202808 20982543 20951996 20784406 20707603
6203B0707603N9399r0313O4644j35286o0318m4487J17195j4601O4368k4548l6906
$$ 20707603 20767002 20676689 20741333 20606047 20545729 20501242 20618437 20603836 20668204 20643656 20606750
6192B0606750k63l0201J40426l7468R1470j064J14999k6304L52434n4456J91786
$$ 20606750 20606487 20576286 20716712 20679244 20770714 20769650 20884649 20858345 21210779 21156323 21348109
6181B1348109J25583k60786K93281J44952K15012j34587L04181K51702J63427
$$ 21348109 21473692 21212906 21506187 21651139 21866151 21731564 22035745 22287447 22450874
6172B2450874P3388P2249K38395J64228J24762N3043L56553J79745K16868L56918
$$ 22450874 22524262 22596511 22834906 22999134 23123896 23176939 23533492 23713237 23930105 24287023
6162B4287023O9243L01390K50836J98386L01931K27127K93219K98338K84939L53462
$$ 24287023 24356266 24657656 24908492 25106878 25408809 25635936 25929155 26227493 26512432 26865894
6152B6865894K18455M15891M06774M03528K67779M38619L26751N39358M49836
$$ 26865894 27084349 27500240 27907014 28310542 28578321 29016940 29343691 29883049 30332885
6143C0332885L59501K61509N84758O79613N36645M92897O73813L80605P26565
$$ 30332885 30692386 30953895 31538653 32218266 32754911 33247808 33921621 34302226 35028791
6134C5028791O05998P59981M96191Q84843O93565Q28241P52935R35436P42357
$$ 35028791 35634789 36394770 36890961 37775804 38469369 39297610 40050545 40985981 41728338
6125D1728338J062595Q69393J081082Q64795J003435J332909J061066J248885
$$ 41728338 42790933 43660326 44741408 45606203 46609638 47942547 49003613 50252498
6117E0252498J136641J365116J313807J372433J407189J576410J444714J629063
$$ 50252498 51389139 52754255 54068062 55440495 56847684 58424094 59868808 61497871
6109F1497871J579679J698128J743284J739427J876104K019558J967462J974755
$$ 61497871 63077550 64775678 66518962 68258389 70134493 72154051 74121513 76096268
6101G6096268J995401K076853K109558K268970K196917K328611K278729K143394
$$ 76096268 78091669 80168522 82278080 84547050 86743967 89072578 91351307 93494701
6093I3494701K417868K176691K543251K339779K465947K418287K426839K112962
$$ 93494701 95912569 98089260 100632511 102972290 105438237 107856524 110283363 112396325
6085A12396325K529523K586030K591371K471695K460570K583859K216020K672000
$$ 112396325 114925848 117511878 120103249 122574944 125035514 127619373 129835393 132507393
6077A32507393K370281K327884K494129K386732K399208K185386K307064K174676
$$ 132507393 134877674 137205558 139699687 142086419 144485627 146671013 148978077 151152753
6069A51152753K321795K096182K255653K131735K131529K143783K071779K118896
$$ 151152753 153474548 155570730 157826383 159958118 162089647 164233430 166305209 168424105
6061A68424105K044896K320409K037876K090552K087498K146347K333473K269906
$$ 168424105 170469001 172789410 174827286 176917838 179005336 181151683 183485156 185755062
6053A85755062K378689K447057K359303K511479K314142K438628K541351K544682
$$ 185755062 188133751 190580808 192940111 195451590 197765732 200204360 202745711 205290393
6045B05290393K578822K355573K638022K509082K410327K225528K495893K105587
$$ 205290393 207869215 210224788 212862810 215371892 217782219 220007747 222503640 224609227
6037B24609227K121191J864597J783113J524291J249496J260053P32985O65216
$$ 224609227 226730418 228595015 230378128 231902419 233151915 234411968 235144953 235810169
6029B35810169J52651J07640m04807o67986r64918j368044j618429j607331k047583
$$ 235810169 235962820 236070460 235665653 234997667 234032749 232664705 231046276 229438945 227391362
6020B27391362k490133k325089k842378l007585k840334l393127l234988l366950
$$ 227391362 224901229 222576140 219733762 216726177 213885843 210492716 207257728 203890778
6012B03890778l513727l695701l801412l603540l730142l888520l795782l889738
$$ 203890778 200377051 196681350 192879938 189276398 185546256 181657736 177861954 173972216
6004A73972216l761221l834221l778640l792374l693854l871023l694064l838961
$$ 173972216 170210995 166376774 162598134 158805760 155111906 151240883 147546819 143707858
5996A43707858l253432l639420l602786l327532l481800l391576l027657l233386
$$ 143707858 140454426 136815006 133212220 129884688 126402888 123011312 119983655 116750269
5988A16750269l191578k970114l121550k953796k789680k856663k690690k754850
$$ 116750269 113558691 110588577 107467027 104513231 101723551 98866888 96176198 93421348
5980I3421348k623036k359466k504395k455227k435195k330511k110710k103566
$$ 93421348 90798312 88438846 85934451 83479224 81044029 78713518 76602808 74499242
5972G4499242k067020k113037j830185j919942j798083j752647j631250j565359
$$ 74499242 72432222 70319185 68489000 66569058 64770975 63018328 61387078 59821719
5964E9821719j727586j535578j477283j288875j303516j239929j312202j353626
$$ 59821719 58094133 56558555 55081272 53792397 52488881 51248952 49936750 48583124
5956D8583124j199997j122687j087681j021540q23943j024148r26051r84296r59068
$$ 48583124 47383127 46260440 45172759 44151219 43327276 42303128 41377077 40392781 39433713
5947C9433713q83799r27686n84023j189261n23150q65758o59847o70688o14969
$$ 39433713 38549914 37622228 37038205 35848944 35325794 34460036 33800189 33129501 32514532
5938C2514532o60045o36171o53003p05202m96578p28708l39567o35241n69650
$$ 32514532 31854487 31218316 30565313 29860111 29363533 28634825 28295258 27660017 27090367
5929B7090367k45583p19941l47888m75471k73453n85762j49956m88978m27676
$$ 27090367 26844784 26124843 25776955 25301484 25028031 24442269 24292313 23803335 23375659
5920B3375659l52927l60354l78419j36932m49520l53750l72494j24240m56377
$$ 23375659 23022732 22662378 22283959 22147027 21697507 21343757 20971263 20847023 20390646
5911B0390646k96357j15699m32214K7748m06440k96923p1708j61801k89111k11229
$$ 20390646 20094289 19978590 19546376 19574124 19167684 18870761 18799053 18637252 18348141 18136912
5901A8136912j39899k38056j71919j27011j26403j65143k41131q8493j14544k06238
$$ 18136912 17997013 17758957 17587038 17460027 17333624 17168481 16927350 16838857 16724313 16518075
5891A6518075q4582k37457o6981j48530k69758q4341K4887l65271K02105j8140
$$ 16518075 16433493 16196036 16129055 15980525 15710767 15626426 15651313 15286042 15488147 15470007
5881A5470007k11267P9652N9571j34505j54653j62009j31060J71089p5393r2959
$$ 15470007 15258740 15338392 15397963 15263458 15108805 14946796 14815736 14986825 14911432 14818473
5871A4818473O440p5599k45280k9843j29089O0895j14895j58093j48964k60057
$$ 14818473 14824913 14749314 14504034 14474191 14345102 14405997 14291102 14133009 13984045 13723988
5861A3723988n1739j74850p3818l32884j42421q5181j49222k41946k54821j70185
$$ 13723988 13672249 13497399 13423581 13090697 12948276 12863095 12713873 12471927 12217106 12046921
5851A2046921k28248M0716l02831j71476j89334l8042k58905o7961l13006j73868
$$ 12046921 11818673 11859389 11556558 11385082 11195748 11157706 10898801 10830840 10517834 10343966
5841A0343966o3775j67893j52008q575k32814j69938j44527q9177k71356j9085
$$ 10343966 10280191 10112298 9960290 9951715 9718901 9548963 9404436 9315259 9043903 9024818
5831I024818k9678k82628J31608k50631j99587N6968j18752k07688m9228q9009
$$ 9024818 8995140 8712512 8844120 8593489 8393902 8450870 8332118 8124430 8075202 7986193
5821G986193p7585k0713M8778l05413L6526l84615K85974j98843l5832o4299M1828
$$ 7986193 7908608 7887895 7936673 7631260 7667786 7283171 7569145 7370302 7334470 7270171 7311999
5810G311999k49181O7750j16932l8166r5063K89563l19854J63537j37222j09475
$$ 7311999 7062818 7130568 7013636 6975470 6880407 7169970 6850116 7013653 6876431 6766956
5800F766956j30088q0208K2077J3848k7549P9395j00286J8552k42656J24386q3590
$$ 6766956 6636868 6556660 6578737 6592585 6565036 6644431 6544145 6562697 6320041 6444427 6360837
5789F360837j02831J04808o8635k23939J76404n3614j61527L8376q5684M8917
$$ 6360837 6258006 6362814 6294179 6070240 6246644 6193030 6031503 6069879 5984195 6033112
5779F033112J61954k32741j4272k1613j04070K22510m07804K90739j31360L00
$$ 6033112 6195066 5962325 5948053 5926440 5822370 6044880 5637076 5927815 5796455 5796755
5769E796755M2255P497k31567R7463L4197j10959q4981L4092K0317k04076K0062
$$ 5796755 5839010 5846507 5614940 5712403 5746600 5635641 5550660 5584752 5605069 5400993 5421055
5758E421055K2486k339N5544J1731j3694j2057k36022o0400J52000L3621k86184
$$ 5421055 5443541 5441202 5496746 5508477 5494783 5482726 5246704 5186304 5338304 5371925 5085741
5747E085741J80396p7885l2207m7601n4967R3504k85547K53279q1333j24181l3519
$$ 5085741 5266137 5188252 5156045 5108444 5053477 5146981 4861434 5114713 5033380 4909199 4875680
5736D875680q7555J45392j27071L4088J19935j88108k824N0412n4809Q7979o0545
$$ 4875680 4788125 4933517 4806446 4840534 4960469 4772361 4769537 4819949 4765140 4853119 4792574
5725D792574j13600J74518k00524l0899J18131j10939R2991j23201L14803j65385
$$ 4792574 4678974 4853492 4652968 4622069 4740200 4629261 4722252 4599051 4913854 4748469
5715D748469K4054k18862J60340j32681O0270p602k3459k1378o8469M5420j89569
$$ 4748469 4772523 4553661 4714001 4581320 4641590 4633988 4610529 4589151 4520682 4566102 4376533
5704D376533K1524O124q0203j33343K05142J17489k07093m3190l7491R4410o8204
$$ 4376533 4398057 4404181 4323978 4190635 4395777 4513266 4306173 4262983 4225492 4319902 4251698
5693D251698k6532R9468m8514k15699K72211j14578j33543J89807j81719Q0005
$$ 4251698 4225166 4324634 4276120 4060421 4332632 4218054 4084511 4274318 4092599 4172604
5683D172604J19598q4682j02201k287l7692j4850n003K3294J51689j76685J56855
$$ 4172604 4292202 4207520 4105319 4103032 4065340 4050490 4045487 4068781 4220470 4043785 4200640
5672D200640r6717q376p0077K22046j55465m8940l2593N5067J07364p8330O4704
$$ 4200640 4103923 4095547 4025470 4247516 4092051 4043111 4010518 4065585 4172949 4094619 4159323
5661D159323r9697n5176J64830L2405k85151J74897p7537m6669M6484O5390o6116
$$ 4159323 4059626 4004450 4169280 4201685 3916534 4091431 4013894 3967225 4013709 4079099 4012983
5650D012983m1540J49746m4738J10606j22618M8544M6693M2599n8916M5778l0754
$$ 4012983 3971443 4121189 4076451 4187057 4064439 4112983 4159676 4202275 4143359 4189137 4158383
5639D158383M5786j69845M1438J68467k229P1130n4241L1676r0127N0892O1958
$$ 4158383 4204169 4034324 4075762 4244229 4242000 4313130 4258889 4290565 4200438 4251330 4313288
5628D313288o5752K44153q3351o2157J94063N4794L9605r1815K3027K1957m4208
$$ 4313288 4247536 4491689 4408338 4346181 4540244 4595038 4634643 4542828 4565855 4587812 4543604
5617D543604O9151L8225J68232j749R649k533j63946K36213n2435J00503O9363
$$ 4543604 4612755 4650980 4819212 4817463 4827112 4824579 4660633 4896846 4844411 4944914 5014277
5606E014277k6316j9963p074K15453o9234R4199P3514q8273R7089q0292J74423
$$ 5014277 4987961 4967998 4960924 5176377 5107143 5201342 5274856 5186583 5283672 5203380 5377803
5595E377803l4867J88506J71432m009N1427J00041r7564K44710k30079L04790
$$ 5377803 5342936 5531442 5702874 5698865 5750292 5850333 5752769 5997479 5767400 6072190
5585F072190k4628J46740k1435M0108K59277O3394k561J42748k9037J45783L4134
$$ 6072190 6047562 6194302 6172867 6212975 6472252 6535646 6533085 6675833 6646796 6792579 6826713
5574F826713N8322M2737R7385J75748J23341m3035Q0582J89193k68j9510L3496
$$ 6826713 6885035 6927772 7025157 7200905 7324246 7281211 7361793 7550986 7550718 7531208 7564704
5563G564704K98008j25870J3845J99247J43293R3757J42731m9345K19654O9201
$$ 7564704 7862712 7736842 7750687 7949934 8093227 8186984 8329715 8280370 8500024 8569225
5553H569225j94621M57360K74248j99387K16345p152O0053K25667J31731J45818
$$ 8569225 8374604 8831964 9106212 8906825 9123170 9116018 9176071 9401738 9533469 9679287
5543I679287J59290J30613m1212K90827M3856K00593K90806L53L94574o042J85513
$$ 9679287 9838577 9969190 9927978 10218805 10262661 10463254 10754060 10754413 11148987 11142945 11328458
5532A1328458K75744J18548L34866p9147L99945R752K73025K71097L01094J07442
$$ 11328458 11604202 11722750 12057616 11978469 12378414 12388166 12661191 12932288 13233382 13340824
5522A3340824M51770J38422J19222N62258J17210J29846N30843K29692K44267
$$ 13340824 13792594 13931016 14050238 14612496 14729706 14859552 15390395 15620087 15864354
5513A5864354L94691M43823J55845M37798M03112L53048M34295K83041N21409
$$ 15864354 16259045 16702868 16858713 17296511 17699623 18052671 18486966 18770007 19291416
5504A9291416K03813M60106M92799P77538L97741M19238N28841M40316L98144
$$ 19291416 19495229 19955335 20448134 21225672 21623413 22042651 22571492 23011808 23409952
5495B3409952N33151O54454P14270N95089P66194N27847N76464O60287Q04737
$$ 23409952 23943103 24597557 25311827 25906916 26673110 27200957 27777421 28437708 29242445
5486B9242445P67406P82446N98675Q28894O59768O94585Q55366O97816J126043
$$ 29242445 30009851 30792297 31390972 32219866 32879634 33574219 34429585 35127401 36253444
5477C6253444M99592R79114Q25248R53883O73606P87057O64696J028074Q50804
$$ 36253444 36753036 37732150 38557398 39511281 40184887 40971944 41636640 42664714 43515518
5468D3515518O97818J066746Q26900Q99835O64420P90264O86980R47864Q57917
$$ 43515518 44213336 45280082 46106982 47006817 47671237 48461501 49148481 50096345 50954262
5459E0954262P33003N81144P53702P82826O65489O29018O72834P53050L82102
$$ 50954262 51687265 52268409 53022111 53804937 54470426 55099444 55772278 56525328 56907430
5450E6907430O16929M37711N66614M08393K77691P05081J98537L52698L37938
$$ 56907430 57524359 57962070 58528684 58937077 59214768 59919849 60118386 60471084 60809022
5441F0809022J85731Q9937L36024n6925K36200k6894P5271J8849k4976k30828
$$ 60809022 60994753 61084690 61420714 61363789 61599989 61573095 61648366 61667215 61642239 61411411
5431F1411411p2528j44899k95149j09235m53992j24668m13772m17883l21754n73175
$$ 61411411 61338883 61193984 60898835 60789600 60335608 60210940 59797168 59379285 59057531 58484356
5421E8484356m81066m96867n30907m76819n23989q49399o41948n27346p89984
$$ 58484356 58003290 57506423 56975516 56498697 55974708 55125309 54483361 53956015 53166031
5412E3166031n74146o95840p61061q52379p50325q52028q12149q27468q22066
$$ 53166031 52591885 51896045 51134984 50282605 49532280 48680252 47868103 47040635 46218569
5403D6218569p59837p61431q24819q19789p69628p98229p94865o82922r61310
$$ 46218569 45458732 44697301 43872482 43052693 42283065 41484836 40689971 40007049 39045739
5394C9045739q47703o21773q85163o69508q71718o67647n89994q70987o31912
$$ 39045739 38198036 37576263 36691100 36021592 35149874 34482227 33892233 33021246 32389334
5385C2389334l94226p40309q03160m65760n82912p18248k99302o81546n52309
$$ 32389334 31995108 31254799 30451639 29985879 29402967 28684719 28385417 27703871 27151562
5376B7151562m63018n43503l16927m19440l65047m87607l03790l23647l46482
$$ 27151562 26688544 26145041 25828114 25408674 25043627 24556020 24252230 23928583 23582101
5367B3582101m72666q4090l19014k26917k36263j97249r230k36831j11001j1411
$$ 23582101 23109435 23025345 22706331 22479414 22243151 22045902 22036672 21799841 21688840 21677429
5357B1677429j47272K4973n2846j4785m3339k6630K06406J52652J61238k2406
$$ 21677429 21530157 21555130 21502284 21487499 21444160 21417530 21623936 21776588 21937826 21915420
5347B1915420J51650L98513K38344K57860K16434R1237N27154M14845M88442M95226
$$ 21915420 22067070 22465583 22703927 22961787 23178221 23269458 23796612 24211457 24699899 25195125
5337B5195125M02366P09579N52011O46803Q77733P72314Q70667R98679R38628
$$ 25195125 25597491 26307070 26859081 27505884 28383617 29155931 30026598 31025277 31963905
5328C1963905Q88645J124251J189581J332653J373026J409194J531398J481578
$$ 31963905 32852550 33976801 35166382 36499035 37872061 39281255 40812653 42294231
5320D2294231J681608J748765J675305K251186J857038J972525K249502J971070
$$ 42294231 43975839 45724604 47399909 49651095 51508133 53480658 55730160 57701230
5312E7701230K373817J990191K116032J864617K456013J745650J956997J801912
$$ 57701230 60075047 62065238 64181270 66045887 68501900 70247550 72204547 74006459
5304G4006459J876945J394251J768990R90649J038794J096344M44975O15275N3139
$$ 74006459 75883404 77277655 79046645 80037294 81076088 82172432 82617407 83232682 83285821
5295H3285821K6516j71565n87052q82030q72696j361459r79217j688623j788522
$$ 83285821 83312337 83140772 82553720 81671690 80798994 79437535 78458318 76769695 74981173
5286G4981173j779465j900656j992055k050962k266156k076433k307883k363755
$$ 74981173 73201708 71301052 69308997 67258035 64991879 62915446 60607563 58243808
5278E8243808k240245j892505k397383k249824j882783j924471k226839j745348
$$ 58243808 56003563 54111058 51713675 49463851 47581068 45656597 43429758 41684410
5270D1684410j742615j742930j656149j469917j313830j428741j371837j408778
$$ 41684410 39941795 38198865 36542716 35072799 33758969 32330228 30958391 29549613
5262B9549613j097544j184972r23365j122383o73642j085244p54365q81154o74547
$$ 29549613 28452069 27267097 26343732 25221349 24547707 23462463 22708098 21826944 21152397
5253B1152397p30187r03668l95374p56238o17737n29594m56107n98818n80001
$$ 21152397 20422210 19518542 19123168 18366930 17749193 17219599 16763492 16164674 15584673
5244A5584673l56570m93068k81239m98291l38606n48683j21720l12776n26125
$$ 15584673 15228103 14735035 14453796 13955505 13616899 13068216 12946496 12633720 12107595
5235A2107595j04699l35402k18044m01991j01429k56426j61381l87235j57010
$$ 12107595 12002896 11667494 11449450 11047459 10946030 10689604 10528223 10140988 9983978
5226I983978l58382j48483o5750k27361j49451l06099j27866J07886k05655j72151
$$ 9983978 9625596 9477113 9411363 9184002 9034551 8728452 8600586 8708472 8502817 8330666
5216H330666k93789j95596J41537j11801k35426q1946j92816Q9448j66980j73822
$$ 8330666 8036877 7841281 7982818 7871017 7635591 7553645 7360829 7450277 7283297 7109475
5206G109475j12291j2662J1748j81588r1571O8525r9137j53881r309q6368n7021
$$ 7109475 6997184 6984522 6996270 6814682 6723111 6791636 6692499 6538618 6529309 6442941 6385920
5195F385920j15037k3985O1373r8120k83511J69411o1802R9069l51177J33853
$$ 6385920 6270883 6246898 6308271 6210151 5926640 6096051 6034249 6133318 5782141 5915994
5185E915994p9863j17441N7467m7406j0038j45456O2747L24J5377j75226J25643
$$ 5915994 5836131 5718690 5776157 5728751 5718713 5573257 5636004 5636328 5651705 5476479 5602122
5174E602122n5755k64780J16072K0412j5607j22550O8396O8989j74861J01036
$$ 5602122 5546367 5281587 5397659 5418071 5402464 5279914 5348310 5417299 5242438 5343474
5164E343474O8580o0957j40531Q9020o7230p5944m6890l8665m093P1992k6917
$$ 5343474 5412054 5351097 5210566 5299586 5232356 5156412 5109522 5070857 5066764 5138756 5111839
5153E111839O7043j28060r9006J37097j94415Q9520J63037j22696q4890J68377
$$ 5111839 5178882 5050822 4951816 5088913 4894498 4984018 5147055 5024359 4939469 5107846
5143E107846p6810j44334K6296J05576M4679j54249p174j14022J34343l0139J67605
$$ 5107846 5031036 4886702 4912998 5018574 5063253 4909004 4901830 4787808 4922151 4892012 5059617
5132E059617M4501l102j24751p4409o1888J09263j8O5528K7933j90312J41198
$$ 5059617 5104118 5101016 4976265 4901856 4839968 4949231 4949213 5014741 5042674 4852362 4993560
5121D993560J43335o0534p9891P0004J3698j949R5208j6281J94905j03041l1958
$$ 4993560 5136895 5076361 4996470 5066474 5080172 5078223 5173431 5157150 5352055 5249014 5217056
5110E217056R2701r2695j3035L26169k09155l818N9175J3423M5541Q0984j32298
$$ 5217056 5309757 5217062 5204027 5530196 5321041 5317223 5376398 5389821 5435362 5516346 5384048
5099E384048K23167J10194O2887m2548L7525O1500o5265J84801O5322Q2943o1244
$$ 5384048 5607215 5717409 5780296 5737748 5775273 5836773 5771508 5956309 6021631 6104574 6043330
5088F043330N3220L9293J29856J11384J93380p9190J1429R1406O0793L72211j89096
$$ 6043330 6096550 6135843 6265699 6377083 6570463 6491273 6502702 6594108 6654901 7027112 6838016
5077F838016J24808J73414n9746L61581j71412J2965K23619J72135J17312k4656
$$ 6838016 6962824 7136238 7076492 7438073 7266661 7279626 7503245 7675380 7792692 7768036
5067G768036L09271J00020Q6762O5214J97108J81547N6439M5194J91532K32276
$$ 7768036 8077307 8177327 8264089 8329303 8526411 8707958 8764397 8809591 9001123 9233399
5057I233399K76817J42640P8518M52371J68461j83715M83276J86545K48657K36529
$$ 9233399 9510216 9652856 9731374 10183745 10352206 10168491 10651767 10838312 11086969 11323498
5047A1323498K64301K67964K43523L18665K90461J86743N98011L14435M04160
$$ 11323498 11587799 11855763 12099286 12417951 12708412 12895155 13493166 13807601 14211761
5038A4211761L82381L80194M99530M86927K84401P68535M67885M46328N58266
$$ 14211761 14594142 14974336 15473866 15960793 16245194 17013729 17481614 17927942 18486208
5029A8486208O16291M79953P24573O11518R41482M04333Q40822N82941J097201
$$ 18486208 19102499 19582452 20307025 20918543 21860025 22264358 23105180 23688121 24785322
5020B4785322P08613P98267Q12380R11005Q02191R91925P41108J008779Q65691
$$ 24785322 25493935 26292202 27104582 28015587 28817778 29809703 30550811 31559590 32425281
5011C2425281J037719J215023R31820R84784P93845J142556Q70023P54992R60440
$$ 32425281 33463000 34678023 35609843 36594627 37388472 38531028 39401051 40156043 41116483
5002D1116483Q20892J017953Q28551P63743O09804Q59750N92268N83371M89795
$$ 41116483 41937375 42955328 43783879 44547622 45157426 46017176 46609444 47192815 47682610
4993D7682610M59094K13469L80084M38583L55328J12993J42573l58518J48533
$$ 47682610 48141704 48355173 48735257 49173840 49529168 49642161 49784734 49426216 49574749
4984D9574749k39140j63797p0312m22195m26497m20670m99225n09404r66921l44904
$$ 49574749 49335609 49171812 49101500 48679305 48252808 47832138 47332913 46823509 45856588 45511684
4974D5511684o80410r11416n53179q70817q17510p98360r15868p50449p79658
$$ 45511684 44831274 43919858 43366679 42495862 41678352 40879992 39964124 39213675 38434017
4965C8434017q94455j052928o26006j005295r20068r15449q91813r65786o79130
$$ 38434017 37539562 36486634 35860628 34855333 33935265 33019816 32128003 31162217 30483087
4956C0483087r58410j116370o27619q36556r44887q56854q35754p22282o87614
$$ 30483087 29524677 28408307 27780688 26944132 25999245 25142391 24306637 23584355 22896741
4947B2896741q07371p01420o77011m31486q64834n73167n89252o45477o13494
$$ 22896741 22089370 21387950 20710939 20279453 19414619 18841452 18252200 17606723 16993229
4938A6993229m46658m19844m80272l30122m40724m73546l98371l60709l00538
$$ 16993229 16546571 16126727 15646455 15316333 14875609 14402063 14003692 13642983 13342445
4929A3342445l70128l66693n7289l35683k85204l35936k91123l37564r5445m1179
$$ 13342445 12972317 12605624 12548335 12212652 11927448 11591512 11300389 10962825 10867380 10826201
4919A0826201l92355k48050j46081k35194m016k46434j21340k49389j93129M8413
$$ 10826201 10433846 10185796 10039715 9804521 9800505 9554071 9432731 9183342 8990213 9038626
4909I038626j06688k83432k18329J27994j22738k52986j11763N4715O548j15078
$$ 9038626 8931938 8648506 8430177 8558171 8435433 8182447 8070684 8125399 8131947 8016869
4899H016869k02869k7030j2396j924j49165j20713q8371j33500N9184r644p2312
$$ 8016869 7814000 7786970 7774574 7772650 7623485 7502772 7414401 7280901 7340085 7330441 7258129
4888G258129q0487P9879n9169j52513R3641j10391k6439j1863p0612n9667J24426
$$ 7258129 7177642 7257521 7198352 7045839 7139480 7029089 7002650 6990787 6920175 6860508 6984934
4877F984934m2030k39409J77730l0439j37696j21541J70706j592j16515k5141
$$ 6984934 6942904 6703495 6881225 6850786 6713090 6591549 6762255 6760663 6644148 6619007
4867F619007n458o6974Q0937j36743j3816J67645j29299J51208M0694j81677K6983
$$ 6619007 6613549 6546575 6627512 6490769 6476953 6644598 6515299 6666507 6707201 6525524 6552507
4856F552507N1360J4623m3084j48635m051r603J64405j6509k20938J74212Q3843
$$ 6552507 6603867 6618490 6575406 6426771 6422720 6413117 6577522 6561013 6340075 6514287 6598130
4845F598130j56107J13890j05228N8245Q4322p2081J10920L3057j15212n0552
$$ 6598130 6442023 6555913 6450685 6508930 6593252 6521171 6632091 6665148 6549936 6499384
4835F499384K55387j74993J39416j04478J429P9339J10503j66881k7248P8678
$$ 6499384 6754771 6579778 6719194 6614716 6616145 6695484 6805987 6639106 6611858 6690536
4825F690536N8031L3499J52841k77120J62099L5395R9486n2098j08979M6845M020
$$ 6690536 6748567 6782066 6934907 6657787 6819886 6855281 6954767 6902669 6793690 6840535 6844555
4814F844555n1687J58969M7448j65649M2468J57360n8427J4060j15003J03120
$$ 6844555 6792868 6951837 6999285 6833636 6876104 7033464 6975037 6989097 6874094 6977214
4804F977214j4656J59231j76501J77233M3528n6316O2980m376J45330n6038J38649
$$ 6977214 6962558 7121789 6945288 7122521 7166049 7109733 7172713 7168337 7313667 7257629 7396278
4793G396278J3269J2291J04839r0090N2618k58303N17797j72620J11065R3238
$$ 7396278 7409547 7421838 7526677 7436587 7489205 7230902 7748699 7576079 7687144 7780382
4783G780382J07291j61378O1088J45720j8561R7111R1954l7265K89131q094o308
$$ 7780382 7887673 7726295 7787383 7933103 7914542 8011653 8103607 8066342 8355473 8347379 8341071
4772H341071P5565M8279p8759J17226R2793K40346M4113r0536R8517J44347j4405
$$ 8341071 8416636 8464915 8386156 8503382 8596175 8836521 8880634 8790098 8888615 9032962 9018557
4761I018557O9681Q7936J39781K21864r8203j2946K74555K38924q8055J94352
$$ 9018557 9088238 9176174 9315955 9537819 9439616 9426670 9701225 9940149 9852094 10046446
4751A0046446N514J65699o2941J50012Q1407L55603R8752O7907M4835K58297k6783
$$ 10046446 10051960 10217659 10154718 10304730 10386137 10741740 10840492 10908399 10953234 11211531 11184748
4740A1184748J65168J59994R1349J02780K60670p0147J45157J73274n849K07866
$$ 11184748 11349916 11509910 11601259 11704039 11964709 11894562 12039719 12212993 12207144 12415010
4730A2415010R1515K12707R8492K24484J1574L05734J80585N1181P1083L59920
$$ 12415010 12506525 12719232 12817724 13042208 13053782 13359516 13540101 13591282 13662365 14022285
4720A4022285j3402K31994K21660J52648K14978J44223J29625Q7004K71723J9248
$$ 14022285 14008883 14240877 14462537 14615185 14830163 14974386 15104011 15191015 15462738 15481986
4710A5481986M08652J93020J62191J89511J70502J30102L16691J66337J64034
$$ 15481986 15890638 16083658 16245849 16435360 16605862 16735964 17052655 17218992 17383026
4701A7383026L88073P9275L27523J84296L12289K40749K96864L28586K64954K60014
$$ 17383026 17771099 17850374 18177897 18362193 18674482 18915231 19212095 19540681 19805635 20065649
4691B0065649K73266L93238K79218O13095K80083K43301K99713N95983M73342
$$ 20065649 20338915 20732153 21011371 21624466 21904549 22147850 22447563 23043546 23516888
4682B3516888K43377N86484L70611N31223L73890O73735N93670M49411M87549
$$ 23516888 23760265 24346749 24717360 25248583 25622473 26296208 26889878 27339289 27826838
4673B7826838Q45248P55799M48730P81832O40701R29582Q36486O09531R41941
$$ 27826838 28672086 29427885 29876615 30658447 31299148 32228730 33065216 33674747 34616688
4664C4616688J107149R54146P65915J299788Q29646J315547J135953J270963J376901
$$ 34616688 35723837 36677983 37443898 38743686 39573332 40888879 42024832 43295795 44672696
4655D4672696J446141J284735J540033J539759J828602J562732J755778J574446
$$ 44672696 46118837 47403572 48943605 50483364 52311966 53874698 55630476 57204922
4647E7204922K140071J870179J938883K191403K053797K130383K284039K153613
$$ 57204922 59344993 61215172 63154055 65345458 67399255 69529638 71813677 73967290
4639G3967290K175586K223806K369614K211392K240430K145819K312075K005190
$$ 73967290 76142876 78366682 80736296 82947688 85188118 87333937 89646012 91651202
4631I1651202J835349J901554J667701J776168J461844J186960J310192Q03469
$$ 91651202 93486551 95388105 97055806 98831974 100293818 101480778 102790970 103594439
4623A03594439P50219P56256K31365M9139k8492l51273k90733p30222q71065q96387
$$ 103594439 104344658 105100914 105332279 105381418 105352926 105001653 104710920 103980698 103109633 102213246
4613A02213246j414499j237903j465560j495668j787979j908403j727991k123035
$$ 102213246 100798747 99560844 98095284 96599616 94811637 92903234 91175243 89052208
4605H9052208j897335j997959k136694j836306j987887k028382j878887j868273
$$ 89052208 87154873 85156914 83020220 81183914 79196027 77167645 75288758 73420485
4597G3420485j810881j832940j866068j673764j562386j586185j305866j505908
$$ 73420485 71609604 69776664 67910596 66236832 64674446 63088261 61782395 60276487
4589F0276487j292670j324594j225737j267498q83839j052031j278208r03409
$$ 60276487 58983817 57659223 56433486 55165988 54282149 53230118 51951910 51048501
4581E1048501o58808j028306m69295q43978q00301o07249n51059n05547n76674
$$ 51048501 50389693 49361387 48892092 48048114 47247813 46640564 46089505 45583958 45007284
4572D5007284n04039l06196n48295k46826l64118l50551l82270k7225j65322j29425
$$ 45007284 44503245 44197049 43648754 43401928 43037810 42687259 42304989 42277764 42112442 41983017
4562D1983017j83230j25780j00899J37090q8890J40083O0186J12739N1342M2173
$$ 41983017 41799787 41674007 41573108 41710198 41621308 41761391 41821577 41934316 41985658 42027831
4552D2027831L35462J80228L80591Q7113M83970L32136L03779N30793K58497O69739
$$ 42027831 42363293 42543521 42924112 43011225 43495195 43827331 44131110 44661903 44920400 45590139
4542D5590139L52731O21593O55269N80141O79353N90323P06736R86628O80541
$$ 45590139 45942870 46564463 47219732 47799873 48479226 49069549 49776285 50762913 51443454
4533E1443454Q72088R13467P76433Q72908Q27443J058822Q78738R16474R51771
$$ 51443454 52315542 53229009 54005442 54878350 55705793 56764615 57643353 58559827 59511598
4524E9511598J165492P33569J129029R54293J206339J127838Q30892J215164J061339
$$ 59511598 60677090 61410659 62539688 63493981 64700320 65828158 66659050 67874214 68935553
4515F8935553J236757J030994J204346J271032J195410J241710J483665J541181
$$ 68935553 70172310 71203304 72407650 73678682 74874092 76115802 77599467 79140648
4507G9140648J489432J612962J638821J820449J929212J897309K062236K297770
$$ 79140648 80630080 82243042 83881863 85702312 87631524 89528833 91591069 93888839
4499I3888839K451106K471720K473505K855674K636029L104222L038980L060016
$$ 93888839 96339945 98811665 101285170 104140844 106776873 109881095 112920075 115980091
4491A15980091L424760L266637L657114L380994L795913L481873L555056L531113
$$ 115980091 119404851 122671488 126328602 129709596 133505509 136987382 140542438 144073551
4483A44073551L672301L536641L577109L195890L386425L031464K889635K822939
$$ 144073551 147745852 151282493 154859602 158055492 161441917 164473381 167363016 170185955
4475A70185955K337062K162199J725310J711853J092599J002462O86447K43715
$$ 170185955 172523017 174685216 176410526 178122379 179214978 180217440 180903887 181147602
4467A81147602M4123l95433p31125j192171j315688j755234k068314k269373k554130
$$ 181147602 181191725 180796292 180065167 178872996 177557308 175802074 173733760 171464387 168910257
4458A68910257k673403k942409k995716l402940l385448l473645l565640l494222
$$ 168910257 166236854 163294445 160298729 156895789 153510341 150036696 146471056 142976834
4450A42976834l615879l538474l831599l384764l487114l423682l325551l261624
$$ 142976834 139360955 135822481 131990882 128606118 125119004 121695322 118369771 115108147
4442A15108147l041714l100786k979920k654268k904021k369480k393193k392777
$$ 115108147 112066433 108965647 105985727 103331459 100427438 98057958 95664765 93271988
4434I3271988k250099j999923j868401k067178j786124j572392j676937j486088
$$ 93271988 91021889 89021966 87153565 85086387 83300263 81727871 80050934 78564846
4426G8564846j435511j220793j411374j033538j423243j193489j041626j058376
$$ 78564846 77129335 75908542 74497168 73463630 72040387 70846898 69805272 68746896
4418F8746896j000675j061390r76962r53937p70598j127220p80504j008456q24817
$$ 68746896 67746221 66684831 65707869 64753932 63983334 62856114 62075610 61067154 60242337
4409F0242337j067608r56797p48717q47296r98491r12212m80115r79578p26406
$$ 60242337 59174729 58217932 57469215 56621919 55623428 54711216 54231101 53251523 52525117
4400E2525117q63466p04152o72264o78787n99940n41392o63089m16429n21442
$$ 52525117 51661651 50957499 50285235 49606448 49006508 48465116 47802027 47385598 46864156
4391D6864156m66756l43007m04256l63525k40590k88193k01123l75913p7042k22378
$$ 46864156 46397400 46054393 45650137 45286612 45046022 44757829 44556706 44180793 44103751 43881373
4381D3881373r8728n2676j63892J92039r0461L2830l8480J05354J50210P4444
$$ 43881373 43782645 43729969 43566077 43758116 43667655 43700485 43662005 43767359 43917569 43992013
4371D3992013K02307K83440J30892L09407K47785L24191M44131K46770M95642
$$ 43992013 44194320 44477760 44608652 44918059 45165844 45490035 45934166 46180936 46676578
4362D6676578K98440N34520O92641M12729M53946Q23415N08423Q51822N09951
$$ 46676578 46975018 47509538 48202179 48614908 49068854 49892269 50400692 51252514 51762465
4353E1762465R67801P68434R35495Q71001J050858R58480R81765J187117J182582
$$ 51762465 52730266 53498700 54434195 55305196 56356054 57314534 58296299 59483416 60665998
4344F0665998J260491J331632J491690J371636J605845J539769J577251J881655
$$ 60665998 61926489 63258121 64749811 66121447 67727292 69267061 70844312 72725967
4336G2725967K025915J841019K252334K106243K350089K549350K667927K568233
$$ 72725967 74751882 76592901 78845235 80951478 83301567 85850917 88518844 91087077
4328I1087077K931656L007719L187487L167474L388583L589855L622173L780949
$$ 91087077 94018733 97026452 100213939 103381413 106769996 110359851 113982024 117762973
4320A17762973L973552M024871M203991M216660M449045M472492M476823M526157
$$ 117762973 121736525 125761396 129965387 134182047 138631092 143103584 147580407 152106564
4312A52106564M573160M672491M365508M357868M344550M021339L977397L914989
$$ 152106564 156679724 161352215 165717723 170075591 174420141 178441480 182418877 186333866
4304A86333866L365483L287004K842885K718601K200210J684990J392706J048026
$$ 186333866 189699349 192986353 195829238 198547839 200748049 202433039 203825745 204873771
4296B04873771M67136K5526l18768r66752p94162j740777j880945k443396k733632
$$ 204873771 205340907 205366433 205047665 204080913 203286751 201545974 199665029 197221633 194488001
4287A94488001k912194l293117l229494l940793l867362m061687m123692m066781
$$ 194488001 191575807 188282690 185053196 181112403 177245041 173183354 169059662 164992881
4279A64992881m462080m167246m240072m455846m039587m350383l937826m046334
$$ 164992881 160530801 156363555 152123483 147667637 143628050 139277667 135339841 131293507
4271A31293507l956985l586688l810731l452044l481033l254259l196370l113263
$$ 131293507 127336522 123749834 119939103 116487059 113006026 109751767 106555397 103442134
4263A03442134k866979k854246k736835k503769k499027k360372k296432k242727
$$ 103442134 100575155 97720909 94984074 92480305 89981278 87620906 85324474 83081747
4255H3081747k153799k071299j689094j943275j658305j644681j462620j681231
$$ 83081747 80927948 78856649 77167555 75224280 73565975 71921294 70458674 68777443
4247F8777443j149574j446076j253419j117811j171201j220004r63218q82980
$$ 68777443 67627869 66181793 64928374 63810563 62639362 61419358 60456140 59573160
4239E9573160q81561r41346o78064p29812n47436p38800o55203l13975n27359
$$ 59573160 58691599 57750253 57072189 56342377 55794941 55056141 54400938 54086963 53559604
4230E3559604m83604m07275k56477k24788k86218r2310j16977l77729o5499j38027
$$ 53559604 53076000 52668725 52412248 52187460 51901242 51808932 51691955 51314226 51248727 51110700
4220E1110700K109j46489J08409l2763j20656J39431K2819O0722K44657j62330
$$ 51110700 51112809 50966320 51074729 51041966 50921310 51060741 51083560 51144282 51388939 51226609
4210E1226609J81056o014J39820L8532K76355K55997K28308L25714O7419P24520
$$ 51226609 51407665 51401651 51541471 51580003 51856358 52112355 52340663 52666377 52733796 53458316
4200E3458316K07336N11545M35674N06208N38511P24242O49402P86621Q99205
$$ 53458316 53665652 54177197 54612871 55119079 55657590 56381832 57031234 57817855 58717060
4191E8717060O93539J122704J033626J057743J169174J425593J223107J346616
$$ 58717060 59410599 60533303 61566929 62624672 63793846 65219439 66442546 67789162
4183F7789162J507563J454726J525907J617530J756483J813404J645220J804136
$$ 67789162 69296725 70751451 72277358 73894888 75651371 77464775 79109995 80914131
4175H0914131J749980J807455J707787J811659J689773J683680J641542J426656
$$ 80914131 82664111 84471566 86179353 87991012 89680785 91364465 93006007 94432663
4167I4432663J404853J284388J188295J116440R92193N11216N77458M86720J72745
$$ 94432663 95837516 97121904 98310199 99426639 100418832 100930048 101507506 101994226 102166971
4158A02166971N8658n3755m46505n06729n55837r82842q29914j119294j293648
$$ 102166971 102225629 102171874 101725369 101218640 100662803 99679961 98850047 97730753 96437105
4149I6437105j596775j595280j619947j874042j657722j975916j813628k166970
$$ 96437105 94840330 93245050 91625103 89751061 88093339 86117423 84303795 82136825
4141H2136825j835231k193102j835217k001087j894533j915922j951532j809389
$$ 82136825 80301594 78108492 76273275 74272188 72377655 70461733 68510201 66700812
4133F6700812j778528j587088j679371j542331j561166j379091j532817j171912
$$ 66700812 64922284 63335196 61655825 60113494 58552328 57173237 55640420 54468508
4125E4468508j252432j268332q75662j189897j063189p38794r75605q19683q37970
$$ 54468508 53216076 51947744 51072082 49882185 48818996 48080202 47104597 46284914 45446944
4116D5446944n73063r71879n22086m59746p39707m82839n04410n43125o17100
$$ 45446944 44873881 43902002 43379916 42920170 42180463 41697624 41193214 40650089 40032989
4107D0032989n57252l87361l96442n18004l44741n07940m01733l98084k03478
$$ 40032989 39475737 39088376 38691934 38173930 37829189 37321249 36919516 36521432 36317954
4098C6317954o34820m13259l12440n10812l94523k93657m39065k42820o09576
$$ 36317954 35683134 35269875 34957435 34446623 34052100 33758443 33319378 33076558 32466982
4089C2466982l11003m21469j67805l79006k00182n37098l16307R185l89307l29476
$$ 32466982 32155979 31734510 31566705 31187699 30987517 30450419 30134112 30143297 29753990 29424514
4079B9424514k38106K2812m19941j21593o7664j80128R3393k74455r8180K6503
$$ 29424514 29186408 29209220 28789279 28667686 28600022 28419894 28513287 28238832 28140652 28167155
4069B8167155N4413j77282J03082r0777R9854K20722j38224o579K26337O6845
$$ 28167155 28221568 28044286 28147368 28056591 28156445 28377167 28238943 28232364 28458701 28525546
4059B8525546P9837L21591J93440m8407K76804J71112L59379K31214J49810J48983
$$ 28525546 28605383 28926974 29120414 29072007 29348811 29519923 29879302 30110516 30260326 30409309
4049C0409309N23202K39642L59773K71285L44984K01989M48867L63061M97277
$$ 30409309 30932511 31172153 31531926 31803211 32148195 32350184 32799051 33162112 33659389
4040C3659389K30351M51833L81434L48932N91807N78602M18795M43277P02219
$$ 33659389 33889740 34341573 34723007 35071939 35663746 36242348 36661143 37104420 37806639
4031C7806639M97612P53222N76590N76721Q55399O23546Q79045N47420R13262
$$ 37806639 38304251 39057473 39634063 40210784 41066183 41689729 42568774 43116194 44029456
4022D4029456P51590R56633Q77836J012974J137416J035648Q71934J366706J298787
$$ 44029456 44781046 45737679 46615515 47628489 48765905 49801553 50673487 52040193 53338980
4013E3338980J196820J286248J420122J479970J536478J610832J695488J622042
$$ 53338980 54535800 55822048 57242170 58722140 60258618 61869450 63564938 65186980
4005F5186980J883883J894873J951905K260419K135196K347464K534705K663932
$$ 65186980 67070863 68965736 70917641 73178060 75313256 77660720 80195425 82859357
3997H2859357K661573K898983L004132L316314L446183L543529L612117M027554
$$ 82859357 85520930 88419913 91424045 94740359 98186542 101730071 105342188 109369742
3989A09369742M058417M464809M691969M981044N206185N529142N843268N972153
$$ 109369742 113428159 117892968 122584937 127565981 132772166 138301308 144144576 150116729
3981A50116729O393212O869509P004412P357807P680994Q373565Q244100Q503974
$$ 150116729 156509941 163379450 170383862 177741669 185422663 193796228 202040328 210544302
3973B10544302R169634R263413R280829R623568R618333R722983R592937R408483
$$ 210544302 219713936 228977349 238258178 247881746 257500079 267223062 276815999 286224482
3965B86224482R407911Q992350Q553662P806394P126577O532704M989196M363802
$$ 286224482 295632393 304624743 313178405 320984799 328111376 334644080 339633276 343997078
3957C43997078K696628J461542K85055j352301k506765l992383m947957o179654
$$ 343997078 346693706 348155248 348440303 347088002 344581237 340588854 335640897 329461243
3949C29461243p157973p781791q416696r518830r279971r758368r919603r818853
$$ 329461243 322303270 314521479 306104783 296585953 287305982 277547614 267628011 257809158
3941B57809158r930481r625984r575703r446631q769797q567114q447611q019274
$$ 257809158 247878677 238252693 228676990 219230359 210460562 201893448 193445837 185426563
3933A85426563p613998p269974p005593o679474o400720n933869n892269n438705
$$ 185426563 177812565 170542591 163536998 156857524 150456804 144522935 138630666 133191961
3925A33191961n418146m785218m807980m711992m330501l981588m004985l673590
$$ 133191961 127773815 122988597 118180617 113468625 109138124 105156536 101151551 97477961
3917I7477961l839083l422184l384256l278551k831229k946071k860950k608782
$$ 97477961 93638878 90216694 86832438 83553887 80722658 77776587 74915637 72306855
3909G2306855k468209k457500k359375k253857k185193j727620k209842j712727
$$ 72306855 69838646 67381146 65021771 62767914 60582721 58855101 56645259 54932532
3901E4932532j775043j679371j519594j625721j589617j371160j403357j285863
$$ 54932532 53157489 51478118 49958524 48332803 46743186 45372026 43968669 42682806
3893D2682806j235365j268248r98368j104011j139681j050978r37080r48292q57968
$$ 42682806 41447441 40179193 39180825 38076814 36937133 35886155 34949075 34000783 33142815
3884C3142815r10723j069473q60839o06220p49729p73955p79806p10234m99674
$$ 33142815 32232092 31162619 30301780 29695560 28945831 28171876 27392070 26681836 26182162
3875B6182162q19167o44227n40032o84313m91822o37252l74512m81482n41538
$$ 26182162 25362995 24718768 24178736 23494423 23002601 22365349 21990837 21509355 20967817
3866B0967817l50532n21592m59887l48064o00412m52258m67243k75429m65738
$$ 20967817 20617285 20095693 19635806 19287742 18687330 18235072 17767829 17492400 17026662
3857A7026662l42921l30721k63534l71542k88066m14110m09615k93131k87368
$$ 17026662 16683741 16353020 16089486 15717944 15429878 15015768 14606153 14313022 14025654
3848A4025654k22977k91814j91672l56704k71948k15441l06951l01892l63339
$$ 14025654 13802677 13510863 13319191 12962487 12690539 12475098 12168147 11866255 11502916
3839A1502916J2955j81259l58007j46114j28988k38733k20178j36202l68327r5689
$$ 11502916 11515871 11334612 10976605 10830491 10701503 10462770 10242592 10106390 9738063 9642374
3829I642374k91657j61275j80185k56573O4146k30881l34759K9629k77735j08294
$$ 9642374 9350717 9189442 9009257 8752684 8816830 8585949 8251190 8280819 8003084 7894790
3819G894790k9518k30849j59842J3359l25908k9049o7984j47820j16512k62019
$$ 7894790 7865272 7634423 7474581 7487940 7162032 7132983 7064999 6917179 6800667 6538648
3809F538648j16668q0132j76287o8459k38612N9900j61581J7771j56432j29318
$$ 6538648 6421980 6341848 6165561 6097102 5858490 5918390 5756809 5774580 5618148 5488830
3799E488830o2567j00964j3385j59589j13804j31436L1476m2412j56836n8794
$$ 5488830 5426263 5325299 5311914 5152325 5038521 4907085 4938561 4896149 4739313 4680519
3789D680519k01181l021j41624k9956M7742k22514l9329N0699j48412j57435J8341
$$ 4680519 4479338 4476317 4334693 4304737 4352479 4129965 4090636 4141335 3992923 3835488 3853829
3778C853829j87776M7002j60616K2218k22886Q3178j55833l5789L8759q0876N0429
$$ 3853829 3666053 3713055 3552439 3574657 3351771 3434949 3279116 3243327 3282086 3201210 3251639
3767C251639j36697j87795P0481m9899j29132j5568j02885J26000j58396k5811
$$ 3251639 3114942 2927147 2997628 2947729 2818597 2803029 2700144 2826144 2667748 2641937
3757B641937j18738K60959l00912K32811j19570j43106K406Q4817k41892o258
$$ 2641937 2523199 2784158 2483246 2716057 2596487 2453381 2455787 2540604 2298712 2292454
3747B292454J63674j31373K0462m724l1505M0127q4075N8918j48950J36458m0507
$$ 2292454 2456128 2324755 2345217 2340493 2308988 2349115 2265040 2323958 2175008 2311466 2270959
3736B270959M1735l8133j40626J35296r4175O8553l4612q5300P5897L6292L0037
$$ 2270959 2312694 2274561 2133935 2269231 2175056 2243609 2208997 2123697 2199594 2235886 2265923
3725B265923M1040n7081r0363J93298J01422k11549K86577l47833K71203K0264
$$ 2265923 2306963 2249882 2159519 2352817 2454239 2242690 2529267 2181434 2452637 2472901
3715B472901j04253Q7482K0232j20366P6275r6761K1295o6235m586l3127n5651
$$ 2472901 2368648 2456130 2476362 2355996 2432271 2335510 2356805 2290570 2285984 2252857 2197206
3704B197206m5398K2458M2419j87119K9543k27212O6185n3278k1143j90038k18418
$$ 2197206 2151808 2174266 2216685 2029566 2059109 1831897 1898082 1844804 1823661 1633623 1415205
3693A415205K75390O034m43779P0270o3523p2059Q4823j96809j16879Q3802j02681
$$ 1415205 1690595 1696629 1252850 1323120 1259597 1187538 1272361 1075552 958673 1042475 939794
3682I39794k08083J0694j7893R310m9821l4343k7427l15633N2127k2021J26730
$$ 939794 731711 742405 724512 733822 684001 649658 622231 306598 358725 336704 463434
3671D63434j98304j11211N3721N299k1230j467k8090k848K4011n1063j10623p7291
$$ 463434 265130 153919 207640 212939 191709 190242 162152 159304 183315 132252 21629 -55662
3659e5662K6720J37303j59067J4339m1657R7262j74986J17164j42752N8548j17803
$$ -55662 -28942 108361 -50706 -36367 -78024 19238 -155748 -38584 -181336 -122788 -240591
3648b40591K00462k73388Q4671j54333J46765j7744L2570n2384J48523j76570
$$ -240591 -40129 -313517 -228846 -383179 -236414 -254158 -221588 -273972 -125449 -302019
3638c02019J718m5812j2856p4285n4109N9594p39O8210q0624J08067j50610N661
$$ -302019 -300301 -346113 -358969 -433254 -487363 -427769 -428508 -360298 -440922 -332855 -483465 -477804
3626d77804r2280J24424j60118N8358Q0434j45906R6669K5713j35715J36342j62009
$$ -477804 -570084 -445660 -605778 -547420 -466986 -612892 -516223 -490510 -626225 -489883 -651892
3615f51892N8433k67309K48138n4582J68939r2857J7577j08999j66432K14529
$$ -651892 -593459 -860768 -612630 -667212 -498273 -591130 -573553 -682552 -848984 -634455
3605f34455j46246J75947p0176n7911n5345P9455p5522p8393N5789J11306K7691
$$ -634455 -780701 -604754 -674930 -732841 -788186 -708731 -784253 -862646 -806857 -695551 -667860
3594f67860j80026N3906l9312Q4540j30045j20177J54868J44800j77804k42540
$$ -667860 -847886 -793980 -833292 -748752 -878797 -998974 -844106 -699306 -877110 -1119650
3584a119650l7684P0632K33638K2697j38914j02466K35289j10799p2249J67442
$$ -1119650 -1157334 -1086702 -853064 -830367 -969281 -1071747 -836458 -947257 -1019506 -852064
3574h52064q1014j6610O3337j58634j12556J85625L6511m8008j12906J58656j04150
$$ -852064 -933078 -949688 -886351 -1044985 -1157541 -971916 -935405 -983413 -1096319 -937663 -1041813
3563a041813k7024J99095j52027j42097K67538q0360k44950P4924k7147L16714
$$ -1041813 -1068837 -869742 -1021769 -1163866 -896328 -976688 -1221638 -1146714 -1173861 -857147
3553h57147L9196l51422K01033j06040R6383j57084N4683L9735j7849N624P5283
$$ -857147 -817951 -1169373 -968340 -1074380 -977997 -1135081 -1080398 -1040663 -1058512 -1052888 -977605
3542i77605k06195J143J51279j50074m772J26662m2631O3545k39761K69735j45638
$$ -977605 -1183800 -1182657 -1031378 -1181452 -1186224 -1059562 -1102193 -1038648 -1278409 -1008674 -1154312
3531a154312J49429k97212J22286Q0702j25219j11642K66803l1203j06115K9680
$$ -1154312 -1004883 -1302095 -1179809 -1099107 -1224326 -1335968 -1069165 -1100368 -1206483 -1176803
3521a176803p6736N8869L5697K1916k6338j40869J70315J69825r5633j83196N0827
$$ -1176803 -1253539 -1194670 -1158973 -1137057 -1163395 -1304264 -1133949 -964124 -1059757 -1242953 -1192126
3510a192126r2605p864k7984K0159Q4953J5315M1517j01838j5920P8846J6297
$$ -1192126 -1284731 -1292595 -1320579 -1300420 -1215467 -1200152 -1158635 -1260473 -1276393 -1197547 -1181250
3499a181250r9677P2916j06102K8768O7785j3923K0395j37983J901J13301q754
$$ -1181250 -1280927 -1208011 -1314113 -1285345 -1217560 -1231483 -1211088 -1349071 -1347170 -1233869 -1242623
3488a242623N1667l60147K95067n8932P9400R5956k97814J67139R736J4597N5481
$$ -1242623 -1190956 -1551103 -1256036 -1314968 -1235568 -1139612 -1437426 -1270287 -1260551 -1245954 -1190473
3477a190473j34190j1382K5198M8613n868K8969O8447j43809J7567P4850j06585
$$ -1190473 -1324663 -1336045 -1310847 -1262234 -1268102 -1239133 -1170686 -1314495 -1296928 -1222078 -1328663
3466a328663p9000J42719o5090p2540J59261j57401J25520O1373k52198K65910
$$ -1328663 -1407663 -1264944 -1330034 -1402574 -1243313 -1400714 -1275194 -1213821 -1466019 -1200109
3456a200109j15477J40592k8887j74146L9253J54705j06019J04191j53795n9334
$$ -1200109 -1315586 -1174994 -1203881 -1378027 -1338774 -1184069 -1290088 -1185897 -1339692 -1399026
3446a399026o2159J57806J2543J99748j69745j24685K0486K56395r3080J4588
$$ -1399026 -1461185 -1303379 -1290836 -1091088 -1260833 -1385518 -1365032 -1108637 -1201717 -1187129
3436a187129J2744l0015k02879P9536M5151N6911k854j60062m692J12310L6777
$$ -1187129 -1174385 -1204400 -1407279 -1327743 -1282592 -1225681 -1228535 -1388597 -1393289 -1280979 -1244202
3425a244202K9762n6796j69071K71427O2379j5668j52001j3338j37590K17288
$$ -1244202 -1214440 -1271236 -1440307 -1168880 -1106501 -1122169 -1274170 -1287508 -1425098 -1207810
3415a207810l3938p0062P9537m3998L5594q4762j23094J49038P6193j06741O5368
$$ -1207810 -1241748 -1311810 -1232273 -1276271 -1240677 -1325439 -1448533 -1299495 -1223302 -1330043 -1264675
3404a264675N7234j39863P2086l0928J5758k6298J51332j6753n6675j11399Q8825
$$ -1264675 -1207441 -1347304 -1275218 -1306146 -1290388 -1316686 -1165354 -1182107 -1238782 -1350181 -1261356
3393a261356L4684L0734R0489j57986Q7787M5148q8246p8737O6414p4823K20806
$$ -1261356 -1226672 -1195938 -1105449 -1263435 -1175648 -1130500 -1218746 -1297483 -1231069 -1305892 -1085086
3382a085086m7517k4239K8351J04371p0873r345p7097l536R3358Q9674m5181o8770
$$ -1085086 -1132603 -1156842 -1128491 -1024120 -1094993 -1104338 -1181435 -1184971 -1091613 -1001939 -1047120 -1115890
3370a115890P8747j53168J50728r6686J00858K12898j91844L2145J37665l285
$$ -1115890 -1037143 -1190311 -1039583 -1136269 -1035411 -822513 -1014357 -982212 -844547 -847832
3360h47832M9547j18193L8490m674J19089k59230K71656n2703m477O0645j4431
$$ -847832 -798285 -916478 -877988 -882662 -763573 -1022803 -751147 -803850 -808327 -747682 -762113
3349g62113l4232L0197M3052n5215K35586l4616J30071J23431r6681R7228j05550
$$ -762113 -796345 -766148 -723096 -778311 -542725 -577341 -447270 -323839 -420520 -323292 -428842
3338d28842L7779o5236J04747K64271m4520l0864N9588R7252J0871K21574M3646
$$ -428842 -391063 -456299 -351552 -87281 -131801 -162665 -103077 -5825 5046 226620 270266
3327B70266J37449Q8076Q2785J04650r802L79374j1293L44889Q648K01965J41749
$$ 270266 407715 495791 578576 683226 673424 1052798 1041505 1386394 1395042 1597007 1738756
3316A738756K33301K30790J34098N3695L32684K37157L96613L14330k7180J82542
$$ 1738756 1972057 2202847 2336945 2390640 2723324 2960481 3357094 3671424 3644244 3826786
3306C826786M10856J58766L34975K03962K64914o610K25545J12051o7945N5353
$$ 3826786 4237642 4396408 4731383 4935345 5200259 5193649 5419194 5531245 5463300 5518653
3296E518653j61044k27231J01024k85685k42410n3491m17872l23983k32699k99134
$$ 5518653 5357609 5130378 5231402 4945717 4703307 4649816 4231944 3907961 3675262 3376128
3286C376128p8728k99814k94100l15011j59553j17159k35119j85910j35442k16630
$$ 3376128 3297400 2997586 2703486 2388475 2228922 2111763 1876644 1690734 1555292 1338662
3276A338662k04655r0016q4748k05159m0569p6400j87088j93345Q954k41695J90525
$$ 1338662 1134007 1043991 959243 754084 713515 637115 450027 256682 265636 23941 214466
3265B14466k58505j38906k005P9085j18023k2330p9278j43688Q1661k91945J28207
$$ 214466 -44039 -182945 -184950 -105865 -223888 -246218 -325496 -469184 -387523 -679468 -551261
3254e51261r8248r805K549k02999J39558o9585M9603j02315k1344j10604K1130
$$ -551261 -649509 -659314 -656765 -859764 -720206 -789791 -740188 -842503 -863847 -974451 -953321
3243i53321n7453o0920r368R9628K69p967j23888l7452j03548J67771q7668J83742
$$ -953321 -1010774 -1071694 -1081062 -981434 -981165 -989132 -1113020 -1150472 -1254020 -1086249 -1173917 -990175
3231i90175j14867J09027j11985j66161M7876j3720R4131k3434m4887M4300j08281
$$ -990175 -1105042 -996015 -1108000 -1274161 -1226285 -1240005 -1145874 -1169308 -1214195 -1169895 -1278176
3220a278176l3767N4810J06529j52069j654K2595j71295R2735j7019J63443j42415
$$ -1278176 -1311943 -1257133 -1150604 -1302673 -1304327 -1281732 -1453027 -1360292 -1377311 -1213868 -1356283
3209a356283L841K00886j01490j828j59090J23775p9641K475Q2244k8512r5854
$$ -1356283 -1352442 -1151556 -1253046 -1254874 -1413964 -1290189 -1369830 -1367355 -1285111 -1313623 -1409477
3198a409477J03549j5453K2013j68832J83518j29698k380M2067M219L833m0619
$$ -1409477 -1305928 -1321381 -1299368 -1468200 -1284682 -1414380 -1416760 -1374693 -1370474 -1366641 -1407260
3187a407260r6707O2608J5528k2539m1882m9675R2045p2858J9768K7460R289r4265
$$ -1407260 -1503967 -1441359 -1425831 -1448370 -1490252 -1539927 -1447882 -1520740 -1500972 -1473512 -1464223 -1558488
3175a558488Q832k0294K5021k4886m5095O9756n1273J28409M3730j54911J5457
$$ -1558488 -1549656 -1569950 -1544929 -1569815 -1614910 -1545154 -1596427 -1468018 -1424288 -1579199 -1563742
3164a563742j1552j9330J92994k7380j45286J41630R356m2292j78031R8471J30399
$$ -1563742 -1575294 -1594624 -1401630 -1429010 -1574296 -1432666 -1423310 -1465602 -1643633 -1545162 -1414763
3153a414763r1152L6124j52619j34501L50611k66156J11512J39561j11225L7664
$$ -1414763 -1505915 -1469791 -1622410 -1756911 -1406300 -1672456 -1560944 -1421383 -1532608 -1494944
3143a494944L3602j77424J27309j2571p6916k49490K97676n1277k1796p2177N6349
$$ -1494944 -1461342 -1638766 -1511457 -1524028 -1600944 -1850434 -1552758 -1604035 -1625831 -1698008 -1641659
3132a641659n2900J56581k07245K09779r6745K35277k02946m785L7161o2432Q5451
$$ -1641659 -1694559 -1537978 -1745223 -1535444 -1632189 -1396912 -1599858 -1604643 -1567482 -1629914 -1544463
3121a544463N4940j64294K21160P5443k91761J60784j53741P2692N6403j0503
$$ -1544463 -1489523 -1653817 -1432657 -1357214 -1648975 -1488191 -1641932 -1569240 -1512837 -1523340
3111a523340J0654j55674J07176k6990J48492j65969l931J84320j16859j10511
$$ -1523340 -1512686 -1668360 -1561184 -1588174 -1439682 -1605651 -1609582 -1425262 -1542121 -1652632
3101a652632N7230M6233n0065M7429q2500k3233N7686j08774N5782o7230O7999
$$ -1652632 -1595402 -1549169 -1599234 -1551805 -1634305 -1657538 -1599852 -1708626 -1652844 -1720074 -1652075
3090a652075O7441k1501J44140j20473l3432j33508J37490K12493k47987L0915
$$ -1652075 -1584634 -1606135 -1461995 -1582468 -1615900 -1749408 -1611918 -1399425 -1647412 -1616497
3080a616497K2590n9234r6216K06496q3418j7334J79486j01471m4516j3426M818
$$ -1616497 -1593907 -1653141 -1749357 -1542861 -1626279 -1643613 -1464127 -1565598 -1610114 -1623540 -1618722
3069a618722o1887j09384J20477R7765j2704O0736m4740j22250J26661o939L2007
$$ -1618722 -1680609 -1789993 -1669516 -1571751 -1584455 -1523719 -1568459 -1690709 -1564048 -1570987 -1538980
3058a538980K4010j86576J76302m6346j0034m5600P2421J66791j54570K7763L9419
$$ -1538980 -1514970 -1701546 -1525244 -1571590 -1581624 -1627224 -1554803 -1388012 -1542582 -1514819 -1475400
3047a475400l8138j30291r3325J05487J34693k46616L2004J61258k3990m491O2093
$$ -1475400 -1513538 -1643829 -1737154 -1631667 -1496974 -1743590 -1711586 -1550328 -1574318 -1578809 -1516716
3036a516716m5932j47088J10688M9133R4355L5623j43152L0124j07258K092p980
$$ -1516716 -1562648 -1709736 -1599048 -1549915 -1455560 -1419937 -1563089 -1532965 -1640223 -1638131 -1646111
3025a646111L7689M7828m5208j56864J43937j07201R4831J14658j01378p3127
$$ -1646111 -1608422 -1560594 -1605802 -1762666 -1618729 -1725930 -1631099 -1516441 -1617819 -1690946
3015a690946M1470P9041L1769k0076J31593p7325j41767q1295K3999J60706L7768
$$ -1690946 -1649476 -1570435 -1538666 -1558742 -1427149 -1504474 -1646241 -1727536 -1703537 -1542831 -1505063
3004a505063Q3333k07339J1957K8222j17194K14080j23308J39864j46335J10116
$$ -1505063 -1421730 -1629069 -1617112 -1588890 -1706084 -1492004 -1615312 -1475448 -1621783 -1511667
2994a511667l4738J26548j67240j21190J20534n668O0588P8123j84628J94255
$$ -1511667 -1546405 -1419857 -1587097 -1708287 -1587753 -1593421 -1532833 -1454710 -1639338 -1445083
2984a445083k93367K31052j03916P0197k1213r2737J07749o6608J6694q756n5267
$$ -1445083 -1738450 -1507398 -1611314 -1541117 -1562330 -1655067 -1547318 -1613926 -1597232 -1605988 -1661255
2973a661255L2530N096R86J15754j39850K16459n1106j13862J56829k45604N6391
$$ -1661255 -1628725 -1623629 -1622643 -1506889 -1646739 -1430280 -1481386 -1595248 -1438419 -1684023 -1627632
2962a627632p5021L9679P4856j3577j3050J05122j79205K18922j40643l7667Q6347
$$ -1627632 -1702653 -1662974 -1588118 -1601695 -1614745 -1509623 -1688828 -1469906 -1610549 -1648216 -1561869
2951a561869M4532q2062p314N4108j28646n2602J7837J83214O5530j14412O5851
$$ -1561869 -1517337 -1599399 -1606713 -1552605 -1681251 -1733853 -1716016 -1532802 -1467272 -1581684 -1515833
2940a515833j18823K17687j89957R4516K7861K8263j34705J45307k20234O1521
$$ -1515833 -1634656 -1416969 -1606926 -1512410 -1484549 -1456286 -1590991 -1445684 -1665918 -1604397
2930a604397J85349r6124k54724L55683k19220l4525Q9925K3497l2784M0198o3397
$$ -1604397 -1419048 -1515172 -1769896 -1414213 -1633433 -1667958 -1578033 -1554536 -1587320 -1547122 -1610519
2919a610519J03517k8886p7067N2779L2544l3058k789K963L5475l0400Q3304j06302
$$ -1610519 -1507002 -1535888 -1612955 -1560176 -1527632 -1560690 -1563479 -1560516 -1525041 -1555441 -1472137 -1578439
2907a578439M5444j54561O5965q2208N8308J34042K482O5840r9073n0618P5967
$$ -1578439 -1532995 -1687556 -1621591 -1703799 -1645491 -1511449 -1508967 -1443127 -1542200 -1592818 -1516851
2896a516851q874n5393O7845r4068J47397j18524j17497J42869k05500J92367
$$ -1516851 -1525725 -1581118 -1513273 -1607341 -1459944 -1578468 -1695965 -1553096 -1758596 -1566229
2886a566229N779j27279J32872r2798J4130l8709K16045r2468L9322j56523J91169
$$ -1566229 -1560450 -1687729 -1554857 -1647655 -1633525 -1672234 -1456189 -1548657 -1509335 -1665858 -1474689
2875a474689m5296m2158M1735p0238j06153K35251j62811K7277m1764J38016j06094
$$ -1474689 -1519985 -1562143 -1520408 -1590646 -1696799 -1461548 -1624359 -1597082 -1638846 -1500830 -1606924
2864a606924m2391O5878J38602j45809k3020K0965M2903p4590L4528P2729r9506
$$ -1606924 -1649315 -1583437 -1444835 -1590644 -1613664 -1592699 -1549796 -1624386 -1589858 -1517129 -1616635
2853a616635P3525j24008R3691j07116Q300k9252Q6291J8299p9698J6945J44048
$$ -1616635 -1543110 -1667118 -1573427 -1680543 -1672243 -1701495 -1615204 -1596905 -1676603 -1659658 -1515610
2842a515610M9879o5226l263K5916m3290M1423N555q4814m7121J24577l0346j37019
$$ -1515610 -1465731 -1530957 -1534220 -1508304 -1551594 -1510171 -1504616 -1589430 -1636551 -1511974 -1542320 -1679339
2830a679339M4090J58039j43601j9025K3311j25442J87999K7005L647l8366J8102
$$ -1679339 -1635249 -1477210 -1620811 -1639836 -1616525 -1741967 -1553968 -1526963 -1523316 -1561682 -1543580
2819a543580p230n5643K3134n0438P6065o4435L5098J00123r1187N9760p9355
$$ -1543580 -1550810 -1606453 -1583319 -1633757 -1557692 -1622127 -1587029 -1486906 -1578093 -1518333 -1597688
2808a597688J93299k41896J4644m8250o3857J46864n8730O5522M3162N2503p8388
$$ -1597688 -1404389 -1646285 -1631641 -1679891 -1743748 -1596884 -1655614 -1590092 -1546930 -1494427 -1572815
2797a572815j37960J39562K6386P1453j14291K6920p2664J77443j40688P7890
$$ -1572815 -1710775 -1571213 -1544827 -1473374 -1587665 -1560745 -1633409 -1455966 -1596654 -1518764
2787a518764k34063J60922J28165j44297K6590R2936K7481q1900M0277p174p0476
$$ -1518764 -1752827 -1591905 -1463740 -1608037 -1581447 -1488511 -1461030 -1542930 -1502653 -1509827 -1580303
2776a580303m7212j11737J9270J69051q4347M7527l5805O1011q977k28229K26685
$$ -1580303 -1627515 -1739252 -1719982 -1550931 -1635278 -1587751 -1623556 -1562545 -1571522 -1799751 -1573066
2765a573066O8744n0324k1664J14046j93140k8721M3422J22697J04104k44890
$$ -1573066 -1504322 -1554646 -1576310 -1462264 -1655404 -1684125 -1640703 -1518006 -1413902 -1658792
2755a658792M6152N6841j8465n2573K3269J29080o5459o7955Q8282j83185K26796
$$ -1658792 -1612640 -1555799 -1574264 -1626837 -1603568 -1474488 -1539947 -1607902 -1519620 -1702805 -1476009
2744a476009R4193r6692r0637R2364J5816j14258m8628J35234J6120o0298r7587
$$ -1476009 -1381816 -1478508 -1569145 -1476781 -1460965 -1575223 -1623851 -1488617 -1472497 -1532795 -1630382
2733a630382J52692n4261n8773k6260O8705R0439k32205K01537l3582k0789j09040
$$ -1630382 -1477690 -1531951 -1590724 -1616984 -1548279 -1457840 -1690045 -1488508 -1522090 -1542879 -1651919
2722a651919J23824p3788J07967o7355N3097N1698j42960j493j03359M0901O4385
$$ -1651919 -1528095 -1601883 -1493916 -1561271 -1508174 -1456476 -1599436 -1600929 -1704288 -1663387 -1599002
2711a599002j53952J22371P0366k3583N3990r765r403J05935l8366m6124j75433
$$ -1599002 -1752954 -1630583 -1560217 -1583800 -1529810 -1539575 -1548978 -1443043 -1481409 -1527533 -1702966
2700a702966L41351j08900k81063K41038K7821j80451J24450m0547j72950O3498
$$ -1702966 -1361615 -1470515 -1751578 -1510540 -1482719 -1663170 -1538720 -1579267 -1752217 -1688719
2690a688719O3383N5504j1368J58451j13734M3070o9127P2536M026j37160J12752
$$ -1688719 -1625336 -1569832 -1581200 -1422749 -1536483 -1493413 -1562540 -1490004 -1485978 -1623138 -1510386
2679a510386j3617k6696n2494Q896J62272j63409N4281j05575R6637q2303J07161
$$ -1510386 -1524003 -1550699 -1603193 -1594297 -1432025 -1595434 -1541153 -1646728 -1550091 -1632394 -1525233
2668a525233m4056l5430J86239j30359j37855J8322l206m197R8178j37874J41142
$$ -1525233 -1569289 -1604719 -1418480 -1548839 -1686694 -1668372 -1671578 -1675775 -1577597 -1715471 -1574329
2657a574329J11613j43738J42594j14073K8857k1118J17534Q495o0995r0800q928
$$ -1574329 -1462716 -1606454 -1463860 -1577933 -1549076 -1570194 -1452660 -1444165 -1505160 -1595960 -1604888
2646a604888j4121M4605j05487J28449k01138L55494k64687J85644k37435J06075
$$ -1604888 -1619009 -1574404 -1679891 -1551442 -1752580 -1397086 -1661773 -1476129 -1713564 -1607489
2636a607489n4588Q4293K1501K75102l62656M8391P9480j92055J94205K07309
$$ -1607489 -1662077 -1577784 -1556283 -1281181 -1643837 -1595446 -1515966 -1708021 -1513816 -1306507
2626a306507p1492k08319K0382K2515O4555Q17n1071j40481J11410k5106O948
$$ -1306507 -1377999 -1586318 -1565936 -1543421 -1478866 -1478049 -1529120 -1669601 -1558191 -1583297 -1576349
2615a576349o6180J88060j20144J01841q1596J37338j13529J30960k37455J16967
$$ -1576349 -1642529 -1454469 -1574613 -1472772 -1554368 -1417030 -1530559 -1399599 -1637054 -1520087
2605a520087q8542j7918J12356J51084k08514J50426k51073K62712r4221n7730
$$ -1520087 -1608629 -1626547 -1514191 -1363107 -1571621 -1421195 -1672268 -1409556 -1503777 -1561507
2595a561507J7045m7336K5561K5455l2162k10086K82467N2498l1432J8213j27071
$$ -1561507 -1544462 -1591798 -1566237 -1540782 -1572944 -1783030 -1500563 -1448065 -1479497 -1461284 -1588355
2584a588355O714K8535p1575K13146l9677q8076O3854k62522K77387j02749L4509
$$ -1588355 -1581641 -1553106 -1624681 -1411535 -1451212 -1539288 -1475434 -1737956 -1460569 -1563318 -1528809
2573a528809j54343J44358m6017M138R3642j63140J09533k4732M6585m4231N9177
$$ -1528809 -1683152 -1538794 -1584811 -1580673 -1487031 -1650171 -1540638 -1565370 -1518785 -1563016 -1503839
2562a503839R6831j76141L2178k5201Q0149N6307o8512N9884M1413k07001L2638
$$ -1503839 -1407008 -1583149 -1550971 -1576172 -1496023 -1439716 -1508228 -1448344 -1406931 -1613932 -1581294
2551a581294K4515P7052n0090Q4998M816j66035R0312n2789M6248o184J00275
$$ -1581294 -1556779 -1479727 -1529817 -1444819 -1440003 -1606038 -1515726 -1568515 -1522267 -1528451 -1428176
2540a428176J15167q5053n1529j77743J54639o4036m0506j2906Q2983k1824J5079
$$ -1428176 -1313009 -1398062 -1449591 -1627334 -1472695 -1536731 -1577237 -1590143 -1507160 -1528984 -1513905
2529a513905j77448J09177J33876n8321r2817l435m6206P0969J84137r4168M5815
$$ -1513905 -1691353 -1582176 -1448300 -1506621 -1599438 -1602873 -1649079 -1578110 -1393973 -1488141 -1442326
2518a442326O5089j14410J2779k6018q5591J44479j78416n3706J40126k2565R6105
$$ -1442326 -1377237 -1491647 -1478868 -1504886 -1590477 -1445998 -1624414 -1678120 -1537994 -1560559 -1464454
2507a464454L3790N005k0265j90739J10402K488J34681p8464l6651O5683L0210
$$ -1464454 -1430664 -1425659 -1445924 -1636663 -1526261 -1523773 -1389092 -1467556 -1504207 -1438524 -1408314
2496a408314k4569r1241L8995k37243J98605j27699M1821Q714J77644j13294J13955
$$ -1408314 -1432883 -1524124 -1485129 -1722372 -1523767 -1651466 -1609645 -1600931 -1423287 -1536581 -1422626
2485a422626o3480o128q3179j6226M8763n5345J37157j39428K646J42841j27391
$$ -1422626 -1486106 -1492234 -1575413 -1591639 -1542876 -1598221 -1461064 -1600492 -1597846 -1455005 -1582396
2474a582396R8137k461j1900r3801O7755Q5637j01850l8576J86073n680M4006
$$ -1582396 -1484259 -1486720 -1498620 -1592421 -1524666 -1439029 -1540879 -1579455 -1393382 -1399062 -1355056
2463a355056k01648n9130J26911K11857k69543J21992J12105j49615k6133q690
$$ -1355056 -1556704 -1615834 -1488923 -1277066 -1546609 -1424617 -1312512 -1462127 -1488260 -1496950
2453a496950Q3489j77490J27217n946r871m1150L6823p1875p4595N5606J48110
$$ -1496950 -1413461 -1590951 -1463734 -1469680 -1479551 -1520701 -1483878 -1555753 -1630348 -1574742 -1426632
2442a426632j6828j21913Q8030P4162n7628j18590J20808j79992K13868o7641
$$ -1426632 -1443460 -1565373 -1477343 -1403181 -1460809 -1579399 -1458591 -1638583 -1424715 -1492356
2432a492356k52863L44567P0673k57444J57667m2939J1009n6103L6784q6535J59110
$$ -1492356 -1745219 -1400652 -1329979 -1587423 -1429756 -1472695 -1461686 -1517789 -1481005 -1567540 -1408430
2421a408430o2622J36578j56143M4997L0207j55265o4567R6858J32666j07400
$$ -1408430 -1471052 -1334474 -1490617 -1445620 -1415413 -1570678 -1635245 -1538387 -1405721 -1513121
2411a513121J60278p766j08822m3329j77775J89067J52728L93j76914Q5734m5556
$$ -1513121 -1352843 -1360609 -1469431 -1512760 -1690535 -1501468 -1348740 -1348347 -1525261 -1439527 -1485083
2400a485083j96739J44273J70112j87579O4615K7683r5383n195N6030N8290J20198
$$ -1485083 -1681822 -1537549 -1367437 -1555016 -1490401 -1462718 -1558101 -1563296 -1507266 -1448976 -1328778
2389a328778l35897K26408m7681J2479J0609j19265P8677k0546L7978m4289J11373
$$ -1328778 -1664675 -1438267 -1485948 -1473469 -1462860 -1582125 -1503448 -1523994 -1486016 -1530305 -1418932
2378a418932r8153N9014j26011P5199j512l292L8238N8674k02547K62710k05489
$$ -1418932 -1517085 -1458071 -1584082 -1508883 -1510395 -1513687 -1475449 -1416775 -1619322 -1356612 -1562101
2367a562101J49576p5311J45175j60981J33558Q6231j35392L6108k50347J51540
$$ -1562101 -1412525 -1487836 -1342661 -1503642 -1370084 -1283853 -1419245 -1383137 -1633484 -1481944
2357a481944l4383p7519J87580n4205k19835K54036K2001K1965O0880K7481n7540
$$ -1481944 -1516327 -1593846 -1406266 -1460471 -1680306 -1426270 -1404269 -1382304 -1321424 -1293943 -1351483
2346a351483N7251j01063k6700n7157m7623J25971j31081J87372k0274j42097
$$ -1351483 -1294232 -1395295 -1421995 -1479152 -1526775 -1400804 -1531885 -1344513 -1364787 -1506884
2336a506884N2854O4073l5465j25815P1825l6854L2255m8944N1792K4571J17163
$$ -1506884 -1454030 -1389957 -1425422 -1551237 -1479412 -1516266 -1484011 -1532955 -1481163 -1456592 -1339429
2325a339429j03760j37838J84112j13581N245j4547j28762R2769K9294R5856m7278
$$ -1339429 -1443189 -1581027 -1396915 -1510496 -1505251 -1519798 -1648560 -1555791 -1526497 -1430641 -1477919
2314a477919k1063q1670L3934J3422Q7509J34072j8734K2473p7665L6869j58654
$$ -1477919 -1498982 -1580652 -1546718 -1533296 -1445787 -1311715 -1330449 -1307976 -1385641 -1348772 -1507426
2303a507426O0142J65528l32403L7697P3488O788m4165J28205r3118L9358j4483
$$ -1507426 -1447284 -1281756 -1614159 -1576462 -1502974 -1496186 -1540351 -1412146 -1505264 -1465906 -1480389
2292a480389L3081m9493j3904J79096k21271Q4269o3826J63684j44305J16414
$$ -1480389 -1447308 -1496801 -1510705 -1331609 -1552880 -1468611 -1532437 -1368753 -1513058 -1396644
2282a396644l393L2435j67893k37418P2044K00479N64L3221m9049j01794R4861
$$ -1396644 -1400037 -1367602 -1535495 -1772913 -1700869 -1500390 -1499826 -1466605 -1515654 -1617448 -1522587
2271a522587J04051o5521M9182j7869k10930K09692J15640k49919M2047P4985
$$ -1522587 -1418536 -1484057 -1434875 -1452744 -1663674 -1453982 -1338342 -1588261 -1546214 -1471229
2261a471229P9429j05190q409J0510m6190J32111j28749J50056r1458N5845n999
$$ -1471229 -1391800 -1496990 -1505399 -1494889 -1541079 -1408968 -1537717 -1387661 -1479119 -1423274 -1429273
2250a429273L60M2722k8360r7534L8760K26511k52015K1268J77419j86676q6316
$$ -1429273 -1428913 -1386191 -1414551 -1512085 -1473325 -1246814 -1498829 -1477561 -1300142 -1486818 -1573134
2239a573134N6469J67867j72010J84050j11473N6032L2381j26041J51852l184
$$ -1573134 -1516665 -1348798 -1520808 -1336758 -1448231 -1392199 -1359818 -1485859 -1334007 -1337191
2229a337191M2803l8916p7583k1847M7055P860k01424K97904q6906L8827j11355
$$ -1337191 -1294388 -1333304 -1410887 -1432734 -1385679 -1377819 -1579243 -1281339 -1368245 -1329418 -1440773
2218a440773o9282K1218J3011j47546J12378l5673J14423J19020j01171o531J0253
$$ -1440773 -1510055 -1488837 -1475826 -1623372 -1510994 -1546667 -1432244 -1313224 -1414395 -1420926 -1410673
2207a410673m7474p6443Q4213l466k6033K61670k6535q3505j11023R6147m280
$$ -1410673 -1458147 -1534590 -1450377 -1453843 -1479876 -1218206 -1244741 -1328246 -1439269 -1343122 -1347402
2196a347402j18997J29629k30634J72864J70424k73237O7863J8023P0645k4389
$$ -1347402 -1466399 -1336770 -1567404 -1394540 -1224116 -1497353 -1429490 -1411467 -1340822 -1365211
2186a365211o7571j43502J46752q0867J72315O5222k43160O228p5818P5883L3472
$$ -1365211 -1432782 -1576284 -1429532 -1510399 -1338084 -1272862 -1516022 -1509794 -1585612 -1509729 -1476257
2175a476257j18588J09025o1721o1402J88379K28192l47104Q9654J03961m9424
$$ -1476257 -1594845 -1485820 -1547541 -1608943 -1420564 -1192372 -1539476 -1449822 -1345861 -1395285
2165a395285j5811j4974r7178R8615M4986l6612m662j81900J33952R8216l6511
$$ -1395285 -1411096 -1426070 -1523248 -1424633 -1379647 -1416259 -1420921 -1602821 -1468869 -1370653 -1407164
2154a407164o0429j04167J23681M9829k7760J05102j59918l4914K5839J34850
$$ -1407164 -1467593 -1571760 -1448079 -1398250 -1426010 -1320908 -1480826 -1515740 -1489901 -1355051
2144a355051k4772J28324j74892j73785J43449L2039j63908J98119k6747k5483
$$ -1355051 -1379823 -1251499 -1426391 -1600176 -1456727 -1424688 -1588596 -1390477 -1417224 -1442707
2134a442707N3624k15163L8795J14742j6712j7294K00350m1121l2175j18091J9546
$$ -1442707 -1389083 -1604246 -1565451 -1450709 -1467421 -1484715 -1284365 -1325486 -1357661 -1475752 -1456206
2123a456206J15861r6240k1903J32621j22230J4822m7844o0753O1122r3123J38008
$$ -1456206 -1340345 -1436585 -1458488 -1325867 -1448097 -1433275 -1481119 -1541872 -1480750 -1573873 -1435865
2112a435865M090j5176r217J15472o5616j10643N0638J50645j72635J23415L4784
$$ -1435865 -1431775 -1446951 -1456168 -1340696 -1406312 -1516955 -1466317 -1315672 -1488307 -1364892 -1330108
2101a330108j45374n9944K66636k41631K1300K74343j31662R132p7034K1125q8364
$$ -1330108 -1475482 -1535426 -1268790 -1510421 -1489121 -1214778 -1346440 -1337308 -1414342 -1393217 -1481581
2090a481581M2674J42327J2115k4933o3922j16048P7893J00789k23433J78753
$$ -1481581 -1438907 -1296580 -1284465 -1309398 -1373320 -1489368 -1411475 -1310686 -1534119 -1355366
2080a355366j17511K34421k27851L6770l3245q6816M0671l9833O9443N2889j55895
$$ -1355366 -1472877 -1238456 -1466307 -1429537 -1462782 -1549598 -1508927 -1548760 -1479317 -1426428 -1582323
2069a582323J49824J10595R5714j79654r9132K6197k6634J86131j48107M322P9321
$$ -1582323 -1432499 -1321904 -1226190 -1405844 -1504976 -1478779 -1505413 -1319282 -1467389 -1463067 -1383746
2058a383746O1179j27515M5096O3791m0970j9564K6016j58537O6473k8375J75717
$$ -1383746 -1322567 -1450082 -1404986 -1341195 -1382165 -1401729 -1375713 -1534250 -1467777 -1496152 -1320435
2047a320435n5559N7217k81463J27817j327j7720J8145j04496K05677j08299M570
$$ -1320435 -1375994 -1318777 -1600240 -1472423 -1473750 -1491470 -1473325 -1577821 -1372144 -1480443 -1475873
2036a475873J89207n982q3903n2514p7722J81578j28258J67138o4618n3734n5159
$$ -1475873 -1286666 -1292648 -1376551 -1429065 -1506787 -1325209 -1453467 -1286329 -1350947 -1404681 -1459840
2025a459840o574Q9214l8664m4630O2200N784r5848k6534J76837R431k66950L77974
$$ -1459840 -1466414 -1377200 -1415864 -1460494 -1398294 -1392510 -1488358 -1514892 -1338055 -1328624 -1595574 -1217600
2013a217600j29610K9541j23965o9131J08337q3864K05733J0904l4769q4049P4564
$$ -1217600 -1347210 -1317669 -1441634 -1510765 -1402428 -1486292 -1280559 -1269655 -1304424 -1388473 -1313909
2002a313909j3000j11030Q0575r7802O3425L0362k868K56784k61268j80016O8786
$$ -1313909 -1326909 -1437939 -1357364 -1455166 -1391741 -1361379 -1364247 -1107463 -1368731 -1548747 -1479961
1991a479961k6930J97600k44173J98461k248r8233k8371m741N8459Q8117q8564
$$ -1479961 -1506891 -1309291 -1553464 -1355003 -1357251 -1455484 -1483855 -1488596 -1430137 -1342020 -1430584
1980a430584L2464R8987k11315J34635K15609l22219O0533M8712j31023J74861
$$ -1430584 -1398120 -1299133 -1510448 -1375813 -1160204 -1482423 -1421890 -1373178 -1504201 -1329340
1970a329340j44046k8980N4851K4973n0546M2959N1260K2904r7009j00672J05514
$$ -1329340 -1473386 -1502366 -1447515 -1422542 -1473088 -1430129 -1378869 -1355965 -1452974 -1553646 -1448132
1959a448132l9528j4368R7718J02111j24617l4526J51888m6556o1906j7264J51075
$$ -1448132 -1487660 -1502028 -1404310 -1302199 -1426816 -1461342 -1309454 -1356010 -1417916 -1435180 -1284105
1948a284105K5199j37329l1051O3536j7273l1417R4534j56792Q6792M8926j13116
$$ -1284105 -1258906 -1396235 -1427286 -1363750 -1381023 -1412440 -1317906 -1474698 -1387906 -1338980 -1452096
1937a452096R0456l8468K8951K1949j45113O6962M6429j12312J31081k4671N7408
$$ -1452096 -1361640 -1400108 -1371157 -1349208 -1494321 -1427359 -1380930 -1493242 -1362161 -1386832 -1329424
1926a329424j57124K03740q6564j3803o4636o5066J30151J3939j45576Q3207J01387
$$ -1329424 -1486548 -1282808 -1369372 -1383175 -1447811 -1512877 -1382726 -1368787 -1514363 -1431156 -1329769
1915a329769K3619k20505J09892q0624Q4122n4780O0177n4909J1461J82312p9107
$$ -1329769 -1306150 -1526655 -1416763 -1497387 -1413265 -1468045 -1407868 -1462777 -1451316 -1269004 -1348111
1904a348111k20277L21042r1112j0579k61128K35018P0306N8475k86413J09896
$$ -1348111 -1568388 -1247346 -1338458 -1349037 -1610165 -1375147 -1304841 -1246366 -1532779 -1422883
1894a422883J26941o4031j10279j6226J2713o8889P0998J37304j11372K37854
$$ -1422883 -1295942 -1359973 -1470252 -1486478 -1473765 -1542654 -1471656 -1334352 -1445724 -1207870
1884a207870r7102k31035K14084J2708n4794J45897n9258k9697K5709K3923r8321
$$ -1207870 -1304972 -1536007 -1321923 -1309215 -1364009 -1218112 -1277370 -1307067 -1281358 -1257435 -1355756
1873a355756J18302j81639N464P5406j62899L11100k73602R6168K9970o6614L5398
$$ -1355756 -1237454 -1419093 -1413629 -1338223 -1501122 -1190022 -1463624 -1367456 -1337486 -1404100 -1368702
1862a368702R0990m5462p4012j11378J35127L2514o371j03920J27629j69838K09317
$$ -1368702 -1277712 -1323174 -1397186 -1508564 -1373437 -1340923 -1347294 -1451214 -1323585 -1493423 -1284106
1851a284106r5430k26P5630k6369j50658J19982j2409J0266r420J3523M2714k3267
$$ -1284106 -1379536 -1379762 -1304132 -1330501 -1481159 -1361177 -1373586 -1363320 -1372740 -1359217 -1316503 -1339770
1839a339770j73982L1623j2760M886K97717j81504O9456n1809j13912J88169j62826
$$ -1339770 -1513752 -1482129 -1494889 -1490003 -1192286 -1373790 -1304334 -1356143 -1470055 -1281886 -1444712
1828a444712J12552k7283j6048K7249R6410j68700j1541J7871Q584J31401j43907
$$ -1444712 -1332160 -1359443 -1375491 -1348242 -1251832 -1420532 -1432073 -1414202 -1405618 -1274217 -1418124
1817a418124J94510k06736M0433J38080j80510J63222k27051l1675J01920J5645
$$ -1418124 -1223614 -1430350 -1389917 -1251837 -1432347 -1269125 -1496176 -1527851 -1425931 -1410286
1807a410286L5945p6380q8933J73429N6538p0936M069M1992p2784N3156n0166
$$ -1410286 -1374341 -1450721 -1539654 -1366225 -1309687 -1380623 -1376554 -1334562 -1407346 -1354190 -1404356
1796a404356l0912q0413J22657J4099N6626j9609l5087j03208P1396k1326O5334
$$ -1404356 -1435268 -1515681 -1393024 -1378925 -1322299 -1341908 -1376995 -1480203 -1408807 -1430133 -1364799
1785a364799r0839J4853J4315j5008L580l3402J06397j55832K50708k96484K219
$$ -1364799 -1455638 -1440785 -1426470 -1441478 -1437898 -1471300 -1364903 -1520735 -1270027 -1566511 -1564292
1774a564292K24863N3875K7399j49455R4759m7036J37052j58085q4213J57260
$$ -1564292 -1339429 -1285554 -1258155 -1407610 -1312851 -1359887 -1222835 -1380920 -1465133 -1307873
1764a307873l269m5173K4827K6529k04010J33651j66588L3710J42948j39451J47978
$$ -1307873 -1311142 -1356315 -1331488 -1304959 -1508969 -1375318 -1541906 -1508196 -1365248 -1504699 -1356721
1753a356721k3211j5966J26768k00364L3741P495p7863J44337o9934J73963j1002
$$ -1356721 -1379932 -1395898 -1269130 -1469494 -1435753 -1428258 -1506121 -1361784 -1431718 -1257755 -1268757
1742a268757p4280j35580R8875j7713Q1556j17104j07300J31844M0208L6813j14990
$$ -1268757 -1343037 -1478617 -1379742 -1397455 -1315899 -1433003 -1540303 -1408459 -1368251 -1331438 -1446428
1731a446428Q3643o5239o0651K68110k53741j8244J33103j13876P8128k3685P2905
$$ -1446428 -1362785 -1428024 -1488675 -1220565 -1474306 -1492550 -1359447 -1473323 -1395195 -1418880 -1345975
1720a345975J0294j79960K44369j16757p6540K4473Q7723k4876N8452j50667J05562
$$ -1345975 -1335681 -1515641 -1271272 -1388029 -1464569 -1440096 -1352373 -1377249 -1318797 -1469464 -1363902
1709a363902R7057k40494P0660J6765N3320j30527J29732k4089m6345J33793m9828
$$ -1363902 -1266845 -1507339 -1436679 -1419914 -1366594 -1497121 -1367389 -1391478 -1437823 -1304030 -1353858
1698a353858j86849J90516Q273j4401J08985j05905P9900j51210J37799k40081
$$ -1353858 -1540707 -1350191 -1341918 -1356319 -1247334 -1353239 -1273339 -1424549 -1286750 -1526831
1688a526831M3536J43032q287M6280j34294p6839K38280R565r5275j8402q2838
$$ -1526831 -1483295 -1340263 -1348550 -1302270 -1436564 -1513403 -1275123 -1265558 -1360833 -1379235 -1462073
1677a462073O4978K4121K0883J812o1263p1619J42658k87236K72656Q1484j24126
$$ -1462073 -1397095 -1372974 -1352091 -1350279 -1411542 -1483161 -1340503 -1627739 -1355083 -1273599 -1397725
1666a397725R048n6990K8254N8496M160p258o013k6562M5386P280o3301k2078
$$ -1397725 -1388677 -1445667 -1417413 -1358917 -1354757 -1362015 -1368028 -1394590 -1349204 -1341924 -1405225 -1427303
1654a427303J03198j4727O2292o7398l7697o5970P1907o7359p3568K31026j8249
$$ -1427303 -1324105 -1338832 -1276540 -1343938 -1381635 -1447605 -1375698 -1443057 -1516625 -1285599 -1303848
1643a303848r2602k5693M9023J0105l6391Q9613j02208J47457m471R334j16704
$$ -1303848 -1396450 -1422143 -1373120 -1363015 -1399406 -1309793 -1412001 -1264544 -1269015 -1259681 -1376385
1632a376385q1389J58476o645m2107m3399J30829j74955J88601j57045J4220J28089
$$ -1376385 -1457774 -1299298 -1305943 -1348050 -1391449 -1260620 -1435575 -1246974 -1404019 -1389799 -1261710
1621a261710l464j55736k8458N3609J17014l1161o6152R8219j7009j04776j6129
$$ -1261710 -1265174 -1420910 -1449368 -1395759 -1278745 -1309906 -1376058 -1277839 -1294848 -1399624 -1415753
1610a415753M0020k0637l2551Q2660L7141j980j35206M4733m2252J9171O186j06265
$$ -1415753 -1375733 -1396370 -1428921 -1346261 -1309120 -1311100 -1446306 -1401573 -1443825 -1424654 -1418468 -1524733
1598a524733J50409J08894n2135N6904q1264K0116m1717L3780k536j1145M9639
$$ -1524733 -1374324 -1265430 -1317565 -1260661 -1341925 -1321809 -1363526 -1329746 -1332282 -1343427 -1293788
1587a293788j35295j7924M7652n1401o9549O9475L5982R365K5370q5798P5939
$$ -1293788 -1429083 -1447007 -1399355 -1450756 -1520305 -1450830 -1414848 -1405483 -1380113 -1465911 -1389972
1576a389972p990J59485r3924m7780k7423J92610j0217j19167j8271N4821k9497
$$ -1389972 -1397962 -1238477 -1332401 -1380181 -1407604 -1214994 -1225211 -1344378 -1362649 -1307828 -1337325
1565a337325L935m7761m0N2058J84899p9515j24575J61891k06667K314J50982
$$ -1337325 -1333390 -1381151 -1381191 -1329133 -1144234 -1223749 -1348324 -1186433 -1393100 -1390786 -1239804
1554a239804k48773M9762j74815J79296M72J96819j80017k6968k3604l5368J16735
$$ -1239804 -1488577 -1438815 -1613630 -1434334 -1433862 -1237043 -1417060 -1444028 -1467632 -1503000 -1386265
1543a386265K14620l5333r3590p1731M0118j34713J73743k6952m2539N6595p2938
$$ -1386265 -1171645 -1206978 -1300568 -1372299 -1332181 -1466894 -1293151 -1320103 -1362642 -1306047 -1378985
1532a378985k7410K06803o7175j41188L11123k84298J2100q9073J24331n064J50381
$$ -1378985 -1406395 -1199592 -1266767 -1407955 -1096832 -1381130 -1369030 -1458103 -1333772 -1338836 -1188455
1521a188455r6703j99177K22006r6015O7069Q4991r9050o3587K51009j60944O6559
$$ -1188455 -1285158 -1484335 -1262329 -1358344 -1291275 -1206284 -1305334 -1368921 -1117912 -1278856 -1212297
1510a212297k38646K36096o2925k09404J90778K8161K1331j19984o4103L1215
$$ -1212297 -1450943 -1214847 -1277772 -1487176 -1296398 -1268237 -1246906 -1366890 -1430993 -1399778
1500a399778o5191L38288k91721J03855j58765Q8508P7834q4207l0009O9274o5237
$$ -1399778 -1464969 -1126681 -1418402 -1314547 -1473312 -1384804 -1306970 -1391177 -1421186 -1351912 -1417149
1489a417149K4519N9870K4564p8257j81598J4044K44730p3819j6815o3152R6935
$$ -1417149 -1392630 -1332760 -1308196 -1386453 -1568051 -1554007 -1309277 -1383096 -1399911 -1463063 -1366128
1478a366128N7979N4347m7730J2877M6694j81080R4363r6473K09751k55826J30130
$$ -1366128 -1308149 -1253802 -1301532 -1288655 -1241961 -1423041 -1328678 -1425151 -1215400 -1471226 -1341096
1467a341096k2030j38194J67001L1094R8013j55799J0394k647J32879j52119Q1818
$$ -1341096 -1363126 -1501320 -1334319 -1303225 -1205212 -1361011 -1350617 -1353264 -1220385 -1372504 -1290686
1456a290686j69130R5840j7257P353L6600L9125R1576j07613Q0810j4426k89963
$$ -1290686 -1459816 -1363976 -1381233 -1373880 -1337280 -1298155 -1206579 -1314192 -1233382 -1247808 -1537771
1445a537771K71611j19120n468j07270J20150r196Q3828j43701J41862m1541O4103
$$ -1537771 -1266160 -1385280 -1390748 -1498018 -1377868 -1387064 -1303236 -1446937 -1305075 -1346616 -1282513
1434a282513p4820J06463P0897j67093k883o6773J69879q1854o7678J67053p0296
$$ -1282513 -1357333 -1250870 -1179973 -1347066 -1349949 -1416722 -1246843 -1328697 -1396375 -1229322 -1299618
1423a299618N8089j24054M1269O388Q94l2203P8164O3525k8530L6687j70298N1546
$$ -1299618 -1241529 -1365583 -1324314 -1317926 -1317032 -1349235 -1271071 -1207546 -1236076 -1199389 -1369687 -1318141
1411a318141n5983J3899k7672O0687j6749J22479r9324l3311J0486q1896k5373
$$ -1318141 -1374124 -1360225 -1387897 -1327210 -1343959 -1221480 -1320804 -1354115 -1343629 -1425525 -1450898
1400a450898J46813q4965P4253o4094m3200R0738j29473L8990N3433m7546j2958
$$ -1450898 -1304085 -1389050 -1314797 -1378891 -1422091 -1331353 -1460826 -1421836 -1368403 -1415949 -1428907
1389a428907O0387M1714j34289J96561N412n3201l0781K4485O1526j36234K27659
$$ -1428907 -1368520 -1326806 -1461095 -1264534 -1259122 -1312323 -1343104 -1318619 -1257093 -1393327 -1165668
1378a165668j92938R4518k787m7350k06764J82586J7154o8549J92925j42472R9973
$$ -1165668 -1358606 -1264088 -1266875 -1314225 -1520989 -1338403 -1321249 -1389798 -1196873 -1339345 -1239372
1367a239372Q2768j40795m8116K4395l2722P7099m5964m8280j195P0089l6482
$$ -1239372 -1156604 -1297399 -1345515 -1321120 -1353842 -1276743 -1322707 -1370987 -1372182 -1302093 -1338575
1356a338575m9749L9837J25215J30171j45371k9569j96098M8183K6177R2984R749
$$ -1338575 -1388324 -1348487 -1223272 -1093101 -1238472 -1268041 -1464139 -1415956 -1389779 -1296795 -1287046
1345a287046o1262J27834M1299r3416k5183L5268J9922j20022k0951J11213L7609
$$ -1287046 -1348308 -1220474 -1179175 -1272591 -1297774 -1262506 -1242584 -1362606 -1383557 -1272344 -1234735
1334a234735q9863J35364j51542K48907k58357M5779M0002j61923R283K62945
$$ -1234735 -1324598 -1189234 -1340776 -1091869 -1350226 -1304447 -1264445 -1426368 -1417085 -1154140
1324a154140L5926k44579K4322N7571j4410o9324j42089K15998k9351R7307j11296
$$ -1154140 -1118214 -1362793 -1338471 -1280900 -1295310 -1364634 -1506723 -1290725 -1320076 -1222769 -1334065
1313a334065J17257j82538O2412n4700J29088N9537k55036K22044o1012n7771
$$ -1334065 -1216808 -1399346 -1336934 -1391634 -1262546 -1203009 -1458045 -1236001 -1297013 -1354784
1303a354784l9234N5236j6904j0452p849R3000J19166o0902k12354p0492K72114
$$ -1354784 -1394018 -1338782 -1355686 -1366138 -1373987 -1280987 -1161821 -1222723 -1435077 -1505569 -1233455
1292a233455m1895L5248j04537k5451J32683l20341L30805m6499P5934p2172j21251
$$ -1233455 -1275350 -1240102 -1344639 -1370090 -1237407 -1557748 -1226943 -1273442 -1197508 -1269680 -1390931
1281a390931J10637j01977Q8242j17139L6903n8981R4741J78511k64298L9364
$$ -1390931 -1280294 -1382271 -1294029 -1411168 -1374265 -1433246 -1338505 -1159994 -1424292 -1384928
1271a384928N8011J20295j25607N7281m9671n7047o5389J61558J34094j27087
$$ -1384928 -1326917 -1206622 -1332229 -1274948 -1324619 -1381666 -1447055 -1285497 -1151403 -1278490
1261a278490j35441q5551J39808J93612k53043J04542J50190k02897M8845p5810
$$ -1278490 -1413931 -1499482 -1359674 -1166062 -1419105 -1314563 -1164373 -1367270 -1318425 -1394235
1251a394235P476P9639o3028R5780J135l0515r4308Q1520L3734p4985J32384K0350
$$ -1394235 -1386759 -1307120 -1370148 -1274368 -1273233 -1303748 -1398056 -1316536 -1282802 -1357787 -1225403 -1205053
1239a205053j36806J52364k4707l99339K20240K15146j45062j25329K18479j89522
$$ -1205053 -1341859 -1189495 -1214202 -1613541 -1393301 -1178155 -1323217 -1448546 -1230067 -1419589
1229a419589R2129M3145n205k49822Q4177K147K14512o3507j572J06278j68809
$$ -1419589 -1327460 -1284315 -1289520 -1539342 -1455165 -1453018 -1238506 -1302013 -1303585 -1197307 -1366116
1218a366116O6179J9248L381L4185j93610K26450j83729O3620J68817k81420P4412
$$ -1366116 -1299937 -1280689 -1277308 -1243123 -1436733 -1210283 -1394012 -1330392 -1161575 -1442995 -1368583
1207a368583P7471m1607K4854Q4543N8360j64704j01679J05174j80410L18736
$$ -1368583 -1291112 -1332719 -1307865 -1223322 -1164962 -1329666 -1431345 -1326171 -1506581 -1187845
1197a187845j56851M7798O5044r9108q0250J47756j6839O0870j09386q932N2247
$$ -1187845 -1344696 -1296898 -1231854 -1330962 -1411212 -1263456 -1280295 -1219425 -1328811 -1337743 -1285496
1186a285496j02516k3184J22300J06284L9176j75356o6202l2211J34250j5893
$$ -1285496 -1388012 -1411196 -1288896 -1182612 -1143436 -1318792 -1384994 -1417205 -1282955 -1298848
1176a298848p1568J69435k33179K80412j96894N8970J06123j95833J78550j30698
$$ -1298848 -1370416 -1200981 -1434160 -1153748 -1350642 -1291672 -1185549 -1381382 -1202832 -1333530
1166a333530m5710J08329K6752k26424J45596n2458j8748O734P8766R8584r5388
$$ -1333530 -1379240 -1270911 -1244159 -1470583 -1324987 -1377445 -1396193 -1389459 -1310693 -1212109 -1307497
1155a307497M374N8390M1459m8480Q0177k0373q4495M0543k1534j11224R4358
$$ -1307497 -1303123 -1244733 -1203274 -1251754 -1171577 -1191950 -1276445 -1235902 -1257436 -1368660 -1274302
1144a274302r2194N8038j8907j04865J21369l2463J50716j71067J95240j39433
$$ -1274302 -1366496 -1308458 -1327365 -1432230 -1310861 -1343324 -1192608 -1363675 -1168435 -1307868
1134a307868j3588q0312j8768P4159p6842J27387R3008j70426j26673J55511J33256
$$ -1307868 -1321456 -1401768 -1420536 -1346377 -1423219 -1295832 -1202824 -1373250 -1499923 -1344412 -1211156
1123a211156j30674R4317k29542J99564k18107J06232J61225l4461j14441o7290
$$ -1211156 -1341830 -1247513 -1477055 -1277491 -1495598 -1389366 -1228141 -1262602 -1377043 -1444333
1113a444333J07769Q0658N3722l8081p8554o9697l3284J11362K2344K2483J9043
$$ -1444333 -1336564 -1255906 -1202184 -1240265 -1318819 -1388516 -1421800 -1310438 -1288094 -1265611 -1246568
1102a246568j45372O801J20248K05P037Q4871J240o3973O6260J1128n5379k0512
$$ -1246568 -1391940 -1385139 -1264891 -1264686 -1257649 -1172778 -1171538 -1235511 -1169251 -1158123 -1213502 -1234014
1090a234014O3274N7761j42305J2509l9569L4890j34801L03349k50564J0128l2764
$$ -1234014 -1170740 -1112979 -1255284 -1242775 -1282344 -1247454 -1382255 -1078906 -1329470 -1319342 -1352106
1079a352106o4869K39657j54976P0689k7987j07322P7480j7400J28698m6648J3145
$$ -1352106 -1416975 -1177318 -1332294 -1261605 -1289592 -1396914 -1319434 -1336834 -1208136 -1254784 -1241639
1068a241639n9267p7980M8438j16875J89728M0788j31757J40442j19361J33779
$$ -1241639 -1300906 -1378886 -1330448 -1447323 -1257595 -1216807 -1348564 -1208122 -1327483 -1193704
1058a193704o3268j46662J32506l2563L5712j6425O3092o5262l3156j39644K11843
$$ -1193704 -1256972 -1403634 -1271128 -1303691 -1267979 -1284404 -1221312 -1286574 -1319730 -1459374 -1247531
1047a247531k44012J24676q2969K62352j77315J13318K08599m26822J28234Q2269
$$ -1247531 -1491543 -1366867 -1449836 -1187484 -1364799 -1251481 -1042882 -1469704 -1341470 -1259201
1037a259201r5689l7284K8314o1179J55647j25367N0633N5422j3732k1794L959
$$ -1259201 -1354890 -1392174 -1363860 -1425039 -1269392 -1394759 -1344126 -1288704 -1302436 -1324230 -1320271
$$ [...]
##END NTUPLES=NMR SPECTRUM
##END=
