##TITLE=abcd
##JCAMPDX= 6.0         $$ Bruker NMR JCAMP-DX V2.0
##DATA TYPE= NMR SPECTRUM
##DATA CLASS= NTUPLES
##ORIGIN= UXNMR, Bruker Analytische Messtechnik GmbH
##OWNER= root
$$ XWIN-NMR		Version 3.5
$$ Sun Feb 16 09:18:40 2025 Russian Standard Time (UT+4h)  servis@DPX200
##.OBSERVE FREQUENCY= 200.131235884673
##.OBSERVE NUCLEUS= ^1H
##.ACQUISITION MODE= SIMULTANEOUS
##.ACQUISITION SCHEME= undefined
##.AVERAGES= 8
##.DIGITISER RES= 18
##SPECTROMETER/DATA SYSTEM= spect
##.PULSE SEQUENCE= zg
##.SOLVENT NAME= DMSO
##.SHIFT REFERENCE= (INTERNAL, DMSO, 0, 16.4885)
##AUDIT TRAIL= $$ (NUMBER, WHEN, WHO, WHERE, WHAT)
$$ ##TITLE= Audit trail, XWIN-NMR		Version 3.5
$$ ##JCAMPDX= 5.01
$$ ##ORIGIN= Bruker BioSpin GmbH
$$ ##OWNER= servis
$$ F:\spectra/data/av/nmr/H1/1/pdata/1/auditp.txt
$$ ##AUDIT TRAIL=  $$ (NUMBER, WHEN, WHO, WHERE, WHAT)
(   1,<2025-02-16 09:18:06.28 +0400>,<servis>,<DPX200>,
      <created by zg, POWCHK disabled, PULCHK disabled
       terminated by command 'halt'
       configuration hash MD5:
       00 E9 B6 7A A2 85 ED C7 34 08 36 98 17 FE 4E 26
       data hash MD5: 32K
       95 75 7A 1A 60 0E 48 27 D4 73 93 20 53 BF B9 3E>)
(   2,<2025-02-16 09:18:08.20 +0400>,<servis>,<DPX200>,
      <Start of raw data processing
       efp BC_mod = 2 LB = 0.05 FT_mod = 6 PKNL = 1 PHC0 = -266.1254 PHC1 = 1.301534 SI = 16K 
       data hash MD5: 16K
       03 78 F9 6A EC E1 77 77 5D E5 16 B2 59 2D 0E 92>)
(   3,<2025-02-16 09:18:21.39 +0400>,<servis>,<DPX200>,
      <pk PHC0 = 4.000001 PHC1 = 0 
       data hash MD5: 16K
       6E 6B 5D 0B 58 13 1E 78 65 25 E4 91 9C 4A 7D 1D>)
$$ ##END=
$$ 
$$ hash MD5
$$ 49 4E CD 1F AE 93 5F 18 B4 DC F1 71 34 6F 17 88
##$RELAX= 
##$RELAX= 
##$RELAX= 
##$RELAX= 
##$RELAX= 
##$RELAX= 
##$RELAX= 
##$RELAX= 
$$ Bruker specific parameters
$$ --------------------------
##$DU= <F:\spectra>
##$EXPNO= 1
##$NAME= <H1>
##$PROCNO= 1
##$TYPE= <nmr>
##$USER= <av>
##$AMP= (0..31)
100 100 100 100 100 100 100 100 100 100 100 100 100 100 100 100 100 100 
100 100 100 100 100 100 100 100 100 100 100 100 100 100 
##$AQSEQ= 0
##$AQ_mod= 1
##$AUNM= <au_zg>
##$AUTOPOS= <>
##$BF1= 200.13
##$BF2= 200.13
##$BF3= 200.13
##$BF4= 200.13
##$BF5= 500.13
##$BF6= 500.13
##$BF7= 500.13
##$BF8= 500.13
##$BYTORDA= 1
##$CFDGTYP= 0
##$CFRGTYP= 5
##$CHEMSTR= <none>
##$CNST= (0..31)
1 1 145 1 1 1 1 1 1 1 1 1 1 1 1 1 1 1 1 1 1 1 1 1 1 1 1 1 1 1 1 1 
##$CPDPRG= <>
##$CPDPRG1= <>
##$CPDPRG2= <>
##$CPDPRG3= <>
##$CPDPRG4= <mlev>
##$CPDPRG5= <mlev>
##$CPDPRG6= <mlev>
##$CPDPRG7= <mlev>
##$CPDPRG8= <mlev>
##$CPDPRGB= <>
##$CPDPRGT= <>
##$D= (0..31)
0 2 0 0 0 0 0 0 0 0.06 0 0 0 0 0 0 0.0002 0 0 0 0 0 0 0 0 0 0 0 0 0 0 
0 
##$DATE= 1739683085
##$DBL= (0..7)
120 120 120 120 120 120 120 120 
##$DBP= (0..7)
150 150 150 150 150 150 150 150 
##$DBP07= 0
##$DBPNAM0= <>
##$DBPNAM1= <>
##$DBPNAM2= <>
##$DBPNAM3= <>
##$DBPNAM4= <>
##$DBPNAM5= <>
##$DBPNAM6= <>
##$DBPNAM7= <>
##$DBPOAL= (0..7)
0.5 0.5 0.5 0.5 0.5 0.5 0.5 0.5 
##$DBPOFFS= (0..7)
0 0 0 0 0 0 0 0 
$$ [...]
##$SUBNAM4= <"">
##$SUBNAM5= <"">
##$SUBNAM6= <"">
##$SUBNAM7= <"">
##$SUBNAM8= <"">
##$SUBNAM9= <"">
##$SW= 20.6817932712277
##$SWIBOX= (0..15)
0 0 3 0 0 0 0 0 0 0 0 0 0 0 0 0 
##$SW_h= 4139.07284768212
##$TD= 32768
##$TD0= 1
##$TE= 0
##$TE2= 300
##$TE3= 300
##$TEG= 300
##$TL= (0..7)
0 120 120 120 120 120 120 120 
##$TP= (0..7)
150 150 150 150 150 150 150 150 
##$TP07= 0
##$TPNAME0= <>
##$TPNAME1= <>
##$TPNAME2= <>
##$TPNAME3= <>
##$TPNAME4= <>
##$TPNAME5= <>
##$TPNAME6= <>
##$TPNAME7= <>
##$TPOAL= (0..7)
0.5 0.5 0.5 0.5 0.5 0.5 0.5 0.5 
##$TPOFFS= (0..7)
0 0 0 0 0 0 0 0 
##$TUNHIN= 0
##$TUNHOUT= 0
##$TUNXOUT= 0
##$USERA1= <user>
##$USERA2= <user>
##$USERA3= <user>
##$USERA4= <user>
##$USERA5= <user>
##$V9= 5
##$VALIST= <valist>
##$VCLIST= <CCCCCCCCCCCCCCC>
##$VD= 0
##$VDLIST= <DDDDDDDDDDDDDDD>
##$VPLIST= <PPPPPPPPPPPPPPP>
##$VTLIST= <TTTTTTTTTTTTTTT>
##$WBST= 1024
##$WBSW= 30
##$XGAIN= (0..3)
0 0 0 0 
##$XL= 0
##$YL= 0
##$YMAX_a= 816980
##$YMIN_a= -495678
##$ZGOPTNS= <>
##$ZL1= 120
##$ZL2= 120
##$ZL3= 120
##$ZL4= 120
##$ABSF1= 0
##$ABSF2= 0
##$ABSG= 0
##$ABSL= 0
##$ALPHA= 0
##$AQORDER= 0
##$ASSFAC= 0
##$ASSFACI= 0
##$ASSFACX= 0
##$ASSWID= 0
##$AUNMP= <proc_1d>
##$AZFE= 0.1
##$AZFW= 0.1
##$BCFW= 0
##$BC_mod= 2
##$BYTORDP= 0
##$COROFFS= 0
##$CY= 18.4799938201904
##$DATMOD= 1
##$DC= 0
##$DFILT= <>
##$DTYPP= 0
##$F1P= 9.9274215381318
##$F2P= -0.165520771350173
##$FCOR= 1
##$FTSIZE= 16384
##$FT_mod= 6
##$GAMMA= 0
##$GB= 0
##$INTBC= 1
##$INTSCL= 4.127829e-11
##$ISEN= 128
##$LB= 0.05
##$LEV0= 0
##$LPBIN= 0
##$MAXI= 10000
##$MC2= 0
##$MEAN= 0
##$ME_mod= 0
##$MI= 50
##$NCOEF= 0
##$NC_proc= -6
##$NLEV= 6
##$NOISF1= 3.799351
##$NOISF2= 2.8
##$NSP= 0
##$NTH_PI= 0
##$NZP= 0
##$OFFSET= 16.48848
##$PC= 4
##$PHC0= -262.1254
##$PHC1= 1.301534
##$PH_mod= 1
##$PKNL= yes
##$PPARMOD= 0
##$PSCAL= 4
##$PSIGN= 0
##$REVERSE= no
##$SF= 200.130005582386
##$SI= 16384
##$SIGF1= 3
##$SIGF2= 2
##$SINO= 400
##$SIOLD= 16384
##$SREGLST= <1H.CDCl3>
##$SSB= 0
##$STSI= 16384
##$STSR= 0
##$SW_p= 4139.07284768211
##$SYMM= 0
##$S_DEV= 0
##$TDeff= 32768
##$TDoff= 0
##$TI= <>
##$TILT= no
##$TM1= 0
##$TM2= 0
##$TOPLEV= 0
##$USERP1= <user>
##$USERP2= <user>
##$USERP3= <user>
##$USERP4= <user>
##$USERP5= <user>
##$WDW= 1
##$XDIM= 16384
##$YMAX_p= 274469460
##$YMIN_p= -2719087
$$ End of Bruker specific parameters
$$ ---------------------------------
##NTUPLES= NMR SPECTRUM
##VAR_NAME=  FREQUENCY,     SPECTRUM/REAL,   SPECTRUM/IMAG
##SYMBOL=    X,             R,               I
##VAR_TYPE=  INDEPENDENT,   DEPENDENT,       DEPENDENT
##VAR_FORM=  AFFN,          ASDF,            ASDF
##VAR_DIM=   16384,         16384,           16384
##UNITS=     HZ,            ARBITRARY UNITS, ARBITRARY UNITS
##FACTOR=    0.252644378177508, 1,           1
##FIRST=     3299.83951724647, 0,            0
##LAST=      -839.233330435636, 0,           0
##MIN=       -839.233330435636, -2719087,    0
##MAX=       3299.83951724647, 274469460,    0
$$ Real data points
##PAGE= N=1
##DATA TABLE= (X++(R..R)), XYDATA
$$ [...]
$$ plain form
6471 2544746 2509532 2554519 2624101 2645813 2728056 2725063 2739153 2715311 2741192 2748647 2885687 2820783
6459 2820783 2763618 2814207 2879693 2907300 3030040 2943192 3017072 2973282 3009857 3006441 3058584
6448 3058584 3200907 3147563 3086395 3205975 3257428 3350973 3314965 3324638 3454229 3457531 3586361
6437 3586361 3593987 3703104 3579127 3768246 3854988 3810038 3810503 3886596 3888988 3969900 4091911
6426 4091911 4122408 4158569 4307309 4308929 4387788 4398847 4454082 4665520 4636809 4695795 4647163
6415 4647163 4757866 4931019 4833309 5045267 5127097 5308126 5356701 5297817 5458064 5636866
6405 5636866 5757655 5717408 5808980 5923297 6037010 6126384 6177407 6319598 6474314 6568049
6395 6568049 6605924 6816945 6983508 7034853 7146349 7450338 7327571 7549780 7810066 7844483
$$ packed form
6471B544746l5214M4987O9582K1712Q2243k993J4090k3842K5881P455J37040o4904
6459B820783n7165N0589O5486K7607J22740q6848P3880m3790L6575l416N2143
6448C058584J42323n3344o1168J19580N1453R3545l6008R673J29591L302J28830
6437C586361P626J09117j23977J89119Q6742m4950M65P6093K392Q0912J22011
6426D091911L0497L6161J48740J620P8859J1059N5235K11438k8711N8986m8632
6415D647163J10703J73153r7710K11958Q1830J81029M8575n8884J60247J78802
6405E636866J20789m0247R1572J14317J13713Q9374N1023J42191J54716R3735
6395F568049L7875K11021J66563N1345J11496L03989j22767K22209K60286L4417
$$ plain form
6385 7844483 7926641 8111264 8360173 8546783 8685399 8972700 9139910 9224943 9546372 9685220
6375 9685220 9989102 10089900 10333462 10561290 10845261 11073349 11364331 11697646 11945984 12294829
6365 12294829 12661305 12922732 13212281 13646151 14051721 14471577 14755689 15271925 15707399
6356 15707399 16159974 16692963 17216415 17764078 18231085 19002959 19502792 20118763 20829950
6347 20829950 21506429 22225436 22942136 23849287 24628862 25486937 26461404 27342457 28365787
6338 28365787 29352625 30336014 31446086 32675084 33735684 34918250 36013642 37338479
6330 37338479 38563777 39858678 41236993 42628499 43900115 45298444 46701458 48076334
6322 48076334 49518493 50811920 52135045 53532161 54875431 56147536 57388659 58633874
$$ packed form
6385G844483Q2158J84623K48909J86610J38616K87301J67210Q5033L21429J38848
6375I685220L03882J00798K43562K27828K83971K28088K90982L33315K48338L48845
6365A2294829L66476K61427K89549M33870M05570M19856K84112N16236M35474
6356A5707399M52575N32989N23452N47663M67007P71874M99833O15971P11187
6347B0829950O76479P19007P16700R07151P79575Q58075R74467Q81053J023330
6338B8365787R86838R83389J110072J228998J060600J182566J095392J324837
6330C7338479J225298J294901J378315J391506J271616J398329J403014J374876
6322D8076334J442159J293427J323125J397116J343270J272105J241123J245215
$$ plain form
6314 58633874 59803286 61030168 62028461 63218937 64185075 65168544 66029264 66874335 67558408
6305 67558408 68246182 68828261 69264040 69548975 69778677 69879940 69951195 69776201 69581329 69202750
6295 69202750 68887999 68346829 67815726 67236665 66479804 65717292 65068955 64137812 63335790
6286 63335790 62455382 61571847 60554343 59703607 58729408 57753377 56726695 55752518 54660290
6277 54660290 53843209 52724351 51806366 50753277 49816013 48914915 47939423 47037274 46210402
6268 46210402 45350267 44507697 43675690 42908253 42318752 41588145 40857646 40273269 39594958
6259 39594958 39030174 38537567 37896967 37381846 36824905 36291665 35856901 35411443 34956405
6250 34956405 34604496 34139071 33671886 33440071 33004208 32822276 32382329 32029959 31662238
$$ packed form
6314E8633874J169412J226882R98293J190476R66138R83469Q60720Q45071O84073
6305F7558408O87774N82079M35779K84935K29702J01263P1255j74994j94872l78579
6295F9202750l14751n41170n31103n79061p56861p62512o48337r31143q02022
6286F3335790q80408q83535j017504q50736r74199r76031j026682r74177j092228
6277E4660290q17081j118858r17985j053089r37264r01098r75492r02149q26872
6268D6210402q60135q42570q32007p67437n89501p30607p30499n84377o78311
6259C9594958n64784m92607o40600n15121n56941n33240m34764m45458m55038
6250C4956405l51909m65425m67185k31815m35863j81932m39947l52370l67721
$$ plain form
6241 31662238 31439597 31181858 30868717 30606138 30450230 30133250 30017628 29834992 29559517
6232 29559517 29375448 29213408 29009888 29002010 28844347 28712334 28650242 28506915 28487423 28511966
6222 28511966 28488346 28482915 28428712 28519262 28503600 28666416 28738524 28857380 29022405 29026360 29194085
6211 29194085 29373858 29545200 29803500 30026877 30268818 30470004 30819561 31114526 31251308
6202 31251308 31624324 32032511 32442331 32765445 33163232 33568139 34036833 34461105 35043898
6193 35043898 35435098 35947105 36452761 36988949 37667430 38238912 38820887 39543900 40159538
6184 40159538 40972668 41539249 42507304 43175602 44127299 45022712 45780032 46784246 47781689
6175 47781689 48861758 49894196 51058160 52261927 53426163 54671972 56013243 57412996
$$ packed form
6241C1662238k22641k57739l13141k62579j55908l16980j15622j82636k75475
6232B9559517j84069j62040k03520p878j57663j32013o2092j43327j9492K4543
6222B8511966k3620n431n4203R0550j5662J62816P2108J18856J65025L955J67725
6211B9194085J79773J71342K58300K23377K41941K01186L49557K94965J36782
6202C1251308L73016M08187M09820L23114L97787M04907M68694M24272N82793
6193C5043898L91200N12007N05656N36188O78481N71482N81975P23013O15638
6184D0159538Q13130N66581R68055O68298R51697Q95413P57320J004214R97443
6175D7781689J080069J032438J163964J203767J164236J245809J341271J399753
$$ plain form
6167 57412996 58814520 60385597 61944098 63518861 65367013 67232984 69067891 71099193
6159 71099193 73061223 75212140 77594165 79826748 82344848 84990572 87622049 90265905
6151 90265905 93193197 96093016 99219037 102323506 105668240 109015207 112407218 115959516
6143 115959516 119630138 123381711 127194206 131093114 134953404 139010163 143107132 147081481
6135 147081481 151191145 155285936 159347896 163330442 167337096 171136716 174880860 178473640
6127 178473640 181947033 185282823 188264383 191033354 193557626 195881427 197736180 199352097
6119 199352097 200505044 201326661 201816954 201990532 201711023 201095993 200105929 198798021 197260953
6110 197260953 195396570 193221310 190956032 188408968 185727611 182900550 179952335 176814512
$$ packed form
6167E7412996J401524J571077J558501J574763J848152J865971J834907K031302
6159G1099193J962030K150917K382025K232583K518100K645724K631477K643856
6151I0265905K927292K899819L126021L104469L344734L346967L392011L552298
6143A15959516L670622L751573L812495L898908L860290M056759M096969L974349
6135A47081481M109664M094791M061960L982546M006654L799620L744144L592780
6127A78473640L473393L335790K981560K768971K524272K323801J854753J615917
6119A99352097J152947Q21617M90293J73578k79509o15030r90064j307908j537068
6110A97260953j864383k175260k265278k547064k681357k827061k948215l137823
$$ plain form
6102 176814512 173877617 170775076 167697777 164549665 161450045 158344215 155445273 152468391
6094 152468391 149662049 146907627 144357318 141887289 139480772 137083176 135042892 132955488
6086 132955488 130972153 129283038 127656588 126106711 124757802 123607021 122574650 121456882
6078 121456882 120609508 119895544 119427491 118846827 118438220 118293142 118158677 118185050 118284426 118419293
6068 118419293 118789232 119217742 119685292 120328847 120957015 121784520 122725397 123553561 124472022
6059 124472022 125510368 126688331 127659397 128945191 130053658 131266812 132594154 133819074
6051 133819074 134901866 136240946 137314714 138434778 139535738 140501395 141394198 142273704
6043 142273704 142829409 143281947 143831375 143986494 143933849 143902141 143521246 143066853 142375498 141414920
$$ packed form
6102A76814512k936895l102541l077299l148112l099620l105830k898942k976882
6094A52468391k806342k754422k550309k470029k406517k397596k040284k087404
6086A32955488j983335j689115j626450j549877j348909j150781j032371j117768
6078A21456882q47374p13964m68053n80664m08607j45078j34465K6373R9376J34867
6068A18419293L69939M28510M67550O43555O28168Q27505R40877Q28164R18461
6059A24472022J038346J177963R71066J285794J108467J213154J327342J224920
6051A33819074J082792J339080J073768J120064J100960R65657Q92803Q79506
6043A42273704N55705M52538N49428J55119n2645l1708l80895m54393o91355r60578
$$ plain form
6033 141414920 140457303 139294284 137893089 136322136 134838360 132984689 131198877 129289495
6025 129289495 127225336 125146718 123126799 120932051 118782898 116761547 114473521 112258023
6017 112258023 110092145 108029146 105825515 103757971 101539360 99442208 97432724 95361150
6009 95361150 93382772 91349608 89403785 87415637 85627184 83762434 82020778 80269356
6001 80269356 78574143 76808359 75242817 73614513 72060256 70550008 68981248 67608173
5993 67608173 66059676 64654212 63296292 61924843 60653381 59388882 58029335 56813894
5985 56813894 55648112 54596470 53445445 52266330 51334025 50444011 49497625 48526523 47520755
5976 47520755 46772651 45933984 45170332 44391893 43652585 42922719 42274718 41621056 40818402
$$ packed form
6033A41414920r57617j163019j401195j570953j483776j853671j785812j909382
6025A29289495k064159k078618k019919k194748k149153k021351k288026k215498
6017A12258023k165878k062999k203631k067544k218611k097152k009484k071574
6009I5361150j978378k033164j945823j988148j788453j864750j741656j751422
6001H0269356j695213j765784j565542j628304j554257j510248j568760j373075
5993F7608173j548497j405464j357920j371449j271462j264499j359547j215441
5985E6813894j165782j051642j151025j179115r32305q90014r46386r71102j005768
5976D7520755p48104q38667p63652p78439p39308p29866o48001o53662q02654
$$ plain form
5967 40818402 40323182 39811135 39168359 38759301 38011253 37536577 37166857 36559882 36139052
5958 36139052 35745530 35247172 34751183 34380017 34059933 33643990 33365383 33017670 32679943
5949 32679943 32401384 32151183 31782430 31550250 31405695 31104750 30838832 30630673 30450366
5940 30450366 30299318 30073704 29902473 29762195 29645847 29483862 29385264 29376001 29161154 29118508
5930 29118508 28897846 28850989 28885404 28751471 28788564 28741720 28682581 28667774 28692748 28617927 28638155
5919 28638155 28683397 28642106 28768713 28715151 28811231 28916746 28962772 29203337 29203565 29502892 29572227
5908 29572227 29876218 30021368 30239130 30466809 30860582 31117453 31380968 31847137 32189248
5899 32189248 32592990 33063183 33371722 33889481 34383554 34816844 35195483 35563754 36004878
$$ packed form
5967D0818402m95220n12047o42776m09058p48048m74676l69720o06975m20830
5958C6139052l93522m98358m95989l71166l20084m15943k78607l47713l37727
5949C2679943k78559k50201l68753k32180j44555l00945k65918k08159j80307
5940C0450366j51048k25614j71231j40278j16348j61985r8598r263k14847m2646
5930B9118508k20662m6857L4415j33933L7093m6844n9139j4807K4974p4821K0228
5919B8638155M5242m1291J26607n3562R6080J05515M6026K40565K28K99327O9335
5908B9572227L03991J45150K17762K27679L93773K56871K63515M66169L42111
5899C2189248M03742M70193L08539N17759M94073M33290L78639L68271M41124
$$ plain form
5890 36004878 36186178 36404282 36723214 36643432 36779300 36862650 37026330 37017082 37151149 37290858
5880 37290858 37611802 37857470 38084014 38469371 38885455 39331261 39909050 40476552 41151171
5871 41151171 41779119 42457864 43243788 43770399 44541958 45259873 45946250 46463494 46984381
5862 46984381 47592500 48148572 48589437 49199820 49623899 50323329 51101239 51636125 52522452
5853 52522452 53628050 54691653 55868972 57311335 58934531 60667187 62464075 64509125
5845 64509125 66261443 67954968 69348702 70300222 70484295 70173429 69051769 67420951 65274187
5836 65274187 62739712 60063341 57183193 54254672 51287040 48606235 45888811 43377956
5828 43377956 41076939 39067374 37103146 35332581 33683443 32161636 30834645 29709800
$$ packed form
5890C6004878J81300K18104L18932p9782J35868Q3350J63680r248J34067J39709
5880C7290858L20944K45668K26544L85357M16084M45806N77789N67502O74619
5871D1151171O27948O78745P85924N26611P71559P17915O86377N17244N20887
5862D6984381O08119N56072M40865O10383M24079O99430P77910N34886Q86327
5853E2522452J105598J063603J177319J442363J623196J732656J796888K045050
5845F4509125J752318J693525J393734R51520J84073l10866j121660j630818k146764
5836F5274187k534475k676371k880148k928521k967632k680805k717424k510855
5828D3377956k301017k009565j964228j770565j649138j521807j326991j124845
$$ plain form
5820 29709800 28408461 27300522 26370805 25468224 24616710 23684343 22932313 22334057 21558616
5811 21558616 20851390 20441960 19719571 19308296 18719236 18232141 17876810 17426325 17027250
5802 17027250 16654707 16326357 15926543 15520480 15221441 14900105 14711964 14395248 14066115
5793 14066115 13752481 13378940 13149385 12968679 12692897 12397047 12140763 12000107 11731108
5784 11731108 11616757 11413739 11245021 11034256 10886337 10783095 10558739 10510663 10307412 10140489
5774 10140489 9975101 9986307 9707506 9555292 9438538 9266650 9167940 8998656 8800067 8735315
5764 8735315 8543359 8463240 8318924 8195350 8125401 8074500 7812808 7831296 7679159 7496368
5754 7496368 7502499 7308330 7223642 7189495 7041959 6967469 6786865 6796886 6770712 6585275 6563894
$$ packed form
5820B9709800j301339j107939r29717r02581q51514r32367p52030n98256p75441
5811B1558616p07226m09430p22389m11275n89060m87095l55331m50485l99075
5802A7027250l72543l28350l99814m06063k99039l21336j88141l16716l29133
5793A4066115l13634l73541k29555j80706k75782k95850k56284j40656k68999
5784A1731108j14351k03018j68718k10765j47919j03242k24356m8076k03251j66923
5774A0140489j65388J1206k78801j52214j16754j71888r8710j69284j98589o4752
5764H735315j91956q0119j44316j23574o9949n0901k61692J8488j52137j82791
5754G496368O131j94169q4688l4147j47536p4490j80604J0021k6174j85437k1381
$$ plain form
5743 6563894 6355867 6456592 6327595 6259460 6155142 6119759 6016304 5928065 5908348 5920916
5733 5920916 5718373 5565389 5628442 5552420 5383641 5293785 5282606 5246970 5208183 5168343 5077648
5722 5077648 5028498 4931872 5029054 4857047 4768512 4782488 4685168 4702493 4607373 4583587 4532163
5711 4532163 4529183 4471611 4391141 4468987 4326278 4316501 4308860 4190790 4300890 4050432 4118296
5700 4118296 4082049 4043364 4008972 4014213 4016851 3949654 3797426 3923275 3846125 3813882 3792025
5689 3792025 3863863 3709950 3712418 3629772 3684004 3658537 3598269 3580845 3533103 3519619 3541546
5678 3541546 3650788 3444000 3575311 3443919 3413464 3348737 3311883 3186116 3277468 3199058
5668 3199058 3273921 3203129 3296398 3238543 3160769 3164679 3185617 3176095 3203928 3140220 3144810 3095162
$$ packed form
5743F563894k08027J00725j28997o8135j04318l5383j03455q8239j9717J2568
5733E920916k02543j52984O3053p6022j68779q9856j1179l5636l8787l9840r0695
5722E077648m9150r6626R7182j72007q8535J3976r7320J7325r5120k3786n1424
5711D532163k980n7572q0470P7846j42709r777p641j18070J10100k50458O7864
5700D118296l6247l8685l4392N241K638o7197j52228J25849p7150l2243k1857
5689C792025P1838j53913K468q2646N4232k5467o0268j7424m7742j3484K1927
5678C541546J09242k06788J31311j31392l0455o4727l6854j25767R1352p8410
5668C199058P4863p0792R3269n7855p7774L910K0938r522K7833o3708M590m9648
$$ plain form
5656 3095162 3171559 3110321 3032089 3105389 3036724 3070422 3040923 3041245 2960096 2926050 3040838 2905424
5644 2905424 2980496 2944798 3040353 3038276 2956230 3055760 2988765 3074473 2955051 3008672 2954340
5633 2954340 3069691 3000425 2993584 3017191 2885544 2988175 2999146 3075106 3032654 3046890 3092681
5622 3092681 2994865 3091816 3135145 3084229 3132777 3092683 3169604 3270342 3167897 3243279 3299232
5611 3299232 3278766 3380013 3395595 3244210 3420147 3427339 3396931 3453746 3536218 3573600 3671496
5600 3671496 3652342 3712401 3853697 3867239 3878443 3930365 4037742 4080558 4147867 4258410 4347182
5589 4347182 4493712 4481368 4484800 4681941 4856133 4951813 5088701 5229765 5390883 5485967
5579 5485967 5637478 5816097 5905589 6153679 6311491 6416764 6752397 6826576 7005373 7178339
$$ packed form
5656C095162P6397o1238p8232P3300o8665L3698k9499L22q1149l4046J14788j35414
5644B905424P5072l5698R5555k077q2046R9530o6995Q5708j19422N3621n4332
5633B954340J15351o9266o841K3607j31647J02631J0971P5960m2452J4236M5791
5622C092681r7816R6951M3329n0916M8548m0094P6921J00738j02445P5382N5953
5611C299232k0466J01247J5582j51385J75937P192l0408N6815Q2472L7382R7896
5600C671496j9154O0059J41296J3542J1204N1922J07377M2816O7309J10543Q8772
5589D347182J46530j2344L432J97141J74192R5680J36888J41064J61118R5084
5579E485967J51511J78619Q9492K48090J57812J05273L35633P4179J78797J72966
$$ plain form
5569 7178339 7486640 7554852 7698781 7798094 7870099 8016907 8021677 8049164 8048352 7998515 7886440
5558 7886440 7982684 7942199 7761412 7623247 7644321 7583162 7538623 7375996 7322497 7257499 7309168
5547 7309168 7365605 7326549 7300224 7293387 7310271 7340055 7379318 7381350 7600664 7584030 7657217 7808713
5535 7808713 7794860 7921705 8051957 8162712 8388655 8448928 8528634 8737184 8883198 9016427
5525 9016427 9008148 9335271 9406350 9661289 9843698 9998833 10217868 10468652 10577824 10838058
5515 10838058 11165848 11400289 11730619 11840833 12168474 12477596 12757462 13094216 13359405
5506 13359405 13787596 14027510 14557525 14871829 15315264 15631033 16119596 16413413 16937530
5497 16937530 17324282 17873611 18349347 18854938 19299370 19916582 20418355 20966626 21505890
$$ packed form
5569G178339L08301O8212J43929R9313P2005J46808M770K7487q12m9837j12075
5558G886440R6244m0485j80787j38165K1074o1159m4539j62627n3499o4998N1669
5547G309168N6437l9056k6325o837J6884K9784L9263K032K19314j6634P3187J51496
5535G808713j3853J26845J30252J10755K25943O0273P9706K08550J46014J33229
5525I016427q279L27123P1079K54939J82409J55135K19035K50784J09172K60234
5515A0838058L27790K34441L30330J10214L27641L09122K79866L36754K65189
5506A3359405M28191K39914N30015L14304M43435L15769M88563K93817N24117
5497A6937530L86752N49329M75736N05591M44432O17212N01773N48271N39264
$$ plain form
5488 21505890 22136278 22596256 23257732 23801111 24454213 25166939 25784762 26329526 27014194
5479 27014194 27742947 28427335 29101247 29764418 30326646 31180552 31829415 32595443 33236854
5470 33236854 33959964 34706222 35282863 36103797 36750032 37359619 38027471 38612415 39171244
5461 39171244 39806223 40347880 40813258 41309226 41845465 42196125 42543669 42934794 43282633
5452 43282633 43634311 43899992 44121544 44468534 44612520 44762635 44927470 45187730 45135731 45244994
5442 45244994 45289511 45332378 45288278 45308415 45160365 45174044 44951872 44783475 44688282 44370746
5432 44370746 44197737 43894893 43674226 43267202 42886551 42431812 42152139 41659804 41313775
5423 41313775 40787103 40269846 39756027 39234706 38710184 38076093 37526065 36996160 36341978
$$ packed form
5488B1505890O30388M59978O61476N43379O53102P12726O17823N44764O84668
5479B7014194P28753O84388O73912O63171N62228Q53906O48863P66028O41411
5470C3236854P23110P46258N76641Q20934O46235O09587O67852N84944N58829
5461C9171244O34979N41657M65378M95968N36239L50660L47544L91125L47839
5452D3282633L51678K65681K21552L46990J43986J50115J64835K60260n1999J09263
5442D5244994M4517M2867m4100K0137j48050J3679k22172j68397r5193l17536
5432D4370746j73009l02844k20667m07024l80651m54739k79673m92335l46029
5423D1313775n26672n17257n13819n21321n24522o34091n50028n29905o54182
$$ plain form
5414 36341978 35833638 35046618 34478689 33860261 33238980 32571548 31910132 31304802 30730082
5405 30730082 30006878 29360814 28804725 28143919 27549609 27005102 26459416 25726536 25237084
5396 25237084 24533919 24055131 23445468 22854285 22400924 21831957 21304255 20871276 20363896
5387 20363896 19854033 19359689 18864391 18520872 18074056 17713117 17285512 16875475 16379959
5378 16379959 16169838 15790834 15472876 15157306 14825822 14550041 14151596 13964340 13658629
5369 13658629 13331548 13187132 12873593 12727186 12543031 12353336 12103155 11998871 11672473
5360 11672473 11565145 11507806 11385325 11224108 11289175 11046750 10958612 10880845 10798042 10776079
5350 10776079 10791681 10757075 10760110 10709628 10822230 10906875 10945782 11019681 11098976 11247375 11368024
$$ packed form
5414C6341978n08340p87020n67929o18428o21281o67432o61416o05330n74720
5405C0730082p23204o46064n56089o60806n94310n44507n45686p32880m89452
5396B5237084p03165m78788o09663n91183m53361n68967n27702m32979n07380
5387B0363896n09863m94344m95298l43519m46816l60939m27605m10037m95516
5378A6379959k10121l79004l17958l15570l31484k75781l98445j87256l05711
5369A3658629l27081j44416l13539j46407j84155j89695k50181j04284l26398
5360A1672473j07328n7339j22481j61217O5067k42425q8138p7767q2803k1963
5350A0776079J5602l4606L035n0482J12602Q4645L8907P3899P9295J48399J20649
$$ plain form
5339 11368024 11464995 11650662 11904467 12111353 12306142 12611850 12907485 13114755 13475984 13917815
5329 13917815 14075344 14504100 14854098 15137151 15546756 15867006 16208065 16613833 16799078
5320 16799078 17080101 17416624 17687453 18071971 18456506 18877904 19343030 19627077 20153857
5311 20153857 20725974 21252501 21766381 22262663 22897267 23423510 23948911 24424623 25077711
5302 25077711 25457468 25887891 26313227 26563767 26896996 26988745 27195815 27276787 27166082 27141976
5292 27141976 26888162 26713310 26424222 25995625 25608657 25012336 24430332 23765570 23049725
5283 23049725 22407177 21671249 20843095 20142193 19377401 18577695 17830668 17073218 16391703
5274 16391703 15803944 15081949 14324824 13775491 13194309 12686917 12184172 11674064 11096801
$$ packed form
5339A1368024R6971J85667K53805K06886J94789L05708K95635K07270L61229M41831
5329A3917815J57529M28756L49998K83053M09605L20250L41059M05768J85245
5320A6799078K81023L36523K70829L84518L84535M21398M65126K84047N26780
5311B0153857N72117N26527N13880M96282O34604N26243N25401M75712O53088
5302B5077711L79757M30423M25336K50540L33229R1749K07070Q0972j10705k4106
5292B7141976k53814j74852k89088m28597l86968n96321n82004o64762p15845
5283B3049725o42548p35928q28154p00902p64792p99706p47027p57450o81515
5274A6391703n87759p21995p57125n49333n81182n07392n02745n10108n77263
$$ plain form
5265 11096801 10756843 10259669 9925117 9522216 9186383 8759428 8484470 8383476 8052198
5256 8052198 7638356 7450950 7263594 7059767 6827738 6659474 6527732 6327036 5961249 5977785
5246 5977785 5829721 5744507 5676207 5515950 5394496 5216352 5123783 5098914 4968569 4841594
5236 4841594 4666510 4681280 4641387 4577076 4370073 4425040 4294887 4293637 4311568 4180955 4203198
5225 4203198 4076208 4069581 3990023 4019996 3870167 3872550 3794094 3733630 3694813 3657139 3756638
5214 3756638 3575914 3543810 3533354 3422042 3361033 3394216 3370085 3373136 3251899 3260472 3221427
5203 3221427 3232082 3194643 3255742 3197364 3140311 3163700 3189450 3022412 3054681 3021325 3079562
5192 3079562 2959945 2891616 2916360 2864382 2767230 2813725 2868023 2827067 2698515 2784105 2695050
$$ packed form
5265A1096801l39958m97174l34552m02901l35833m26955k74958j00994l31278
5256H052198m13842j87406j87356k03827k32029j68264j31742k00696l65787J6536
5246E977785j48064q5214o8300j60257j21454j78144r2569k4869j30345j26975
5236D841594j75084J4770l9893o4311k07003N4967j30153j250J7931j30613K2243
5225D203198j26990o627p9558K9973j49829K383p8456o0464l8817l7674R9499
5214C756638j80724l2104j0456j11312o1009L3183k4131L051j21237Q573l9045
5203C221427J0655l7439O1099n8378n7053K3389K5750j67038L2269l3356N8237
5192C079562j19617o8329K4744n1978r7152M6495N4298m0956j28552Q5590q9055
$$ plain form
5181 2695050 2687268 2535565 2629302 2556481 2641359 2629544 2593528 2604970 2610300 2534493 2429282
5170 2429282 2576436 2375500 2490849 2505117 2531555 2508172 2572966 2545906 2459988 2475716 2435670
5159 2435670 2398428 2493867 2404699 2474429 2403447 2407156 2393580 2472466 2395513 2337098 2333069 2332430
5147 2332430 2275478 2367229 2261533 2263778 2363524 2299800 2279108 2274102 2259858 2173505 2191967 2223167
5135 2223167 2163033 2225382 2223959 2143974 2055269 2195393 2249843 2085311 2189799 2150455 2158955
5124 2158955 2068128 2199324 2169539 2106334 2155254 2091567 2175289 2199173 2045580 2101676 2179809
5113 2179809 2146263 2110395 2241067 2080374 2123443 2145114 2158234 2209662 2227197 2210081 2201481
5102 2201481 2212699 2206164 2247575 2247479 2243643 2316463 2303651 2320340 2370267 2258050 2381918 2396880
$$ packed form
5181B695050p782j51703R3737p2821Q4878j1815l6016J1442N330p5807j05211
5170B429282J47154k00936J15349J4268K6438k3383O4794k7060q5918J5728m0046
5159B435670l7242R5439q9168O9730p0982L709j3576P8886p6953n8415m029o39
5147B332430n6952R1751j05696K245R9746o3724k0692n006j4244q6353J8462L1200
5135B223167o0134O2349j423p9985q8705J40124N4450j64532J04488l9344Q500
5124B158955r0827J31196k9785o3205M8920o3687Q3722K3884j53593N6096P8133
5113B179809l3546l5868J30672j60693M3069K1671J3120N1428J7535j7116q600
5102B201481J1218o535M1411r6l836P2820j2812J6689M9927j12217J23868J4962
$$ plain form
5090 2396880 2448134 2298563 2374443 2557262 2531142 2542235 2529178 2549924 2612512 2562521 2719304
5079 2719304 2746378 2670586 2848017 2793844 2802889 2907386 2966141 2988785 2966409 2966625 3067463
5068 3067463 3136753 3100329 3083302 3131120 3303334 3264543 3322975 3261637 3284738 3362829 3431160
5057 3431160 3485368 3591775 3619275 3574849 3629414 3778545 3734790 3810853 3960509 4017450 4036276
5046 4036276 4098691 4161678 4202762 4238281 4413979 4382191 4474907 4643557 4654225 4761694 4847424
5035 4847424 4900997 5005676 4954368 5093963 5220838 5285548 5409708 5453790 5470079 5640458
5025 5640458 5866543 5905597 6080333 6193406 6334225 6385235 6472129 6673815 6839416 7162269
5015 7162269 7255127 7457561 7444754 7749714 7889460 8149611 8379545 8584016 8933041 9184199
$$ packed form
5090B396880N1254j49571P5880J82819k6120J1093j3057K0746O2588m9991J56783
5079B719304K7074p5792J77431n4173R045J04497N8755K2644k2376K16J00838
5068C067463O9290l6424j7027M7818J72214l8791N8432o1338K3101P8091O8331
5057C431160N4208J06407K7500m4426N4565J49131m3755P6063J49656N6941J8826
5046D036276O2415O2987M1084L5519J75698l1788R2716J68650J0668J07469Q5730
5035D847424N3573J04679n1308J39595J26875O4710J24160M4082J6289J70379
5025E640458K26085L9054J74736J13073J40819N1010Q6894K01686J65601L22853
5015G162269R2858K02434j2807L04960J39746K60151K29934K04471L49025K51158
$$ plain form
5005 9184199 9467402 9732736 10103730 10261852 10648542 11032463 11533041 11891725 12228065 12626145
4995 12626145 13150591 13672177 14215054 14703252 15216627 15805593 16479895 17157154 17855371
4986 17855371 18491249 19413160 20295320 21019608 21957358 22868670 23776024 24801457 25876661
4977 25876661 27029898 28078058 29327655 30547631 31945063 33256721 34699527 36146320
4969 36146320 37725839 39255995 40888159 42525706 44242845 46121192 47942223 49849962
4961 49849962 51661791 53660834 55824944 58042390 60375271 63007543 65767902 68531035
4953 68531035 71421576 74122679 76493487 78133552 78910198 78857269 77653755 75615090 73153634
4944 73153634 70290292 67206161 64130611 61031798 57894194 54885712 52264829 49832422
$$ packed form
5005I184199K83203K65334L70994J58122L86690L83921N00578L58684L36340L98080
4995A2626145N24446N21586N42877M88198N13375N88966O74302O77259O98217
4986A7855371O35878R21911Q82160P24288R37750R11312R07354J025433J075204
4977B5876661J153237J048160J249597J219976J397432J311658J442806J446793
4969C6146320J579519J530156J632164J637547J717139J878347J821031J907739
4961D9849962J811829J999043K164110K217446K332881K632272K760359K763133
4953F8531035K890541K701103K370808J640065P76646n2929j203514k038665k461456
4944G3153634k863342l084131l075550l098813l137604l008482k620883k432407
$$ plain form
4936 49832422 47421741 45325117 43353878 41536382 39830065 38141118 36708019 35267796
4928 35267796 33927453 32760410 31489865 30378151 29292374 28210074 27325028 26378623
4920 26378623 25345862 24515396 23766576 22919443 22169467 21475757 20824377 20251593 19496066
4911 19496066 18940251 18370387 17756084 17228958 16777234 16353937 15878587 15355757 14955172
4902 14955172 14642457 14279508 13851278 13550134 13183447 12923275 12450707 12326024 12008500
4893 12008500 11692432 11388099 11195650 11010796 10651459 10509768 10329491 10040567 9910631
4884 9910631 9692441 9580724 9428724 9239180 9086552 8970909 8882862 8614274 8640311 8503035
4874 8503035 8439909 8294368 8158796 8125005 8070142 8065439 7942297 7915077 7861162 7853942 7897598
$$ packed form
4936D9832422k410681k096624j971239j817496j706317j688947j433099j440223
4928C5267796j340343j167043j270545j111714j085777j082300q85046r46405
4920B6378623j032761q30466p48820q47133p49976o93710o51380n72784p55527
4911A9496066n55815n69864o14303n27126m51724m23297m75350n22830m00585
4902A4955172l12715l62949m28230l01144l66687k60172m72568j24683l17524
4893A2008500l16068l04333j92449j84854l59337j41691j80277k88924j29936
4884I910631k18190j11717j52000j89544j52628j15643q8047k68588K6037j37276
4874H503035o3126j45541j35572l3791n4863m703j23142k7220n3915p220M3656
$$ plain form
4863 7897598 7834269 7676686 7820429 7940634 7830620 7752753 7961405 7883722 8038177 8212063
4853 8212063 8204375 8308664 8370143 8552930 8876000 8905210 9049799 9185455 9464728 9633172
4843 9633172 9774052 9871330 9863512 9823834 9863472 9850664 9720194 9655586 9439488 9411359 9206348
4832 9206348 9144777 9136042 8923340 8871982 8856451 8801944 8708371 8656659 8673680 8616948 8689483
4821 8689483 8733474 8622803 8751818 8697472 8651052 8748295 8797306 8863979 8952655 9033627 8991922
4810 8991922 9158829 9202152 9260639 9285489 9371094 9376453 9418650 9561553 9626237 9761241 9784010
4799 9784010 9785764 9922891 9945692 10014713 10076796 10096809 10157695 10115623 10233903 10375489 10258823
4788 10258823 10277417 10356957 10350915 10445688 10385587 10405327 10437569 10362605 10439609 10361336 10374394
$$ packed form
4863G897598o3329j57583J43743J20205j10014p7867K08652p7683J54455J73886
4853H212063p688J04289O1479J82787L23070K9210J44589J35656K79273J68444
4843I633172J40880R7278p818l9678L9638j2808j30470o4608k16098k8129k05011
4832I206348o1571q735k12702n1358j5531n4507r3573n1712J7021n6732P2535
4821H689483M3991j10671J29015n4346m6420R7243M9011O6673Q8676Q0972m1705
4810H991922J66907M3323N8487K4850Q5605N359M2197J42903O4684J35004K2769
4799I784010J754J37127K2801O9021O2083K0013O0886m2072J18280J41586j16666
4788A0258823J8594P9540o042R4773o0101J9740L2242p4964P7004p8273J3058
$$ plain form
4777 10374394 10291071 10232429 10186827 10123896 10039592 10026493 10033136 9847694 9741001 9816719 9765113
4766 9765113 9643154 9592996 9482707 9438999 9501417 9381259 9305956 9298326 9231260 9195572 9161861
4755 9161861 9001602 9087675 8989999 9039492 8964471 9046267 9024048 8886282 8980530 8977806 8991892
4744 8991892 8946414 8866774 8932877 9029661 8951204 9061634 8995255 9044269 9092481 9107740 9096642
4733 9096642 9213463 9208682 9145010 9101820 9227702 9304265 9240853 9288994 9464817 9535938 9569865
4722 9569865 9608504 9666690 9680436 9733364 9875240 9873810 9942932 10038138 10075115 10154944 10265492
4711 10265492 10370194 10396907 10500581 10566889 10684104 10759602 10927767 10947086 11097549 11266370
4701 11266370 11454710 11453302 11751786 11844845 12056884 12098602 12158252 12285254 12607630 12667713
$$ packed form
4777A0374394q3323n8642m5602o2931q4304j3099O643j85442j06693P5718n1606
4766I765113j21959n0158j10289m3708O2418j20158p5303p630o7066l5688l3711
4755I161861j60259Q6073r7676M9493p5021Q1796k2219j37766R4248k724J4086
4744H991892m5478p9640O6103R6784p8457J10430o6379M9014M8212J5259j1098
4733I096642J16821m781o3672m3190J25882P6563o3412M8141J75823P1121L3927
4722I569865L8639N8186J3746N2928J41876j430O9122R5206L6977P9829J10548
4711A0265492J04702K6713J03674O6308J17215P5498J68165J9319J50463J68821
4701A1266370J88340j408K98484R3059K12039M1718N9650J27002L22376O0083
$$ plain form
4691 12667713 12698478 12947856 13117882 13203483 13498759 13580223 13814767 13959719 14232799 14488337
4681 14488337 14656163 14952809 15143130 15392267 15723012 15995322 16309075 16601844 16959917
4672 16959917 17361952 17747746 18121147 18497398 18958312 19445604 19882175 20269289 20975307
4663 20975307 21430248 22009232 22690836 23239142 23921132 24640065 25393306 26103517 26898067
4654 26898067 27849166 28673526 29633639 30587408 31646785 32727562 33788396 34864229 36186737
4645 36186737 37372917 38725463 40093934 41447866 42904628 44466580 45901851 47495086
4637 47495086 48976451 50591037 52301923 53785764 55453992 57165921 58734045 60287754
4629 60287754 61741544 63163586 64612076 65928563 67001797 68065920 69013633 69805229
$$ packed form
4691A2667713L0765K49378J70026Q5601K95276Q1464K34544J44952K73080K55538
4681A4488337J67826K96646J90321K49137L30745K72310L13753K92769L58073
4672A6959917M02035L85794L73401L76251M60914M87292M36571L87114P06018
4663B0975307M54941N78984O81604N48306O81990P18933P53241P10211P94550
4654B6898067R51099Q24360R60113R53769J059377J080777J060834J075833J322508
4645C6186737J186180J352546J368471J353932J456762J561952J435271J593235
4637D7495086J481365J614586J710886J483841J668228J711929J568124J553709
4629F0287754J453790J422042J448490J316487J073234J064123R47713P91596
$$ plain form
4621 69805229 70473520 70965181 71364896 71461162 71565339 71425881 71132840 70646860 70162887 69482525
4611 69482525 68608155 67736318 66632105 65593114 64513887 63150276 61889568 60742237
4603 60742237 59315502 58159000 56867917 55575553 54317783 52988725 51836816 50585796
4595 50585796 49568015 48368887 47245412 46141098 45221659 44230149 43285424 42318616 41413087
4586 41413087 40553397 39769312 38894836 38114213 37393408 36698024 35965020 35418970 34711863
4577 34711863 34090452 33497514 32948357 32367878 31919824 31436972 30959408 30535746 30249775
4568 30249775 29761437 29401823 29134918 28741510 28446633 28293402 28064038 27826758 27710277
4559 27710277 27512718 27375735 27260979 27246211 27210446 27164521 27117126 27184704 27138899 27336677
$$ packed form
4621F9805229O68291M91661L99715R6266J04177j39458k93041m85980m83973o80362
4611F9482525q74370q71837j104213j038991j079227j363611j260708j147331
4603F0742237j426735j156502j291083j292364j257770j329058j151909j251020
4595E0585796j017781j199128j123475j104314r19439r91510r44725r66808r05529
4586D1413087q59690p84085q74476p80623p20805o95384p33004n46050p07107
4577C4711863o21411n92938n49157n80479m48054m82852m77564m23662k85971
4568C0249775m88338l59614k66905l93408k94877j53231k29364k37280j16481
4559B7710277j97559j36983j14756j4768l5765m5925m7395O7578m5805J97778
$$ plain form
4549 27336677 27251967 27514996 27535632 27777246 27966259 28137486 28415937 28679151 29008030 29250239
4539 29250239 29684964 30018535 30392675 30721270 31223078 31699464 32204321 32739358 33288401
4530 33288401 33795807 34341331 35024683 35678317 36182138 36970537 37565269 38228209 38892737
4521 38892737 39466572 40308299 40933517 41464169 42157486 42742183 43285820 44046619 44607021
4512 44607021 45326745 45963641 46699606 47371650 48163422 49065601 49899940 50899931 51829892
4503 51829892 52862811 54086024 55212346 56568575 57858885 59423490 61024710 62653509
4495 62653509 64322887 66242481 68140996 70144686 72281879 74466997 76790446 79161251
4487 79161251 81663639 84334562 86926159 89656625 92412252 95072442 97769323 100659374
$$ packed form
4549B7336677q4710K63029K0636K41614J89013J71227K78451K63214L28879K42209
4539B9250239M34725L33571L74140L28595N01808M76386N04857N35037N49043
4530C3288401N07406N45524O83352O53634N03821P88399N94732O62940O64528
4521C8892737N73835Q41727O25218N30652O93317N84697N43637P60799N60402
4512D4607021P19724O36896P35965O72044P91772R02179Q34339R99991R29961
4503E1829892J032919J223213J126322J356229J290310J564605J601220J628799
4495F2653509J669378J919594J898515K003690K137193K185118K323449K370805
4487G9161251K502388K670923K591597K730466K755627K660190K696881K890051
$$ plain form
4479 100659374 103406898 106193720 108788505 111466500 113974870 116142966 118380024 120399433
4471 120399433 122187688 123758097 125148592 126207036 126947029 127420999 127671540 127704754 127303168
4462 127303168 126726852 125838151 124745214 123476360 121754764 120094546 118187803 116117312
4454 116117312 113793294 111586298 109089006 106793502 104179935 101835081 99270770 96831997
4446 96831997 94424021 92108323 89785737 87490181 85273014 83108828 81155238 79136877
4438 79136877 77210883 75362443 73612881 71912919 70259042 68791405 67321479 65942122
4430 65942122 64500577 63266487 62107584 60920543 59745920 58802156 57805361 56791681
4422 56791681 55820031 55013969 54134718 53310964 52511427 51786275 51022803 50219826 49379838
$$ packed form
4479A00659374K747524K786822K594785K677995K508370K168096K237058K019409
4471A20399433J788255J570409J390495J058444P39993M73970K50541L3214m01586
4462A27303168n76316q88701j092937j268854j721596j660218j906743k070491
4454A16117312k324018k206996k497292k295504k613567k344854k564311k438773
4446I6831997k407976k315698k322586k295556k217167k164186j953590k018361
4438G9136877j925994j848440j749562j699962j653877j467637j469926j379357
4430F5942122j441545j234090j158903j187041j174623r43764r96795j013680
4422E6791681r71650q06062q79251q23754p99537p25152p63472q02977q39988
$$ plain form
4413 49379838 48678936 47733414 47142840 46256664 45468984 44603872 43855876 43050033 42293495
4404 42293495 41437497 40479819 39752420 38975386 38230222 37541900 36851437 36068665 35483255
4395 35483255 34802813 34239723 33672870 33057538 32616249 32054402 31521833 31120738 30750324
4386 30750324 30278629 29906185 29588898 29259180 28856928 28619654 28387167 28054111 27802119
4377 27802119 27574400 27355773 27164196 27076251 26873763 26757808 26538267 26370246 26343841 26167295
4367 26167295 26157097 26067870 26128704 25986543 25985591 25924146 25942687 25965740 25936645 25938580 26054580
4356 26054580 26205047 26231079 26351602 26398332 26604124 26762547 26910129 27102970 27313703 27481468
4346 27481468 27785782 27960175 28295633 28604176 28826034 29103402 29662175 29872814 30283802
$$ packed form
4413D9379838p00902r45522n90574q86176p87680q65112p47996q05843p56538
4404D2293495q55998r57678p27399p77034p45164o88322o90463p82772n85410
4395C5483255o80442n63090n66853o15332m41289n61847n32569m01095l70414
4386C0750324m71695l72444l17287l29718m02252k37274k32487l33056k51992
4377B7802119k27719k18627j91577q7945k02488j15955k19541j68021k6405j76546
4367B6167295j0198q9227O0834j42161r52o1445J8541K3053k9095J935J16000
4356B6054580J50467K6032J20523M6730K05792J58423J47582J92841K10733J67765
4346B7481468L04314J74393L35458L08543K21858K77368N58773K10639M10988
$$ plain form
4337 30283802 30705883 31111033 31503818 32008512 32454142 33005608 33522531 34101436 34584431
4328 34584431 35238001 35822748 36517550 37191707 37770243 38491198 39282395 40067087 40749202
4319 40749202 41493377 42289940 43141749 43954612 44871796 45846206 46889102 47977973 49065462
4310 49065462 50218117 51348870 52630742 53951215 55313426 56828473 58330797 60051355
4302 60051355 61745710 63410262 65404488 67202322 69359433 71518323 73751458 76149513
4294 76149513 78807829 81363336 84113923 87017450 90050579 93164387 96436187 99893253
4286 99893253 103529510 107181451 110962117 114881946 118866643 123040890 127133017 131414717
4278 131414717 135592414 139866461 144113962 148177927 152297503 156298446 160140414 163707696
$$ packed form
4337C0283802M22081M05150L92785N04694M45630N51466N16923N78905M82995
4328C4584431O53570N84747O94802O74157N78536P20955P91197P84692O82115
4319D0749202P44175P96563Q51809Q12863R17184R74410J042896J088871J087489
4310D9065462J152655J130753J281872J320473J362211J515047J502324J720558
4302F0051355J694355J664552J994226J797834K157111K158890K233135K398055
4294G6149513K658316K555507K750587K903527L033129L113808L271800L457066
4286I9893253L636257L651941L780666L919829L984697M174247M092127M281700
4278A31414717M177697M274047M247501M063965M119576M000943L841968L567282
$$ plain form
4270 163707696 167123441 170236023 172932522 175435669 177220912 178774688 179716468 180244453
4262 180244453 180101344 179479334 178277858 176648292 174596585 172277395 169323866 166278053
4254 166278053 162940333 159471472 155793212 152019069 148272712 144241876 140406110 136500025
4246 136500025 132506560 128789335 124944060 121283014 117775288 114217697 110818293 107592489
4238 107592489 104398770 101355500 98437496 95577614 92821723 90157718 87834748 85438625
4230 85438625 83228757 80919417 78810329 76905479 75008319 73211483 71468468 69797462
4222 69797462 68219754 66805412 65273594 63986469 62559289 61290315 60025979 58914468
4214 58914468 57754872 56636158 55548601 54636136 53568653 52536537 51709088 50801122 49898582
$$ packed form
4270A63707696L415745L112582K696499K503147J785243J553776R41780N27985
4262A80244453j43109o22010j201476j629566k051707k319190k953529l045813
4254A66278053l337720l468861l678260l774143l746357m030836l835766l906085
4246A36500025l993465l717225l845275l661046l507726l557591l399404l225804
4238A07592489l193719l043270k918004k859882k755891k664005k322970k396123
4230H5438625k209868k309340k109088j904850j897160j796836j743015j671006
4222F9797462j577708j414342j531818j287125j427180j268974j264336j111511
4214E8914468j159596j118714j087557r12465j067483j032116q27449r07966r02540
$$ plain form
4205 49898582 49040106 48324946 47543005 46875116 46232190 45564179 44996490 44363707 43835610
4196 43835610 43310269 42787200 42442684 42116693 41708286 41332333 40973458 40791088 40484171
4187 40484171 40323138 40142857 39925675 39683499 39514832 39354754 39446028 39204438 39252452 39162947
4177 39162947 39056010 39059560 39052748 39001560 39098692 39140792 39306033 39460384 39604798 39784209 40067742
4166 40067742 40361833 40734616 41095176 41400409 41826862 42265230 42739637 43299480 43862253
4157 43862253 44404504 45051412 45696750 46342502 47274144 48157077 49116465 50191098 51359130
4148 51359130 52579263 53758666 55068223 56360887 57933784 59383518 61008743 62565273
4140 62565273 64241903 66008738 67699545 69403038 71189900 72905711 74586335 76109723
$$ packed form
4205D9898582q58476p15160p81941o67889o42926o68011n67689o32783n28097
4196D3835610n25341n23069l44516l25991m08407l75953l58875j82370l06917
4187D0484171j61033j80281k17182k42176j68667j60078R1274k41590M8014q9505
4177C9162947j06937L550o812n1188R7132M2100J65241J54351J44414J79411K83533
4166D0067742K94091L72783L60560L05233M26453M38368M74407N59843N62773
4157D3862253N42251O46908O45338O45752R31642Q82933R59388J074633J168032
4148E1359130J220133J179403J309557J292664J572897J449734J625225J556530
4140F2565273J676630J766835J690807J703493J786862J715811J680624J523388
$$ plain form
4132 76109723 77630324 79077595 80327625 81360925 82279544 83138914 83556875 83921989 83820171
4123 83820171 83911018 83347804 82887550 82106999 80931006 79661648 78443717 76912550 75394455
4114 75394455 73673836 72009421 70234665 68495783 66684302 64923543 63120818 61385132
4106 61385132 59802924 58191365 56528001 54948148 53573614 52056144 50642108 49518846
4098 49518846 48183661 47054348 45920332 44867394 43839687 42877675 41987353 40931671
4090 40931671 40222121 39365431 38588785 37740477 37019832 36378260 35700400 35004705 34364468
4081 34364468 33816272 33193481 32601552 32026350 31479416 31086926 30476372 30068566 29560917
4072 29560917 29105272 28710499 28304526 27878875 27534645 27109530 26726510 26335278 25943259
$$ packed form
4132G6109723J520601J447271J250030J033300R18619Q59370M17961L65114j01818
4123H3820171R0847n63214m60254p80551j175993j269358j217931j531167j518095
4114G5394455j720619j664415j774756j738882j811481j760759j802725j735686
4106F1385132j582208j611559j663364j579853j374534j517470j414036j123262
4098D9518846j335185j129313j134016j052938j027707r62012q90322j055682
4090D0931671p09550q56690p76646q48308p20645o41572o77860o95695o40237
4081C4364468n48196o22791n91929n75202n46934l92490o10554m07806n07649
4072B9560917m55645l94773m05973m25651l44230m25115l83020l91232l92019
$$ plain form
4063 25943259 25673163 25356243 25018478 24803077 24491425 24270727 23954270 23762428 23590693
4054 23590693 23379965 23145891 23055581 22818237 22695251 22647571 22493291 22610379 22404499 22294482
4044 22294482 22319851 22329166 22312718 22240509 22282700 22410079 22445176 22455486 22562573 22802450 22719839
4033 22719839 23008781 23175247 23338042 23445316 23687375 23967218 24199255 24459581 24664569
4024 24664569 25004604 25284703 25629603 25947980 26269864 26659728 27064302 27449145 27931993
4015 27931993 28382035 28984160 29537010 30100974 30783130 31383725 32013977 32775957 33518202
4006 33518202 34309743 35187210 36201765 37051524 38048465 39131742 40214231 41232874 42477430
3997 42477430 43591801 44885122 46055249 47181932 48375933 49589809 50849579 52048388
$$ packed form
4063B5943259k70096l16920l37765k15401l11652k20698l16457j91842j71735
4054B3590693k10728k34074r0310k37344j22986m7680j54280J17088k05880j10017
4044B2294482K5369R315j6448p2209M2191J27379L5097J0310J07087K39877q2611
4033B2719839K88942J66466J62795J07274K42059K79843K32037K60326K04988
4024B4664569L40035K80099L44900L18377L21884L89864M04574L84843M82848
4015B7931993M50042O02125N52850N63964O82156O00595O30252P61980P42245
4006C3518202P91541Q77467J014555Q49759R96941J083277J082489J018643J244556
3997D2477430J114371J293321J170127J126683J194001J213876J259770J198809
$$ plain form
3989 52048388 53322752 54599027 55951397 57328332 58716881 60248798 61811090 63434981
3981 63434981 65146609 67013474 68987867 70989978 73254441 75670387 78225974 80846129
3973 80846129 83646739 86553027 89441559 92217087 95025854 97694022 100305540 103016883
3965 103016883 105840262 108661138 111707121 115144877 118797871 122671586 126928439 131445611
3957 131445611 136513659 141689969 147436380 153493264 159830072 166588217 173596080 180932015
3949 180932015 188429615 196258239 204265216 212412720 220513544 228590409 236390542 244061179
3941 244061179 251115244 257529590 263237059 267883663 271361630 273564302 274469460 273980657
3933 273980657 272176968 269091206 264671612 259165871 252848180 246007542 238390938 230582621
$$ packed form
3989E2048388J274364J276275J352370J376935J388549J531917J562292J623891
3981F3434981J711628J866865J974393K002111K264463K415946K555587K620155
3973H0846129K800610K906288K888532K775528K808767K668168K611518K711343
3965A03016883K823379K820876L045983L437756L652994L873715M256853M517172
3957A31445611N068048N176310N746411O056884O336808O758145P007863P335935
3949A80932015P497600P828624Q006977Q147504Q100824Q076865P800133P670637
3941B44061179P054065O414346N707469M646604L477967K202672R05158m88803
3933B73980657j803689l085762m419594n505741o317691o840638p616604p808317
$$ plain form
3925 230582621 222326351 214241218 206110605 198052405 190274491 182651633 175436548 168510193
3917 168510193 161867696 155584532 149536243 143791733 138461262 133428846 128522319 123952249
3909 123952249 119578026 115374724 111486456 107492717 103818692 100401166 96991963 93802797
3901 93802797 90551518 87620836 84566005 81814509 79054145 76476955 73908159 71479825
3893 71479825 69084790 66829750 64635238 62397265 60426907 58465317 56575812 54668738
3885 54668738 53010675 51218899 49646829 48044966 46613823 45091987 43688231 42470807
3877 42470807 41199088 39967505 38886861 37694285 36680524 35664275 34671605 33734438
3869 33734438 32726126 31811755 31128067 30160110 29348993 28613232 27919520 27152298 26479637
$$ packed form
3925B30582621q256270q085133q130613q058200p777914p622858p215085o926355
3917A68510193o642497o283164o048289n744510n330471n032416m906527m570070
3909A23952249m374223m203302l888268l993739l674025l417526l409203l189166
3901I3802797l251279k930682l054831k751496k760364k577190k568796k428334
3893G1479825k395035k255040k194512k237973j970358j961590j889505j907074
3885E4668738j658063j791776j572070j601863j431143j521836j403756j217424
3877D2470807j271719j231583j080644j192576j013761j016249r92670r37167
3869C3734438j008312r14371o83688r67957q11117p35761o93712p67222o72661
$$ plain form
3860 26479637 25770225 25165431 24565960 24060079 23444352 22750040 22438442 21863669 21410632
3851 21410632 20858591 20425243 20020570 19574379 19138102 18670091 18279284 17909939 17558537
3842 17558537 17169193 16887134 16432655 16163979 15865136 15542716 15165511 14919513 14672669
3833 14672669 14426379 14102129 13757468 13514590 13253153 13071629 12827550 12601228 12386711
3824 12386711 12145750 11895232 11763940 11492551 11188988 11068587 10891797 10713410 10519476
3815 10519476 10347235 10172144 10000119 9817019 9683819 9425049 9299625 9145824 8970106
3806 8970106 8873513 8704942 8531197 8417565 8297071 8063455 8012135 7861566 7834609 7611228
3796 7611228 7651977 7438714 7337462 7222970 7107231 7104649 6930504 6877228 6717286 6567303
$$ packed form
3860B6479637p09412o04794n99471n05881o15727o94312l11598n74773m53037
3851B1410632n52041m33348m04673m46191m36277m68011l90807l69345l51402
3842A7558537l89344k82059m54479k68676k98843l22420l77205k45998k46844
3833A4672669k46290l24250l44661k42878k61437j81524k44079k26322k14517
3824A2386711k40961k50518j31292k71389l03563j20401j76790j78387j93934
3815A0519476j72241j75091j72025j83100j33200k58770j25424j53801j75718
3806H970106r6593j68571j73745j13632j20494k33616n1320j50569k6957k23381
3796G611228M0749k13263j01252j14492j15739k582j74145n3276j59942j49983
$$ plain form
3786 6567303 6508078 6517596 6263211 6195115 6136382 6054577 6019642 5854997 5851551 5733417 5624507
3775 5624507 5535485 5483187 5389487 5349287 5263128 5137245 5149271 5101060 4977774 4885412 4890723
3764 4890723 4751443 4658431 4693836 4634156 4501521 4489229 4479125 4312970 4269476 4258368 4221657
3753 4221657 4279773 4126899 4023737 4052939 3900096 4022970 3885311 3888797 3789908 3788059 3768367
3742 3768367 3809501 3650177 3713493 3724057 3588687 3516808 3523373 3471847 3460461 3353931 3481597
3731 3481597 3327800 3325945 3274089 3296212 3259803 3258911 3151569 3119002 3086652 3110891 3094455 3041361
3719 3041361 2917020 2954883 2960803 2991282 2968068 2959108 3016770 2997172 2939513 3031205 2935908 3021908
3707 3021908 2976244 2949373 2953942 3018442 2938846 3038636 2986445 2907582 3033622 2992765 3081138
$$ packed form
3786F567303n9225R518k54385o8096n8733q1805l4935j64645l446j18134j08910
3775E624507q9022n2298r3700m0200q6159j25883J2026m8211j23286r2362N311
3764D890723j39280r3012L5405n9680j32635j2292j0104j66155m3494j1108l6711
3753D221657N8116j52874j03162K9202j52843J22874j37659L486r8889j849j9692
3742C768367M1134j59324O3316J0564j35370p1879O565n1526j1386j06530J27666
3731C481597j53797j855n1856K2123l6409q92j07342l2567l2350K4239j6436n3094
3719C041361j24341L7863N920L0479k3214q960N7662j9598n7659R1692r5297Q6000
3707C021908m5664k6871M569O4500p9596R9790n2191p8863J26040m0857Q8373
$$ plain form
3696 3081138 3029529 3001293 3062202 2996861 3004044 3108091 2979972 3041074 3017023 3004294 3049953
3685 3049953 2887715 2903406 2898388 2752002 2741734 2760673 2714033 2651998 2459867 2506334 2467412
3674 2467412 2369128 2329177 2294557 2251723 2209638 2138537 2036718 2039211 1964501 1970765 1804174
3663 1804174 1839346 1799329 1824067 1682579 1722370 1666023 1600803 1591811 1553916 1515957 1428463
3652 1428463 1565965 1364376 1402984 1383394 1382063 1294975 1289123 1349238 1259802 1178787 1228513
3641 1228513 1179748 1131684 1105007 1062389 1046071 979535 1007892 994497 885182 920649 971693
3630 971693 857228 880420 755551 841065 869133 812381 789801 730193 707805 747740 636644
3619 636644 738242 669308 612866 516275 613838 679482 648316 549643 574063 477603 480266 412952
$$ packed form
3696C081138n1609k8236O0909o5341P183J04047j28119O1102k4051j2729M5659
3685C049953j62238J5691n018j46386j0268J8939m6640o2035j92131M6467l8922
3674B467412r8284l9951l4620m2834m2085p1101j01819K493p4710O264j66591
3663A804174L5172m0017K4738j41488L9791n6347o5220q992l7895l7959q7494
3652A428463J37502k01589L8608j9590j331q7088n852O0115q9436q1015M9726
3641A228513m8765m8064k6677m2618j6318o6536K8357j3395j09315L5467N1044
3630I71693j14465K3192j24869Q5514K8068n6752k2580n9608k2388L9935j11096
3619F36644J01598o8934n6442r6591R7563O5644l1166r8673K4420r6460K663o7314
$$ plain form
3607 412952 427762 434457 411243 348490 376021 329728 384793 298437 334482 347287 235053 309056
3595 309056 229367 305717 277873 184449 269153 203716 199384 180244 178202 217756 203839 212102
3583 212102 148636 105272 101598 162739 265149 110282 4553 74885 160504 95152 55399
3572 55399 49329 60591 57594 -43928 -35118 -7649 -43776 17382 -16376 31628 -55321 44684
3560 44684 -7509 -100674 -168533 -36163 -46810 -40047 -71448 -123142 -105852 -160455 -106667 -112451
3548 -112451 -15106 -156980 -141131 -19949 -115969 -145211 -136454 -165448 -177108 -281435 -153391
3537 -153391 -185305 -201357 -149203 -241234 -307472 -139585 -181249 -200566 -174728 -174665 -302094 -260132
3525 -260132 -215008 -290680 -296271 -264464 -298950 -225622 -252173 -298111 -248943 -190257 -355994 -324791
$$ packed form
3607D12952J4810O695k3214o2753K7531m6293N5065q6356L6045J2805j12234P4003
3595C09056p9689P6350k7844r3424Q4704o5437m332j9140k042L9554j3917Q263
3583B12102o3466m3364l674O1141J02410j54867j05729P0332Q5619o5352l9753
3572E5399o070J1262k997j01522Q810K7469l6127O1158l3758M8004q6949J00005
3560D4684n2193r3165o7859J32370j0647O763l1401n1694J7290n4603N3788n784
3548a12451R7345j41874J5849J21182r6020k9242Q757k8994j1660j04327J28044
3537a53391l1914j6052N2154r2031o6238J67887m1664j9317K5838O3j27429M1962
3525b60132M5124p5672n591L1807l4486P3328k6551m5938M9168N8686j65737L1203
$$ plain form
3513 -324791 -292324 -338867 -331170 -350682 -324798 -354080 -430327 -338183 -301077 -260260 -411365 -418409
3501 -418409 -403337 -401808 -442548 -460306 -422557 -461649 -509807 -497618 -470490 -433236 -364604 -396193
3489 -396193 -438333 -485448 -438451 -435773 -481529 -443967 -624734 -412716 -501567 -495273 -583069 -595812
3477 -595812 -561634 -537026 -558733 -602257 -569839 -542976 -528414 -535836 -551754 -610379 -557455 -574499
3465 -574499 -583437 -578551 -627416 -649565 -588516 -700038 -553846 -611634 -562114 -672151 -737645
3454 -737645 -713731 -633586 -650993 -720761 -670410 -681699 -691762 -690110 -731758 -774575 -698215 -759310
3442 -759310 -672675 -672210 -715505 -706012 -730309 -821726 -681310 -730491 -759086 -714824 -707865 -643499
3430 -643499 -712158 -807899 -789786 -740340 -783866 -765868 -758568 -798435 -801398 -727615 -820087 -849367
$$ packed form
3513c24791L2467m6543P697j9512K5884k9282p6247R2144L7106M0817j51105p044
3501d18409J5072J529m0740j7758L7749l9092m8158J2189K7128L7254O8632l1589
3489c96193m2140m7115M6997K678m5756L7562j80767K12018q8851O294q7796j2743
3477e95812L4178K4608k1707m3524L2418K6863J4562p422j5918n8625N2924j7044
3465e74499q938M886m8865k2149O1049j11522J46192n7788M9520j10037o5494
3454g37645K3914Q0145j7407o9768N0351j1289j0063J652m1648m2817P6360o1095
3442g59310Q6635M65m3295R493k4297r1417J40416m9181k8595M4262O959O4366
3430f43499o8659r5741J8113M9446m3526J7998P300l9867k963P3783r2472k9280
$$ plain form
3418 -849367 -792936 -725071 -818587 -807353 -728770 -901164 -871213 -777408 -792986 -830801 -824424 -822648
3406 -822648 -884203 -810548 -800944 -838926 -854102 -917785 -857628 -834121 -895739 -875068 -893161 -887185
3394 -887185 -774526 -819567 -878187 -922910 -856234 -937107 -811135 -854614 -892937 -791418 -953376
3383 -953376 -872551 -896488 -904820 -963403 -954704 -1005304 -863054 -935177 -907039 -951866 -936528 -920221
3371 -920221 -776289 -903461 -891924 -889647 -961430 -945221 -926397 -861393 -944410 -891577 -931674
3360 -931674 -1060469 -933510 -955933 -926240 -914168 -907924 -926093 -908006 -906080 -882689 -923496 -788469
3348 -788469 -884374 -906938 -864432 -932014 -860804 -930818 -935257 -849322 -943205 -946361 -903754 -931984
3336 -931984 -937860 -820203 -937614 -887947 -924907 -928866 -819481 -890164 -816410 -870281 -923703
$$ packed form
3418h49367N6431O7865r3516J1234P8583j72394K9951R3805j5578l7815O377J776
3406h22648o1555P3655R604l7982j5176o3683O0157K3507o1618K0671j8093N976
3394h87185J12659m5041n8620m4723O6676q0873J25972m3479l8323J01519j61958
3383i53376Q0825k3937q332n8583Q699n0600J42250p2123K8138m4827J5338J6307
3371i20221J43932j27172J1537K277p1783J6209J8824O5004q3017N2833m0097
3360i31674j28795J26959k2423K9693J2072O244j8169J8087J926K3391m0807J35027
3348g88469r5905k2564M2506o7582P1210p0014m439Q5935r3883l156M2607k8230
3336i31984n876J17657j17411M9667l6960l959J09385p0683P3754n3871n3422
$$ plain form
3325 -923703 -822162 -792951 -785763 -773826 -746213 -723104 -714267 -755305 -722787 -706576 -583204 -722308
3313 -722308 -584739 -612175 -564438 -473827 -415436 -358237 -408154 -323159 -265435 -286765 -217045
3302 -217045 -213474 -177931 -226993 -184360 -197274 -309311 -435619 -430777 -476841 -594601 -641086
3291 -641086 -626982 -540806 -577633 -624829 -703388 -814833 -766665 -746039 -837609 -839261 -976897
3280 -976897 -952472 -846706 -854844 -940926 -1032108 -997561 -1024581 -986071 -920773 -907014 -949985 -1037459
3268 -1037459 -1097582 -1121463 -964034 -1100617 -980440 -954426 -1068681 -1019041 -1072013 -1079451 -1070295
3257 -1070295 -1059881 -1057414 -1172520 -1094360 -1085387 -1213752 -1150133 -1077780 -1143632 -1205050 -1125906
3246 -1125906 -1009352 -1183653 -1068053 -1053475 -1076596 -1108261 -1081633 -1103583 -1135640 -1040722 -1138335
$$ packed form
3325i23703J01541K9211P188J1937K7613K3109Q837m1038L2518J6211J23372j39104
3313g22308J37569k7436M7737R0611N8391N7199m9917Q4995N7724k1330O9720
3302b17045L571L5543m9062M2633j2914j12037j26308M842m6064j17760m6485
3291f41086J4104Q6176l6827m7196p8559j11445M8168K0626r1570j652j37636
3280i76897K4425J05766q138q6082r1182L4547k7020L8510O5298J3759m2971q7474
3268a037459o0123k3881J57429j36583J20177K6014j14255M9640n2972p438R156
3257a070295J0414K467j15106P8160Q973j28365O3619P2353o5852o1418P9144
3246a125906J16554j74301J15600J4578k3121l1665K6628k1950l2057R4918r7613
$$ plain form
3235 -1138335 -1116463 -1117975 -1114028 -1130672 -1260475 -1187196 -1176643 -1179685 -1234573 -1195960 -1178627 -1100958
3223 -1100958 -1161773 -1157609 -1199750 -1245508 -1252501 -1230607 -1214947 -1145551 -1152796 -1199830 -1133987 -1261280
3211 -1261280 -1147670 -1117610 -1192807 -1271831 -1130937 -1258397 -1202098 -1253333 -1273492 -1193923 -1204115
3200 -1204115 -1159385 -1243525 -1218886 -1200509 -1180398 -1137032 -1194004 -1190871 -1286176 -1227235 -1274337 -1318764
3188 -1318764 -1241856 -1266167 -1242801 -1216292 -1130409 -1167610 -1194912 -1330339 -1192462 -1134627 -1265467
3177 -1265467 -1206815 -1204913 -1337276 -1192709 -1243643 -1209608 -1264869 -1242720 -1215036 -1194044 -1114696
3166 -1114696 -1272424 -1313807 -1362198 -1198662 -1216657 -1260646 -1254123 -1247639 -1174317 -1249885 -1272953
3155 -1272953 -1268711 -1207318 -1259496 -1300976 -1232890 -1341727 -1280916 -1211824 -1219906 -1284577 -1327423 -1321711
$$ packed form
3235a138335K1872j512L947j6644j29803P3279J0553l042n4888L8613J7333P7669
3223a100958o0815M164m2141m5758o993K1894J5660O9396p245m7034O5843j27293
3211a261280J13610L0060p5197p9024J40894j27460N6299n1235k0159P9569j0192
3200a204115M4730q4140K4639J8377K0111M3366n6972L133r5305N8941m7102m4427
3188a318764P6908k4311K3366K6509Q5883l7201k7302j35427J37877N7835j30840
3177a265467N8652J902j32363J44567n0934L4035n5261K2149K7684K0992P9348
3166a114696j57728m1383m8391J63536j7995m3989O523O484P3322p5568k3068
3155a272953M242O1393n2178m1480O8086j08837O0811O9092q082o4671m2846N712
$$ plain form
3143 -1321711 -1225337 -1269328 -1284884 -1301158 -1299948 -1290144 -1318054 -1200112 -1278096 -1317031 -1217530 -1359533
3131 -1359533 -1353886 -1284854 -1338850 -1338180 -1247991 -1282834 -1311439 -1338273 -1283668 -1361346 -1353797 -1286472
3119 -1286472 -1303160 -1250880 -1312738 -1371857 -1331944 -1259145 -1350350 -1346476 -1318656 -1268976 -1270406 -1299063
3107 -1299063 -1339963 -1260871 -1244564 -1332898 -1266465 -1345442 -1277949 -1380762 -1376442 -1288345 -1316779
3096 -1316779 -1319482 -1318857 -1317636 -1319220 -1342430 -1280177 -1294348 -1335094 -1219919 -1285306 -1327638 -1308021
3084 -1308021 -1341319 -1311645 -1321719 -1306681 -1264808 -1254093 -1317293 -1405137 -1433285 -1339301 -1287929
3073 -1287929 -1347635 -1274050 -1302372 -1316202 -1330450 -1306247 -1354033 -1346566 -1294146 -1392710 -1338633 -1308840
3061 -1308840 -1354691 -1397114 -1391478 -1315460 -1325418 -1341763 -1334931 -1310899 -1307575 -1337110 -1335818 -1351259
$$ packed form
3143a321711R6374m3991j5556j6274J210R804k7910J17942p7984l8935R9501j42003
3131a359533N647O9032n3996O70R0189l4843k8605k6834N4605p7678P549O7325
3119a286472j6688N2280o1858n9119L9913P2799r1205L874K7820M9680j430k8657
3107a299063m0900P9092J6307q8334O6433p8977O7493j02813M320Q8097k8434
3096a316779k703O25J221j584k3210O2253j4171m0746J15175o5387m2332J9617
3084a308021l3298K9674j0074J5038M1873J0715o3200q7844k8148R3984N1372
3073a287929n9706P3585k8322j3830j4248K4203m7786P467N2420r8564N4077K9793
3061a308840m5851m2423N636P6018r958j6345O832K4032L324k9535J292j5441
$$ plain form
3049 -1351259 -1330675 -1283942 -1355748 -1255878 -1326296 -1261331 -1365321 -1397993 -1342223 -1393526 -1461361
3038 -1461361 -1343843 -1288405 -1296786 -1329724 -1313767 -1437467 -1422723 -1353837 -1314401 -1287404 -1349207
3027 -1349207 -1303990 -1411725 -1309305 -1366377 -1327040 -1303359 -1353464 -1385361 -1359875 -1423050 -1448861
3016 -1448861 -1375772 -1376473 -1373461 -1363812 -1387768 -1362703 -1472315 -1386412 -1351824 -1385697 -1351775 -1422585
3004 -1422585 -1295971 -1310866 -1420764 -1367732 -1351127 -1337302 -1358241 -1373804 -1365390 -1478711 -1372568
2993 -1372568 -1273229 -1356644 -1454827 -1364789 -1335677 -1388529 -1376397 -1452027 -1335135 -1371327 -1415617
2982 -1415617 -1438554 -1432330 -1370106 -1443195 -1349367 -1467564 -1328908 -1341945 -1460271 -1351902 -1364240
2971 -1364240 -1427878 -1322404 -1416673 -1321107 -1288870 -1408094 -1388341 -1287776 -1421733 -1380020 -1351974
$$ packed form
3049a351259K0584M6733p1806R9870p0418O4965j03990l2672N5770n1303o7835
3038a461361J17518N5438q381l2938J5957j23700J4744O8886L9436K6997o1803
3027a349207M5217j07735J02420n7072L9337K3681n0105l1897K5486o3175k5811
3016a448861P3089p01L012R649k3956K5065j09612Q5903L4588l3873L3922p0810
3004a422585J26614j4895j09898N3032J6605J3825k0939j5563Q414j13321J06143
2993a372568R9339q3415r8183R0038K9112n2852J2132p5630J16892l6192m4290
2982a415617k2937O224O2224p3089R3828j18197J38656j3037j18326J08369j2338
2971a364240o3638J05474r4269R5566L2237j19224J9753J00565j33957M1713K8046
$$ plain form
2960 -1351974 -1411407 -1385083 -1405199 -1323333 -1395669 -1475585 -1384547 -1377283 -1423039 -1432565 -1395089 -1418520
2948 -1418520 -1368745 -1529391 -1431914 -1489699 -1342493 -1411202 -1445675 -1332591 -1380646 -1368835 -1439824
2937 -1439824 -1438018 -1441373 -1482215 -1314267 -1400651 -1433467 -1419618 -1380860 -1499426 -1437602 -1385732
2926 -1385732 -1387599 -1391928 -1466707 -1455375 -1579914 -1440640 -1457183 -1475402 -1469491 -1450486 -1465429 -1430454
2914 -1430454 -1401042 -1451748 -1468873 -1472665 -1388560 -1405163 -1416449 -1461661 -1395110 -1457674 -1383183 -1437610
2902 -1437610 -1466158 -1452501 -1478869 -1440382 -1458860 -1471995 -1588074 -1413165 -1455891 -1487774 -1464885
2891 -1464885 -1449053 -1499117 -1501623 -1509760 -1498460 -1512091 -1500908 -1471728 -1438007 -1404886 -1485869 -1423999
2879 -1423999 -1462882 -1448727 -1515007 -1433927 -1456373 -1375114 -1479679 -1501568 -1463775 -1489091 -1474925
$$ packed form
2960a351974n9433K6324k0116Q1866p2336p9916R1038P264m5756r526L7476k3431
2948a418520M9775j60646R7477n7785J47206o8709l4473J13084m8055J1811p0989
2937a439824J806l355m0842J67948q6384l2816J3849L8758j18566O1824N1870
2926a385732j867m329p4779J1332j24539J39274j6543j8219N911J9005j4943L4975
2914a430454K9412n0706j7125l792Q4105j6603j1286m5212O6551o2564P4491n4427
2902a437610k8548J3657k6368L8487j8478j3135j16079J74909m2726l1883K2889
2891a464885J5832n0064k506q137J1300j3631J1183K9180L3721L3121q0983O1870
2879a423999l8883J4155o6280Q1080k2446Q1259j04565k1889L7793k5316J4166
$$ plain form
2868 -1474925 -1456314 -1463771 -1493077 -1491324 -1383244 -1459957 -1415137 -1471230 -1480245 -1464845 -1504810 -1453715
2856 -1453715 -1387797 -1514434 -1429401 -1489693 -1591868 -1481043 -1402704 -1483361 -1502960 -1599338 -1452447
2845 -1452447 -1566202 -1466803 -1472373 -1495890 -1427972 -1529013 -1430809 -1423282 -1541145 -1474420 -1431682
2834 -1431682 -1392879 -1542694 -1453118 -1473557 -1487639 -1418335 -1554900 -1500184 -1509024 -1521996 -1529932
2823 -1529932 -1431271 -1369293 -1492503 -1515872 -1447541 -1497465 -1501433 -1532082 -1522605 -1570248 -1540277 -1514916
2811 -1514916 -1435301 -1503355 -1445390 -1414037 -1452672 -1396174 -1507396 -1531482 -1444666 -1526078 -1431863
2800 -1431863 -1473847 -1461689 -1490156 -1510932 -1533628 -1423631 -1470965 -1518689 -1471064 -1488901 -1486307
2789 -1486307 -1532363 -1617849 -1477810 -1498506 -1507022 -1531112 -1428467 -1436659 -1496229 -1482121 -1422457
$$ packed form
2868a474925J8611p457k9306J753J08080p6713M4820n6093r015J5400l9965N1095
2856a453715O5918j26637Q5033o0292j02175J10825P8339q0657j9599r6378J46891
2845a452447j13755R9399n570k3517O7918j01041R8204P527j17863O6725M2738
2834a431682L8803j49815Q9576k0439j4082O9304j36565N4716q840j2972p936
2823a529932R8661O1978j23210k3369O8331m9924l968l0649R477m7643K9971K5361
2811a514916P9615o8054N7965L1353l8635N6498j11222k4086Q6816q1412R4215
2800a431863m1984J2158k8467k0776k2696J09997m7334m7724M7625j7837K594
2789a486307m6056q5486J40039k0696q516k4090J02645q192n9570J4108N9664
$$ plain form
2778 -1422457 -1504740 -1436081 -1435127 -1459569 -1467129 -1520916 -1430385 -1557753 -1416166 -1415134 -1513680 -1487152
2766 -1487152 -1423932 -1532488 -1480953 -1532453 -1417184 -1526179 -1505254 -1510635 -1534271 -1465940 -1478081
2755 -1478081 -1575308 -1519197 -1452610 -1504066 -1484208 -1553305 -1529923 -1473124 -1545672 -1525979 -1515306
2744 -1515306 -1470464 -1450161 -1535217 -1504327 -1477624 -1442366 -1539731 -1522989 -1500538 -1515163 -1520051 -1491208
2732 -1491208 -1425944 -1510848 -1452896 -1441586 -1452591 -1476674 -1503100 -1497592 -1423124 -1525497 -1549387
2721 -1549387 -1640214 -1429094 -1522092 -1587100 -1505560 -1530186 -1546468 -1497459 -1538780 -1426955 -1520283
2710 -1520283 -1603480 -1381630 -1514929 -1496851 -1557520 -1450151 -1542666 -1521682 -1474413 -1584457 -1476194
2699 -1476194 -1339000 -1568315 -1494481 -1469305 -1525841 -1526638 -1507406 -1631080 -1530966 -1516379 -1478889
$$ packed form
2778a422457q2283O8659R54k4442p560n3787R0531j27368J41587J032r8546K6528
2766a487152O3220j08556N1535n1500J15269j08995K0925n381k3636O8331j2141
2755a478081r7227N6111O6587n1456J9858o9097K3382N6799p2548J9693J0673
2744a515306M4842K0303q5056L0890K6703L5258r7365J6742K2451j4625m888K8843
2732a491208O5264q4904N7952J1310j1005k4083k6426N508P4468j02373k3890
2721a549387r0827K11120r2998o5008Q1540k4626j6282M9009m1321J11825r3328
2710a520283q3197K21850j33299J8078o0669J07369r2515K0984M7269j10044J08263
2699a476194J37194k29315P3834K5176n6536p97J9232j23674J00114J4587L7490
$$ plain form
2688 -1478889 -1454837 -1480361 -1576360 -1519428 -1546239 -1526933 -1405264 -1519121 -1533083 -1578230 -1518092
2677 -1518092 -1518431 -1488418 -1441045 -1471875 -1477807 -1542350 -1495153 -1518502 -1370234 -1462087 -1546532 -1543137
2665 -1543137 -1486238 -1538296 -1473568 -1505103 -1445792 -1529263 -1531420 -1417431 -1579472 -1563736 -1572910
2654 -1572910 -1500354 -1562551 -1616142 -1495969 -1479341 -1472492 -1548522 -1502627 -1459612 -1557261 -1492274
2643 -1492274 -1562760 -1587669 -1571333 -1469126 -1654588 -1556515 -1540014 -1551496 -1528333 -1333663 -1487160
2632 -1487160 -1559836 -1615958 -1524654 -1571169 -1530125 -1527098 -1620556 -1558978 -1501966 -1573049 -1556993 -1543423
2620 -1543423 -1502939 -1527215 -1554028 -1548024 -1523875 -1485177 -1467632 -1580590 -1581090 -1637234 -1626929 -1617568
2608 -1617568 -1550738 -1534975 -1567117 -1573759 -1676001 -1525309 -1579083 -1518949 -1554516 -1590188 -1544130
$$ packed form
2688a478889K4052k5524r5999N6932k6811J9306J21669j13857j3962m5147O0138
2677a518092l39L0013M7373l0830n932o4543M7197k3349J48268r1853q4445L395
2665a543137N6899n2058O4728l1535N9311q3471k157J13989j62041J5736r174
2654a572910P2556o2197n3591J20173J6628O849p6030M5895M3015r7649O4987
2643a492274p0486k4909J6336J02207j85462R8073J6501j1482K3163J94670j53497
2632a487160p2676n6122R1304m6515M1044L027r3458O1578N7012p1083J6056J3570
2620a543423M0484k4276k6813O004K4149L8698J7545j12958n00n6144J0305R361
2608a617568O6830J5763l2142o642j02242J50692n3774O0134l5567l5672M6058
$$ plain form
2597 -1544130 -1590684 -1616814 -1513065 -1485691 -1558988 -1558373 -1604679 -1653502 -1478071 -1661569 -1612233
2586 -1612233 -1518344 -1570483 -1536247 -1518932 -1501961 -1660312 -1517746 -1632010 -1486045 -1561970 -1483912
2575 -1483912 -1507296 -1571417 -1555994 -1527468 -1627698 -1453760 -1504678 -1436860 -1545290 -1564012 -1470242
2564 -1470242 -1522566 -1590917 -1460311 -1626964 -1655046 -1525133 -1595077 -1512910 -1417853 -1558319 -1502824
2553 -1502824 -1579256 -1491360 -1503456 -1481582 -1590600 -1577641 -1503811 -1550988 -1610238 -1533320 -1491785
2542 -1491785 -1567605 -1542043 -1566403 -1563974 -1497922 -1503976 -1547091 -1538695 -1597885 -1583355 -1632948 -1598867
2530 -1598867 -1617118 -1559668 -1659832 -1430654 -1526099 -1568193 -1539161 -1614840 -1498814 -1571834 -1621650
2519 -1621650 -1514374 -1523334 -1604989 -1618692 -1563713 -1584124 -1644388 -1524479 -1573740 -1530447 -1509368
$$ packed form
2597a544130m6554k6130J03749K7374p3297O15m6306m8823J75431j83498M9336
2586a612233R3889n2139L4236J7315J6971j58351J42566j14264J45965p5925P8058
2575a483912k3384o4121J5423K8526j00230J73938n0918O7818j08430j8722R3770
2564a470242n2324o8351J30606j66653k8082J29913o9944Q2167R5057j40466N5495
2553a502824p6432Q7896j2096K1874j09018J2959P3830m7177n9250P6918M1535
2542a491785p5820K5562k4360K429O6052o054m3115Q396n9190J4530m9593L4081
2530a598867j8251N7450j00164K29178r5445m2094K9032p5679J16026p3020m9816
2519a621650J07276q960q1655j3703N4979k0411o0264J19909m9261M3293K1079
$$ plain form
2508 -1509368 -1510665 -1581075 -1517825 -1636048 -1496867 -1559220 -1670675 -1544859 -1560412 -1600651 -1517241
2497 -1517241 -1555389 -1599714 -1528033 -1597471 -1602758 -1588843 -1503085 -1590206 -1543498 -1460356 -1519750 -1596708
2485 -1596708 -1561418 -1494927 -1591834 -1545192 -1564268 -1493377 -1492908 -1506870 -1431375 -1475685 -1585295 -1586469
2473 -1586469 -1516184 -1589097 -1618010 -1624372 -1653219 -1532734 -1503504 -1630258 -1561132 -1667608 -1583221
2462 -1583221 -1579235 -1649921 -1594807 -1598205 -1483327 -1522284 -1673301 -1609186 -1613658 -1477887 -1576930
2451 -1576930 -1486510 -1582577 -1512855 -1475189 -1596169 -1565122 -1612417 -1586810 -1639726 -1508798 -1575673
2440 -1575673 -1668887 -1503472 -1566272 -1557140 -1695083 -1574084 -1631031 -1622029 -1581007 -1537651 -1568167
2429 -1568167 -1564006 -1511531 -1602641 -1633838 -1636682 -1608278 -1567948 -1549348 -1462703 -1670745 -1631971 -1540265
$$ packed form
2508a509368j297p0410O3250j18223J39181o2353j11455J25816j5553m0239Q3410
2497a517241l8148m4325P1681o9438n287J3915Q5758q7121M6708Q3142n9394p6958
2485a596708L5290O6491r6907M6642j9076P0891M69j3962P5495m4310j09610j174
2473a586469P0285p2913k8913o362k8847J20485K9230j26754O9126j06476Q4387
2462a583221L986p0686N5114l398J14878l8957j51017O4115m472J35771r9043
2451a576930R0420r6067O9722L7666j20980L1047m7295K5607n2916J30928o6875
2440a575673r3214J65415o2800R132j37943J20999n6947R002M1022M3356l0516
2429a568167M161N2475r1110l1197k844K8404M0330J8600Q6645k08042L8774R1706
$$ plain form
2417 -1540265 -1610852 -1612511 -1602282 -1448716 -1608056 -1511020 -1539049 -1530289 -1598218 -1566729 -1644731
2406 -1644731 -1586122 -1583328 -1646638 -1545150 -1575506 -1602420 -1590074 -1564363 -1527137 -1599246 -1618034
2395 -1618034 -1604504 -1651965 -1597303 -1561007 -1508582 -1530683 -1547264 -1591389 -1538933 -1513274 -1629113
2384 -1629113 -1586001 -1585565 -1636958 -1624605 -1503356 -1705658 -1660350 -1481566 -1555776 -1541333 -1519621
2373 -1519621 -1473906 -1632180 -1511975 -1601780 -1584685 -1625252 -1582842 -1590492 -1530777 -1572285 -1586895
2362 -1586895 -1656170 -1571317 -1532202 -1617503 -1619935 -1602551 -1547841 -1497174 -1608859 -1596987 -1688807
2351 -1688807 -1553012 -1516265 -1548744 -1492136 -1616416 -1519983 -1564513 -1667295 -1664188 -1589139 -1554705
2340 -1554705 -1634616 -1548999 -1623210 -1560870 -1560001 -1597399 -1574728 -1641458 -1543516 -1658694 -1655717 -1577864
$$ packed form
2417a540265p0587j659J0229J53566j59340R7036k8029Q760o7929L1489p8002
2406a644731N8609K794o3310J01488l0356k6914J2346K5711L7226p2109j8788
2395a618034J3530m7461N4662L6296N2425k2101j6581m4125N2456K5659j15839
2384a629113M3112M36n1393J2353J21249k02302M5308J78784p4210J4443K1712
2373a519621M5715j58274J20205q9805J7095m0567M2410p650N9715m1508j4610
2362a586895o9275Q4853L9115q5301k432J7384N4710N0667j11685J1872r1820
2351a688807J35795L6747l2479N6608j24280R6433m4530j02782L107P5049L4434
2340a554705p9911Q5617p4211O2340Q69l7398K2671o6730R7942j15178K977P7853
$$ plain form
2328 -1577864 -1623255 -1637042 -1628601 -1638947 -1634400 -1576508 -1597845 -1594299 -1622993 -1604809 -1607969 -1500149
2316 -1500149 -1583438 -1526378 -1676436 -1552609 -1665902 -1655719 -1598233 -1500393 -1664421 -1581296 -1589523
2305 -1589523 -1590376 -1600479 -1682495 -1630253 -1559511 -1588239 -1625965 -1488601 -1544482 -1650909 -1617067
2294 -1617067 -1622858 -1587372 -1507908 -1610936 -1631794 -1620525 -1664843 -1578569 -1613981 -1552906 -1618801
2283 -1618801 -1619430 -1571465 -1577618 -1603259 -1564039 -1612241 -1657572 -1631469 -1645751 -1565612 -1507533 -1576362
2271 -1576362 -1678493 -1707054 -1528111 -1541275 -1593707 -1540896 -1576174 -1483377 -1657381 -1555705 -1656773
2260 -1656773 -1687309 -1680448 -1577267 -1618906 -1580727 -1593781 -1585954 -1539464 -1572232 -1652458 -1644365 -1623584
2248 -1623584 -1660589 -1604630 -1581016 -1570953 -1596636 -1693472 -1608001 -1563058 -1573530 -1597171 -1564001
$$ packed form
2328a577864m5391j3787Q441j0346M547N7892k1337L546k8694J8184l160J07820
2316a500149q3289N7060j50058J23827j13293J0183N7486R7840j64028Q3125q227
2305a589523q53j0103q2016N2242P0742k8728l7726J37364n5881j06427L3842
2294a617067n791L5486P9464j03028k0858J1269m4318Q6274l5412O1075o5895
2283a618801o29M7965o153k5641L9220m8202m5331K6103j4282Q0139N8079o8829
2271a576362j02131k8561J78943j3164n2432N2811l5278R2797j74004J01676j01068
2260a656773l0536O861J03181m1639L8179j3054P827M6490l2768q0226Q093K0781
2248a623584l7005N5959K3614J0063k5683r6836Q5471M4943j0472k3641L3170
$$ plain form
2237 -1564001 -1605139 -1526802 -1660512 -1583100 -1503806 -1589219 -1591574 -1535344 -1598506 -1549234 -1553257 -1599202
2225 -1599202 -1590830 -1602429 -1624195 -1692347 -1474877 -1641280 -1599051 -1571442 -1623023 -1526552 -1721177
2214 -1721177 -1557278 -1523884 -1684628 -1596626 -1554256 -1582566 -1573449 -1559307 -1631256 -1500733 -1571044
2203 -1571044 -1544929 -1689232 -1631396 -1566686 -1599403 -1605855 -1503134 -1598929 -1583198 -1605146 -1562863
2192 -1562863 -1662705 -1673868 -1572371 -1593684 -1553144 -1592204 -1522550 -1601943 -1523389 -1562606 -1654072
2181 -1654072 -1607686 -1649660 -1585494 -1597594 -1616932 -1613088 -1656022 -1620942 -1599306 -1626718 -1620533 -1610818
2169 -1610818 -1643629 -1674843 -1553482 -1602562 -1540935 -1633362 -1664030 -1639607 -1578790 -1649265 -1611089
2158 -1611089 -1559160 -1612759 -1488261 -1567563 -1612798 -1635749 -1588614 -1647782 -1578938 -1534215 -1640038
$$ packed form
2237a564001m1138P8337j33710P7412P9294q5413k355N6230o3162M9272m023m5945
2225a599202Q372j1599k1766o8152K17470j66403M2229K7609n1581R6471j94625
2214a721177J63899L3394j60744Q8002M2370k8310R117J4142p1949J30523p0311
2203a571044K6115j44303N7836O4710l2717o452J02721r5795J5731k1948M2283
2192a562863r9842j1163J01497k1313M0540l9060O9654p9393P8554l9217r1466
2181a654072M6386m1974O4166j2100j9338L844m2934L5080K1636k7412O185R715
2169a610818l2811l1214J21361m9080O1627r2427l0668K4423O0817p0475L8176
2158a611089N1929n3599J24498p9302m5235k2951M7135n9168O8844M4723j05823
$$ plain form
2147 -1640038 -1657616 -1544738 -1592451 -1602922 -1631469 -1623522 -1684876 -1626601 -1572920 -1612970 -1590821
2136 -1590821 -1635017 -1610604 -1697815 -1513042 -1533642 -1637421 -1688589 -1530997 -1633997 -1605340 -1680134
2125 -1680134 -1708946 -1544394 -1595373 -1531017 -1554451 -1596528 -1617487 -1502089 -1682359 -1649767 -1607752
2114 -1607752 -1551571 -1639105 -1606375 -1576456 -1634733 -1749073 -1559603 -1658975 -1599937 -1574478 -1509593
2103 -1509593 -1617326 -1580093 -1738285 -1626378 -1683058 -1672553 -1653993 -1583266 -1672153 -1654325 -1696865
2092 -1696865 -1667508 -1658336 -1645016 -1662751 -1627803 -1549156 -1660848 -1690658 -1665572 -1591641 -1572370
2081 -1572370 -1513642 -1576668 -1571120 -1600369 -1572375 -1621209 -1585936 -1543677 -1638173 -1550363 -1622154 -1638766
2069 -1638766 -1688876 -1591013 -1632616 -1504590 -1681252 -1643352 -1681520 -1624683 -1603573 -1660112 -1633881
$$ packed form
2147a640038j7578J12878m7713j0471k8547P947o1354N8275N3681m0050K2149
2136a590821m4196K4413q7211J84773k0600j03779n1168J57592j03000K8657p4794
2125a680134k8812J64552n0979O4356k3434m2077k0959J15398j80270L2592M2015
2114a607752N6181q7534L2730K9919n8277j14340J89470r9372N9038K5459O4885
2103a509593j07733L7233j58192J11907n6680J0505J8560P0727q8887J7828m2540
2092a696865K9357R172J3320j7735L4948P8647j11692k9810K5086P3931J9271
2081a572370N8728o3026N548k9249K7994m8834L5273M2259r4496Q7810p1791j6612
2069a638766n0110R7863m1603J28026j76662L7900l8168N6837K1110n6539K6231
$$ plain form
2058 -1633881 -1629636 -1655890 -1643616 -1710795 -1639132 -1700481 -1683563 -1671883 -1564610 -1588635 -1527819
2047 -1527819 -1637546 -1629391 -1607309 -1582233 -1647310 -1594510 -1677619 -1639159 -1525771 -1575698 -1589248
2036 -1589248 -1656155 -1645338 -1664957 -1599618 -1601343 -1586445 -1644007 -1643590 -1526352 -1554076 -1605417 -1461360
2024 -1461360 -1624634 -1593681 -1683731 -1606464 -1597026 -1640564 -1646544 -1595464 -1630256 -1572253 -1705487
2013 -1705487 -1584742 -1637325 -1603499 -1607396 -1650440 -1549871 -1679411 -1625317 -1619493 -1547053 -1664963
2002 -1664963 -1633260 -1523195 -1653341 -1612234 -1659432 -1559703 -1565491 -1646066 -1589420 -1587847 -1617167
1991 -1617167 -1608366 -1590789 -1556155 -1625200 -1540438 -1550168 -1619779 -1633793 -1679714 -1625222 -1588718 -1618431
1979 -1618431 -1631836 -1648418 -1589119 -1557829 -1592126 -1662210 -1679255 -1636800 -1723895 -1606273 -1550577
$$ packed form
2058a633881M245k6254J2274o7179P1663o1349J6918J1680J07273k4025O0816
2047a527819j09727Q155K2082K5076o5077N2800q3109L8460J13388m9927j3550
2036a589248o6907J0817j9619O5339j725J4898n7562M17J17238k7724n1341J44057
2024a461360j63274L0953r0050P7267R438m3538n980N1080l4792N8003j33234
2013a705487J20745n2583L3826l897m3044J00569j29540N4094N824P2440j17910
2002a664963L1703J10065j30146M1107m7198R9729n788q0575N6646J573k9320
1991a617167Q801J7577L4634o9045Q4762r730o9611j4014m5921N4492L6504k9713
1979a618431j3405j6582N9299L1290l4297p0084j7045M2455q7095J17622N5696
$$ plain form
1968 -1550577 -1612666 -1664949 -1549612 -1730606 -1608766 -1603303 -1650302 -1574018 -1627647 -1640308 -1618947
1957 -1618947 -1623000 -1677283 -1599625 -1619231 -1591233 -1584891 -1551323 -1586152 -1599049 -1620004 -1612513 -1656433
1945 -1656433 -1548899 -1647076 -1645744 -1631825 -1689666 -1567336 -1602181 -1550695 -1561693 -1602304 -1566396
1934 -1566396 -1600620 -1574328 -1616072 -1489076 -1583622 -1660816 -1608570 -1631794 -1557841 -1718340 -1645131
1923 -1645131 -1669580 -1629012 -1637741 -1575771 -1645285 -1672856 -1608195 -1588238 -1685471 -1642309 -1674927 -1620069
1911 -1620069 -1500758 -1642241 -1627446 -1587150 -1550527 -1639769 -1683336 -1598820 -1595880 -1690924 -1712724
1900 -1712724 -1623841 -1526581 -1584937 -1689398 -1709579 -1503249 -1534204 -1618220 -1606121 -1612766 -1579048
1889 -1579048 -1524331 -1594955 -1561927 -1610775 -1680442 -1585333 -1641533 -1679495 -1648881 -1611591 -1718678
$$ packed form
1968a550577o2089n2283J15337j80994J21840N463m6999P6284n3629j2661K1361
1957a618947m053n4283P7658j9606K7998O342L3568l4829j2897k0955P491m3920
1945a656433J07534r8177J332J3919n7841J22330l4845N1486j0998m0611L5908
1934a566396l4224K6292m1744J26996r4546p7194N2246k3224P3953j60499P3209
1923a645131k4449M0568q729O1970o9514k7571O4661J9957r7233M3162l2618N4858
1911a620069J19311j41483J4795M0296L6623q9242m3567Q4516K940r5044k1800
1900a712724Q8883R7260n8356j04461k0181K06330l0955q4016J2099o645L3718
1889a579048N4717p0624L3028m8848o9667R5109n6200l7962L0614L7290j07087
$$ plain form
1878 -1718678 -1586556 -1612754 -1570685 -1645269 -1651091 -1528600 -1720552 -1649922 -1674353 -1676617 -1622285
1867 -1622285 -1666816 -1571900 -1685787 -1670199 -1712343 -1608034 -1667556 -1582324 -1638008 -1598302 -1646058
1856 -1646058 -1640577 -1621696 -1626499 -1606309 -1638446 -1692918 -1638830 -1670463 -1598333 -1589262 -1590693 -1690859
1844 -1690859 -1658952 -1592831 -1725277 -1614101 -1640698 -1685440 -1662322 -1605790 -1658901 -1722168 -1609572
1833 -1609572 -1677283 -1689748 -1553665 -1586533 -1673662 -1634782 -1590008 -1548844 -1683732 -1639879 -1654905
1822 -1654905 -1568356 -1649728 -1685642 -1528714 -1561415 -1626662 -1567211 -1654032 -1644265 -1650580 -1678306 -1632389
1810 -1632389 -1505853 -1631675 -1565688 -1627879 -1620547 -1619084 -1576342 -1646837 -1648414 -1604277 -1596144 -1533596
1798 -1533596 -1708416 -1595552 -1633832 -1643855 -1645661 -1613388 -1655276 -1604817 -1619842 -1620129 -1759137
$$ packed form
1878a718678J32122k6198M2069p4584n822J22491j91952P0630k4431k264N4332
1867a622285m4531R4916j13887J5588m2144J04309n9522Q5232n5684L9706m7756
1856a646058N481J8881m803K0190l2137n4472N4088l1633P2130R071j431j00166
1844a690859L1907O6121j32446J11176k6597m4742K3118N6532n3111o3267J12596
1833a609572o7711j2465J36083l2868q7129L8880M4774M1164j34888M3853j5026
1822a654905Q6549q1372l5914J56928l2701o5247N9451q6821R767o315k7726M5917
1810a632389J26536j25822O5987o2191P332J463M2742p0495j577M4137Q133O2548
1798a533596j74820J12864l8280j0023j806L2273m1888N0459j5025k87j39008
$$ plain form
1787 -1759137 -1748706 -1684234 -1575055 -1621000 -1658385 -1561384 -1670738 -1590524 -1525059 -1565341 -1677665
1776 -1677665 -1628848 -1636546 -1633182 -1654060 -1662474 -1585995 -1511264 -1579136 -1622106 -1679788 -1688311 -1587003
1764 -1587003 -1632657 -1618011 -1593647 -1492796 -1555196 -1669740 -1698301 -1563728 -1634346 -1550893 -1662863
1753 -1662863 -1539128 -1543592 -1568644 -1588258 -1583473 -1611878 -1648449 -1635056 -1581746 -1611494 -1702075 -1621603
1741 -1621603 -1494138 -1532666 -1558457 -1646072 -1634067 -1580702 -1623474 -1662056 -1592525 -1638714 -1623029
1730 -1623029 -1586367 -1603837 -1633307 -1634055 -1721513 -1635768 -1578068 -1653014 -1661252 -1585123 -1678252 -1646389
1718 -1646389 -1676137 -1572112 -1656216 -1623970 -1599426 -1637857 -1681341 -1598497 -1675084 -1645108 -1620868
1707 -1620868 -1608672 -1660823 -1614247 -1644182 -1635033 -1638047 -1526724 -1646583 -1585881 -1560663 -1584185
$$ packed form
1787a759137J0431O4472J09179m5945l7385R7001j09354Q0214O5465m0282j12324
1776a677665M8817p698L364k0878q414P6479P4731o7872m2970n7682q523J01308
1764a587003m5654J4646K4364J00851o2400j14544k8561J34573p0618Q3453j11970
1753a662863J23735m464k5052j9614M785k8405l6571J3393N3310k9748r0581Q0472
1741a621603J27465l8528k5791q7615J2005N3365m2772l8582O9531m6189J5685
1730a623029L6662j7470k9470p48q7458Q5745N7700p4946q238P6129r3129L1863
1718a646389k9748J04025q4104L2246K4544l8431m3484Q2844p6587K9976K4240
1707a620868J2196n2151M6576k9935R149l014J11323j19859O0702K5218k3522
$$ plain form
1696 -1584185 -1676148 -1512247 -1517123 -1533828 -1562840 -1634612 -1641114 -1661937 -1590391 -1616046 -1601048 -1690217
1684 -1690217 -1636612 -1505310 -1643261 -1652416 -1708251 -1651671 -1673370 -1729171 -1634469 -1635703 -1638160 -1629959
1672 -1629959 -1574736 -1702380 -1576073 -1630412 -1651785 -1564026 -1605151 -1681097 -1672663 -1611123 -1594968
1661 -1594968 -1678723 -1707422 -1629903 -1702150 -1592909 -1703689 -1603426 -1702508 -1696484 -1639262 -1648986
1650 -1648986 -1667428 -1618256 -1599869 -1554448 -1600335 -1624554 -1702341 -1572498 -1659857 -1617860 -1608246
1639 -1608246 -1627024 -1598240 -1616016 -1621877 -1591538 -1627200 -1611752 -1601719 -1670418 -1589393 -1687353 -1570064
1627 -1570064 -1755529 -1654957 -1675467 -1542612 -1602303 -1679462 -1614190 -1703668 -1625522 -1667713 -1727812
1616 -1727812 -1688187 -1604023 -1553719 -1731900 -1606521 -1560112 -1570753 -1647072 -1694256 -1635354 -1621082
$$ packed form
1696a584185r1963J63901m876j6705k9012p1772o502k0823P1546k5655J4998q9169
1684a690217N3605J31302j37951r155n5835N6580k1699n5801R4702j234k457Q201
1672a629959N5223j27644J26307n4339k1373Q7759m1125p5946Q434O1540J6155
1661a594968q3755k8699P7519p2247J09241j10780J00263r9082O024N7222r724
1650a648986j8442M9172J8387M5421m5887k4219p7787J29843q7359M1997R614
1639a608246j8778K8784j7776n861L0339l5662J5448J0033o8699Q1025r7960J17289
1627a570064j85465J00572k0510J32855n9691p7159O5272q9478P8146m2191o0099
1616a727812L9625Q4164N0304j78181J25379M6409j0641p6319m7184N8902J4272
$$ plain form
1605 -1621082 -1532781 -1642453 -1659556 -1568395 -1645593 -1691393 -1664337 -1574314 -1629908 -1613456 -1648928
1594 -1648928 -1576753 -1650509 -1660928 -1607768 -1659709 -1607306 -1707393 -1601078 -1679042 -1525005 -1642184
1583 -1642184 -1658913 -1641730 -1662327 -1582508 -1580269 -1578338 -1584616 -1617062 -1554454 -1623853 -1637705 -1570732
1571 -1570732 -1637695 -1703306 -1641627 -1614361 -1572084 -1500001 -1562046 -1618492 -1597413 -1664496 -1552254
1560 -1552254 -1591090 -1668592 -1649850 -1689192 -1662576 -1612848 -1646305 -1572510 -1650004 -1616946 -1618331 -1596213
1548 -1596213 -1700218 -1773334 -1646371 -1633793 -1629553 -1679083 -1573959 -1615728 -1595459 -1659005 -1625764
1537 -1625764 -1554808 -1618402 -1642199 -1636062 -1642844 -1660339 -1697118 -1641758 -1543244 -1719567 -1671960 -1596193
1525 -1596193 -1610322 -1771548 -1726357 -1577064 -1640724 -1595028 -1611751 -1614207 -1623686 -1598094 -1680956
$$ packed form
1605a621082Q8301j09672j7103R1161p7198m5800K7056R0023n5594J6452l5472
1594a648928P2175p3756j0419N3160n1941N2403j00087J06315p7964J54037j17179
1583a642184j6729J7183k0597P9819K239J931o278l2446O2608o9399j3852O6973
1571a570732o6963o5611O1679K7266M2277P2083o2045n6446K1079o7083J12242
1560a552254l8836p7502J8742l9342K6616M9728l3457P3795p7494L3058j385K2118
1548a596213j04005p3116J26963J2578M240m9530J05124m1769K0269o3546L3241
1537a625764P0956o3594k3797O137o782j7495l6779N5360R8514j76323M7607P5767
1525a596193j4129j61226M5191J49293o3660M5696j6723k456r479K5592q2862
$$ plain form
1514 -1680956 -1701094 -1644076 -1670395 -1731053 -1665826 -1616263 -1644284 -1579824 -1580579 -1624610 -1660024 -1683428
1502 -1683428 -1574184 -1753937 -1638825 -1690677 -1604608 -1681668 -1605625 -1687678 -1550174 -1700887
1492 -1700887 -1606699 -1590935 -1717329 -1652610 -1658984 -1635141 -1579447 -1609566 -1655596 -1632553 -1599373
1481 -1599373 -1605671 -1654669 -1575254 -1643767 -1686759 -1621330 -1609965 -1570431 -1733526 -1523578 -1618936
1470 -1618936 -1613086 -1617717 -1621922 -1656728 -1603487 -1593749 -1597155 -1655131 -1579177 -1603747 -1553474 -1632322
1458 -1632322 -1712086 -1721338 -1675457 -1717725 -1597499 -1719797 -1679726 -1659896 -1649707 -1619548 -1677078
1447 -1677078 -1570329 -1636462 -1537191 -1669334 -1733335 -1684126 -1696170 -1684133 -1608261 -1592021 -1577186
1436 -1577186 -1649275 -1552711 -1616373 -1597016 -1582814 -1655542 -1595239 -1610116 -1583646 -1623683 -1569038
$$ packed form
1514a680956k0138N7018k6319o0658O5227M9563k8021O4460p55m4031l5414k3404
1502a683428J09244j79753J15112n1852Q6069p7060P6043q2053J37504j50713
1492a700887R4188J5764j26394O4719o374K3843N5694l0119m6030K3043L3180
1481a599373o298m8998P9415o8513m2992O5429J1365L9534j63095K09948r5358
1470a618936N850m631m205l4806N3241R738l406n7976P5954k4570N0273p8848
1458a632322p9764r252M5881m2268J20226j22298M0071J9830J0189L0159n7530
1447a677078J06749o6133R9271j32143o4001M9209j2044J2037P5872J6240J4835
1436a577186p2089R6564o3662J9357J4202p2728O0303j4877K6470m0037N4645
$$ plain form
1425 -1569038 -1646602 -1647845 -1586958 -1632668 -1609017 -1623508 -1645540 -1702900 -1567191 -1672680 -1629692
1414 -1629692 -1728317 -1650422 -1674736 -1573455 -1733816 -1653698 -1625775 -1649145 -1699577 -1639099 -1680697
1403 -1680697 -1584172 -1638813 -1630083 -1696297 -1736495 -1723347 -1579115 -1627359 -1591566 -1599283 -1514549 -1613233
1391 -1613233 -1575219 -1485947 -1699422 -1697415 -1603420 -1655568 -1585072 -1664831 -1658637 -1606680 -1620431 -1571132
1379 -1571132 -1606432 -1575394 -1660163 -1637484 -1610512 -1581269 -1698021 -1749053 -1602801 -1583847 -1629469
1368 -1629469 -1647227 -1618364 -1652067 -1683908 -1596283 -1662596 -1679442 -1684871 -1599283 -1611444 -1626084 -1701484
1356 -1701484 -1694305 -1662758 -1651931 -1624839 -1518353 -1616079 -1588416 -1680898 -1605190 -1601899 -1637706 -1603380
1344 -1603380 -1663438 -1574283 -1572223 -1585493 -1576730 -1604582 -1653715 -1584025 -1630833 -1560305 -1687688 -1577511
$$ packed form
1425a569038p7564j243O0887m5710K3651j4491k2032n7360J35709j05489M2988
1414a629692r8625P7895k4314J01281j60361Q0118K7923k3370n0432O0478m1598
1403a680697R6525n4641Q730o6214m0198J3148J44232m8244L5793p717Q4734r8684
1391a613233L8014Q9272k13475K007R3995n2148P0496p9759O194N1957j3751M9299
1379a571132l5300L1038q4769K2679K6972K9243j16752n1032J46252J8954m5622
1368a629469j7758K8863l3703l1841Q7625o6313j6846n429Q5588j2161j4640p5400
1356a701484P179L1547J0827K7092J06486r7726K7663r2482P5708L291l5807L4326
1344a603380o0058Q9155K060j3270Q763k7852m9133O9690m6808P0528j27383J10177
$$ plain form
1332 -1577511 -1665075 -1591485 -1680575 -1695604 -1665928 -1732182 -1637725 -1662705 -1653934 -1614019 -1647274 -1658377
1320 -1658377 -1639452 -1693275 -1651436 -1649742 -1653788 -1662408 -1602903 -1623073 -1758219 -1708425 -1624257 -1645933
1308 -1645933 -1568644 -1692594 -1632267 -1563497 -1690851 -1622652 -1674526 -1638406 -1660065 -1622366 -1579770
1297 -1579770 -1650685 -1644814 -1566371 -1660810 -1571857 -1688523 -1579957 -1594203 -1661973 -1656696 -1525741
1286 -1525741 -1644007 -1662633 -1602923 -1618739 -1652881 -1562292 -1543816 -1668465 -1695446 -1717515 -1640943
1275 -1640943 -1613177 -1657017 -1549363 -1543137 -1695804 -1581014 -1611736 -1548661 -1554786 -1635278 -1664824
1264 -1664824 -1691988 -1585173 -1659330 -1626257 -1629056 -1565827 -1629089 -1653976 -1653595 -1590056 -1667447 -1614516
1252 -1614516 -1636087 -1603948 -1515741 -1659246 -1655618 -1675084 -1682579 -1640517 -1715396 -1632982 -1645411 -1704544
$$ packed form
1332a577511q7564P3590q9090j5029K9676o6254R4457k4980Q771L9915l3255j1103
1320a658377J8925n3823M1839J694m046q620N9505k0170j35146M9794Q4168k1676
1308a645933P7289j23950O0327O8770j27354O8199n1874L6120k1659L7699M2596
1297a579770p0915N871P8443r4439Q8953j16666J08566j4246o7770N277J30955
1286a525741j18266j8626N9710j5816l4142R0589J8476j24649k6981k2069P6572
1275a640943K7766m3840J07654O226j52667J14790l0722O3075o125q0492k9546
1264a664824k7164J06815p4157L3073k799O3229o3262k4887L81O3539p7391N2931
1252a614516k1571L2139Q8207j43505L628j9466p495M2062p4879Q2414j2429n9133
$$ plain form
1240 -1704544 -1655933 -1694168 -1669475 -1648525 -1626390 -1596120 -1642899 -1550938 -1657836 -1572878 -1646332
1229 -1646332 -1717359 -1593596 -1670263 -1623047 -1577637 -1613794 -1723903 -1672281 -1655327 -1674550 -1540996
1218 -1540996 -1605386 -1680044 -1582140 -1642819 -1597227 -1635230 -1649771 -1552387 -1610691 -1626157 -1558810
1207 -1558810 -1577294 -1686938 -1633711 -1636715 -1657304 -1484043 -1598759 -1624744 -1713487 -1752103 -1700896
1196 -1700896 -1614532 -1603723 -1597803 -1582710 -1643573 -1685404 -1614881 -1640507 -1664531 -1671173 -1651291 -1597992
1184 -1597992 -1642819 -1641378 -1660097 -1643492 -1668500 -1634927 -1634520 -1625248 -1558205 -1667866 -1781878 -1647608
1172 -1647608 -1614705 -1579173 -1645361 -1568624 -1618408 -1644502 -1695626 -1699417 -1675591 -1618533 -1637760 -1624204
1160 -1624204 -1568193 -1688118 -1617422 -1591747 -1590498 -1595275 -1674068 -1691314 -1561616 -1596506 -1642454
$$ packed form
1240a704544M8611l8235K4693K0950K2135L0270m6779R1961j06898Q4958p3454
1229a646332p1027J23763p6667M7216M5410l6157j10109N1622J6954j9223J33554
1218a540996o4390p4658R7904o0679M5592l8003j4541R7384n8304j5466O7347
1207a558810j8484j09644N3227l004k0589J73261j14716k5985q8743l8616N1207
1196a700896Q6364J0809N920J5093o0863m1831P0523k5626k4024o642J9882N3299
1184a597992m4827J441j8719J6605k5008L3573M07R272O7043j09661j14012J34270
1172a647608L2903L5532o6188P6737m9784k6094n1124l791K3826N7058j9227J3556
1160a624204N6011j19925P0696K5675J249m777p8793j7246J29698l4890m5948
$$ plain form
1149 -1642454 -1729522 -1641892 -1740575 -1606072 -1610928 -1633351 -1596823 -1542271 -1647543 -1640745 -1668461
1138 -1668461 -1630182 -1641906 -1682736 -1558293 -1567395 -1639009 -1713201 -1669651 -1660228 -1592225 -1644980 -1652490
1126 -1652490 -1560188 -1645793 -1645692 -1577372 -1630698 -1564158 -1678955 -1642418 -1731421 -1591773 -1679002
1115 -1679002 -1627130 -1724077 -1540749 -1629016 -1614016 -1583457 -1576328 -1706661 -1656408 -1517045 -1640228
1104 -1640228 -1505075 -1639128 -1705221 -1643000 -1696930 -1602500 -1586073 -1588851 -1578422 -1583349 -1546342
1093 -1546342 -1610157 -1605404 -1684530 -1678030 -1633131 -1640451 -1644095 -1646790 -1688477 -1625231 -1656405 -1501450
1081 -1501450 -1669735 -1634651 -1658442 -1600652 -1648874 -1720213 -1774191 -1632645 -1712780 -1704094 -1636744
1070 -1636744 -1630955 -1673816 -1583567 -1610055 -1652499 -1633744 -1542898 -1734590 -1638549 -1695727 -1529239
$$ packed form
1149a642454q7068Q7630r8683J34503m856k2423L6528N4552j05272O798k7716
1138a668461L8279j1724m0830J24443r102p1614p4192M3550R423O8003n2755p510
1126a652490R2302q5605J01O8320n3326O6540j14797L6537q9003J39648q7229
1115a679002N1872r6947J83328q8267J5000L0559P129j30333N0253J39363j23183
1104a640228J35153j34053o6093O2221n3930R4430J6427k778J0429m927L7007
1093a546342o3815M753p9126O500M4899p320l644k695m1687O3246l1174J54955
1081a501450j68285L5084k3791N7790m8222p1339n3978J41546q0135Q686O7350
1070a636744N789m2861R0249k6488m2444J8755R0846j91692R6041n7178J66488
$$ plain form
1059 -1529239 -1592555 -1656033 -1629659 -1701870 -1559518 -1534561 -1608594 -1614896 -1659379 -1572062 -1547696
1048 -1547696 -1652627 -1663873 -1598781 -1692877 -1617030 -1591630 -1620649 -1577757 -1672603 -1623768 -1600729
1037 -1600729 -1655950 -1622302 -1549422 -1643870 -1627028 -1628101 -1671595 -1678061 -1672469 -1601950 -1556768 -1552553
1025 -1552553 -1723900 -1586684 -1653152 -1629872 -1631945 -1580546 -1658219 -1548714 -1650040 -1665183 -1740492
1014 -1740492 -1663241 -1596038 -1609591 -1635990 -1570741 -1591974 -1639030 -1635947 -1667083 -1587587 -1654759 -1632297
1002 -1632297 -1642857 -1605627 -1605839 -1614092 -1686299 -1585430 -1572838 -1737158 -1658272 -1591132 -1505694 -1627566
990 -1627566 -1575206 -1642212 -1739373 -1557056 -1614583 -1581692 -1680370 -1639550 -1596218 -1617713 -1528716
979 -1528716 -1618031 -1617852 -1592911 -1585430 -1631146 -1530702 -1674012 -1665598 -1645313 -1582218 -1591136 -1609765
$$ packed form
1059a529239o3316o3478K6374p2211J42352K4957p4033o302m4483Q7317K4366
1048a547696j04931j1246O5092r4096P5847K5400k9019M2892r4846M8835K3039
1037a600729n5221L3648P2880r4448J6842j073m3494o466N592P0519M5182M215
1025a552553j71347J37216o6468K3280k073N1399p7673J09505j01326j5143p5309
1014a740492P7251O7203j3553k6399O5249k1233m7056L083l1136P9496o7172K2462
1002a632297j0560L7230k12q253p2207J00869J2592j64320P8886O7140Q5438j21872
990a627566N2360o7006r7161J82317n7527L2891r8678M0820M3332k1495Q8997
979a528716q9315J79K4941P481m5716J00444j43310Q414K0285O3095q918j8629
$$ plain form
967 -1609765 -1613649 -1510540 -1554613 -1618331 -1648151 -1620630 -1655793 -1675541 -1550385 -1623793 -1569442
956 -1569442 -1616524 -1582584 -1627401 -1582674 -1634250 -1686855 -1618302 -1632752 -1660396 -1648382 -1610873 -1656386
944 -1656386 -1592001 -1575831 -1699220 -1644901 -1610579 -1633309 -1655849 -1570420 -1602641 -1606511 -1547447 -1555404
932 -1555404 -1665873 -1597659 -1592435 -1628125 -1682276 -1559423 -1567215 -1630113 -1712066 -1603261 -1657110
921 -1657110 -1684116 -1585488 -1596717 -1637563 -1642183 -1639019 -1589130 -1632940 -1647858 -1557613 -1566414 -1606106
909 -1606106 -1601357 -1620310 -1688859 -1586723 -1660595 -1588651 -1525963 -1560785 -1642829 -1673221 -1640178 -1594284
897 -1594284 -1714075 -1644381 -1653605 -1567161 -1602937 -1656214 -1665852 -1586045 -1655960 -1645320 -1494148 -1575164
$$ packed form
967a609765l884J03109m4073o3718k9820K7521l5163j9748J25156p3408N4351
956a569442m7082L3940m4817M4727n1576n2605O8553j4450k7644J2014L7509m5513
944a656386O4385J6170j23389N4319L4322k2730k2540Q5429l2221l870N9064p957
932a555404j10469O8214N224l5690n4151J22853p792o2898q1953J08805n3849
921a657110k7006R8628j1229m0846m620L164M9889m3810j4918R0245q801l9692
909a606106M749j8953o8549J02136p3872P1944O2688l4822q2044l0392L3043M5894
897a594284j19791O9694r224Q6444l5776n3277r638P9807o9915J0640J51172q1016
$$ [...]
##END NTUPLES=NMR SPECTRUM
##END=
