##TITLE=abcd
##JCAMPDX= 6.0         $$ Bruker NMR JCAMP-DX V2.0
##DATA TYPE= NMR SPECTRUM
##DATA CLASS= NTUPLES
##ORIGIN= UXNMR, Bruker Analytische Messtechnik GmbH
##OWNER= root
$$ XWIN-NMR		Version 3.5
$$ Sat Feb 15 09:37:51 2025 Russian Standard Time (UT+4h)  servis@DPX200
##.OBSERVE FREQUENCY= 200.131235884673
##.OBSERVE NUCLEUS= ^1H
##.ACQUISITION MODE= SIMULTANEOUS
##.ACQUISITION SCHEME= undefined
##.AVERAGES= 24
##.DIGITISER RES= 18
##SPECTROMETER/DATA SYSTEM= spect
##.PULSE SEQUENCE= zg
##.SOLVENT NAME= DMSO
##.SHIFT REFERENCE= (INTERNAL, DMSO, 0, 16.4885)
##AUDIT TRAIL= $$ (NUMBER, WHEN, WHO, WHERE, WHAT)
$$ ##TITLE= Audit trail, XWIN-NMR		Version 3.5
$$ ##JCAMPDX= 5.01
$$ ##ORIGIN= Bruker BioSpin GmbH
$$ ##OWNER= servis
$$ F:\spectra/data/av/nmr/H1/1/pdata/1/auditp.txt
$$ ##AUDIT TRAIL=  $$ (NUMBER, WHEN, WHO, WHERE, WHAT)
(   1,<2025-02-15 09:37:11.37 +0400>,<servis>,<DPX200>,
      <created by zg, POWCHK disabled, PULCHK disabled
       terminated by command 'halt'
       configuration hash MD5:
       00 E9 B6 7A A2 85 ED C7 34 08 36 98 17 FE 4E 26
       data hash MD5: 32K
       BE 63 3C 26 E5 E8 62 47 FF E5 33 2A 06 1E 49 31>)
(   2,<2025-02-15 09:37:13.29 +0400>,<servis>,<DPX200>,
      <Start of raw data processing
       efp BC_mod = 2 LB = 0.05 FT_mod = 6 PKNL = 1 PHC0 = -261.9254 PHC1 = 1.301534 SI = 16K 
       data hash MD5: 16K
       2C D2 CD 92 6A 58 77 7A E1 DC 69 4C 50 6F 68 F7>)
(   3,<2025-02-15 09:37:17.60 +0400>,<servis>,<DPX200>,
      <abs ABSG = 5 
       data hash MD5: 16K
       AF D8 D7 89 B1 C2 D2 AE 6A 02 48 9E 2F E1 9F E0>)
(   4,<2025-02-15 09:37:31.03 +0400>,<servis>,<DPX200>,
      <pk PHC0 = -1.4 PHC1 = 0 
       data hash MD5: 16K
       7F F9 AB 5E C8 A9 9E 4F F7 9F 4B E1 B4 BF A1 3B>)
$$ ##END=
$$ 
$$ hash MD5
$$ 46 62 19 82 9E EC 9F 5B E4 6B 9B 8F 78 32 AE 4A
##$RELAX= 
##$RELAX= 
##$RELAX= 
##$RELAX= 
##$RELAX= 
##$RELAX= 
##$RELAX= 
##$RELAX= 
$$ Bruker specific parameters
$$ --------------------------
##$DU= <F:\spectra>
##$EXPNO= 1
##$NAME= <H1>
##$PROCNO= 1
##$TYPE= <nmr>
##$USER= <av>
##$AMP= (0..31)
100 100 100 100 100 100 100 100 100 100 100 100 100 100 100 100 100 100 
100 100 100 100 100 100 100 100 100 100 100 100 100 100 
##$AQSEQ= 0
##$AQ_mod= 1
##$AUNM= <au_zg>
##$AUTOPOS= <>
##$BF1= 200.13
##$BF2= 200.13
##$BF3= 200.13
##$BF4= 200.13
##$BF5= 500.13
##$BF6= 500.13
##$BF7= 500.13
##$BF8= 500.13
##$BYTORDA= 1
##$CFDGTYP= 0
##$CFRGTYP= 5
##$CHEMSTR= <none>
##$CNST= (0..31)
1 1 145 1 1 1 1 1 1 1 1 1 1 1 1 1 1 1 1 1 1 1 1 1 1 1 1 1 1 1 1 1 
##$CPDPRG= <>
##$CPDPRG1= <>
##$CPDPRG2= <>
##$CPDPRG3= <>
##$CPDPRG4= <mlev>
##$CPDPRG5= <mlev>
##$CPDPRG6= <mlev>
##$CPDPRG7= <mlev>
##$CPDPRG8= <mlev>
##$CPDPRGB= <>
##$CPDPRGT= <>
##$D= (0..31)
0 2 0 0 0 0 0 0 0 0.06 0 0 0 0 0 0 0.0002 0 0 0 0 0 0 0 0 0 0 0 0 0 0 
0 
##$DATE= 1739597831
##$DBL= (0..7)
120 120 120 120 120 120 120 120 
##$DBP= (0..7)
150 150 150 150 150 150 150 150 
##$DBP07= 0
##$DBPNAM0= <>
##$DBPNAM1= <>
##$DBPNAM2= <>
$$ [...]
##$SUBNAM5= <"">
##$SUBNAM6= <"">
##$SUBNAM7= <"">
##$SUBNAM8= <"">
##$SUBNAM9= <"">
##$SW= 20.6817932712277
##$SWIBOX= (0..15)
0 0 3 0 0 0 0 0 0 0 0 0 0 0 0 0 
##$SW_h= 4139.07284768212
##$TD= 32768
##$TD0= 1
##$TE= 0
##$TE2= 300
##$TE3= 300
##$TEG= 300
##$TL= (0..7)
0 120 120 120 120 120 120 120 
##$TP= (0..7)
150 150 150 150 150 150 150 150 
##$TP07= 0
##$TPNAME0= <>
##$TPNAME1= <>
##$TPNAME2= <>
##$TPNAME3= <>
##$TPNAME4= <>
##$TPNAME5= <>
##$TPNAME6= <>
##$TPNAME7= <>
##$TPOAL= (0..7)
0.5 0.5 0.5 0.5 0.5 0.5 0.5 0.5 
##$TPOFFS= (0..7)
0 0 0 0 0 0 0 0 
##$TUNHIN= 0
##$TUNHOUT= 0
##$TUNXOUT= 0
##$USERA1= <user>
##$USERA2= <user>
##$USERA3= <user>
##$USERA4= <user>
##$USERA5= <user>
##$V9= 5
##$VALIST= <valist>
##$VCLIST= <CCCCCCCCCCCCCCC>
##$VD= 0
##$VDLIST= <DDDDDDDDDDDDDDD>
##$VPLIST= <PPPPPPPPPPPPPPP>
##$VTLIST= <TTTTTTTTTTTTTTT>
##$WBST= 1024
##$WBSW= 30
##$XGAIN= (0..3)
0 0 0 0 
##$XL= 0
##$YL= 0
##$YMAX_a= 2299468
##$YMIN_a= -1468109
##$ZGOPTNS= <>
##$ZL1= 120
##$ZL2= 120
##$ZL3= 120
##$ZL4= 120
##$ABSF1= 16.48848
##$ABSF2= -4.193441
##$ABSG= 5
##$ABSL= 3
##$ALPHA= 0
##$AQORDER= 0
##$ASSFAC= 0
##$ASSFACI= 0
##$ASSFACX= 0
##$ASSWID= 0
##$AUNMP= <proc_1d>
##$AZFE= 0.1
##$AZFW= 0.1
##$BCFW= 0
##$BC_mod= 2
##$BYTORDP= 0
##$COROFFS= 0
##$CY= 18.4799938201904
##$DATMOD= 1
##$DC= 0
##$DFILT= <>
##$DTYPP= 0
##$F1P= 9.9274215381318
##$F2P= -0.165520771350173
##$FCOR= 1
##$FTSIZE= 16384
##$FT_mod= 6
##$GAMMA= 0
##$GB= 0
##$INTBC= 1
##$INTSCL= 4.127829e-11
##$ISEN= 128
##$LB= 0.05
##$LEV0= 0
##$LPBIN= 0
##$MAXI= 10000
##$MC2= 0
##$MEAN= 0
##$ME_mod= 0
##$MI= 50
##$NCOEF= 0
##$NC_proc= -5
##$NLEV= 6
##$NOISF1= 3.799351
##$NOISF2= 2.8
##$NSP= 0
##$NTH_PI= 0
##$NZP= 0
##$OFFSET= 16.48848
##$PC= 4
##$PHC0= -263.3254
##$PHC1= 1.301534
##$PH_mod= 1
##$PKNL= yes
##$PPARMOD= 0
##$PSCAL= 4
##$PSIGN= 0
##$REVERSE= no
##$SF= 200.130005582386
##$SI= 16384
##$SIGF1= 3
##$SIGF2= 2
##$SINO= 400
##$SIOLD= 16384
##$SREGLST= <1H.CDCl3>
##$SSB= 0
##$STSI= 16384
##$STSR= 0
##$SW_p= 4139.07284768211
##$SYMM= 0
##$S_DEV= 0
##$TDeff= 32768
##$TDoff= 0
##$TI= <>
##$TILT= no
##$TM1= 0
##$TM2= 0
##$TOPLEV= 0
##$USERP1= <user>
##$USERP2= <user>
##$USERP3= <user>
##$USERP4= <user>
##$USERP5= <user>
##$WDW= 1
##$XDIM= 16384
##$YMAX_p= 321260999
##$YMIN_p= -829747
$$ End of Bruker specific parameters
$$ ---------------------------------
##NTUPLES= NMR SPECTRUM
##VAR_NAME=  FREQUENCY,     SPECTRUM/REAL,   SPECTRUM/IMAG
##SYMBOL=    X,             R,               I
##VAR_TYPE=  INDEPENDENT,   DEPENDENT,       DEPENDENT
##VAR_FORM=  AFFN,          ASDF,            ASDF
##VAR_DIM=   16384,         16384,           16384
##UNITS=     HZ,            ARBITRARY UNITS, ARBITRARY UNITS
##FACTOR=    0.252644378177508, 1,           1
##FIRST=     3299.83951724647, 0,            0
##LAST=      -839.233330435636, 0,           0
##MIN=       -839.233330435636, -829747,     0
##MAX=       3299.83951724647, 321260999,    0
$$ Real data points
##PAGE= N=1
##DATA TABLE= (X++(R..R)), XYDATA
$$ [...]
7476e28730p466J4894J4578j8249L7148L9069o1745K5100J7684n6848M7479J8941
$$ -528730 -536196 -521302 -506724 -524973 -487825 -448756 -510501 -485401 -467717 -524565 -477086 -458145
7464d58145k6806m6000O4938m0095p751L5739n0596L4777j5834Q4760j05154K9165
$$ -458145 -484951 -530951 -466013 -506108 -513859 -478120 -528716 -493939 -509773 -425013 -530167 -501002
7452e01002J0114P1119p7870K0545J0713L8673p9609M4474l3309Q1487p7825L9491
$$ -501002 -490888 -419769 -497639 -477094 -466381 -427708 -507317 -462843 -496152 -414665 -492490 -452999
7440d52999p6802R1074p1187l62J04840M4628o7774K000m0288P1705j2790l7710
$$ -452999 -529801 -438727 -509914 -510276 -405436 -360808 -428582 -426582 -466870 -395165 -407955 -445665
7428d45665K0949k053L745l9491K0733K24J9387r953l2323N6502k4705M6535n1497
$$ -445665 -424716 -426769 -423024 -462515 -441782 -441558 -422171 -432124 -464447 -407945 -432650 -386115 -437612
7415d37612M12l175j9885Q4141K4467k7925N7835j8053N0113p4838m9188L6087
$$ -437612 -437200 -440375 -460260 -376119 -351652 -379577 -321742 -339795 -289682 -364520 -413708 -377621
7403c77621m1156j2905N9659k6840O1736m9241K3940K7487n2266j414p5492K4283
$$ -377621 -418777 -431682 -372023 -398863 -337127 -386368 -362428 -334941 -387207 -388621 -464113 -439830
7391d39830P7893m834p9984Q1367o733O5867j3921M6722l4092N9880k7395M173
$$ -439830 -361937 -366771 -446755 -365388 -372121 -306254 -320175 -273453 -307545 -247665 -275060 -270887
7379b70887M187p2372N2757k5842J533o0741M557M2781K2759k5191J3238q1383
$$ -270887 -266700 -339072 -286315 -312157 -310624 -371365 -366808 -324027 -301268 -326459 -313221 -394604
7367c94604J59335l7346q5609j5888N1483J0359k9532N8638L5508l6222J5093
$$ -394604 -235269 -272615 -358224 -374112 -322629 -312270 -341802 -283164 -247656 -283878 -268785
7356b68785N3173m0779J0189J00518j13233k273L8243k0303o5912J09399K5461
$$ -268785 -215612 -256391 -246202 -145684 -258917 -261190 -222947 -243250 -309162 -199763 -174302
7345a74302k9396L7153r1462Q2993k8913L8028j8880N0546k1592k913k5414p8363
$$ -174302 -203698 -166545 -258007 -175014 -203927 -165899 -184779 -134233 -155825 -158738 -184152 -262515
7333b62515Q0153Q5038m2383k895k2646j0902o6197J21424J7409j03314O3871
$$ -262515 -182362 -97324 -139707 -142602 -165248 -176150 -242347 -120923 -103514 -206828 -142957
7322a42957k0472J12498m1722k0989p410J08822p5274M4966l2983r936m96K7431
$$ -142957 -163429 -50931 -92653 -113642 -121052 -12230 -87504 -42538 -75521 -85457 -85953 -58522
7310e8522j3289P0229l3566L9703K3691L4314m4596n2678J9710J675l5297K2764
$$ -58522 -71811 -1582 -35148 4555 28246 62560 17964 -34714 -15004 -13329 -48626 -25862
7298b5862O4392k5465J3644k5148l815N4185K6640m2768k1653k5266J67172q8456
$$ -25862 38530 13065 26709 1561 -2254 51931 78571 35803 14150 -11116 156056 67600
7286F7600L937j4097j5251L4536J8727M9094n429p185j02224J11112l2982P5077
$$ 67600 71537 57440 42189 76725 95452 144546 139117 131932 29708 140820 107838 182915
7274A82915r6037j1512J71418o5109m3716r512J95007p6656p4848P4083M5042
$$ 182915 86878 75366 246784 181675 137959 128447 323454 246798 171950 246033 291075
7263B91075j8678l2903k2173M8928L7829k104j0066J24909j45876l9642J62753
$$ 291075 272397 239494 217321 266249 304078 301974 291908 416817 270941 231299 394052
7252C94052j16161L9452J4682o8222L9397M2493J3400J28652p1317j1608O0592
$$ 394052 277891 317343 332025 263803 303200 345693 359093 487745 416428 404820 465412
7241D65412j00467K7482N028J5480P0750k1169R788O1411n6320m2776J53776r9344
$$ 465412 364945 392427 397455 412935 483685 462516 472304 533715 477395 434619 588395 489051
7229D89051P7326q2691O1840N3159p4661p285Q918J43728J5020p3406o531R6085
$$ 489051 566377 483686 545526 598685 524024 516739 525657 669385 684405 610999 604468 700553
7217G00553j9671P4198p694n9168J24659k4085o7347J20359m8093N8888j7995
$$ 700553 680882 755080 747386 688218 812877 788792 721445 841804 793711 852599 834604
7206H34604K5915M2233k4689M0129m8819Q0634o8900l7362J25697p6856M5859
$$ 834604 860519 902752 878063 918192 869373 950007 881107 843745 969442 892586 938445
7195I38445K7496K5540J02754Q702j22912O1770R3548n3155o6583O2281m8726
$$ 938445 965941 991481 1094235 1102937 980025 1041795 1135343 1082188 1015605 1077886 1029160
7184A029160J30535p5521R7078n5688M934J7785Q483M7575Q419r9179M6544O3908
$$ 1029160 1159695 1084174 1181252 1125564 1130498 1148283 1156766 1204341 1212760 1113581 1160125 1224033
7172A224033n1103j8950J09401j3733r4339Q4317m2535N1815M6679o0687N1640
$$ 1224033 1172930 1153980 1263381 1249648 1155309 1239626 1197091 1248906 1295585 1234898 1286538
7161A286538j3747J5978O9898r0910K9325L5675K6546K2142k2392K6530J5095
$$ 1286538 1272791 1288769 1358667 1267757 1297082 1332757 1359303 1381445 1359053 1385583 1400678
7150A400678p3016Q1374M3457k7750k1631J24997j07091J16246m3890r0591J26722
$$ 1400678 1327662 1409036 1452493 1424743 1403112 1528109 1421018 1537264 1493374 1402783 1529505
7139A529505k5382J05614j02005J0082O8146j3264M4911m802J3122M4133j1370
$$ 1529505 1504123 1609737 1507732 1517814 1585960 1572696 1617607 1612805 1625927 1670060 1658690
7128A658690O5335J6643R389R9386p8035R2277Q611j1823M1178J9649O3738n6469
$$ 1658690 1724025 1740668 1750057 1849443 1771408 1863685 1872296 1860473 1901651 1921300 1985038 1928569
7116A928569L6421O4091n7881R1688K1519j1089L3033N4130Q2357r3194O7917
$$ 1928569 1964990 2029081 1971200 2062888 2084407 2073318 2106351 2160481 2242838 2149644 2217561
7105B217561L2646K1027Q3436N6931K5600n172K9602N2385m5113J17310p0092
$$ 2217561 2250207 2271234 2354670 2411601 2437201 2432029 2461631 2514016 2468903 2586213 2516121
7094B516121R6118K9023P4511J1312K645J21548P8451m0744l0005K14393q1296
$$ 2516121 2612239 2641262 2715773 2727085 2729730 2851278 2929729 2888985 2858980 3073373 2992077
7083B992077J40609l3170M9972P3703o1540J23697O7339Q2945O8268K4911O1619
$$ 2992077 3132686 3099516 3149488 3223191 3161651 3285348 3352687 3435632 3503900 3528811 3590430
7072C590430p194O2131M1077J35981K6262N0749O8410J20980o8729J41134J82228
$$ 3590430 3583236 3645367 3686444 3822425 3848687 3899436 3967846 4088826 4020097 4161231 4343459
7061D343459m3971R0240j062J19619N9560J37540J774J45009L560J65896N7159
$$ 4343459 4299488 4389728 4388666 4508285 4567845 4705385 4707159 4852168 4855728 5021624 5078783
7050E078783O4108J92169k9605K06659M4681J08120Q1196O1046J38063J85575
$$ 5078783 5142891 5335060 5305455 5512114 5556795 5664915 5746111 5807157 5945220 6130795
7040F130795J02724P7113R7337J47484R9427J33996K24778k7829K63252Q9419
$$ 6130795 6233519 6310632 6407969 6555453 6654880 6788876 7013654 6985825 7249077 7338496
7030G338496K09761J29303M6113K21531J85811J08143K00328J50505J95385J56162
$$ 7338496 7548257 7677560 7723673 7945204 8131015 8239158 8439486 8589991 8785376 8941538
7020H941538J56300K27412J15582K47243J61066K68219K31289J74211L18685K49376
$$ 8941538 9097838 9325250 9440832 9688075 9849141 10117360 10348649 10522860 10841545 11090921
7010A1090921J50541K16400K96576K47237K92222K10800L65213L33626L19273
$$ 11090921 11241462 11457862 11754438 12001675 12293897 12504697 12869910 13203536 13522809
7001A3522809J80549L20738L25090L54457K97951L97766L58683K91440M51903
$$ 13522809 13703358 14024096 14349186 14703643 15001594 15399360 15758043 16049483 16501386
6992A6501386M52732K53338N89631M56956L42609N63034N38794N16308M98337
$$ 16501386 16954118 17207456 17797087 18254043 18596652 19159686 19698480 20214788 20713125
6983B0713125N27739N06899O19230N98105O12015O91673N56489P15963P11691
$$ 20713125 21240864 21747763 22366993 22965098 23577113 24268786 24825275 25541238 26252929
6974B6252929P97257P17450Q50913Q31225Q95812Q71258Q39999R33839J024521
$$ 26252929 27050186 27767636 28618549 29449774 30345586 31216844 32056843 32990682 34015203
6965C4015203J113307J095041J036518J206056J183060J208247J334429J174334
$$ 34015203 35128510 36223551 37260069 38466125 39649185 40857432 42191861 43366195
6957D3366195J306503J442516J466225J383242J510885J464900J493611J623485
$$ 43366195 44672698 46115214 47581439 48964681 50475566 51940466 53434077 55057562
6949E5057562J623575J503006J636450J656837J602835J592909J636592J605789
$$ 55057562 56681137 58184143 59820593 61477430 63080265 64673174 66309766 67915555
6941F7915555J501615J606286J404486J583187J476978J446054J397139J332766
$$ 67915555 69417170 71023456 72427942 74011129 75488107 76934161 78331300 79664066
6933G9664066J257108J301148J319377J147223J189138J034445J035349R53427
$$ 79664066 80921174 82222322 83541699 84688922 85878060 86912505 87947854 88901281
6925H8901281Q50287P73626O15640P27384M96703M00290P7450K05587l3274j32928
$$ 88901281 89751568 90525194 91140834 91868218 92364921 92765211 92842661 93048248 93014974 92882046
6915I2882046k58359l36605n70272n14248o36131r26651p13924r78718r78203
$$ 92882046 92623687 92287082 91716810 91202562 90566431 89639780 88925856 87947138 86968935
6906H6968935j035479r79657j124010j208084j342323j236367j267920j343062
$$ 86968935 85933456 84953799 83829789 82621705 81279382 80043015 78775095 77432033
6898G7432033j372786j493652j404020j529010j483681j723570j512248j631995
$$ 77432033 76059247 74565595 73161575 71632565 70148884 68425314 66913066 65281071
6890F5281071j587906j624609j595948j675127j564663j615801j476413j461308
$$ 65281071 63693165 62068556 60472608 58797481 57232818 55617017 54140604 52679296
6882E2679296j634827j341780j487634j438990j356599j377874j242480j221402
$$ 52679296 51044469 49702689 48215055 46776065 45419466 44041592 42799112 41577710
6874D1577710j292185j122518j100450j152125r95345j060854j095964q13642
$$ 41577710 40285525 39163007 38062557 36910432 35915087 34854233 33758269 32944627
6866C2944627r60192r29859p99266r23097p90059p35716o58883o75872p19701
$$ 32944627 31984435 31054576 30255310 29332213 28542154 27806438 27147555 26471683 25751982
6857B5751982p79080o06020o53559m90350p50568m27119n16581n22333n18911
$$ 25751982 24972902 24366882 23713323 23222973 22472405 22045286 21528705 21006372 20487461
6848B0487461m49388n49782l95089n03252l84121l50692n26366k77854m30105
$$ 20487461 20038073 19488291 19093202 18589950 18205829 17855137 17328771 17050917 16620812
6839A6620812l51081l67511l10851l37349l09897l18255l55734k67950j83699
$$ 16620812 16269731 15902220 15591369 15254020 14944123 14625868 14270134 14002184 13818485
6830A3818485k62685l00396l31185k25783k38212j92806k12391k33027k30004
$$ 13818485 13555800 13255404 12924219 12698436 12460224 12267418 12055027 11822000 11591996
6821A1591996j74785k60879j61916j45415j93107l23737o6239k03033q7049j77646
$$ 11591996 11417211 11156332 10994416 10849001 10655894 10332157 10265918 10062885 9975836 9798190
6811I798190j50450j39253j78497m9018k33911j09188j67646l1475j94506j41976
$$ 9798190 9647740 9508487 9329990 9280972 9047061 8937873 8770227 8738752 8544246 8402270
6801H402270j1456j11375r4683j83978p1894j3377o7624k29901J7805j72592l57
$$ 8402270 8390814 8279439 8184756 8000778 7928884 7915507 7847883 7617982 7635787 7463195 7462838
6790G462838j03711N6j03354j07299m8766o1204L1570j02868k8969j06739j7596
$$ 7462838 7359127 7359183 7255829 7148530 7099764 7038560 7070130 6967262 6938293 6831554 6813958
6779F813958m0261M3507j12212p9593L3101l3666l1734q2705N757n5590q1537
$$ 6813958 6773697 6817204 6704992 6625399 6658500 6624834 6593100 6510395 6516152 6460562 6379025
6768F379025Q0841N2964j62873R8493j03443j0915J2216L3879r5247O8792l3564
$$ 6379025 6459866 6512830 6349957 6448450 6345007 6334092 6346308 6380187 6284940 6353732 6320168
6757F320168p1950m7907L2530l3279j12932K17858j23204K0969j2908p900M798
$$ 6320168 6248218 6200311 6232841 6199562 6086630 6304488 6181284 6202253 6189345 6181445 6186243
6746F186243j39647J4464N0768p1856j8727o4929R3800j13737l435q2522q5546
$$ 6186243 6046596 6061060 6111828 6039972 6021245 5956316 6050116 5936379 5932944 5850422 5764876
6735E764876n4593Q6060j47197q0753p5523j5581r1333J6597p016j36410p5580
$$ 5764876 5710283 5796343 5649146 5568393 5492870 5477289 5385956 5402553 5395537 5259127 5183547
6724E183547O9836j20156q7074o129p5663k1285p0610n6356n1570p2066J9163
$$ 5183547 5253383 5133227 5046153 5040024 4964361 4943076 4872466 4816110 4764540 4692474 4711637
6713D711637j31728N428o6618l7688q5358n2587o3776l137l4632Q388l6843k7496
$$ 4711637 4579909 4585337 4518719 4481031 4395673 4343086 4279310 4276173 4241541 4249929 4213086 4185590
6701D185590j68335N9473j82167N5474o2607j987Q1105j21205j7889k5684p5930
$$ 4185590 4017255 4076728 3894561 3950035 3887428 3885441 3966546 3845341 3827452 3801768 3725838
6690C725838r8469O0068n5789j945m7995J0880o2481l9146L4396q5409P3063j7571
$$ 3725838 3627369 3687437 3631648 3629703 3581708 3592588 3530107 3490961 3525357 3439948 3513011 3495440
6678C495440j0915r7998o5538J24159q6039J03997j46121L5393K7280n3024K0549
$$ 3495440 3484525 3386527 3320989 3445148 3359109 3463106 3316985 3352378 3379658 3326634 3347183
6667C347183j04847J6866k1638l459M3893K3035l7342J9732N265o2463K046m8066
$$ 3347183 3242336 3259202 3237564 3234105 3277998 3301033 3263691 3283423 3288688 3226225 3228271 3180205
6655C180205j5637l4808M9161k2720J2734q9503N7796J9279o2568M9629K142m0943
$$ 3180205 3164568 3129760 3178921 3156201 3168935 3079432 3137228 3156507 3093939 3143568 3145710 3104767
6643C104767J15769r2343N113q3081J28007p6273L766l720j1461N9873m8304l9413
$$ 3104767 3220536 3128193 3133306 3050225 3178232 3101959 3105725 3102005 3090544 3150417 3102113 3062700
6631C062700J6526o4889R1678j6657j01930K5494K7538j5921j8205P6022p0382
$$ 3062700 3079226 3014337 3106015 3089358 2987428 3012922 3040460 3024539 3006334 3082356 3011974
6620C011974p7992P4584M6392K6954K4922j17609P5430l5917o0846O1540J119
$$ 3011974 2933982 3008566 3054958 3081912 3106834 2989225 3064655 3028738 2967892 3029432 3030551
6609C030551l3351K8122j289p347K7878R328n8363K5872K7363o0721J3607L2637
$$ 3030551 2997200 3025322 3024033 3016686 3044564 3053892 2995529 3021401 3048764 2988043 3001650 3034287
6597C034287L6041n9786p0066J44745n5485L1307l665O7125n0503J6352l0455
$$ 3034287 3070328 3010542 2940476 3085221 3029736 3061043 3057378 3124503 3074000 3090352 3059897
6586C059897L492M6730k8714m4791K4486K9132o2537O7814N3251j474p0391O9446
$$ 3059897 3063389 3110119 3081405 3036614 3061100 3090232 3027695 3095509 3148760 3147286 3076895 3146341
6574C146341j9023j04075L9049m11P2115o391n2446P0669q4831m581l780L5035
$$ 3146341 3127318 3023243 3062292 3061881 3133996 3127605 3075159 3145828 3060997 3056416 3052636 3087671
6562C087671J0669j9517J9663J0738n8104P1645J15494q3391K1357J7337J3012
$$ 3087671 3098340 3078823 3098486 3109224 3051120 3122765 3238259 3154868 3176225 3193562 3206574
6551C206574L3234p1030K7830Q4174l1306K6302j3267O0789l8728o2580P2640
$$ 3206574 3239808 3168778 3196608 3280782 3249476 3275778 3262511 3323300 3284572 3221992 3294632
6540C294632k8005L0579j4801J5545j9227N7864P1108K3699r8385O7621j3282
$$ 3294632 3266627 3297206 3282405 3297950 3278723 3336587 3407695 3431394 3333009 3400630 3387348
6529C387348R5859P535m6420K3946K5006R8887K1828L038l0651J20791O5183j68460
$$ 3387348 3483207 3490742 3444322 3468268 3493274 3592161 3613989 3617027 3586376 3707167 3772350 3603890
6517C603890P4603J02968o4267R0852L8113L2291m1427M2598k8868Q5803j6865
$$ 3603890 3678493 3781461 3717194 3808046 3846159 3878450 3837023 3879621 3850753 3936556 3919691
6506C919691M8711L1179O5354L5529O214K9906l913Q7468L3473M3290N2858J5549
$$ 3919691 3968402 3999581 4064935 4100464 4106678 4136584 4132671 4220139 4253612 4296902 4349760 4365309
6494D365309J10895M3046L0531o8326K903N806J16590P6184J2023P0406P8822
$$ 4365309 4476204 4519250 4549781 4481455 4484358 4490164 4606754 4682938 4694961 4765367 4844189
6483D844189q840N0787k0969P4510K4463N2971N5243J24828K7506L4185K1904
$$ 4844189 4835349 4886136 4865167 4939677 4964140 5017111 5072354 5197182 5224688 5258873 5280777
6472E280777J61216K3236m135J40762L2963L7644Q455J02284P1162J27171K2319
$$ 5280777 5441993 5465229 5461094 5601856 5634819 5672463 5680918 5783202 5854364 5981535 6003854
6461F003854M8067N9615J44058L1872N2933J35648L8184R7914L1783N8951J36239
$$ 6003854 6051921 6111536 6255594 6287466 6340399 6476047 6514231 6612145 6643928 6702879 6839118
6450F839118K6555K20332J7968R9766M0657O7292J25289J18820J09735L0270K08510
$$ 6839118 6865673 7086005 7103973 7203739 7244396 7311688 7436977 7555797 7665532 7695802 7904312
6439G904312P6170J21925J29151J11214Q7202J59122P0320J89751O114J73472
$$ 7904312 7980482 8102407 8231558 8342772 8429974 8589096 8659416 8849167 8855281 9028753
6429I028753R9734R2876K94073M5849J48587R8146J59258K02920J43534Q4941
$$ 9028753 9128487 9221363 9515436 9561285 9709872 9808018 9967276 10170196 10313730 10398671
6419A0398671J88768J44791J89987K28464J28508P5387K02504K69522Q5067J98761
$$ 10398671 10587439 10732230 10922217 11150681 11279189 11354576 11557080 11826602 11911669 12110430
6409A2110430K74312K00719J45584J80064K03066L18606J24812J94191K70701
$$ 12110430 12384742 12585461 12731045 12911109 13114175 13432781 13557593 13751784 14022485
6400A4022485K16578K97028K74849K13500L09226K93666K61152K81051K97501
$$ 14022485 14239063 14536091 14810940 15024440 15333666 15627332 15888484 16169535 16467036
6391A6467036L43530K50393L58243L39010K96874L87742L46599L65668M78740
$$ 16467036 16810566 17060959 17419202 17758212 18055086 18442828 18789427 19155095 19633835
6382A9633835M18531L60055M32156M18037N57955M32968N17159M48978O20772
$$ 19633835 20052366 20412421 20844577 21262614 21820569 22253537 22770696 23219674 23840446
6373B3840446N13138O07647N36740O07424P12146O80767O64742O83275P51753
$$ 23840446 24353584 24961231 25497971 26105395 26817541 27498308 28163050 28846325 29598078
6364B9598078P36433P99035Q12023R24670Q25148J027583Q73337R93407J061995
$$ 29598078 30334511 31133546 31945569 32870239 33695387 34722970 35596307 36589714 37651709
6355C7651709J197766R79094J160690J066323J467661J214747J288164J465036
$$ 37651709 38849475 39828569 40989259 42055582 43523243 44737990 46026154 47491190
6347D7491190J321453J461178J562757J510479J574638J591547J664360J646907
$$ 47491190 48812643 50273821 51836578 53347057 54921695 56513242 58177602 59824509
6339E9824509J723292J747798J719800J809706J697801J930655J707564J884756
$$ 59824509 61547801 63295599 65015399 66825105 68522906 70453561 72161125 74045881
6331G4045881J650364J804997J779872J654688J636658J570837J523107J666630
$$ 74045881 75696245 77501242 79281114 80935802 82572460 84143297 85666404 87333034
6323H7333034J461662J453774J320270J422234J321443J197805J200027J010400
$$ 87333034 88794696 90248470 91568740 92990974 94312417 95510222 96710249 97720649
6315I7720649J083244J008279R20653P85404O60322O24290M17566L05921J13730
$$ 97720649 98803893 99812172 100732825 101518229 102178551 102802841 103220407 103526328 103640058
6306A03640058J66568j30450k34751l63113n20409n67532o33962q77914q50448
$$ 103640058 103806626 103676176 103441425 103078312 102557903 101990371 101356409 100478495 99628047
6297I9628047r44153j091641j092793j123780j267862j210057j306907j282603
$$ 99628047 98683894 97592253 96499460 95375680 94107818 92897761 91590854 90308251
6289I0308251j420992j441807j287431j391191j500202j483310j506682j563780
$$ 90308251 88887259 87445452 86158021 84766830 83266628 81783318 80276636 78712856
6281G8712856j630589j496872j639455j489707j660666j529725j435215j637200
$$ 78712856 77082267 75585395 73945940 72456233 70795567 69265842 67830627 66193427
6273F6193427j554280j412877j430487j464946j235689j392504j265651j254725
$$ 66193427 64639147 63226270 61795783 60330837 59095148 57702644 56436993 55182268
6265E5182268j223174j041182j069662j134186r40777j061297r29176q73414r00680
$$ 55182268 53959094 52917912 51848250 50714064 49773287 48711990 47782814 46909400 46008720
6256D6008720q03781p28921p35261o49899o77127o64958n14902o07594n84892
$$ 46008720 45204939 44476018 43740757 43090858 42413731 41748773 41233871 40626277 40041385
6247D0041385m69147n33188l35288m58627l39743k99665m36707k77171l42162
$$ 40041385 39572238 39039050 38703762 38245135 37905392 37605727 37169020 36891849 36549687
6238C6549687j60132k32537j92059j54617k37025j43097r0416n4420j39663j0027
$$ 36549687 36389555 36157018 35964959 35810342 35573317 35430220 35339804 35285384 35145721 35135694
6228C5135694j59032l1956J9083N7199J2602K1234M4112J01478R2386J11686J92914
$$ 35135694 34976662 34944706 34963789 35020988 35033590 35054824 35098936 35200414 35292800 35404486 35597400
6217C5597400J99411N0013K60203J05940M22776J39300K22607K20455M32766K99963
$$ 35597400 35796811 35846824 36107027 36212967 36635743 36775043 36997650 37218105 37650871 37950834
6207C7950834L99425L17388L24219M43960M60120M93299M69526M62170O14833
$$ 37950834 38350259 38667647 38991866 39435826 39895946 40389245 40858771 41320941 41935774
6198D1935774N03840P03493M84265P44069O77833O76034P77295Q73393P85576
$$ 41935774 42439614 43143107 43627372 44371441 45049274 45725308 46502603 47375996 48161572
6189D8161572Q33043R48231Q41843J073929J067674J022854J173746J128411J293451
$$ 48161572 48994615 49942846 50784689 51858618 52926292 53949146 55122892 56251303 57544754
6180E7544754J281198J228113J406621J370645J294295J621854J457971J624875
$$ 57544754 58825952 60054065 61460686 62831331 64125626 65747480 67205451 68830326
6172F8830326J641876J592979J779729J621280J692786J827304J857532J768112
$$ 68830326 70472202 72065181 73844910 75466190 77158976 78986280 80843812 82611924
6164H2611924J894520J710988J937841J827848J869380J711921J905746J802612
$$ 82611924 84506444 86217432 88155273 89983121 91852501 93564422 95470168 97272780
6156I7272780J872633J773107J702843J774154J669521J642047J718621J637291
$$ 97272780 99145413 100918520 102621363 104395517 106065038 107707085 109425706 111062997
6148A11062997J574822J492020J541445J389045J440009J268160J156897J170632
$$ 111062997 112637819 114129839 115671284 117060329 118500338 119768498 120925395 122096027
6140A22096027R75847J047825P69764Q87828O94846N18661L56650L65546L39463
$$ 122096027 123071874 124119699 124889463 125777291 126472137 126990798 127347448 127712994 128052457
6131A28052457J71852J19690L910n1885n2357j75527k11901j75706j68395k84613
$$ 128052457 128224309 128343999 128347909 128296024 128243667 128068140 127856239 127680533 127512138 127227525
6121A27227525l19756k04043k72643k56481l00138l96616k61038j68570k05979
$$ 127227525 126907769 126703726 126431083 126174602 125874464 125477848 125216810 125048240 124842261
6112A24842261k21810j58227k05495J259j44319L0692J19719R8466K31679K98679
$$ 124842261 124620451 124462224 124256729 124257988 124113669 124144361 124264080 124362546 124594225 124892904
6102A24892904M18650N69565O33298O74395Q40307R77588J043552J185702J298956
$$ 124892904 125311554 125881119 126514417 127188812 128029119 129006707 130050259 131235961 132534917
6093A32534917J484952J408785J671287J708687J812123J937671J939884K036207
$$ 132534917 134019869 135428654 137099941 138808628 140620751 142558422 144498306 146534513
6085A46534513K158211K150614K162299K352250K232823K415624K324013K274656
$$ 146534513 148692724 150843338 153005637 155357887 157590710 160006334 162330347 164605003
6077A64605003K378765K117409K170560K264813K062057K050981J898530K001243
$$ 164605003 166983768 169101177 171271737 173536550 175598607 177649588 179548118 181549361
6069A81549361J923851J786845J858403J695110J767293J659444J600934J596465
$$ 181549361 183473212 185260057 187118460 188813570 190580863 192240307 193841241 195437706
6061A95437706J492528J315805J463100J174350J182207J119203R31197P79987
$$ 195437706 196930234 198246039 199709139 200883489 202065696 203184899 204116096 204896083
6053B04896083P19274N40537M65075K37717J09779o0459k42542m23771n63445
$$ 204896083 205615357 206155894 206620969 206858686 206968465 206908006 206665464 206241693 205678248
6044B05678248o58519q96745j124097j262081j314624j584563j799580j728978
$$ 205678248 205019729 204122984 202998887 201736806 200422182 198837619 197038039 195309061
6036A95309061k090601k125683k293994k476566k490466k641099k792703k746603
$$ 195309061 193218460 191092777 188798783 186322217 183831751 181190652 178397949 175651346
6028A75651346l039606k927643l054456l112826l115450l155369l170097l255511
$$ 175651346 172611740 169684097 166629641 163516815 160401365 157245996 154075899 150820388
6020A50820388l208995l042024l254617l170657l029932l263660l103392k992094
$$ 150820388 147611393 144569369 141314752 138144095 135114163 131850503 128747111 125755017
6012A25755017l049285k935436k991769k862058k881024k795348k767867k588816
$$ 125755017 122705732 119770296 116778527 113916469 111035445 108240097 105472230 102883414
6004A02883414k698210k620478k432930k534823k473039k395622k306877k245168
$$ 102883414 100185204 97564726 95131796 92596973 90123934 87728312 85421435 83176267
5996H3176267k126353k184925k047514k063797k004095j758840j866531j775093
$$ 83176267 81049914 78864989 76817475 74753678 72749583 70990743 69124212 67349119
5988F7349119j859510j581358j656255j500919j514274j523193j412365j315362
$$ 67349119 65489609 63908251 62251996 60751077 59236803 57713610 56301245 54985883
5980E4985883j308525j224574j321638j147358j031489j222667j085789r76974
$$ 54985883 53677358 52452784 51131146 49983788 48952299 47729632 46643843 45666869
5972D5666869j016864r32331r79976q80474q32828q29005p94702p79134p73871
$$ 45666869 44650005 43717674 42737698 41857224 41024396 40195391 39400689 38621555 37847684
5963C7847684p95207o69072o41219o78954p13111m95065o48378n76970o07078
$$ 37847684 37052477 36383405 35742186 35063232 34350121 33855056 33206678 32629708 32022630
5954C2022630n38110m55797n98050n71417l11425m87418n23039l41763n05318
$$ 32022630 31484520 31028723 30430673 29859256 29547831 29060413 28537374 28195611 27690293
5945B7690293m07045k62604l97331m04475m50349m05749k89560k51341k78856
$$ 27690293 27283248 27020644 26623313 26218838 25768489 25362740 25073180 24821839 24542983
5936B4542983m10994l89665k51236k56034l57884k12640k58801k09936l41144
$$ 24542983 24131989 23742324 23491088 23235054 22877170 22664530 22405729 22195793 21854649
5927B1854649k01502k17040k88068k80348j74566k36698j02909k56145j57262
$$ 21854649 21653147 21436107 21148039 20867691 20693125 20456427 20353518 20097373 19940111
5918A9940111k34931k30448j13159j63542k56033j99850j95155n0275p9802k52806
$$ 19940111 19705180 19474732 19361573 19198031 18941998 18742148 18546993 18496718 18416916 18164110
5908A8164110j35120k23245j23450j14651j35288j18459m1904k65550n7624j18088
$$ 18164110 18028990 17805745 17682295 17567644 17432356 17313897 17271993 17006443 16948819 16830731
5898A6830731o9050j55114j01302j10884m6365p0583q6083n7087q6066j36749
$$ 16830731 16761681 16606567 16505265 16394381 16348016 16277433 16191350 16134263 16048197 15911448
5888A5911448m119j61389j15973k5306j33331n3939n4012r9304j04915r4735o6347
$$ 15911448 15907329 15745940 15629967 15604661 15471330 15417391 15363379 15264075 15159160 15064425 14998078
5877A4998078j07012j42798j07410p4183k37834k20988r2199j23575r4731k43276
$$ 14998078 14891066 14748268 14640858 14566675 14328841 14107853 14015654 13892079 13797348 13554072
5867A3554072j75746j38867j66774q7502k13985j04623k48580j56502k9882j83777
$$ 13554072 13378326 13239459 13072685 12985183 12771198 12666575 12417995 12261493 12231611 12047834
5857A2047834j83999r4934r0625k01708p9509j20268j70184j69246n1286l0383
$$ 12047834 11863835 11768901 11678276 11476568 11397059 11276791 11106607 10937361 10886075 10855692
5847A0855692q4030j32290j39258k25974L8028j49605j25869j24183j30332N8046
$$ 10855692 10771662 10639372 10500114 10274140 10312168 10162563 10036694 9912511 9782179 9840225
5837I840225j78027p8247j25650o5404l0404l6797j04169j21963o8589l7605j07710
$$ 9840225 9662198 9583951 9458301 9392897 9362493 9325696 9221527 9099564 9030975 8993370 8885660
5826H885660k014j11272p3502K845j39528q6154J4425j12868M6242m6232j20129
$$ 8885660 8883646 8772374 8698872 8701717 8562189 8476035 8490460 8377592 8423834 8377602 8257473
5815H257473l9114o8963P720K2422p8409m1950r7784K6408p2979L4508j37361
$$ 8257473 8218359 8149396 8157116 8179538 8101129 8059179 7961395 7987803 7914824 7949332 7811971
5804G811971O7M5709o1065p6394k0329N6271j15653M3418r7686j29889O7087P735
$$ 7811971 7812038 7857747 7796682 7720288 7699959 7756230 7640577 7683995 7586309 7456420 7523507 7531242
5792G531242p9015o820j0770k0810k1640p6946j1810K9220o8209l4928j6101P622
$$ 7531242 7452227 7445407 7434637 7413827 7392187 7315241 7303431 7332651 7264442 7229514 7213413 7221035
5780G221035j05655m7405K2319K7539K5184j30563N70J024K2497l9742l5156k8425
$$ 7221035 7115380 7067975 7090294 7117833 7143017 7012454 7013024 7014048 7036545 6996803 6961647 6933222
5768F933222l6520p6615M4569o7369j4234n4716Q645Q979l0881o9435J6338J6701
$$ 6933222 6896702 6820087 6864656 6797287 6783053 6728337 6736982 6745961 6715080 6645645 6661983 6678684
5756F678684l7717j8693j05056o6807M3506k7370O6202j018p5627q7456k7600
$$ 6678684 6640967 6622274 6517218 6450411 6493917 6466547 6532749 6531731 6456104 6368648 6341048
5745F341048l1635L1167k9833m0492j6116n6216M873j03877J2264j8069Q4102
$$ 6341048 6309413 6340580 6310747 6270255 6254139 6197923 6202796 6098919 6111183 6093114 6177216
5734F177216n9948o6445m9308M970j02854R9756j32602J18382q2942M1961p5032
$$ 6177216 6117268 6050823 6001515 6006485 5903631 6003387 5870785 5989167 5906225 5948186 5873154
5723E873154n1067j08471R0775l1328J3422k8518M5077o7811j5296j24694J87755
$$ 5873154 5822087 5713616 5804391 5773063 5786485 5757967 5803044 5735233 5719937 5595243 5782998
5712E782998o2089j36461M9991N1335j6098q1211J6902P630n6612L5825J894k6316
$$ 5782998 5720909 5584448 5634439 5685774 5669676 5588465 5605367 5612997 5556385 5592210 5594104 5567788
5700E567788Q3638n9437J4519q7615R4902q3211K2696N7673l2178O246l4415O9270
$$ 5567788 5651426 5591989 5606508 5518893 5613795 5530584 5553280 5610953 5578775 5585021 5550606 5619876
5688E619876L7693r0510j8167N1243K005N2017n6879K6120k1846J1223M9235n8203
$$ 5619876 5657569 5567059 5548892 5600135 5602140 5654157 5597278 5623398 5601552 5612775 5662010 5603807
5676E603807M4411O8007j3595p1948N1576Q3884j99680J06158l4982N2712L2390
$$ 5603807 5648218 5716225 5702630 5630682 5682258 5766142 5566462 5672620 5637638 5690350 5722740
5665E722740P6831o6233K2768o336N761P0540O8418j06716R466J0824N1102L7974
$$ 5722740 5799571 5733338 5756106 5749770 5755531 5826071 5894489 5787773 5797239 5808063 5859165 5897139
5653E897139L2939m8959P8522l1576R0703p5415R1521m3623J24902j3583j9412
$$ 5897139 5930078 5881119 5959641 5928065 6018768 5943353 6034874 5991251 6116153 6102570 6083158
5642F083158R567J17821j12319O8853J06804o945J07725p2240O7521N0937O1731
$$ 6083158 6092725 6210546 6098227 6167080 6273884 6266939 6374664 6302424 6369945 6420882 6482613
5631F482613q6206M0038R8101m1349N7741O8803N5529R3221j7050O397N0915O2536
$$ 6482613 6396407 6436445 6534546 6493197 6550938 6619741 6675270 6768491 6751441 6757838 6808753 6871289
5619F871289L6738J23136J950l8422J55127P0527O7626J158J03322m6187J14095
$$ 6871289 6908027 7031163 7033113 6994691 7149818 7220345 7287971 7289129 7392451 7346264 7460359
5608G460359M9337R5838O0036L7682J32142J2642R3898O8914L2673J35965P9015
$$ 7460359 7509696 7605534 7665570 7703252 7835394 7848036 7941934 8010848 8043521 8179486 8258501
5597H258501J13680M7925J35318N3445J43208O7151P9880J56089R9753J35483
$$ 8258501 8372181 8420106 8555424 8608869 8752077 8819228 8899108 9055197 9154950 9290433
5587I290433Q0599J29978J42448J15622J32749J02046Q7908K30909Q8065J88607
$$ 9290433 9371032 9501010 9643458 9759080 9891829 9993875 10081783 10312692 10400757 10589364
5577A0589364J94265M2362K17956N5978K19805J57580J26567L00537J28104J73425
$$ 10589364 10783629 10825991 11043947 11099925 11319730 11477310 11603877 11904414 12032518 12205943
5567A2205943K21182J38728J82390J25391K26067L13572K21200J84466K51351
$$ 12205943 12427125 12565853 12748243 12873634 13099701 13413273 13634473 13818939 14070290
5558A4070290K34799K73516K52511J50917L18250L28931K36160K85510K31417
$$ 14070290 14305089 14578605 14831116 14982033 15300283 15629214 15865374 16150884 16382301
5549A6382301L03351M11316L25367L21529L81558K50272M54904M28736L60953
$$ 16382301 16685652 17096968 17422335 17743864 18125422 18375694 18830598 19259334 19620287
5540A9620287N16622L68074M19471M59643M96540M90732N55069N03958M90352
$$ 19620287 20136909 20504983 20924454 21384097 21880637 22371369 22926438 23430396 23920748
5531B3920748O23898N31119N99300O64507O55305N43998P46070P16146P66785
$$ 23920748 24544646 25075765 25675065 26339572 26994877 27538875 28284945 29001091 29767876
5522B9767876O16328P81664P55732P98927Q82099Q15636Q96363P03902R81724
$$ 29767876 30384204 31165868 31921600 32720527 33602626 34418262 35314625 36018527 37000251
5513C7000251R44228R10079R08859Q73956J032246Q95413J126060J001959R94279
$$ 37000251 37944479 38854558 39763417 40637373 41669619 42565032 43691092 44693051 45687330
5504D5687330J058157R26438J085923J058299J011163J039717J070453J147205
$$ 45687330 46745487 47671925 48757848 49816147 50827310 51867027 52937480 54084685
5496E4084685R55043J101419J034407J032398J114007J009740J013126R91406
$$ 54084685 55039728 56141147 57175554 58207952 59321959 60331699 61344825 62336231
5488F2336231R86957J025949R54353J108960P35217Q73716R23923Q82552P30601
$$ 62336231 63323188 64349137 65303490 66412450 67147667 68021383 68945306 69827858 70558459
5479G0558459Q32233P01215O36326O80404O56923N16666N73205N79218M99296
$$ 70558459 71390692 72091907 72728233 73408637 74065560 74582226 75155431 75734649 76233945
5470G6233945M15644M50673L02064K66435K85930K60258J13929J67781m734q8081
$$ 76233945 76649589 77100262 77402326 77668761 77954691 78214949 78328878 78496659 78491925 78403844
5460G8403844P3139O307k36907j33122k43533j15619l00258l65366m34955m21540
$$ 78403844 78476983 78483290 78246383 78113261 77869728 77754109 77453851 77088485 76653530 76231990
5450G6231990m72838n22658n73239n09813o88809o15991o89319o66824q48623
$$ 76231990 75759152 75236494 74663255 74153442 73464633 72848642 72159323 71492499 70643876
5441G0643876q03983p69427q23595q94045q84845r70242r34113r72727r39901
$$ 70643876 69839893 69070466 68246871 67352826 66467981 65497739 64563626 63590899 62650998
5432F2650998j005109r85314r65513j077886j060460r83896j093675j058649r86860
$$ 62650998 61645889 60660575 59695062 58617176 57556716 56572820 55479145 54420496 53433636
5423E3433636j101195j039067j061716r78237r92719j021924j021406r72230j051256
$$ 53433636 52332441 51293374 50231658 49253421 48260702 47238778 46217372 45245142 44193886
5414D4193886r60096q83874r55888q90772q08753j059358p50705q96494q22850
$$ 44193886 43233790 42349916 41394028 40503256 39694503 38635145 37884440 36987946 36165096
5405C6165096q54481p86963q50581p33847p54538p67158o45904p36465n58271
$$ 36165096 35310615 34523652 33673071 32939224 32184686 31417528 30771624 30035159 29476888
5396B9476888o72844n96670o41193n78648n69981n81808m14712n86182n24263
$$ 29476888 28804044 28207374 27566181 26987533 26417552 25835744 25421032 24834850 24310587
5387B4310587m86488l37102m95025l80079l83158l90859m20664l29753m03176
$$ 24310587 23824099 23486997 22991972 22611893 22228735 21837876 21417212 21087459 20684283
5378B0684283k80679k93799l93818j99542l17895k73584k17715l28165j42166
$$ 20684283 20403604 20109805 19715987 19516445 19198550 18924966 18707251 18379086 18236920
5369A8236920k01007k29031j89330k28472j62222j11070j38285j48569k23582
$$ 18236920 18035913 17806882 17617552 17389080 17226858 17115788 16977503 16828934 16605352
5360A6605352n4765J012k19825j53621J34054j53198j19754R9733j38625p4880
$$ 16605352 16550587 16551599 16331774 16178153 16312207 16159009 16039255 16138988 16000363 15925483
5350A5925483j0963p1515J05867j7368M2730O8315j4042M8175J54866L9468R4735
$$ 15925483 15914520 15843005 15948872 15931504 15974234 16042549 16028507 16076682 16231548 16271016 16365751
5339A6365751P4692K37604O1361J43992K77933M774L40695K78152J75093K57861
$$ 16365751 16440443 16678047 16739408 16883400 17161333 17166107 17506802 17784954 17960047 18217908
5329A8217908L57432K63316M42534L24903L14870L80177L64781N48223L46954
$$ 18217908 18575340 18838656 19281190 19606093 19920963 20301140 20665921 21214144 21561098
5320B1561098M43201N72912N87152M11977O64818M68385N49543P37520N65025
$$ 21561098 22004299 22577211 23164363 23576340 24241158 24709543 25259086 25996606 26561631
5311B6561631N44227O41253N24057M96392N88978N63514M98279N99161L44202
$$ 26561631 27105858 27747111 28271168 28767560 29356538 29920052 30418331 31017492 31361694
5302C1361694M87675L56664L71046K10481K35941J69084N9074J9586p04q5556
$$ 31361694 31849369 32206033 32577079 32787560 33023501 33192585 33251659 33271245 33270541 33184985
5292C3184985k90694j07751l67935k53506l19737m97339m40638n22399n33201
$$ 33184985 32894291 32786540 32418605 32165099 31845362 31348023 30907385 30384986 29851785
5283B9851785o36974o66585o07621o53455o09323o04310o88955o95070o56841
$$ 29851785 29214811 28548226 27940605 27287150 26677827 26073517 25384562 24689492 24032651
5274B4032651o68922n86252o85521n96650o05033n59304o01363m47357o23045
$$ 24032651 23363729 22777477 22091956 21495306 20890273 20330969 19729606 19282249 18659204
5265A8659204l98931n59325m22565m56144m14326l66272m00542m34716l05868
$$ 18659204 18260273 17700948 17278383 16822239 16407913 16041641 15641099 15206383 14900515
5256A4900515l34603l90705l08459j67690l29682k46832k49058k33649k39682
$$ 14900515 14565912 14175207 13866748 13699058 13369376 13122544 12873486 12639837 12400155
5247A2400155k16227k15165j62593j16871k34606j95637q6085j79638j78412j01876
$$ 12400155 12183928 11968763 11806170 11689299 11454693 11259056 11172971 10993333 10814921 10713045
5237A0713045j22710l8157j80395q4361j14325j51689J9821j13184j35788q3878
$$ 10713045 10590335 10552178 10371783 10287422 10173097 10021408 10041229 9928045 9792257 9708379
5227I708379m497r3863l5233n0160j7223r1114m7663j3608p6615o369Q020m2772
$$ 9708379 9703882 9610019 9574786 9524626 9507403 9416289 9368626 9355018 9278403 9272034 9280054 9237282
5215I237282k6189l384r0864M1663k2088q8568q5793M046J09137m1886l2475k1633
$$ 9237282 9211093 9207709 9116845 9158508 9136420 9047852 8962059 8966105 9075242 9033356 9000881 8979248
5203H979248l2672Q376J7641N1568j31640p258M50O0333n5267L9004j22752J31618
$$ 8979248 8946576 8954952 8972593 9024161 8892521 8885263 8885713 8946046 8890779 8929783 8807031 8938649
5191H938649R861p7305n1429M0519R6791j72114P3P2773j0446k1854p9187n794
$$ 8938649 8948510 8871205 8819776 8860295 8957086 8784972 8785045 8857818 8847372 8825518 8746331 8740537
5179H740537J9761l4125o156P6324k7875j3933K4741p1685K5482k8540Q042p191
$$ 8740537 8760298 8726173 8720017 8796341 8768466 8754533 8779274 8707589 8733071 8704531 8712573 8705382
5167H705382m2460q494J09226M6304j79760R0275m2904J1610K3933Q4983j04626
$$ 8705382 8662922 8654428 8763654 8809958 8630198 8720473 8677569 8689179 8713112 8798095 8693469
5156H693469M3961k7000J02501j0837R908n1932J9369M356M9005k0319J07644
$$ 8693469 8737430 8710430 8812931 8802094 8812002 8760070 8779439 8783795 8832800 8812481 8920125
5145H920125m2723m6881J00062K9715m7088Q2001M9595L750P1038j319N6833j04907
$$ 8920125 8877402 8830521 8930583 8960298 8913210 8995211 9044806 9048556 9119594 9118275 9175108 9070201
5133I070201J40553j4567J6485J33729M0752o1624M5713O2385m4229J01594L5849
$$ 9070201 9210754 9196187 9212672 9346401 9387153 9325529 9371242 9433627 9389398 9490992 9526841
5122I526841Q3918j2834J19547R168J27315K7355N2614j651K3931J02497J09151
$$ 9526841 9610759 9597925 9717472 9726640 9853955 9881310 9933924 9932273 9956204 10058701 10167852
5111A0167852j462J03725J03165R1528M5409J0182O0320Q0863P5715J01866J04159
$$ 10167852 10166390 10270115 10373280 10464808 10510217 10520399 10580719 10661582 10737297 10839163 10943322
5100A0943322J21536L3491J03412P1087k5824J33791Q1678L5337J57876J60563
$$ 10943322 11064858 11098349 11201761 11272848 11247024 11380815 11462493 11497830 11655706 11816269
5090A1816269K7437J68899j8039J50869N5376J11126K15665M1338P2327Q7286
$$ 11816269 11843706 12012605 11994566 12145435 12200811 12311937 12527602 12568940 12641267 12728553
5080A2728553R4205J91113K11450N3803R5414J93451Q3329J13859J71286K47703
$$ 12728553 12822758 13013871 13225321 13279124 13374538 13567989 13651318 13765177 13936463 14184166
5070A4184166N3676K06035J97218J01237K12817J52956P6738K04952P7402K94217
$$ 14184166 14237842 14443877 14641095 14742332 14955149 15108105 15184843 15389795 15467197 15761414
5060A5761414K71237J05189J47306K90445J36867K30074K18650K53418J67644
$$ 15761414 16032651 16137840 16285146 16575591 16712458 16942532 17161182 17414600 17582244
5051A7582244K80170K23271J67735K93845K05078K11645L75971K17666K20387
$$ 17582244 17862414 18085685 18253420 18547265 18752343 18963988 19339959 19557625 19778012
5042A9778012L18082L41388J77534L57533L21559K37951L55168K63362M42395
$$ 19778012 20096094 20437482 20615016 20972549 21294108 21532059 21887227 22150589 22592984
5033B2592984K37206L99507K74880M80249L83852M49991L82645M10783L81108
$$ 22592984 22830190 23229697 23504577 23984826 24368678 24818669 25201314 25612097 25993205
5024B5993205M24098M14543M88651M14730M17492N35772M48364N81186M65001
$$ 25993205 26417303 26831846 27320497 27735227 28152719 28688491 29136855 29718041 30183042
5015C0183042N87661N47812N32764N79961M48590P32397O53063N70777P32904
$$ 30183042 30770703 31318515 31851279 32431240 32879830 33612227 34265290 34836067 35568971
5006C5568971P26509O45844O66378P68875P66061Q84151Q07159Q21253Q46245
$$ 35568971 36295480 36941324 37607702 38376577 39142638 40026789 40833948 41655201 42501446
4997D2501446J065290R55638J012099R12640J166313J098693J182374J286203
$$ 42501446 43566736 44522374 45534473 46447113 47613426 48712119 49894493 51180696
4989E1180696J175079J316382J398190J491814J509051J620101J625289J813007
$$ 51180696 52355775 53672157 55070347 56562161 58071212 59691313 61316602 63129609
4981F3129609J843366J943382J873474K126630K099590K353037K378085K424330
$$ 63129609 64972975 66916357 68789831 70916461 73016051 75369088 77747173 80171503
4973H0171503K446517K558495K668732K818270K780410L061519L077963L126497
$$ 80171503 82618020 85176515 87845247 90663517 93443927 96505446 99583409 102709906
4965A02709906L064258L219408L165305L232347L169242L343540L164971L072635
$$ 102709906 105774164 108993572 112158877 115391224 118560466 121904006 125068977 128141612
4957A28141612K907114K840174K528326K545411K287633K180149K014427J953182
$$ 128141612 131048726 133888900 136417226 138962637 141250270 143430419 145444846 147398028
4949A47398028J770860J785813J688484J647328J513148J400591J448143J424787
$$ 147398028 149168888 150954701 152643185 154290513 155803661 157204252 158652395 160077182
4941A60077182J404988J447450J460751J528470J378956J576857J379024J388297
$$ 160077182 161482170 162929620 164390371 165918841 167297797 168874654 170253678 171641975
4933A71641975J254814J224578J270783R74572J007087Q70087P39706N87832N92461
$$ 171641975 172896789 174121367 175392150 176366722 177373809 178243896 178983602 179571434 180163895
4924A80163895L07315K65624J6307j3835l32507l51106n16855p39855q13947j103332
$$ 180163895 180471210 180736834 180753141 180739306 180406799 180055693 179538838 178798983 177985036 176881704
4914A76881704j176719j233318j556298j556004j841723j813737j945619k184501
$$ 176881704 175704985 174471667 172915369 171359365 169517642 167703905 165758286 163573785
4906A63573785k186119k310870k290224k490075k510597k558893k561330k653759
$$ 163573785 161387666 159076796 156786572 154296497 151785900 149227007 146665677 144011918
4898A44011918k657555k787207k684184k669221k643994k579147k698903k628763
$$ 144011918 141354363 138567156 135882972 133213751 130569757 127990610 125291707 122662944
4890A22662944k571982k574755k481755k375411k362257k292727k226169k153887
$$ 122662944 120090962 117516207 115034452 112659041 110296784 108004057 105777888 103624001
4882A03624001k179333j983548j959378j855080j843121j731615j604257j672622
$$ 103624001 101444668 99461120 97501742 95646662 93803541 92071926 90467669 88795047
4874H8795047j474784j413474j447701j256697j288691j103042j099902j014527
$$ 88795047 87320263 85906789 84459088 83202391 81913700 80810658 79710756 78696229
4866G8696229r08111r20444p63365q34745o33837o30799n90771o18865n03930
$$ 78696229 77788118 76867674 76104309 75269564 74635727 74004928 73414157 72795292 72291362
4857G2291362n35579k54771m24351k39799k79594k32316K754q1198j79296R2850
$$ 72291362 71755783 71501012 71076661 70836862 70557268 70324952 70327706 70246508 70067212 70160062
4847G0160062J2876K4063J68537Q5503K11328L57820K22737L24476L72241M38681
$$ 70160062 70172938 70197001 70365538 70451041 70662369 71020189 71242926 71567402 71939643 72378324
4837G2378324M69284M89273M48931N98193O60847O19669Q12731P13168R31538
$$ 72378324 72847608 73336881 73785812 74384005 75044852 75664521 76477252 77190420 78121958
4828G8121958P76344R11880J029034R98684R89195J108053J216428J274654J185125
$$ 78121958 78898302 79810182 80839216 81837900 82827095 83935148 85151576 86426230 87611355
4819H7611355J443366J451454J471671J432867J600549J672887J810805J869887
$$ 87611355 89054721 90506175 91977846 93410713 95011262 96684149 98494954 100364841
4811A00364841J887864K020936K034126K263796K245114K331003K515836K549578
$$ 100364841 102252705 104273641 106307767 108571563 110816677 113147680 115663516 118213094
4803A18213094K685927K780806K957140L075263L091971L316895L416598L640669
$$ 118213094 120899021 123679827 126636967 129712230 132804201 136121096 139537694 143178363
4795A43178363L691974L817213L971296M243738M304508M438798M699950M723255
$$ 143178363 146870337 150687550 154658846 158902584 163207092 167645890 172345840 177069095
4787A77069095M887754N189524N180576N295132N612477N524310N767882N905941
$$ 177069095 181956849 187146373 192326949 197622081 203234558 208758868 214526750 220432691
4779B20432691N900646N994980O069512O006575O118879O060818N977583N874497
$$ 220432691 226333337 232328317 238397829 244404404 250523283 256584101 262561684 268436181
4771B68436181N798646N593395N353613N260144M852572M532845M238634L717041
$$ 268436181 274234827 279828222 285181835 290441979 295294551 299827396 304066030 307783071
4763C07783071L462922K920648K369874K022943J475151R10102L16288l8487p69270
$$ 307783071 311245993 314166641 316536515 318559458 320034609 320944711 321260999 321222512 320453242
4754C20453242j288383j818537k146475k756218l235143l531128l978561m363970
$$ 320453242 319164859 317346322 315199847 312443629 309208486 305677358 301698797 297334827
4746B97334827m694417m873892n333174n463815n487614n855754n891969n852494
$$ 297334827 292640410 287766518 282433344 276969529 271481915 265626161 259734192 253881698
4738B53881698o062522n983838o055037n963340n955300n859551n748069n763530
$$ 253881698 247819176 241835338 235780301 229816961 223861661 218002110 212254041 206490511
4730B06490511n603020n319778n344799n221952n072330m819024m866445m587919
$$ 206490511 200887491 195567713 190222914 185000962 179928632 175109608 170243163 165655244
4722A65655244m591485m257278m231357m103525l889805l832207l509097l526809
$$ 165655244 161063759 156806481 152575124 148471599 144581794 140749587 137240490 133713681
4714A33713681l438302l178715l109974k931837k946818k736605k669451k545211
$$ 133713681 130275379 127096664 123986690 121054853 118108035 115371430 112701979 110156768
4706A10156768k509044k253447k234141k187640k181379k031059j880678j896474
$$ 110156768 107647724 105394277 103160136 100972496 98791117 96760058 94879380 92982906
4698I2982906j726912j733096j563616j603542j448078j449299j390467j306489
$$ 92982906 91255994 89522898 87959282 86355740 84907662 83458363 82067896 80761407
4690H0761407j228721j292364j111060j130181j070175r61056r34725p95454r52297
$$ 80761407 79532686 78240322 77129262 75999081 74928906 73967850 73033125 72237671 71285374
4681G1285374q81495o97185p26999o76161o62893o15259o07336m46047n34843
$$ 71285374 70403879 69706694 68979695 68303534 67640641 67025382 66418046 65971999 65437156
4672F5437156n15246m21675l57444l81573m52202j99831l81492j29799k92790
$$ 65437156 64921910 64500235 64142791 63761218 63309016 63109185 62727693 62597894 62305104
4663F2305104k28298j50153j07000o0891j38307n9282O5677n0079J7021R2717
$$ 62305104 62076806 61926653 61819653 61758762 61620455 61561173 61626850 61576771 61593792 61686509
4653F1686509N8769J81889L8141K57009J86625K24705K47847M38350K42643L93027
$$ 61686509 61745278 61927167 61965308 62222317 62408942 62633647 62881494 63319844 63562487 63955514
4643F3955514L58145M95053M71137N11399M08737O14882N21293O46382O83729
$$ 63955514 64313659 64808712 65279849 65791248 66199985 66814867 67336160 67982542 68666271
4634F8666271P91599O04686R04711P44948Q74260Q61533Q69096R96750J027642
$$ 68666271 69457870 70062556 70967267 71712215 72586475 73448008 74317104 75313854 76341496
4625G6341496Q82114J056641J053006J216392J077486J133526J246140J162753
$$ 76341496 77223610 78280251 79333257 80549649 81627135 82760661 84006801 85169554
4617H5169554J196394J206226J328350J201765J241824J426916J402275J174481
$$ 85169554 86365948 87572174 88900524 90102289 91344113 92771029 94173304 95347785
4609I5347785J369072J368529J398967J306685J512375J388227J460790J435224
$$ 95347785 96716857 98085386 99484353 100791038 102303413 103691640 105152430 106587654
4601A06587654J553086J551492J512425J599529J756494J635003J723474J860561
$$ 106587654 108140740 109692232 111204657 112804186 114560680 116195683 117919157 119779718
4593A19779718J804101K010467J976966K161474K075677K327967K314997K520382
$$ 119779718 121583819 123594286 125571252 127732726 129808403 132136370 134451367 136971749
4585A36971749K507954K625880K754548K783056K935594K995619L175244L261731
$$ 136971749 139479703 142105583 144860131 147643187 150578781 153574400 156749644 160011375
4577A60011375L259500L377135L485269L487614L539877L695396L575539L644279
$$ 160011375 163270875 166648010 170133279 173620893 177160770 180856166 184431705 188075984
4569A88075984L657434L648887L809055L571732L597156L506914L351718L520330
$$ 188075984 191733418 195382305 199191360 202763092 206360248 209867162 213218880 216739210
4561B16739210L304719L068288L148982K788265K762569K635778K399496K231540
$$ 216739210 220043929 223112217 226261199 229049464 231812033 234447811 236847307 239078847
4553B39078847K126106J776285J580994J525176J201595J022513Q74907N87983
$$ 239078847 241204953 242981238 244562232 246087408 247289003 248311516 249186423 249774406
4545B49774406L76561J35422r1269k32471m90429p26036r72445j143298j220990
$$ 249774406 250150967 250286389 250195120 249962649 249472220 248746184 247773739 246630441 245409451
4536B45409451j629633j693021j898483k223918k168847k396297k730922k687559
$$ 245409451 243779818 242086797 240188314 237964396 235795549 233399252 230668330 227980771
4528B27980771k868637k981231l204464l207380l392881l411879l425272l573824
$$ 227980771 225112134 222130903 218926439 215719059 212326178 208914299 205489027 201915203
4520B01915203l688866l560085l757846l561630l583956l755627l547747l606752
$$ 201915203 198226337 194666252 190908406 187346776 183762820 180007193 176459446 172852694
4512A72852694l554245l516930l359251l431922l273749l189852l207272l000761
$$ 172852694 169298449 165781519 162422268 158990346 155716597 152526745 149319473 146318712
4504A46318712k893896l056462k806354k776627k570537k556921k487002k387886
$$ 146318712 143424816 140368354 137562000 134785373 132214836 129657915 127170913 124783027
4496A24783027k325751k310319k304559k118652k126695k094174k013192j909672
$$ 124783027 122457276 120146957 117842398 115723746 113597051 111502877 109489685 107580013
4488A07580013j929493j893732j812144j930623j811125j761591j778083j818158
$$ 107580013 105650520 103756788 101944644 100014021 98202896 96441305 94663222 92845064
4480I2845064j733482j748292j650838j668789j704163j655670j679239j711294
$$ 92845064 91111582 89363290 87712452 86043663 84339500 82683830 81004591 79293297
4472G9293297j580202j556651j511186j663293j555355j467469j494496j450791
$$ 79293297 77713095 76156444 74645258 72981965 71426610 69959141 68464645 67013854
4464F7013854j512192j365895j489603j225647j333938j349678j363481j162388
$$ 67013854 65501662 64135767 62646164 61420517 60086579 58736901 57373420 56211032
4456E6211032j246397j117446j214397j116544j136757q97508j129590r47378
$$ 56211032 54964635 53847189 52632792 51516248 50379491 49481983 48352393 47405015
4448D7405015r88434r89601q24310r59805q40428q55074q30674p53662q66341
$$ 47405015 46416581 45426980 44602670 43642865 42802437 41947363 41116689 40363027 39496686
4439C9496686p19467o12252p99025n77781o88199o80596o46323n32632o38999
$$ 39496686 38777219 38164967 37365942 36788161 36099962 35419366 34773043 34240411 33601412
4430C3601412o00192n04142n34337n61732m86084n64096m14383n26633m13086
$$ 33601412 33001220 32497078 31962741 31401009 30914925 30350829 29936446 29409813 28996727
4421B8996727m48591m28110m61100l97135l79144m73763l29397l36127l81822
$$ 28996727 28548136 28120026 27658926 27261791 26882647 26408884 26079487 25743360 25361538
4412B5361538l29067k84836l91109m57427k95774k43894l49713k78521k29226
$$ 25361538 25032471 24747635 24356526 23899099 23603325 23359431 23009718 22731197 22501971
4403B2501971m23339j79690k72629k35501k41245l03468k25371k69603k37553
$$ 22501971 22078632 21898942 21626313 21390812 21149567 20846099 20620728 20351125 20113572
4394B0113572k66612l10270j17523l02845j06211k14774k24696j55660k20144
$$ 20113572 19846960 19536690 19419167 19116322 19010111 18795337 18570641 18414981 18194837
4385A8194837k81513j50229k82577o2828j64506k04201k08024k35433j01762r7125
$$ 18194837 17913324 17763095 17480518 17417690 17253184 17048983 16840959 16605526 16503764 16406639
4375A6406639j84652j38827j83566j91460j8881k02500j54034r0165k43870o779
$$ 16406639 16221987 16083160 15899594 15708134 15689253 15486753 15332719 15242554 14998684 14991905
4365A4991905k08621k6836k08704j6590j10671k08212j31517r5957j21756k8497
$$ 14991905 14783284 14756448 14547744 14531154 14420483 14212271 14080754 13984797 13863041 13834544
4355A3834544j46483K0304j50294q9608j22312j18451n2401k00216J20923j37819
$$ 13834544 13688061 13708365 13558071 13468463 13346151 13227700 13175299 12975083 13096006 12958187
4345A2958187r4338r3194j49304J6705j35189K3625j48361j2734o6321p5148m8578
$$ 12958187 12863849 12770655 12621351 12638056 12502867 12526492 12378131 12365397 12299076 12223928 12175350
4334A2175350q8883l1714J5559j72531J0651l4689r811j46957p084o2863m5682
$$ 12175350 12086467 12054753 12070312 11897781 11908432 11873743 11863932 11716975 11709891 11647028 11601346
4323A1601346k1953N025j30001n7750P1353r3228j832m5049r3674L6965p7312
$$ 11601346 11579393 11584418 11454417 11396667 11468020 11374792 11372960 11327911 11234237 11271202 11193890
4312A1193890P0258n1808j4999j14849p168k6126o9346j0017r353p2185P4282
$$ 11193890 11264148 11212340 11197341 11082492 11075324 11049198 10979852 10969835 10960482 10888297 10962579
4301A0962579M0841j30167O8755j9447l192o1074N0296r0010L9709l9910o7257
$$ 10962579 11003420 10873253 10942008 10922561 10919369 10858295 10908591 10818581 10858290 10818380 10751123
4290A0751123J8626N9172l2589J9617k447O3342j59172q753N4767p4453M1494
$$ 10751123 10769749 10828921 10796332 10815949 10813502 10876844 10717672 10708919 10763686 10689233 10730727
4279A0730727l9015l8920m2994L3466l9109l2071j4744j0049j42986K8396k8139
$$ 10730727 10691712 10652792 10609798 10643264 10604155 10572084 10557340 10547291 10404305 10432701 10404562
4268A0404562o5332q4536r1797L5300j45919o9961j29513m1395j33995j51876
$$ 10404562 10339230 10254694 10162897 10198197 10052278 9982317 9852804 9811409 9677414 9525538
4258I525538o8208p7443p5137j7518j87874j03926j20884j02125j02405p1372
$$ 9525538 9457330 9379887 9304750 9287232 9099358 8995432 8874548 8772423 8670018 8598646
4248H598646j48269o3254p8478j26464o0782j53971j06234o8066j28577l4167
$$ 8598646 8450377 8387123 8308645 8182181 8121399 7967428 7861194 7793128 7664551 7630384
4238G630384k08765k8373j63309j01379L770j53650r192n0825m8136j36221r3315
$$ 7630384 7421619 7393246 7229937 7128558 7132328 6978678 6969486 6918661 6870525 6734304 6640989
4227F640989j03652o2815M1246j74287j16921N7220j07365l7794n468j21956q8343
$$ 6640989 6537337 6474522 6515768 6341481 6224560 6281780 6174415 6136621 6131153 6009197 5920854
4216E920854M9868j35193j40179L3290n7004l926l9072k1349m2640j40582l6486
$$ 5920854 5970722 5835529 5695350 5728640 5671636 5667710 5628638 5607289 5564649 5424067 5387581
4205E387581J5967j41187N148K1707j7220j34054l2973n276L9565j30762L8295
$$ 5387581 5403548 5262361 5267509 5289216 5271996 5137942 5104969 5099693 5139258 5008496 5046791
4194E046791k5525o9003o4558o0148o5801j0126q996l7054K0558r3872N9143j84327
$$ 5046791 5021266 4952263 4887705 4827557 4761756 4751630 4742634 4705580 4726138 4632266 4691409 4507082
4182D507082j9817Q5043j46071J31628j23060R861r2838M7775o2420j4855L7433
$$ 4507082 4487265 4572308 4426237 4557865 4434805 4444666 4351828 4399603 4337183 4322328 4359761
4171D359761q1910q6437k5293l2751L5030l5219l4436o031k5919j00847N3372
$$ 4359761 4277851 4191414 4166121 4133370 4168400 4133181 4098745 4092714 4066795 3965948 4019320
4160D019320n1406l111p2840N4717q3136k173m7504l8963k3990M9046L2621k5478
$$ 4019320 3967914 3964803 3891963 3946680 3863544 3861371 3813867 3774904 3750914 3799960 3832581 3807103
4148C807103j45407R447k6509j1374Q6744r7522n1443M6711O4950j26524n5434
$$ 3807103 3661696 3671143 3644634 3633260 3720004 3622482 3571039 3617750 3682700 3556176 3500742
4137C500742N4225m426n7401k3683n9369k358k5568M8290j2448m7025o8576J17865
$$ 3500742 3554967 3550541 3493140 3469457 3410088 3407730 3382162 3430452 3418004 3370979 3302403 3420268
4125C420268m3301r9639L9608n7805R804N378l3090L6406p8528N009J833K5016
$$ 3420268 3376967 3277328 3316936 3259131 3268935 3274313 3241223 3277629 3199101 3204110 3205943 3230959
4113C230959r8269J4693l0348M6814l0166j9783m5497q393K0182j04116k6601
$$ 3230959 3132690 3147383 3117035 3163849 3133683 3113900 3068403 3060010 3080192 2976076 2949475
4102B949475P9624K725n2753L560Q0128j31132k5422M482j01036O0837j15777
$$ 2949475 3029099 3031824 2979071 2982631 3062759 2931627 2906205 2910687 2809651 2870488 2754711
4091B754711J32680m0729J7713j25121O9176r8456K6816n511l3145L5510l3916
$$ 2754711 2887391 2846662 2864375 2739254 2808430 2709974 2736790 2731279 2698134 2733644 2699728
4080B699728m6301q367l5829Q177q5457Q5068j0025K081q7825O1281K854q1959
$$ 2699728 2653427 2645060 2609231 2617408 2531951 2617019 2606994 2609075 2521250 2582531 2585385 2503426
4068B503426m4758O3277o175j2274j9648M1099l0398l7637Q808L5131j08188O6698
$$ 2503426 2458668 2521945 2515770 2503496 2483848 2524947 2494549 2456912 2465720 2500851 2392663 2459361
4056B459361q8414o0411J09463M4264q3936J5592k8599L4377n9662L5653J7296
$$ 2459361 2370947 2310536 2419999 2464263 2380327 2395919 2367320 2401697 2342035 2377688 2394984
4045B394984p2941K335K2520Q9921o7981J12320j28821p50N8299K9078n743j9589
$$ 2394984 2322043 2324378 2346898 2436819 2368838 2481158 2352337 2351587 2409886 2438964 2433221 2413632
4033B413632o8946P3153L090o7545Q8983O3646o1915P9527p1756P2323k1744l3893
$$ 2413632 2344686 2417839 2420929 2353384 2442367 2506013 2444098 2523625 2451869 2524192 2502448 2468555
4021B468555M9335O9359j11601P0857M9018J1247L6030N4078n0674N0488o327
$$ 2468555 2517890 2587249 2475648 2546505 2595523 2606770 2642800 2696878 2646204 2696692 2690365
4010B690365K8471j2489J11586J3191N7431j0415j5782J5186N6619J05260o0216
$$ 2690365 2718836 2706347 2817933 2831124 2888555 2878140 2862358 2877544 2934163 3039423 2979207
3999B979207N6016k4551J14915l8473J3678J40089j45088O1417N7021j134o339
$$ 2979207 3035223 3010672 3125587 3087114 3100792 3240881 3095793 3157210 3214231 3213097 3206758
3988C206758l6313J02753j3661o2329P4825K8023L6947r4661J41612q4061J15012
$$ 3206758 3170445 3273198 3259537 3197208 3272033 3300056 3337003 3242342 3383954 3299893 3414905
3977C414905o1958k0074j2647j8343J7696R817j9611q1508L2262j8096q5155n795
$$ 3414905 3352947 3332873 3320226 3301883 3319579 3329396 3309785 3228277 3260539 3242443 3157288 3151493
3965C151493q577L2716j64474K9685j20911K0690j3802j45143L2195n0165L0026
$$ 3151493 3142916 3175632 3011158 3040843 2919932 2940622 2926820 2781677 2813872 2763707 2793733
3954B793733r0722j9970r2839P0943r8587k409j59682P8842j846o5023l3528j6282
$$ 2793733 2703011 2683041 2590202 2661145 2562558 2560149 2400467 2479309 2477463 2412440 2378912 2362630
3942B362630m4340O214j30665J3426K5393m7369p7538l1348m668k0020j02280
$$ 2362630 2318290 2324504 2193839 2207265 2232658 2185289 2107751 2076403 2071735 2051715 1949435
3931A949435p3608q006k612q3156Q785m9034o0388P235l5202k5291n0383m1089
$$ 1949435 1875827 1867821 1865209 1782053 1790838 1741804 1681416 1688651 1653449 1628158 1577775 1536686
3919A536686L0552m9474J4088q3662l6679P8583m9899r3669J4801n2316o3465
$$ 1536686 1567238 1517764 1531852 1448190 1411511 1490094 1440195 1346526 1361327 1309011 1245546
3908A245546k9475j0650J830O209j7995M0597p4340l4776Q0613l7980K9717l8946
$$ 1245546 1216071 1205421 1207251 1213460 1195465 1236062 1161722 1126946 1207559 1169579 1199296 1160350
3896A160350l8048l5812o0548N1863r3225Q6140j00379O1986q118k0455j07316
$$ 1160350 1122302 1086490 1025942 1077805 984580 1070720 970341 1032327 1024209 1003754 896438
3885H96438Q0780J092p2417K2491r6534J33813k9712L4657j7643r060j45236J22450
$$ 896438 977218 978310 905893 928384 831850 965663 935951 970608 952965 943905 798669 921119
3873I21119Q0406j79088O5758j31378k9013N4466O6349n0617L8623j05786J19034
$$ 921119 1001525 822437 888195 756817 727804 782270 848619 798002 836625 730839 849873
3862H49873p3611N00o3939L1069m787l6697j3019j673j325m9077O8634j4820p1817
$$ 849873 776262 776762 712823 743892 739105 702408 689389 687716 686391 637314 705948 691128 619311
3849F19311j8231M0239M1062p0911J19692j07502p1941J3168M3252l9951j1271
$$ 619311 601080 641319 682381 611470 731162 623660 551719 564887 608139 568188 556917
3838E56917P865P203p2271N1131o4595O8622M4153m6176j3846l9101l3110R2132
$$ 556917 564782 571985 499714 550845 486250 554872 599025 552849 539003 499902 466792 558924
3826E58924n1131M3116m8505n422n2221M8566L7066p3560J21205j05048P1480
$$ 558924 507793 550909 502404 496982 444761 493327 530393 456833 578038 472990 544470
3815E44470k7542n0012m7437Q5239j44119J07974p3926Q5884q8972K7933P0833
$$ 544470 516928 466916 419479 504718 360599 468573 394647 480531 391559 419492 490325
3804D90325j15693n146M6859l0153l3915J3879N4111j7178m6217M6267J3272p6894
$$ 490325 374632 369486 416345 386192 352277 366156 420267 403089 356872 403139 416411 339517
3792C39517R1801j02589P2662j01578l433J31919m5237k717p7525N3341n8302
$$ 339517 431318 328729 401391 299813 296380 428299 383062 380345 302820 356161 297859
3781B97859K8668L0022l2608M1594N6078m9504n5979K0733p3465J04352o6474
$$ 297859 326527 356549 323941 365535 421613 372109 316130 336863 263398 367750 301276
3770C01276m9182K146l7964K2678R7293j27497k8128Q5434l6881J19607q3940
$$ 301276 252094 254240 216276 238954 336247 208750 180622 266056 229175 348782 264842
3759B64842o7006J51036j84380N0850O1267N0708q3498j4209l1430J3471K9987
$$ 264842 197836 348872 164492 215342 276609 327317 243819 229610 198180 211651 241638
3748B41638o6698K4533j3505j6159P8199m3329o9847Q2688p3126O878K6243m4151
$$ 241638 174940 199473 185968 169809 248008 204679 134832 217520 144394 151272 177515 133364
3736A33364Q7801m4017l7528R4316j881l8280k8484l591q6029P3789J2868q499
$$ 133364 221165 177148 139620 233936 232055 193775 165291 161700 75671 149460 162328 153829
3724A53829J5373n7599L9790P0527p5594o5014P2374j24650L3748J01693j04551
$$ 153829 169202 111603 151393 221920 146326 81312 153686 29036 62784 164477 59926
3713E9926J36086j16826L9605k5227k4188l419J0317J5564J7779K9480j55537
$$ 59926 196012 79186 118791 93564 69376 65957 76274 91838 109617 139097 -16440
3702a6440J52696j18395M2399j0164p1729Q4000J8314m2299N0386j5377L7553
$$ -16440 136256 17861 60260 50096 -21633 62367 80681 38382 88768 73391 110944
3691A10944j6505l5896R295K3021j68275j1018J40871N1543j14907J3039J27279
$$ 110944 94439 58543 67838 90859 -77416 -88434 52437 103980 -10927 2112 129391
3680A29391q7212J6380o7042N4256K7456j8595m627m4476O0297m5868n2546R7960
$$ 129391 42179 58559 -8483 45773 73229 54634 50007 5531 65828 19960 -32586 65374
3668F5374l4647p2622O9950m1717J5642q6984K1333Q781Q7210l504m9382Q8900
$$ 65374 30727 -41895 28055 -13662 1980 -85004 -63671 -54890 32320 28816 -20566 68334
3656F8334j07433M9525n6248M5871q6195P3831r2489J9301Q0928m5880N446o756
$$ 68334 -39099 10426 -45822 49 -86146 -12315 -104804 -85503 -4575 -50455 -45009 -51765
3644e1765l8096J01993q6819Q5106l7120j23912K6243Q1211p1236K3944L2670
$$ -51765 -89861 12132 -74687 10419 -26701 -150613 -124370 -43159 -114395 -90451 -57781
3633e7781J4480n5038Q217r550L8439k1472M7049m6497J6186m1491l3N4535k7002
$$ -57781 -43301 -98339 -90122 -99672 -61233 -82705 -35656 -82153 -65967 -107458 -107491 -52956 -79958
3620g9958J5403q5924O1281m524N2245m7491o9518J86636j08779L9200r0861Q587
$$ -79958 -64555 -150479 -89198 -93722 -41477 -88968 -158486 28150 -80629 -41429 -132290 -123703
3608a23703l3139M6984q8990J24609n0635l1815L3479n6867j9519R9966j146l8328
$$ -123703 -156842 -109858 -198848 -74239 -124874 -156689 -123210 -180077 -199596 -99630 -100776 -139104
3596a39104n1497L1336M9995K9095n2810N0061q0876O4941M857k9035k0384J1884
$$ -139104 -190601 -159265 -109270 -80175 -132985 -82924 -163800 -98859 -94002 -123037 -143421 -131537
3584a31537O8578n7636j1868l5180M5743m5084J8639n9467M0168n2774P7727n3836
$$ -131537 -62959 -120595 -132463 -167643 -121900 -166984 -148345 -207812 -167644 -220418 -142691 -196527
3572a96527P3438l3103j6451r001p119K6576J2170l5184J0220P6878n1197r0752
$$ -196527 -123089 -156192 -172643 -181644 -188763 -162187 -150017 -185201 -174981 -98103 -149300 -240052
3560b40052O1332K1591l1454k3599M9012k8642R658K7755P498o0825M1561q467
$$ -240052 -178720 -157129 -188583 -212182 -163170 -191812 -182154 -154399 -146901 -207726 -166165 -174632
3548a74632K2458k3926r9642K2586J56450j40677P7095n6708N5448L2053n0541
$$ -174632 -152174 -176100 -275742 -253156 -96706 -237383 -160288 -216996 -161548 -129495 -180036
3537a80036m0137o7791M1224J071l0564P8807L3002k0080k9970j8238j8547O0648
$$ -180036 -220173 -287964 -246740 -245669 -276233 -197426 -164424 -184504 -214474 -232712 -251259 -190611
3525a90611n3628k0469M2613m5743K0416m939J771P1592l2587K0093o3966p911
$$ -190611 -244239 -264708 -222095 -267838 -247422 -252361 -250590 -178998 -211585 -191492 -255458 -263369
3513b63369R1899m4715r5598K7802k2669j9361L0028P2222l3718m6329P5485q5164
$$ -263369 -171470 -216185 -311783 -283981 -306650 -326011 -295983 -223761 -257479 -303808 -228323 -313487
3501c13487j3207K666L6008K7313n4451k4607O8542M199J06030O518j15360l3065
$$ -313487 -326694 -324028 -288020 -260707 -315158 -339765 -271223 -267024 -160994 -154476 -269836 -302901
3489c02901M2184M4347j4568j70424J47166J426j4034o863P4367q0192M7793K159
$$ -302901 -260717 -216370 -230938 -401362 -254196 -252770 -266804 -273667 -199300 -279492 -231699 -229540
3477b29540m3102L896P0973o5622l6183p956P0356p9830K0618M8491J6700m3042
$$ -229540 -272642 -268746 -197773 -263395 -299578 -307534 -237178 -317008 -296390 -247899 -231199 -274241
3465b74241J01491q5323n4003M5199m2872K9345K8988O2336J1477p1302p9097
$$ -274241 -172750 -258073 -312076 -266877 -309749 -280404 -251416 -189080 -177603 -248905 -328002
3454c28002P5875q3791k4035P1938j7346P9123j07175L8589k4731K5291K9214
$$ -328002 -252127 -335918 -359953 -288015 -305361 -226238 -333413 -294824 -319555 -294264 -265050
3443b65050l9363O2895j19311Q8900l7038K0361O9100q496l5525j2858l3913m809
$$ -265050 -304413 -241518 -360829 -271929 -308967 -288606 -219506 -228002 -263527 -276385 -310298 -315107
3431c15107L6702M4945p4734N2613j6475J40074j50610K0654p2082J21735q783
$$ -315107 -278405 -233460 -308194 -255581 -272056 -131982 -282592 -261938 -334020 -212285 -221068
3420b21068r6221k749O4118o1555M8745K5959n2656O5883o0834o2565N8694p560
$$ -221068 -317289 -320038 -255920 -317475 -268730 -242771 -295427 -229544 -290378 -352943 -294249 -301809
3408c01809M7367k6124P2335o1851R5987o4157M539q7473J57358q4657R8250n2058
$$ -301809 -254442 -280566 -208231 -270082 -174095 -238252 -233713 -321186 -163828 -248485 -150235 -202293
3396b02293r5488J03689K4202o6205R1609j00173O7383M6167o2050L4650p183
$$ -202293 -297781 -194092 -169890 -236095 -144486 -244659 -177276 -131109 -193159 -158509 -165692
3385a65692J7271l432p9436P0387O1148j75957N6170O5539m5321J28555n2191
$$ -165692 -148421 -151853 -231289 -160902 -99754 -275711 -219541 -154002 -199323 -70768 -122959
3374a22959m0235j6376N9436j5233N2773j9700N3969j16560J07830m3340Q9906
$$ -122959 -163194 -179570 -120134 -135367 -82594 -102294 -48325 -164885 -57055 -100395 -10489
3363a0489p7645m5216J03040j937J5999N0341Q212j30282K13882j9495m6010J9564
$$ -10489 -88134 -133350 -30310 -32247 -16248 34093 42305 -87977 125905 106410 60400 79964
3351G9964l315O6488k7768J9054J20375m7443k0803L2200K9166J2856Q7459j5706
$$ 79964 76649 143137 115369 134423 254798 207355 186552 218752 247918 260774 348233 332527
3339C32527R5283k6908N4102k2111P2267O3859O1598n8691M7054J55507J4998
$$ 332527 427810 400902 455004 432893 505160 569019 630617 571926 618980 774487 789485
3328G89485J50525n6768R9444J848J46474P1027j415K3595R6309O8727Q1942J20860
$$ 789485 940010 883242 982686 984534 1131008 1202035 1200620 1224215 1320524 1389251 1471193 1592053
3316A592053j308Q8572N7952L1193J18523J2116J39746o6272R0126L1838J9592
$$ 1592053 1590745 1679317 1737269 1768462 1886985 1899101 2038847 1972575 2062701 2094539 2114131
3305B114131K8920j34632M5709M0145j47819J5540p8652o8315p0649p7910k4780
$$ 2114131 2143051 2008419 2054128 2094273 1946454 1961994 1883342 1815027 1744378 1666468 1641688
3294A641688q6150n7785j58933k9211l2228j7504p0217j53822l4127r1479j8280
$$ 1641688 1555538 1497753 1338820 1309609 1277381 1259877 1189660 1035838 1001711 910232 891952
3283H91952l3062j58536j8137K3443K2923j81981j52872Q3119q012l8052k1554
$$ 891952 858890 700354 682217 705660 728583 546602 393730 476849 468837 430785 409231
3272D09231r4341L492j4697k2208p4899r7268J00551o8070L2898m5192k3896l2889
$$ 409231 314890 318382 303685 281477 206578 109310 209861 141791 174689 129497 105601 72712
3260G2712p9872Q4529j40737N4041n1262q651O4243q0613o9865J7700l0244K0566
$$ 72712 -7160 77369 -63368 -9327 -60589 -69240 -4997 -85610 -155475 -137775 -168019 -147453
3248a47453l1629l6303P5450l1408o6088J8514R3800n4408l9572q1236Q4260J5508
$$ -147453 -179082 -215385 -139935 -171343 -237431 -218917 -125117 -179525 -219097 -300333 -216073 -200565
3236b00565l4586J5984J3110n7185l6139M2250p8295R9744o8551o1780Q6525K7808
$$ -200565 -235151 -219167 -206057 -263242 -299381 -257131 -335426 -235682 -304233 -366013 -279488 -251680
3224b51680l2253o7885L4863n7149M4853J7049r2849j0087M8976j6069P5301o5838
$$ -251680 -283933 -351818 -316955 -374104 -329251 -312202 -405051 -415138 -366162 -382231 -306930 -372768
3212c72768k9086N7574j5574m4617n3218J02428m7529J5493m7947l2911L5040
$$ -372768 -401854 -344280 -359854 -404471 -457689 -355261 -402790 -387297 -435244 -468155 -433115
3201d33115Q161O0005j00752N5096o33P306P704q9431J10559m7865q556l4983
$$ -433115 -424954 -364949 -465701 -410605 -411238 -403932 -396228 -485659 -375100 -422965 -431521 -466504
3189d66504J4333J4575l1389K1661M8785j46954R9781j0269J483N1177j0860n2216
$$ -466504 -452171 -437596 -468985 -447324 -398539 -545493 -445712 -455981 -454498 -403321 -414181 -466397
3177d66397N8714n8537K7708j1900k4051Q4180r0588n3129K1301J7677L1105m7938
$$ -466397 -407683 -466220 -438512 -450412 -474463 -390283 -480871 -534000 -512699 -495022 -463917 -511855
3165e11855N7935J9713n4861k3208j5019R663J13965p7328l6768O2873m0396m3961
$$ -511855 -453920 -434207 -489068 -512276 -527295 -517632 -403667 -480995 -517763 -454890 -495286 -539247
3153e39247l4681N4752R0591j25905j0116M2315O0364l1995N128n5532K9794n576
$$ -539247 -573928 -519176 -428585 -554490 -564606 -522291 -461927 -493922 -488794 -544326 -514532 -520108
3141e20108o646J7796n6924P9851n7729L5838k5657L5448O7358p6592k7697R1347
$$ -520108 -526754 -508958 -565882 -486031 -543760 -507922 -533579 -498131 -430773 -507365 -535062 -443715
3129d43715n5468j1900P5008k4740L64o4831J17050j05509n1985K3542L1924j8467
$$ -443715 -499183 -511083 -436075 -460815 -460451 -525282 -408232 -513741 -565726 -542184 -510260 -528727
3117e28727O749k1730K6396L2504K3744j01788J9876J4492k2908R0430j18855
$$ -528727 -521978 -543708 -517312 -484808 -461064 -562852 -542976 -528484 -551392 -460962 -579817
3106e79817M305N5576p5526k34L8561N93L1773l1385N997L9008n7445Q796l1973
$$ -579817 -575512 -519936 -595462 -595696 -557135 -556542 -524769 -556154 -550157 -511149 -568594 -559798 -591771
3093e91771O7779o4627P7303n6744j7753L5859k5364J4392L2400j20603K5853
$$ -591771 -523992 -588619 -511316 -568060 -585813 -549954 -575318 -560926 -528526 -649129 -623276
3082f23276N9798L0827m5364k220k2857O2866P1336j39037R5617q8585L5341j03558
$$ -623276 -563478 -532651 -578015 -580235 -603092 -540226 -468890 -607927 -512310 -600895 -565554 -669112
3070f69112R1727M2302o3777j1149m5088O9462j801K2121j1066k0165N3723j5921
$$ -669112 -577385 -535083 -598860 -610009 -655097 -585635 -587436 -565315 -576381 -596546 -542823 -558744
3058e58744o4607K4191n6096J32295n5093k475J6269O004j8283j2505j228L6641
$$ -558744 -623351 -599160 -655256 -522961 -578054 -580529 -564260 -558256 -576539 -589044 -590272 -553631
3046e53631j13301R6538l0369l2903J05758k0153K07j4760q7150R8323n7685J8244
$$ -553631 -666932 -570394 -600763 -633666 -527908 -548061 -547854 -562614 -649764 -551441 -609126 -590882
3034e90882M8051o6977m7539K663O4746N234q3031L3635M2955N3470j03277J08361
$$ -590882 -542831 -609808 -657347 -654684 -589938 -584704 -667735 -634100 -591145 -537675 -640952 -532591
3022e32591p1301r067J6586n0372N1923r8295J24745j05937O3441k5778N485N5448
$$ -532591 -603892 -612959 -596373 -646745 -594822 -693117 -568372 -674309 -610868 -636646 -631161 -575713
3010e75713N881L845k1090o2920L2038J8414j2119j7058L7897L7097m0029L8379
$$ -575713 -569832 -565987 -587077 -649997 -617959 -599545 -611664 -628722 -590825 -553728 -593757 -555378
2998e55378k1223j15838M7056L3011k7741l6711R9102l4441L6308P02l943m4241
$$ -555378 -576601 -692439 -645383 -612372 -640113 -676824 -577722 -612163 -575855 -575153 -579096 -623337
2986f23337k842n0272O6194o5065L1516Q2516l4139n9985K7263J5854m5274o0287
$$ -623337 -626179 -676451 -610257 -675322 -643806 -561290 -595429 -655414 -628151 -612297 -657571 -717858
2974g17858N8233L0605q532K8485p3783J11225p5223L6560q5229R9346L3526p1444
$$ -717858 -659625 -629020 -637552 -609067 -682850 -571625 -646848 -610288 -695517 -596171 -562645 -634089
2962f34089Q8602o5683j13893P6935J10111j43083k331j4614J09674m6955n0907
$$ -634089 -545487 -611170 -725063 -648128 -538017 -681100 -683431 -698045 -588371 -635326 -686233
2951f86233K6508L6991p9617P9643j0914O936p1760K8626M0798K5537k612r8272
$$ -686233 -659725 -622734 -702351 -622708 -633622 -626686 -698446 -669820 -629022 -603485 -606097 -704369
2939g04369N0846K38J0632K1325k1969N9915n4563K2548j27927J54809m0782J1050
$$ -704369 -653523 -653285 -642653 -621328 -643297 -583382 -637945 -615397 -743324 -588515 -629297 -618247
2927f18247q2896R7633l1225l6760P1412n1510J0358K5606n5797O7771l1222Q3518
$$ -618247 -701143 -603510 -634735 -671495 -600083 -651593 -641235 -615629 -671426 -603655 -634877 -551359
2915e51359j58532L1466M4731k5136K6676l8542K7409l9156N156J3133R8373m0202
$$ -551359 -709891 -678425 -633694 -658830 -632154 -670696 -643287 -682443 -677287 -664154 -565781 -605983
2903f05983l4526j6899k3799M1777r675o9302K0825J9000N1165n169r6955N0693
$$ -605983 -640509 -657408 -681207 -639430 -649105 -718407 -697582 -678582 -627417 -632586 -729541 -678848
2891f78848Q9578p7943k8324Q352P9746p2369L0223l0836M1394l5811J406M4815
$$ -678848 -589270 -667213 -695537 -687185 -607439 -679808 -649585 -680421 -639027 -674838 -673432 -628617
2879f28617j09018Q3339m3272N3729j0598L7960M920k3521o0509J15733q2523
$$ -628617 -737635 -654296 -697568 -643839 -654437 -616477 -611557 -635078 -695587 -579854 -662377
2868f62377L2916K4890p8106K4097K3872j27566J81935p7844j8867J8184l5859
$$ -662377 -629461 -604571 -682677 -658580 -634708 -762274 -580339 -658183 -677050 -658866 -694725
2857f94725J2285j3150P9954p6837K1355l7890m867P4714l0940K6463m946N703
$$ -694725 -682440 -695590 -615636 -692473 -671118 -709008 -713875 -639161 -670101 -643638 -648584 -642881
2845f42881j7179N839K8669l8490j7259m854J3489N2928n4545l5296q371j0526
$$ -642881 -660060 -654221 -625552 -664042 -681301 -686155 -672666 -619738 -674283 -709579 -717950 -728476
2833g28476J12653l9820n2391L2449K6571l9462J417k7872J0421L3399l9182J6424
$$ -728476 -615823 -655643 -708034 -675585 -649014 -688476 -687059 -714931 -704510 -671111 -710293 -693869
2821f93869J8560J7601q798N6281j10483L5452j4413M9246j1655K4322k1915L9388
$$ -693869 -675309 -657708 -666506 -610225 -720708 -685256 -699669 -650423 -662078 -637756 -659671 -620283
2809f20283j25737P1717L7048p035m0893o8156N4601N5773r0351O3942k2956L4421
$$ -620283 -746020 -674303 -637255 -644290 -685183 -753339 -698738 -642965 -733316 -669374 -692330 -657909
2797f57909j4086J4821m4390P155N9877L4164l1624k830k9416m4021J1784J9942
$$ -657909 -671995 -657174 -701564 -694409 -634532 -600368 -631992 -634822 -664238 -708259 -696475 -676533
2785f76533o826l8311J7657K027J1035k5114O4598k3307O3765o3048m3511Q8879
$$ -676533 -683359 -721670 -704013 -701986 -690951 -716065 -651467 -674774 -611009 -674057 -717568 -628689
2773f28689O187p5398k4820J22986j15426K090k8792N0745k6725P9114j1293p7585
$$ -628689 -622502 -697900 -722720 -599734 -715160 -713070 -741862 -691117 -717842 -638728 -650021 -727606
2761g27606o877P1979K4412r8055O4499k4477k89K9489l0535J0582J01203j12513
$$ -727606 -734483 -662504 -638092 -736147 -671648 -696125 -696414 -666925 -697460 -686878 -585675 -698188
2749f98188l5756R5369J7059k0070o4114p5753N3961n056L9896R2818q7892K1980
$$ -698188 -733944 -638575 -621516 -641586 -705700 -781453 -727492 -732548 -692652 -599834 -687726 -665746
2737f65746P355N356J882l8101j0244L316q983P7049j2395J2147L8467j29230
$$ -665746 -658391 -653035 -651153 -689254 -699498 -696182 -705165 -628116 -640511 -628364 -589897 -719127
2725g19127J1656N6137L5113n5988K7621j10028N4515J53L5038o8393Q073J8780
$$ -719127 -707471 -651334 -616221 -672209 -644588 -754616 -700101 -699948 -664910 -733303 -725230 -706450
2713g06450J4050l3394m9336O7932M398M0498j0038O5713p9777j2713l9484N807
$$ -706450 -692400 -725794 -775130 -707198 -702800 -662302 -672340 -606627 -686404 -699117 -738601 -732794
2701g32794j2685L078m8548O3330L9551k1566k5402M7739l4111K4685K1931k8523
$$ -732794 -745479 -742401 -790949 -727619 -688068 -709634 -735036 -687297 -721408 -696723 -674792 -703315
2689g03315m6588N0806J5425K4474L8391q695o1121K6762l6192P2351n1599M7163
$$ -703315 -749903 -699097 -683672 -659198 -620807 -629502 -690623 -663861 -700053 -627702 -679301 -632138
2677f32138m4319k2622Q4129j88630J20951p4901O4991N9509k627q3231j2110
$$ -632138 -676457 -699079 -614950 -803580 -682629 -757530 -692539 -633030 -635657 -718888 -730998
2666g30998l182M0031k9743k527q0276J06042K5264m8415N6044K5116O986j56933
$$ -730998 -734180 -694149 -723892 -726419 -806695 -700653 -675389 -723804 -667760 -642644 -635658 -792591
2654g92591L9356N6086n941L4584l8997j4579L866K9209k2233N3875m5848j0320
$$ -792591 -753235 -697149 -703090 -668506 -707503 -722082 -718216 -689007 -711240 -657365 -703213 -713533
2642g13533Q1384n0703M1516l4531N9175o5719J3029O0880k06447J53165l3055
$$ -713533 -632149 -682852 -641336 -675867 -616692 -682411 -669382 -608502 -814949 -661784 -694839
2631f94839O8l0683J3959O8760q3047M2104j9219O145R8328j50703Q6665p2110
$$ -694839 -694771 -725454 -711495 -642735 -725782 -683678 -702897 -696752 -598424 -749127 -662462 -734572
2619g34572K1128K691P8068n6934J7037O7253j28226Q6348n2783J3684q998K1253
$$ -734572 -713444 -710753 -632685 -689619 -672582 -605329 -733555 -647207 -699990 -686306 -695304 -674051
2607f74051p5668R1586m7608k4071J4640M5523j7456p381J5944q541J1231l7857
$$ -674051 -749719 -658133 -705741 -729812 -715172 -669649 -687105 -694486 -678542 -687083 -675852 -713709
2595g13709K438J0001M0641p7554J09625r8796j0100M0891k4006J06103r0668
$$ -713709 -711271 -701270 -660629 -738183 -628558 -727354 -737454 -696563 -720569 -614466 -705134
2584g05134o811J8154J2525m2899J04060J021j9753j63630J13369K8183p1613
$$ -705134 -711945 -693791 -681266 -724165 -620105 -619084 -638837 -802467 -689098 -660915 -732528
2573g32528R8165j15422Q2375o5280N7080j6317j3943N2050l4822q7884P9357
$$ -732528 -634363 -749785 -667410 -732690 -675610 -691927 -705870 -653820 -688642 -776526 -697169
2562f97169L6660j57988J00782L134q5455J21498m5888p9791j1355J10546n9099
$$ -697169 -660509 -818497 -717715 -714581 -800036 -678538 -724426 -804217 -815572 -705026 -764125
2551g64125J759O4301J6976K3836k46o4956M3049K6908R325q0775L685j1739k6892
$$ -764125 -762366 -698065 -681089 -657253 -657499 -722455 -679406 -652498 -643173 -723948 -720263 -732002 -758894
2538g58894Q8286m9296l0564P3410l2234m3203N1690J49441j89595Q1376j15137
$$ -758894 -670608 -719904 -750468 -677058 -709292 -752495 -700805 -551364 -740959 -659583 -774720
2527g74720O0995m0896l605J3174P1425n7867K9622j8387k9256Q5203L6983l5109
$$ -774720 -713725 -754621 -758226 -745052 -673627 -731494 -701872 -720259 -749515 -664312 -627329 -662438
2515f62438n0652N7990j25787Q9159O5187k5534m8516J8666n226k8760M8456R427
$$ -662438 -713090 -655100 -780887 -691728 -626541 -652075 -700591 -681925 -687151 -715911 -667455 -658028
2503f58028l8072k3633R1637l5565J6109k5516l1068k7734O7575k1499k5578l524
$$ -658028 -696100 -719733 -628096 -663661 -647552 -673068 -704136 -731870 -664295 -685794 -711372 -714896
2491g14896J0146K8091K5255j31054M7392l1817M4941k9080R3357K1783j13023
$$ -714896 -704750 -676659 -651404 -782458 -735066 -766883 -721942 -751022 -657665 -635882 -748905
2480g48905R9646M2763j78478L5821Q5769o5106L8251r4026Q5404q5656J67196
$$ -748905 -649259 -606496 -784974 -749153 -663384 -728490 -690239 -784265 -698861 -784517 -617321
2469f17321n3907o1309k4391M5797j795o853Q2141o1440l2921R0288n9108Q3584
$$ -617321 -671228 -732537 -756928 -711131 -712926 -719779 -637638 -699078 -731999 -641711 -700819 -617235
2457f17235M239m9898k8981L6522L5818j7064p0206j8104J03755q4373M5500j196
$$ -617235 -612996 -662894 -691875 -655353 -619535 -636599 -706805 -724909 -621154 -705527 -660027 -661223
2445f61223o8542j5038N9320N2410k7001m7205J600M8742k9513O9346q1098J5080
$$ -661223 -729765 -744803 -685483 -633073 -660074 -707279 -705679 -656937 -686450 -617104 -698202 -683122
2433f83122O18o7361M2546J5452P4233j2917j26749Q6252J1414j08952M1370P695
$$ -683122 -682504 -749865 -707319 -691867 -617634 -630551 -757300 -671048 -659634 -768586 -727216 -719521
2421g19521N4763n425Q116q8769N8689k0396P745q873N4346j29558J16854o3845
$$ -719521 -664758 -670183 -662067 -750836 -692147 -712543 -704798 -713671 -659325 -788883 -672029 -735874
2409g35874O4951l542j9477K3845l944k7402N6907q6343N3173n8346N7149j16241
$$ -735874 -670923 -674465 -693942 -670097 -674041 -701443 -644536 -730879 -677706 -736052 -678903 -795144
2397g95144J27545K9086p5028N495Q5270j8739j22129Q3445m6743j773k467J16962
$$ -795144 -667599 -638513 -713541 -708046 -622776 -641515 -763644 -680199 -726942 -728715 -731182 -614220
2385f14220n7673k6384M9297p647L5158p0524M5332l3018m0296R8151j30836O6639
$$ -614220 -671893 -698277 -648980 -656627 -621469 -691993 -646661 -679679 -719975 -621824 -752660 -686021
2373f86021O245r556k094O3199m2126q957P7745j17446Q9056r6580O8871j8454
$$ -686021 -679776 -689332 -691426 -628227 -670353 -679310 -601565 -719011 -629955 -726535 -657664 -676118
2361f76118O006J6409K8637n9279n5812P0904K4663l0388P3356n0121q1605M4560
$$ -676118 -670112 -653703 -625066 -684345 -740157 -669253 -644590 -674978 -601622 -651743 -733348 -688788
2349f88788j7910K764N4502j19746P1819j5605k8848N4698L6551p9990r9194J67651
$$ -688788 -706698 -703934 -649432 -769178 -697359 -712964 -741812 -687114 -650563 -730553 -829747 -662096
2337f62096j00655J00279n8599P1354j36409P8982N2940J5847j8525k7993N539
$$ -662096 -762751 -662472 -721071 -649717 -786126 -707144 -654204 -638357 -656882 -684875 -679336
2326f79336Q47o14k1035J16886j53351K5191r642J2798P936R0045o8980R496j2111
$$ -679336 -678489 -679103 -700138 -583252 -736603 -711412 -721054 -708256 -700320 -610275 -679255 -669759 -681870
2313f81870J5787L8314k2963q785r36m5523J09130j10715K9020l4402M2183Q9022
$$ -681870 -666083 -627769 -650732 -659517 -660453 -705976 -596846 -707561 -678541 -712943 -670760 -581738
2301e81738m9698o8672l6764N7662l563K7842k8049N3064k5588K4J4499p3164
$$ -581738 -631436 -700108 -736872 -679210 -682773 -654931 -682980 -629916 -655504 -655480 -640981 -714145
2289g14145O7570L5284p7670J4706K3498r856l9157J0067l2117l5540J49669j06053
$$ -714145 -646575 -611291 -688961 -674255 -650757 -660613 -699770 -689703 -721820 -757360 -607691 -713744
2277g13744K450N9445q0685M8389M1462l6080m0195L0247k0715J7962L0301K9442
$$ -713744 -711294 -651849 -732534 -684145 -642683 -678763 -718958 -688711 -709426 -691464 -661163 -631721
2265f31721q5004J5938R453m9665J43847o2684o8332k5444N4502O2912j01681
$$ -631721 -716725 -700787 -691334 -740999 -597152 -659836 -728168 -753612 -699110 -636198 -737879
2254g37879L2946M5539j8401k2952O9115k5804p8148L4883j5061M8210n6999N1871
$$ -737879 -704933 -659394 -677795 -700747 -631632 -657436 -735584 -700701 -715762 -667552 -724551 -672680
2242f72680k1071J1209K2045l472q356l2861N0494o3749J09589o8451j7306L1193
$$ -672680 -693751 -682542 -660497 -663969 -672325 -705186 -654692 -718441 -608852 -677303 -694609 -663416
2230f63416l9275O6184k2352j1840J97m454r135j0342K9223r0168J51847j5688
$$ -663416 -702691 -636507 -658859 -670699 -670502 -674956 -684091 -694433 -665210 -755378 -603531 -619219
2218f19219o6019j2137N1706n2789l1337l1619J9598M9617k5550J06301j41j22489
$$ -619219 -685238 -697375 -645669 -698458 -729795 -761414 -741816 -692199 -717749 -611448 -611589 -734078
2206g34078P0649R401j644j1199K279j4136M3439p7066k4882L4833Q9058q9211
$$ -734078 -663429 -654028 -655672 -666871 -664592 -678728 -635289 -712355 -737237 -702404 -613346 -702557
2194g02557N2136K3747k908L4537o1828p0769J7584J06827n7740R779K7327o625
$$ -702557 -650421 -626674 -629582 -595045 -656873 -727642 -710058 -603231 -660971 -651192 -623865 -630490
2182f30490p216n4346O1244R976k1919l9734L356O8353n3697k2679Q478M2594
$$ -630490 -637706 -692052 -630808 -620832 -642751 -682485 -679129 -610776 -664473 -687152 -678674 -636080
2170f36080m8311K1184K743O2132j8702n2211l0957p396k115L7112m0115J00419
$$ -636080 -684391 -663207 -660464 -598332 -617034 -669245 -700202 -707598 -709713 -672601 -712716 -612297
2158f12297o0711k6988N6557P694j7199K777q6331J14594n7520J495j8786N0321
$$ -612297 -673008 -699996 -643439 -635745 -652944 -650167 -736498 -621904 -679424 -677929 -696715 -646394
2146f46394l2354j7750l8083R7270K6924K1332r107o5551L4433J1338m3393N9223
$$ -646394 -678748 -696498 -734581 -637311 -610387 -589055 -598162 -663713 -629280 -617942 -661335 -602112
2134f02112q9315O4511n8147Q6053j14597K7821R37N1284p579m8424J7391N5172
$$ -602112 -691427 -626916 -685063 -599010 -713607 -685786 -684849 -633565 -641144 -689568 -672177 -617005
2122f17005m9028M032J26381j87943J13292m8657P7774j5919n3492L3539o2570
$$ -617005 -666033 -662001 -535620 -723563 -610271 -658928 -581154 -597073 -650565 -617026 -679596
2111f79596m0934J27766j08645Q3633m6890o0478P6415j9395L3368K4973l797
$$ -679596 -720530 -592764 -701409 -617776 -664666 -725144 -648729 -668124 -634756 -609783 -613580
2100f13580J1526J9105j04351j7026O6953j3916p8458P2006r147K4150K7541J0296
$$ -613580 -602054 -582949 -687300 -704326 -637373 -651289 -729747 -657741 -666888 -642738 -615197 -604901
2088f04901o8347k0012M5135J3874K0743n6684o0093q123P6143l0234J23223j08751
$$ -604901 -673248 -693260 -648125 -634251 -613508 -670192 -730285 -738408 -662265 -692499 -569276 -678027
2076f78027M1802k4330k0806M9889k1592J0914J3484r558O216J7562l6489M6483
$$ -678027 -636225 -660555 -681361 -631472 -653064 -642150 -628666 -638224 -632008 -614446 -650935 -604452
2064f04452j29522J22330l0346M7873p5500M8773n8862k0688r803L8873k2668
$$ -604452 -733974 -611644 -641990 -594117 -669617 -620844 -679706 -700394 -710197 -671324 -693992
2053f93992j2712O3193k2514J02343j25789R1967o469j31512N8855l2646J06012
$$ -693992 -706704 -643511 -666025 -563682 -689471 -597504 -603973 -735485 -676630 -709276 -603264
2042f03264o0062m6135K4194K798L585K6856K5727q6823P3892o0118O1681J9041
$$ -603264 -663326 -709461 -685267 -682469 -678884 -652028 -626301 -713124 -639232 -699350 -637669 -618628
2030f18628j01708L6765M393K5043n9998J13797k3594K3466n9946M1741J7629
$$ -618628 -720336 -683571 -679178 -654135 -714133 -600336 -623930 -600464 -660410 -618669 -601040
2019f01040j2328M2735r0818R0941l1709r2582O1404k32P7373r0652L3199j07703
$$ -601040 -613368 -570633 -661451 -570510 -602219 -694801 -633397 -633629 -556256 -646908 -613709 -721412
2007g21412Q2398k8376K2469L4701p8906J07208o5769k4392R7162l6939l0045
$$ -721412 -639014 -667390 -644921 -610220 -689126 -581918 -647687 -672079 -574917 -611856 -641901
1996f41901K9507J9193m9654ql6820O6860k6887J07935n8346j13477J28118n1940
$$ -641901 -612394 -593201 -642855 -642863 -679683 -612823 -639710 -531775 -590121 -703598 -575480 -627420
1984f27420l0777J6344q353q0860P8447J6130J3601m7831N5581L3362k9113j21250
$$ -627420 -658197 -641853 -650206 -731066 -652619 -636489 -622888 -670719 -615138 -581776 -610889 -732139
1972g32139Q1664J02356p4192l8990Q669k9152M7419N9494j0855p0661M6851m6208
$$ -732139 -650475 -548119 -622311 -661301 -652632 -681784 -634365 -574871 -585726 -656387 -609536 -655744
1960f55744R2307J146o4490R977o0345M0302l118J9985q3585P7844O289N442J267
$$ -655744 -563437 -562291 -626781 -616804 -677149 -636847 -639965 -619980 -703565 -625721 -619432 -613990 -612723
1947f12723J7308j24897J00954K6146m9937M1331n0936J1443J1291k1182M474
$$ -612723 -595415 -720312 -619358 -593212 -643149 -601818 -652754 -641311 -630020 -651202 -646728
1936f46728N5429j04730P9870k7382O1470l7147M3575l6356o628k9243J6609k9964
$$ -646728 -591299 -696029 -616159 -643541 -582071 -619218 -575643 -611999 -618627 -647870 -631261 -661225
1924f61225M0807k1148O0693J9378j6127p4830q596L8770J4040p965j1213K6113
$$ -661225 -620418 -641566 -580873 -561495 -577622 -652452 -661048 -622278 -608238 -616203 -627416 -601303
1912f01303m2023k1794O1740R787r7171N9905o9831J90687l7610l3359j14855
$$ -601303 -643326 -665120 -603380 -593593 -690764 -630859 -700690 -510003 -547613 -580972 -695827
1901f95827J30720o9457j3843L2492K2148j7342M0490k9300J8895l9480L3936
$$ -695827 -565107 -634564 -648407 -615915 -593767 -611109 -570619 -599919 -581024 -620504 -586568
1890e86568j1846m289K2990l5742J5716L6559n8190L4405N3635J6447j15936M4584
$$ -586568 -598414 -602703 -579713 -615455 -599739 -563180 -621370 -586965 -533330 -516883 -632819 -588235
1878e88235k6097O026K8826m6215j5436J8057L0107L1880q2752R5697k3872p10
$$ -588235 -614332 -608306 -579480 -625695 -641131 -623074 -592967 -561087 -643839 -548142 -572014 -572724
1866e72724J1445k6293l9839K2962L288K3259o9781J04901m9035j6072n20N5814
$$ -572724 -561279 -587572 -627411 -604449 -601161 -577902 -647683 -542782 -591817 -607889 -608409 -552595
1854e52595o633o7406N6784q3559R9233j7602q0145P0803k8906k3741O099L2522
$$ -552595 -559228 -626634 -569850 -653409 -554176 -571778 -651923 -581120 -610026 -633767 -627668 -595146
1842e95146m9072N6897j04220J80097N442q4163j17284J15554l9856L3770Q3077
$$ -595146 -644218 -587321 -691541 -511444 -506002 -590165 -707449 -591895 -631751 -597981 -514904
1831e14904r9732M0298o847l2308k3801l3398J0583O4395j7781k4227m2817K3353
$$ -514904 -614636 -574338 -581185 -613493 -637294 -670692 -660109 -595714 -613495 -637722 -680539 -657186
1819f57186J19642p5655P8548l5959l2217l7736Q1919k7601L3214M9855j04012
$$ -657186 -537544 -613199 -534651 -570610 -602827 -640563 -558644 -586245 -553031 -503176 -607188
1808f07188L2069o8897J51734q4528m2255K6741k4921O6582m4555j6935J6255
$$ -607188 -575119 -644016 -492282 -576810 -619065 -592324 -617245 -550663 -595218 -612153 -595898
1797e95898n2717J26171k2624J8085M5049j21920M3882o0555O6641L9662j08011
$$ -595898 -648615 -522444 -545068 -526983 -481934 -603854 -559972 -620527 -553886 -514224 -622235
1786f22235R4358o5201j8044M075P4180j48456K6385K4040p967J26202r1547P3997
$$ -622235 -527877 -593078 -611122 -607047 -532867 -681323 -654938 -630898 -638865 -512663 -604210 -530213
1774e30213N387o2993j7583M7021N3022j6815n1673k8170m0394L1534Q7692K9489
$$ -530213 -524826 -587819 -605402 -558381 -505359 -522174 -573847 -602017 -642411 -610877 -523185 -493696
1762d93696j26175L2580K3318j5283O9568M1816j23939k976O0876p5298J2617
$$ -493696 -619871 -587291 -563973 -579256 -509688 -467872 -591811 -594787 -533911 -609209 -596592
1751e96592P465Q3122j6303m6128J23068n4838r0443o5318K4204J36935q8081
$$ -596592 -589127 -506005 -522308 -568436 -445368 -500206 -590649 -655967 -631763 -494828 -582909
1740e82909O1462m759o3810P66L9620K1804M9278j7106p5685O3532p8725j1657
$$ -582909 -521447 -526206 -590016 -589250 -549630 -527826 -478548 -495654 -571339 -507807 -586532 -598189
1728e98189N8275J27908j04341k6799J545P0478r7763P6671j1106M803m2991K8468
$$ -598189 -539914 -412006 -516347 -543146 -541601 -471123 -568886 -492215 -503321 -498518 -541509 -513041
1716e13041n1536M7823k7092k5810j010K8503L1463l9675Q1030j3062m0591j6577
$$ -513041 -564577 -516754 -543846 -569656 -570666 -542163 -510700 -550375 -469345 -482407 -522998 -539575
1704e39575J5851m4164P9472n8789K0108L5855n685r7622K8254L9253l9826k0460
$$ -539575 -523724 -567888 -488416 -547205 -527097 -491242 -496927 -594549 -566295 -527042 -566868 -587328
1692e87328j4359p220K3039O2012J7139J7145n8884m6218K7163N9548m3779k8017
$$ -587328 -601687 -608907 -585868 -523856 -506717 -489572 -548456 -594674 -567511 -507963 -551742 -579759
1680e79759K20K5310R929Q5010N158j02473P9416o2753m9705k5465N1851l983
$$ -579759 -579539 -554229 -544300 -459290 -454132 -556605 -477189 -539942 -589647 -615112 -563261 -567244
$$ [...]
##END NTUPLES=NMR SPECTRUM
##END=
