##TITLE=abcd
##JCAMPDX= 6.0         $$ Bruker NMR JCAMP-DX V2.0
##DATA TYPE= NMR SPECTRUM
##DATA CLASS= NTUPLES
##ORIGIN= UXNMR, Bruker Analytische Messtechnik GmbH
##OWNER= root
$$ XWIN-NMR		Version 3.5
$$ Sat Feb 22 09:16:16 2025 Russian Standard Time (UT+4h)  servis@DPX200
##.OBSERVE FREQUENCY= 200.131235884673
##.OBSERVE NUCLEUS= ^1H
##.ACQUISITION MODE= SIMULTANEOUS
##.ACQUISITION SCHEME= undefined
##.AVERAGES= 8
##.DIGITISER RES= 18
##SPECTROMETER/DATA SYSTEM= spect
##.PULSE SEQUENCE= zg
##.SOLVENT NAME= DMSO
##.SHIFT REFERENCE= (INTERNAL, DMSO, 0, 16.4885)
##AUDIT TRAIL= $$ (NUMBER, WHEN, WHO, WHERE, WHAT)
$$ ##TITLE= Audit trail, XWIN-NMR		Version 3.5
$$ ##JCAMPDX= 5.01
$$ ##ORIGIN= Bruker BioSpin GmbH
$$ ##OWNER= servis
$$ F:\spectra/data/av/nmr/H1/1/pdata/1/auditp.txt
$$ ##AUDIT TRAIL=  $$ (NUMBER, WHEN, WHO, WHERE, WHAT)
(   1,<2025-02-22 09:15:19.09 +0400>,<servis>,<DPX200>,
      <created by zg, POWCHK disabled, PULCHK disabled
       terminated by command 'halt'
       configuration hash MD5:
       00 E9 B6 7A A2 85 ED C7 34 08 36 98 17 FE 4E 26
       data hash MD5: 32K
       C7 D2 60 67 FD 22 19 57 B6 CF 31 4B EF 8E 85 1C>)
(   2,<2025-02-22 09:15:24.48 +0400>,<servis>,<DPX200>,
      <Start of raw data processing
       efp BC_mod = 2 LB = 0.05 FT_mod = 6 PKNL = 1 PHC0 = -267.7254 PHC1 = 1.301534 SI = 16K 
       data hash MD5: 16K
       76 A2 E9 4E 50 E7 06 26 88 2F 7F 65 16 3F AF E2>)
(   3,<2025-02-22 09:15:43.79 +0400>,<servis>,<DPX200>,
      <pk PHC0 = 3.6 PHC1 = 0 
       data hash MD5: 16K
       EB 7F 23 A3 D6 75 D7 3E 9E A3 4A BA 55 9A 3B 4F>)
$$ ##END=
$$ 
$$ hash MD5
$$ 66 74 53 FA E3 2C 52 7B 42 82 4B B5 59 72 64 CE
##$RELAX= 
##$RELAX= 
##$RELAX= 
##$RELAX= 
##$RELAX= 
##$RELAX= 
##$RELAX= 
##$RELAX= 
$$ Bruker specific parameters
$$ --------------------------
##$DU= <F:\spectra>
##$EXPNO= 1
##$NAME= <H1>
##$PROCNO= 1
##$TYPE= <nmr>
##$USER= <av>
##$AMP= (0..31)
100 100 100 100 100 100 100 100 100 100 100 100 100 100 100 100 100 100 
100 100 100 100 100 100 100 100 100 100 100 100 100 100 
##$AQSEQ= 0
##$AQ_mod= 1
##$AUNM= <au_zg>
##$AUTOPOS= <>
##$BF1= 200.13
##$BF2= 200.13
##$BF3= 200.13
##$BF4= 200.13
##$BF5= 500.13
##$BF6= 500.13
##$BF7= 500.13
##$BF8= 500.13
##$BYTORDA= 1
##$CFDGTYP= 0
##$CFRGTYP= 5
##$CHEMSTR= <none>
##$CNST= (0..31)
1 1 145 1 1 1 1 1 1 1 1 1 1 1 1 1 1 1 1 1 1 1 1 1 1 1 1 1 1 1 1 1 
##$CPDPRG= <>
##$CPDPRG1= <>
##$CPDPRG2= <>
##$CPDPRG3= <>
##$CPDPRG4= <mlev>
##$CPDPRG5= <mlev>
##$CPDPRG6= <mlev>
##$CPDPRG7= <mlev>
##$CPDPRG8= <mlev>
##$CPDPRGB= <>
##$CPDPRGT= <>
##$D= (0..31)
0 2 0 0 0 0 0 0 0 0.06 0 0 0 0 0 0 0.0002 0 0 0 0 0 0 0 0 0 0 0 0 0 0 
0 
##$DATE= 1740201318
##$DBL= (0..7)
120 120 120 120 120 120 120 120 
##$DBP= (0..7)
150 150 150 150 150 150 150 150 
##$DBP07= 0
##$DBPNAM0= <>
##$DBPNAM1= <>
##$DBPNAM2= <>
##$DBPNAM3= <>
##$DBPNAM4= <>
##$DBPNAM5= <>
##$DBPNAM6= <>
##$DBPNAM7= <>
##$DBPOAL= (0..7)
0.5 0.5 0.5 0.5 0.5 0.5 0.5 0.5 
##$DBPOFFS= (0..7)
0 0 0 0 0 0 0 0 
##$DE= 6
$$ [...]
##$SUBNAM4= <"">
##$SUBNAM5= <"">
##$SUBNAM6= <"">
##$SUBNAM7= <"">
##$SUBNAM8= <"">
##$SUBNAM9= <"">
##$SW= 20.6817932712277
##$SWIBOX= (0..15)
0 0 3 0 0 0 0 0 0 0 0 0 0 0 0 0 
##$SW_h= 4139.07284768212
##$TD= 32768
##$TD0= 1
##$TE= 0
##$TE2= 300
##$TE3= 300
##$TEG= 300
##$TL= (0..7)
0 120 120 120 120 120 120 120 
##$TP= (0..7)
150 150 150 150 150 150 150 150 
##$TP07= 0
##$TPNAME0= <>
##$TPNAME1= <>
##$TPNAME2= <>
##$TPNAME3= <>
##$TPNAME4= <>
##$TPNAME5= <>
##$TPNAME6= <>
##$TPNAME7= <>
##$TPOAL= (0..7)
0.5 0.5 0.5 0.5 0.5 0.5 0.5 0.5 
##$TPOFFS= (0..7)
0 0 0 0 0 0 0 0 
##$TUNHIN= 0
##$TUNHOUT= 0
##$TUNXOUT= 0
##$USERA1= <user>
##$USERA2= <user>
##$USERA3= <user>
##$USERA4= <user>
##$USERA5= <user>
##$V9= 5
##$VALIST= <valist>
##$VCLIST= <CCCCCCCCCCCCCCC>
##$VD= 0
##$VDLIST= <DDDDDDDDDDDDDDD>
##$VPLIST= <PPPPPPPPPPPPPPP>
##$VTLIST= <TTTTTTTTTTTTTTT>
##$WBST= 1024
##$WBSW= 30
##$XGAIN= (0..3)
0 0 0 0 
##$XL= 0
##$YL= 0
##$YMAX_a= 345464
##$YMIN_a= -257237
##$ZGOPTNS= <>
##$ZL1= 120
##$ZL2= 120
##$ZL3= 120
##$ZL4= 120
##$ABSF1= 0
##$ABSF2= 0
##$ABSG= 0
##$ABSL= 0
##$ALPHA= 0
##$AQORDER= 0
##$ASSFAC= 0
##$ASSFACI= 0
##$ASSFACX= 0
##$ASSWID= 0
##$AUNMP= <proc_1d>
##$AZFE= 0.1
##$AZFW= 0.1
##$BCFW= 0
##$BC_mod= 2
##$BYTORDP= 0
##$COROFFS= 0
##$CY= 18.4799938201904
##$DATMOD= 1
##$DC= 0
##$DFILT= <>
##$DTYPP= 0
##$F1P= 9.9274215381318
##$F2P= -0.165520771350173
##$FCOR= 1
##$FTSIZE= 16384
##$FT_mod= 6
##$GAMMA= 0
##$GB= 0
##$INTBC= 1
##$INTSCL= 4.127829e-11
##$ISEN= 128
##$LB= 0.05
##$LEV0= 0
##$LPBIN= 0
##$MAXI= 10000
##$MC2= 0
##$MEAN= 0
##$ME_mod= 0
##$MI= 50
##$NCOEF= 0
##$NC_proc= -7
##$NLEV= 6
##$NOISF1= 3.799351
##$NOISF2= 2.8
##$NSP= 0
##$NTH_PI= 0
##$NZP= 0
##$OFFSET= 16.48848
##$PC= 4
##$PHC0= -264.1254
##$PHC1= 1.301534
##$PH_mod= 1
##$PKNL= yes
##$PPARMOD= 0
##$PSCAL= 4
##$PSIGN= 0
##$REVERSE= no
##$SF= 200.130005582386
##$SI= 16384
##$SIGF1= 3
##$SIGF2= 2
##$SINO= 400
##$SIOLD= 16384
##$SREGLST= <1H.CDCl3>
##$SSB= 0
##$STSI= 16384
##$STSR= 0
##$SW_p= 4139.07284768211
##$SYMM= 0
##$S_DEV= 0
##$TDeff= 32768
##$TDoff= 0
##$TI= <>
##$TILT= no
##$TM1= 0
##$TM2= 0
##$TOPLEV= 0
##$USERP1= <user>
##$USERP2= <user>
##$USERP3= <user>
##$USERP4= <user>
##$USERP5= <user>
##$WDW= 1
##$XDIM= 16384
##$YMAX_p= 351639089
##$YMIN_p= -1247627
$$ End of Bruker specific parameters
$$ ---------------------------------
##NTUPLES= NMR SPECTRUM
##VAR_NAME=  FREQUENCY,     SPECTRUM/REAL,   SPECTRUM/IMAG
##SYMBOL=    X,             R,               I
##VAR_TYPE=  INDEPENDENT,   DEPENDENT,       DEPENDENT
##VAR_FORM=  AFFN,          ASDF,            ASDF
##VAR_DIM=   16384,         16384,           16384
##UNITS=     HZ,            ARBITRARY UNITS, ARBITRARY UNITS
##FACTOR=    0.252644378177508, 1,           1
##FIRST=     3299.83951724647, 0,            0
##LAST=      -839.233330435636, 0,           0
##MIN=       -839.233330435636, -1247627,    0
##MAX=       3299.83951724647, 351639089,    0
$$ Real data points
##PAGE= N=1
##DATA TABLE= (X++(R..R)), XYDATA
$$ [...]
$$ plain form
9013 793339 815630 811769 821985 862302 774935 718103 752501 669798 813759 623633 665475
9002 665475 662738 722641 621106 610760 786067 618467 707269 634748 533651 765937 525415
8991 525415 492259 553991 579863 540202 552538 476275 496330 460929 409445 436378 525301 596038
8979 596038 668623 546970 507596 508960 331507 438937 443846 213007 409223 354171 465665
8968 465665 371649 419006 306744 259411 299366 259052 193812 352278 387791 152954 173532
8957 173532 229463 386005 219666 302607 115628 324579 83565 221595 259337 21253
8947 21253 121580 27502 -35696 8497 221961 -43761 25263 158305 188923 -121291 -92647
8936 -92647 246142 65243 141366 -105651 38400 13404 -78875 -7511 -25739 -248604 -85368
$$ packed form
9013G93339K2291l861J0216M0317q7367n6832L4398q2703J43961j90126M1842
9002F65475k737N9903j01535j0346J75307j67600Q8802p2521j01097K32286k40522
8991E25415l3156O1732K5872l9661J2336p6263K0055l5401n1484K6933Q8923P0737
8979E96038P2585j21653l9374J364j77453J07430M909k30839J96216n5052J11494
8968D65665r4016M7357j12262m7333L9955m0314o5240J58466L5513k34837K0578
8957A73532N5931J56542j66339Q2941j86979K08951k41014J38030L7742k38084
8947B1253J00327r4078o3198M4193K13464k65722O9024J33042L0618l10214K8644
8936i2647L38789j80899P6123k47017J44051k4996r2279P1364j8228k22865J63236
$$ plain form
8925 -85368 -85720 -116013 97439 63414 180297 -43859 163010 188524 17619 -56773 5800
8914 5800 27065 88268 68254 90585 88069 -1486 28867 -121073 -20383 -166719 -167772 30564
8902 30564 77557 29174 -277908 -99845 -103473 -47402 -183061 -64332 -78146 -18054 89985
8891 89985 15777 -70049 -244161 110819 -100491 104244 -69008 -130828 51148 -22024 5987
8880 5987 -24949 -221040 -138866 -58414 -203483 -46980 -198658 -11847 -147935 -24530 -170991
8869 -170991 26564 -149992 11650 -162011 -157945 -141928 -64550 -188951 20055 -17072 69400
8858 69400 -125041 -170177 -220720 -301717 -139399 -159251 -126916 108657 -221145 -153423 -140503
8847 -140503 -163258 -65459 -77014 -39204 -62887 -91799 -223647 -146154 -181157 -196899 -226618
$$ packed form
8925h5368l52l0293K13452l4025J16883k24156K06869K5514j70905p4392O2573
8914E800K1265O1203k0014K2331k516q9555L0353j49940J00690j46336j053J98336
8902C0564M6993m8383l07082J78063l628N6071j35659J18729j3814O0092J08039
8891H9985p4208q5826j74112L54980k11310K04735j73252o1820J81976p3172K8011
8880E987l0936j96091Q2174Q0452j45069J56503j51678J86811j36088J23405j46461
8869a70991J97555j76556J61642j73661M066J6017P7378j24401K09006l7127Q6472
8858F9400j94441m5136n0543q0997J62318j9852L2335K35573l29802O7722J2920
8847a40503k2755R7799j1555L7810k3683k8912j31848P7493l5003j5742k9719
$$ plain form
8836 -226618 19306 -180997 -146556 -130525 -196133 -264279 -63870 -198126 -97801 -123948 -103478
8825 -103478 -171317 -90935 -81078 65487 -201718 -233522 -204904 -221176 -347048 -219983 -99420
8814 -99420 -287030 -264308 -228843 -151664 -206971 3733 -227813 -458392 -117242 -330154 -328265
8803 -328265 -104537 -114518 33663 28351 -271481 -197870 -364977 -321462 -190065 -165971 69907
8792 69907 -102440 -211001 -330085 -317926 -40905 -269382 -287567 -375540 -125029 -145069 -114467
8781 -114467 -230446 -197875 -147483 -227694 -83032 -292864 -260571 -208158 -30548 -138809 -136842
8770 -136842 -234603 -260069 -172959 -205612 -61902 53081 -350752 -262937 -156111 -130251 -214655
8759 -214655 -254565 -381454 -205903 -158345 -262691 -299181 -244990 -145523 -83908 -178572 -295046
$$ packed form
8836b26618K45924k00303L4441J6031o5608o8146K00409j34256J00325k6147K0470
8825a03478o7839Q0382R857J46565k67205l1804K8618j6272j25872J27065J20563
8814i9420j87610K2722L5465P7179n5307K10704k31546k30579L41150k12912J889
8803c28265K23728r981J48181n312k99832P3611j67107M3515J31397K4094K35878
8792F9907j72347j08561j19084J2159K77021k28477j8185q7973K50511k0040L0602
8781a14467j15979L2571N0392q0211J44662k09832L2293N2413J77610j08261J967
8770a36842r7761k5466Q7110l2653J43710J14983m03833Q7815J06826K5860q4404
8759b14655l9910j26889J75551M7558j04346l6490N4191R9467O1615r4664j16474
$$ plain form
8748 -295046 -263479 -302646 -175109 -178210 -349410 -191344 -261739 -140787 -145412 -73361 -219207
8737 -219207 -110266 -49502 -31404 -223573 -95884 -319864 -328898 -142569 -323742 -86430
8727 -86430 -280169 -220272 -243000 -386443 9586 -20375 -308122 -235743 -238057 -337682 -287130
8716 -287130 -294225 -49383 -140723 -399931 -316266 -156469 -202810 -142104 9575 -214176 -161037
8705 -161037 -226391 -157382 -272811 -206108 -262483 -72707 -193969 -447670 -302269 -315998 -77881
8694 -77881 -400692 -225064 -220424 -211525 -33293 -192174 -164334 -320944 -342767 -358150 -140494
8683 -140494 -250745 -244688 -171632 -91923 -257920 -245347 -203170 -274662 -125716 -325065 -122584
8672 -122584 -150024 -251268 -179735 -455244 -293550 -233670 -459907 -429146 -76446 -291014
$$ packed form
8748b95046L1567l9167J27537l101j71200J58066p0395J20952m625P2051j45846
8737b19207J08941O0764J8098j92169J27689k23980r034J86329j81173K37312
8727h6430j93739N9897k2728j43443L96029k9961k87747P2379k314r9625N0552
8716b87130p095K44842r1340k59208Q3665J59797m6341O0706J51679k23751N3139
8705a61037o5354O9009j15429O6703n6375J89776j21262k53701J45401j3729K38117
8694g7881l22811J75628M640Q899J78232j58881K7840j56610k1823j5383K17656
8683a40494j10251O057P3056P9709j65997J2573M2177p1492J48946j99349K02481
8672a22584k7440j01244P1533k75509J61694N9880k26237L0761L52700k14568
$$ plain form
8662 -291014 -242527 -446026 -218582 -161821 -259182 -266037 -214478 -496837 -76391 -260491 -230659
8651 -230659 -282597 -260971 -354912 -144200 -91857 -127576 -158143 -132806 -412780 -290072 -287918
8640 -287918 -405873 -96287 -231345 -317799 -351719 -273344 -115094 -195594 -345966 -179833
8630 -179833 -138837 -74903 -264827 -115779 -166059 -140393 -233888 -337744 -285961 -315872 -186793
8619 -186793 -68358 -103417 -184616 -210732 -326847 -302411 -346992 -281810 -270796 -141905 -211777
8608 -211777 -149828 -180994 -197988 -369901 -152472 -201802 -239483 -284870 -352461 -135468 -137040
8597 -137040 -299034 -59348 -112160 -231549 -93926 -338622 -194669 -362633 -207089 -317479
8587 -317479 -206910 -172326 -170173 -114106 -14766 -97068 -120826 -201077 -152064 -343836 -276493
$$ packed form
8662b91014M8487k03499K27444N6761r7361o855N1559k82359M20446j84100K9832
8651b30659n1938K1626r3941K10712N2343l5719l0567K5337k79974J22708K154
8640b87918j17955L09586j35058q6454l3920P8375J58250q0500j50372J66133
8630a79833M0996O3934j89924J49048n0280K5666r3495j03856N1783k9911J29079
8619a86793J18435l5059q1199k6116j16115K4436m4581O5182J1014J28891o9872
8608b11777O1949l1166j6994j71913K17429m9330l7681m5387o7591K16993j572
8597a37040j61994K39686n2812j19389J37623k44696J43953j67964J55544j10390
8587c17479J10569L4584K153N6067R9340q2302k3758q0251M9013j91772O7343
$$ plain form
8576 -276493 -242532 -247555 -414804 -7601 -261598 -304962 -111048 -249190 -213809 -347122 26209
8565 26209 -292531 -210520 -125587 -49934 -121485 -121683 -200238 -98546 -179081 -218264 -227545 -93965
8553 -93965 -265163 -235389 -348154 -377641 -46233 -147587 -365189 -196974 -425883 -175079
8543 -175079 -253372 -177494 -84389 -319242 -487163 -282596 -122455 -193525 -114434 -154711 -217001
8532 -217001 -550480 -225873 -86867 -55116 -169926 -219343 -337791 -225407 -222749 -219914 -240633
8521 -240633 -271621 -136864 -292006 -317694 -400531 -428987 -231480 -260878 -205436 -230153 -191567
8510 -191567 -211717 -235531 -308832 -209147 -342153 -208892 -464252 -183462 -161493 -85460 -367490
8499 -367490 -308753 -282102 -284843 -199342 -229070 -190159 -340783 -167537 -413955 -453850 -220257
$$ packed form
8576b76493L3961n023j67249M07203k53997m3364J93914j38142L5381j33313L73331
8565B6209l18740Q2011Q4933P5653p1551j98p8555J01692q0535l9183r281J33580
8553i3965j71198K9774j12765k9487L31408j01354k17602J68215k28909K50804
8543a75079p8293P5878R3105k34853j67921K04567J60141p1070P9091m0277o2290
8532b17001l33479L24607J39006L1751j14810m9417j18448J12384K658K835k0719
8521b40633l0988J34757j55142k5688q2837k8456J97507k9398N5442k4717L8586
8510a91567k0150k3814p3301R9685j33006J33261k55360K80790K1969P6033k82030
8499c67490N8737K6651k741Q5501k9728L8911j50624J73246k46418l9895K33593
$$ plain form
8488 -220257 -315614 -245937 -266961 -279315 -246033 -288456 -354077 -327951 -246206 -288288 -404114
8477 -404114 -327339 -449844 -350694 -446984 -341758 -245340 -284329 -280789 -386209 -188453 -281598
8466 -281598 -408889 -256305 -272575 -267154 -228840 -187964 -326858 -392154 -67986 -309059 -486406
8455 -486406 -523245 -375072 -272122 -220508 -222352 -111791 -333157 -270547 -261653 -394558 -325251
8444 -325251 -369208 -203940 -250536 -430390 -246717 -409669 -109977 -330673 -191404 -285602
8434 -285602 -36244 -145733 -305568 -302034 -334894 -431052 -210050 -240109 -354136 -205109 -251802
8423 -251802 -276265 -297143 -497511 -305388 -349432 -408766 -278169 -424718 -400891 -246231 -316907
8412 -316907 -232058 -214281 -153858 -327385 -230502 -339968 -169263 -208661 -197197 -240397 -301795
$$ packed form
8488b20257r5357O9677k1024j2354L3282m2423o5621K6126Q1745m2082j15826
8477d04114P6775j22505R9150r6290J05226R6418l8989L540j05420J97756r3145
8466b81598j27291J52584j6270N421L8314M0876j38894o5296L24168k41073j77347
8455d86406l6839J48173J02950N1614j844J10561k21366O2610Q894j32905O9307
8444c25251m3957J65268m6596j79854J83673j62952K99692k20696J39269r4198
8434b85602K49358j09489j59835L534l2860r6158K21002l0059j14027J49027m6693
8423b51802k4463k0878k00368J92123m4044n9334J30597j46549K3827J54660p0676
8412c16907Q4849J7777O0423j73527R6883j09466J70705l9398J1464m3200o1398
$$ plain form
8401 -301795 -263916 -379566 -171924 -213859 -273347 -181759 -175532 -251934 -384316 -238506 -128682
8390 -128682 -288744 -346384 -295055 -279901 -195530 -200533 -145957 -215933 -191451 -403423 -255045
8379 -255045 -167011 -238433 -220281 -341753 -143915 -227364 -434481 -287950 -172467 -63240
8369 -63240 -166284 -274819 -439095 -166629 -238226 -394760 -247137 -291530 -179661 -392078
8359 -392078 -255414 -147871 -183283 -413857 -402910 -290324 -241623 -246650 29701 -119172 -322689
8348 -322689 9590 -284186 -375846 -269817 -321570 -31236 -335232 -273645 -215569 -211481 -242273
8337 -242273 -312056 -340806 -34983 -402226 -213676 -194734 -417331 -175166 -386237 -216630
8327 -216630 -162403 -263231 -102151 -333922 -265917 -132277 -86644 -9490 -257199 -251322 -318879
$$ packed form
8401c01795L7879j15650K07642m1935n9488R1588O227p6402j32382J45810J09824
8390a28682j60062n7640N1329J5154Q4371n003N4576o9976K4482k11972J48378
8379b55045Q8034p1422J8152j21472J97838q3449k07117J46531J15483J09227
8369f3240j03044j08535j64276K72466p1597j56534J47623m4393J11869k12417
8359c92078J36664J07543l5412k30574J0947J12586M8701n027K76351j48873k03517
8348c22689L32279k93776r1660J06029n1753K90334l03996O1587N8076M088l0792
8337b42273o9783k8750L05823l67243J88550J8942k22597K42165k11071J69607
8327b16630N4227j00828J61080k31771O8005J33640M5633P7154k47709N877o7557
$$ plain form
8316 -318879 -198821 -101272 -104587 -376650 -80086 -214936 -343027 -142933 -352396 -223678
8306 -223678 -418099 -152888 -237002 -356685 -290561 -269425 -413224 -234073 -263541 -143618
8296 -143618 -196584 -65323 -89074 -147769 -193241 -301361 -359963 -185340 -302870 -260251 -159952
8285 -159952 -139193 -112698 -180078 -233303 -327768 -208063 -258410 -138524 -257856 -37951 -179313
8274 -179313 -185220 -304696 -149452 -303126 -374698 -95196 -207076 -169639 -190051 -148480 -212690
8263 -212690 -344207 -148753 -306200 -90465 -40387 -238046 -322318 -335732 -286191 -110653
8253 -110653 -102499 -320892 -96148 -281268 -293783 -104876 -307240 -289296 -265882 -51518 -251682
8242 -251682 -299446 -33986 -246621 -132748 -356292 -363048 -186728 -79366 -206904 -101201
$$ packed form
8316c18879J20058R7549l315k72063K96564j34850j28091K00094k09463J28718
8306b23678j94421K65211q4114j19683O6124K1136j43799J79151k9468J19923
8296a43618n2966J31261k3751n8695m5472j08120n8602J74623j17530M2619J00299
8285a59952K0759K6495o7380n3225r4465J19705n0347J19886j19332K19905j41362
8274a79313n907j19476J55244j53674p1572K79502j11880L7437k0412M1571o4210
8263b12690j31517J95454j57447K15735N0078j97659q4272j3414M9541J75538
8253a10653Q154k18393K24744j85120j2515J88907k02364J7944K3414K14364k00164
8242b51682m7764K65460k12635J13873k23544o756J76320J07362j27538J05703
$$ plain form
8232 -101201 -373115 -281363 -121896 -206314 -309233 -296731 -42939 -371108 -322522 -281868 -326356
8221 -326356 -211168 -249313 -201405 -385134 -365141 -329873 -223187 -211241 -88445 -134456 -120804
8210 -120804 -116760 -236830 -303638 -227768 -76169 -259140 -324363 -525319 -279544 -132428 -355637
8199 -355637 -210457 -306033 -174871 -443972 -215350 -205785 -503596 1113928 -31769 18620
8189 18620 99818 -200204 -6015 -310415 -244564 -112613 -93340 -143830 -141789 -211030 -328475
8178 -328475 -45704 -108418 -295829 -139366 -309056 -14387 -106996 -229358 -305902 -32667
8168 -32667 -80332 -234689 -185832 -164611 -14282 -90217 -246374 15719 -237231 17540 -233515
8157 -233515 -53419 -185367 -230101 125137 -250082 -230999 -82458 -200896 -286028 -140152
$$ packed form
8232a01201k71914R1752J59467q4418j02919J2502K53792l28169M8586M0654m4488
8221c26356J15188l8145M7908j83729J9993L5268J06686J1946J22796m6011J3652
8210a20804M044j20070o6808P5870J51599j82971o5223k00956K45775J47116k23209
8199c55637J45180r5576J31162k69101K28622R565k97811J617524j145697N0389
8189A8620Q1198l00022J94189l04400O5851J31951J9273n0490K041o9241j17445
8178c28475K82771o2714j87411J56463j69690K94669r2609j22362p6544K73235
8168c2667m7665j54357M8857K1221J50329p5935j56157K62093k52950K54771k51055
8157b33515J80096j31948m4734L55238l75219J9083J48541j18438q5132J45876
$$ plain form
8147 -140152 -113659 -163949 -143220 -31625 -187284 -27060 -113435 -140226 -132542 -348492 -17252
8136 -17252 -153042 -151563 -169681 -80362 -102710 -137169 -178381 -243770 -305340 -242837 -299419 -306454
8124 -306454 -143139 -137920 41843 -219778 -253934 -61830 2394 -141495 -117203 107519 -93834
8113 -93834 -397807 -113160 -84783 -198754 -80602 -283696 -81813 -182758 -198880 1599
8103 1599 -235549 -22667 -152752 14099 -226940 -163320 -270925 -277239 -154510 -149380 -203978
8092 -203978 -331652 -182058 -198666 -264352 -207327 -178831 -248883 -189022 -236437 -229206 -227272 -199822
8080 -199822 -358554 -159474 -173652 -378041 -268617 -339050 -236448 -75614 -91333 -209881
8070 -209881 -134668 -144499 -64045 -9952 -6817 -81791 -215278 -13666 -13873 -192167 -206639 -33855
$$ packed form
8147a40152K6493n0290K0729J11595j55659J60224q6375k6791P684k15950L31240
8136a7252j35790J479j8118Q9319k2348l4459m1212o5389o1570O2503n6582p035
8124c06454J63315N219J79763k61621l4156J92104O4224j43889K4292K24722k01353
8113i3834l03973K84647K8377j13971J18152k03094K01883j00945j6122K00479
8103A599k37148K12882j30085J66851k41039O3620j07605o314J22729N130n4598
8092b03978j27674J49594j6608o5686N7025K8496p0052N9861m7415P231J934K7450
8080a99822j58732J99080j4178k04389J09424p0433J02602J60834j5719j18548
8070b09881P5213r831Q0454N4093L135p4974j33487K01612k07j78294j4472J72784
$$ plain form
8058 -33855 -113400 -200173 32262 -160852 -208590 -80418 -187539 -87731 -138041 -96110 -294295
8047 -294295 -98528 -113145 -172025 -57291 -61610 -236888 -26613 -227256 -69100 -133856 -89188
8036 -89188 -75770 -98634 -52568 -146225 -416782 -333472 -127719 37480 92712 -154082 -61522
8025 -61522 87970 58016 32543 -56580 -171584 -227627 -131215 -30386 -213211 -190388 -109612
8014 -109612 -17437 -130220 -141326 -49243 68725 -42722 -174713 -130085 15619 118399
8004 118399 -104745 -23831 -6134 -65706 -74990 -209335 -143346 -21966 -63660 108718 -251836
7993 -251836 -205570 -256386 -314667 -84853 -66582 7102 -218795 -45144 -184982 -95099 -246028
7982 -246028 10855 -126449 8938 13268 -115400 -197599 -112188 -107944 45890 1348 -43699
$$ packed form
8058c3855p9545q6773K32435j93114m7738J28172j07121R9808n0310M1931j98185
8047b94295J95767j4617n8880J14734m319j75278K10275k00643J58156o4756M4668
8036h9188J3418k2864M6066r3657k70557Q3310K05753J65199N5232k46794R2560
8025f1522J49492k9954k5473q9123j15004n6043R6412J00829j82825K2823Q0776
8014a09612R2175j12783j1106R2083J17968j11447j31991M4628J45704J02780
8004A18399k23144Q0914J7697n9572r284j34345O5989J21380m1694J72378l60554
7993b51836M6266n0816n8281K29814J8271P3684k25897J73651j39838Q9883j50929
7982b46028K56883j37304J35387M330j28668q2199Q5411M244J53834m4542m5047
$$ plain form
7971 -43699 76914 -52839 41758 -43576 30796 -106647 -31058 -23647 33867 -183546 83181
7960 83181 -98814 81539 43418 226899 27336 123906 -131308 -10696 124760 6350
7950 6350 -76097 -69063 40013 148382 93531 78926 -10558 13259 -60968 -131321 11870 182079
7938 182079 -22129 28423 187778 159904 -4430 -127459 -113321 158416 238501 194656 77139
7927 77139 170618 129312 -105402 66984 111233 220215 47859 41412 -23434 43449 218021
7916 218021 220396 135351 -28572 19528 -76204 148072 49674 23114 110559 82597 43631
7905 43631 48330 280338 195614 215805 10589 148182 45779 202718 45813 99873 129417
7894 129417 157119 558493 288633 127419 311781 385091 340723 268140 288416 328614 185064
$$ packed form
7971d3699J20613j29753R4597q5334P4372j37443P5589P411N7514k17413K66727
7960H3181j81995J80353l8121J83481j99563R6570k55214J20612J35456j18410
7950F350q2447P034J09076J08369n4851j4605q9484K3817p4227p0353J43191J70209
7938A82079k04208N0552J59355k7874j64334j23029J4138K71737Q0085m3845j17517
7927G7139R3479m1306k34714J72386M4249J08982j72356o447o4846O6883J74572
7916B18021K375q5045j63923M8100r5732K24276r8398k6560Q7445k7962l8966
7905D3631M699K32008q4724K0191k05216J37593j02403J56939j56905N4060K9544
7894A29417K7702M01374k69860j61214J84362P3310m4368p2583K0276M0198j43550
$$ plain form
7883 185064 284484 233849 311809 490874 487888 466899 342149 558122 409798 166247 348941
7872 348941 399699 179316 450104 315564 268974 202332 156470 199609 220678 449461 191919
7861 191919 88884 347109 -10326 -76294 160602 -112918 -228286 -130408 -672537 -24017
7851 -24017 529774 551285 332829 210007 99705 159338 236281 157406 161491 23180 -26172
7840 -26172 47480 138021 42371 127873 101306 -53981 -219153 113940 -6293 126373 118891
7829 118891 -19115 19270 15410 142846 -69280 175716 -51245 31394 23325 50991 118038
7818 118038 46084 34379 -177091 -33246 11926 49937 223879 -14030 -27076 -82491 16594
7807 16594 181353 63489 16329 157805 24549 237462 -139176 26671 -81650 98073
$$ packed form
7883A85064R9420n0635P7960J79065k986k0989j24750K15973j48324k43551J82694
7872C48941N0758k20383K70788j34540m6590o6642m5862M3139K1069K28783k57542
7861A91919j03035K58225l57435o5968K36896k73520j15368R7878n42129O48520
7851b4017N53791K1511k18456j22822j10302N9633P6943p8875M085j38311m9352
7840b6172P3652R0541r5650Q5502k6567j55287j65172L33093j20233J32666p482
7829A18891j38006L8385l860J27436k12126K44996k26961Q2639q069K7666O7047
7818A18038p1954j1705k11470J43845M5172L8011J73942k37909j3046n5415R9085
7807A6594J64759j17864m7160J41476j33256K12913l76638J65847j08321J79723
$$ plain form
7797 98073 -173434 67236 -34194 78414 42883 -53194 -16844 47897 30872 -50435 88153
7786 88153 -121561 -58789 205576 80309 16393 -207690 82116 -168577 -60814 7196
7776 7196 -109188 -121076 -15461 100074 -54319 116530 -202053 58795 99714 33463 34822
7765 34822 75193 -228444 -46451 -181948 -40933 -14738 -2067 -37316 179866 19336 72509
7754 72509 -64922 -54913 106691 18633 -100385 137711 17835 227858 176067 91837 -40727
7743 -40727 162323 -162366 -126479 42272 -19680 26191 112190 17517 -141729 127701 45176
7732 45176 -71097 -91053 283494 37481 397206 7487 107303 -70775 8745 111071
7722 111071 23677 130576 72185 44077 139081 -183539 57407 -23572 54468 16967 96665
$$ packed form
7797I8073k71507K40670j01430J12608l5531r6077L6350O4741j7025q1307J38588
7786H8153k09714O2772K64365j25267o3916k24083K89806k50693J07763O8010
7776G196j16384j1888J05615J15535j54393J70849l18583K60848M0919o6251J359
7765C4822M0371l03637J81993j35497J41015K6195J2671l5249K17182j60530N3173
7754G2509j37431J0009J61604q8058j19018K38096j19876K10023n1791q4230j32564
7743d0727K03050l24689L5887J68751o1952M5871Q5999r4673j59246K69430q2525
7732D5176j16273j9956L74547k46013L59725l89719R9816j78078P9520J02326
7722A11071q7394J06899n8391k8108R5004l22620K40946q0979P8040l7501P9698
$$ plain form
7711 96665 73786 -18922 -4410 179523 122909 -17942 91114 177638 -22598 8000 155403
7700 155403 -263610 -123542 -64139 -16432 148785 49886 130672 63146 5771 -7820 -184851
7689 -184851 95996 -221608 210411 71670 -6442 77718 74024 224358 229486 -8945 238437
7678 238437 123553 106710 241557 43755 80369 214166 68026 -180173 52550 153636
7668 153636 258286 75758 31212 19764 346 168388 -5192 103271 -183227 -16757
7658 -16757 30374 -27032 50112 170760 66722 45856 139623 237408 64904 213044 -106874
7647 -106874 214167 180500 21783 136694 113284 258278 63650 -22900 -95194 118761
7637 118761 249438 124157 181081 -65487 -20105 129772 180529 31712 21404 213298
$$ packed form
7711I6665k2879r2708J4512J83933n6614j40851J09056Q6524k00236L0598J47403
7700A55403m19013J40068N9403M7707J65217r8899Q0786o7526n7375j3591j77031
7689a84851K80847l17604M32019j38741p8112Q4160l694J50334N128k38431K47382
7678B38437j14884j6843J34847j97802L6614J33797j46140k48199K32723J01086
7668A53636J04650j82528m4546j1448j9418J68042j73580J08463k86498J66470
7658a6757M7131n7406P7144J20648j04038k0866R3767R7785j72504J48140l19918
7647a06874L21041l3667j58717J14911k3410J44994j94628q6550p2294K13955
7637A18761J30677j25281N6924k46568M5382J49877N0757j48817j0308J91894
$$ plain form
7627 213298 -41291 28547 246167 68778 180079 86086 448002 163011 -50513 86433
7617 86433 191466 280469 214311 286031 73742 187000 84689 77018 117019 88753 148471
7606 148471 300135 177158 84935 138999 24641 153311 177199 208277 -85189 133890
7596 133890 53973 86282 -74182 104662 -4950 127208 -50499 232330 210753 9750
7586 9750 18578 72695 230930 119680 158373 234533 198336 177839 176447 295365 183127 150067
7574 150067 182578 244431 148853 145931 -40430 48001 201937 258458 511543 329704 331460
7563 331460 140728 344691 250612 456046 97725 61068 258423 113910 270995 133322
7553 133322 -45206 155429 380645 188889 183922 290927 138886 224005 156843 329703
$$ packed form
7627B13298k54589O9838K17620j77389J11301r3993L61916k84991k13524J36946
7617H6433J05033Q9003o6158P1720k12289J13258j02311p671M0001k8266N9718
7606A48471J51664j22977r2223N4064j14358J28670K3888L1078k93466K19079
7596A33890p9917L2309j60464J78844j09612J32158j77707K82829k1577k01003
7586I750Q828N4117J58235j11250L8693P6160l6197k0497j392J18918j12238l3060
7574A50067L2511O1853r5578k922j86361Q8431J53936N6521K53085j81839J756
7563C31460j90732K03963r4079K05434l58321l6657J97355j44513J57085j37673
7553A33322j78528K00635K25216j91756m967J07005j52041Q5119o7162J72860
$$ plain form
7543 329703 303260 65947 361862 210919 256361 387506 343853 213911 186904 381774
7533 381774 128253 287639 263124 217040 130181 292319 153409 325090 119650 375484
7523 375484 332690 238703 336865 299784 237308 247224 478690 304446 305078 239320 296510 151891
7511 151891 313879 337168 344326 367145 507157 299995 385675 318893 312510 402832 345442
7500 345442 479807 481022 436804 427392 483100 466603 396421 254123 381474 431346 560455
7489 560455 414036 586312 382443 259046 307647 542684 375515 485756 490381 432367
7479 432367 534432 458213 538219 355259 536415 511429 446274 446949 466485 559097 314713
7468 314713 511724 347677 330209 393206 195749 477563 538480 283650 607846 404669
$$ packed form
7543C29703k6443k37313K95915j50943M5442J31145m3653j29942k7007J94870
7533C81774k53521J59386k4515m6084q6859J62138j38910J71681k05440K55834
7523C75484m2794r3987R8162l7081o2476R916K31466j74244O32o5758N7190j44619
7511A51891J61988K3289P158K2819J40012k07162Q5680o6782o383R0322n7390
7500C45442J34365J215m4218r412N5708j6497p0182j42298J27351M9872J29109
7489E60455j46419J72276k03869j23397M8601K35037j67169J10241M625n8014
7479D32367J02065p6219Q0006j82960J81156k4986o5155O75J9536R2612k44384
7468C14713J97011j64047j7468O2997j97457K81814O0917k54830L24196k03177
$$ plain form
7458 404669 415495 458462 545181 337714 339525 492113 506137 336272 676968 476039 436960
7447 436960 599158 488033 411610 391331 269576 389206 401761 489255 189876 450715
7437 450715 344873 399612 498311 525582 423532 383172 463681 446320 599632 427694 399405
7426 399405 427384 413297 500423 431287 316861 578328 449198 442241 426227 592254 325402
7415 325402 382759 445747 398759 307206 400316 503084 468147 422693 426150 536665 467076
7404 467076 544507 343271 388243 554698 415882 489569 345880 401119 565645 413114
7394 413114 580960 590386 542363 556472 424192 505397 602071 415029 536111 332881 483884
7383 483884 472753 427731 284528 310142 462840 527945 635240 376884 592292 468452
$$ packed form
7458D04669J0826M2967Q6719k07467J811J52588J4024j69865L40696k00929l9079
7447D36960J62198j11125p6423k0279j21755J19630J2555Q7494k99379K60839
7437D50715j05842N4739R8699K7271j02050m0360Q0509j7361J53312j71938k8289
7426C99405K7979j4087Q7126o9136j14426K61467j29130o957j6014J66027k66852
7415C25402N7357O2988m6988r1553R3110J02768l4937m5454L457J10515o9589
7404D67076P7431k01236M4972J66455j38816P3687j43689N5239J64526j52531
7394D13114J67846R426m8023J4109j32280Q1205R6674j87042J21082k03230J51003
7383D83884j1131m5022j43203K5614J52698O5105J07295k58356K15408j23840
$$ plain form
7373 468452 650788 504639 446613 392971 568125 481636 487751 620758 619504 556634 471633
7362 471633 465974 662892 507064 550515 679230 763691 613276 547704 678182 670810 492054
7351 492054 646228 460911 616544 676390 700942 677859 348687 643270 807484 748519
7341 748519 545869 771499 671825 761554 651673 746220 623170 607388 650357 612212 588911
7330 588911 840223 741732 832758 693556 595784 795536 826374 737930 665195 751821 877449
7319 877449 673662 735352 769621 679412 807153 790528 633317 687600 781478 875831 896674
7308 896674 641621 859075 832360 819918 870196 689357 830080 740163 790763 887505 1010686
7297 1010686 901878 807007 775535 813296 824063 845202 945313 917494 1011372 944055 1033260
$$ packed form
7373D68452J82336j46149n8026n3642J75154q6489O115J33007j254o2870q5001
7362D71633n659J96918j55828M3451J28715Q4461j50415o5572J30478p372j78756
7351D92054J54174j85317J55633N9846K4552k3083l29172K94583J64214n8965
7341G48519k02650K25630r9674Q9729j09881R4547j23050j5782M2969l8145k3301
7330E88911K51312r8491R1026j39202r7772J99752L0838q8444p2735Q6626J25628
7319H77449k03787O1690L4269r0209J27741j6625j57211N4283R3878R4353K0843
7308H96674k55053K17454k6715j2442N0278j80839J40723q9917N0600R6742J23181
7297A010686j08808r4871l1472L7761J0767K1139J00111k7819R3878o7317Q9205
$$ plain form
7286 1033260 797829 901632 1189843 990272 917191 1100437 1223106 939697 1109569 1053892
7276 1053892 973425 1147571 917744 1065619 1313889 1102996 1193919 1033183 1174970 1135637
7266 1135637 1266071 1150586 1139236 1185585 1123360 1207380 1433328 1405847 1259813 1473796
7256 1473796 1329490 1339921 1332897 1288305 1300520 1302180 1355277 1572615 1403007 1570339 1442433
7245 1442433 1459620 1567558 1514222 1539289 1413657 1637809 1651597 1621715 1478376 1660771
7235 1660771 1855559 1727246 1851413 1711356 1789970 1832563 1838038 2026443 1829611 2168021
7225 2168021 1980148 2136084 2157899 2248928 2246968 2381251 2428332 2341034 2574664 2521208 2623071
7214 2623071 2421025 2691181 2673447 2657424 2805360 2829457 2832966 2979910 2764775 2894939
$$ packed form
7286A033260k35431J03803K88211j99571p3081J83246J22669k83409J69872n5677
7276A053892q0467J74146k29827J47875K48270k10893R0923j60736J41787l9333
7266A135637J30434j15485j1350M6349o2225Q4020K25948k7481j46034K13983
7256A473796j44306J0431p024m4592J2215J660N3097K17338j69608J67332j27906
7245A442433J7187J07938n3336K5067j25632K24152J3788k9882j43339J82395
7235A660771J94788j28313J24167j40057P8614M2593N475J88405j96832L38410
7225B168021j87873J55936K1815R1029j960J34283M7081q7298K33630n3456J01863
7214B623071k02046K70156j7734j6023J47936K4097L509J46944k15135J30164
$$ plain form
7204 2894939 3041910 3181160 3143584 2934064 3015502 3372448 3413246 3155924 3385860 3422578
7194 3422578 3539567 3565656 3506857 3598286 3712520 3556876 3578341 3842785 3772446 3613284
7184 3613284 3802252 3668003 3808437 3597220 3924566 3900778 3890286 3782320 3888672 3836707
7174 3836707 4026208 3767481 3728073 3763732 3674102 3621183 3734934 3632791 3687194 3624481 3598635
7163 3598635 3584848 3570705 3520935 3499823 3413954 3417524 3595864 3396450 3630165 3348912 3354599
7152 3354599 3179596 3257544 3169644 3248137 3051171 3116542 3044559 3059612 3038976 2937736 2739999
7141 2739999 3009961 2717245 2927871 2841406 2828840 2785814 2711229 2762929 2696129 2616739 2581163
7130 2581163 2478259 2660811 2535267 2520728 2608218 2713406 2541038 2460566 2636567 2567929
$$ packed form
7204B894939J46971J39250l7576k09520Q1438L56946M0798k57322K29936L6718
7194C422578J16989K6089n8799R1429J14234j55644K1465K64444p0339j59162
7184C613284J88968j34249J40434k11217L27346k3788j0492j07966J06352n1965
7174C836707J89501k58727l9408L5659q9630n2919J13751j02143N4403o2713k5846
7163C598635j3787j4143m9770k1112q5869L570J78340j99414K33715k81253N687
7152C354599j75003P7948q7900P8493j96966O5371p1983J5053k0636j01240j97737
7141B739999K69962k92716K10626q6465j2566m3026p4585N1700o6800p9390l5576
7130B581163j02904J82552j25544j4539Q7490J05188j72368q0472J76001o8638
$$ plain form
7120 2567929 2566671 2613242 2476077 2425430 2424942 2576614 2540190 2583064 2560094 2409609 2570580
7109 2570580 2694394 2615119 2619995 2716546 2618078 2496991 2453463 2500947 2565175 2650606 2662490
7098 2662490 2687865 2480085 2720500 2572368 2621659 2660143 2735683 2769001 2769395 2775293 2822252
7087 2822252 2707657 2672421 2781220 2908361 2815531 2929137 3040628 2659838 2928708 3041539
7077 3041539 3067007 2888130 3037362 3197863 3227623 3314178 3161206 3148657 3256977 3441882
7067 3441882 3506891 3367908 3245736 3473736 3595798 3474879 3708989 3565808 3905397 3695228
7057 3695228 3839241 3891713 3785733 3906272 4087817 3926127 4111958 4259453 4076984 4151154
7047 4151154 4393712 4470605 4421067 4690721 4613723 4630260 4805488 4818241 4998129 5174011
$$ packed form
7120B567929j258M6571j37165n0647m88J51672l6424M2874k2970j50485J60971
7109B570580J23814p9275M876R6551r8468j21087m3528M7484O4228Q5431J1884
7098B662490K5375k07780K40415j48132M9291L8484P5540L3318L94N898M6959
7087B822252j14595l5236J08799J27141r2830J13606J11491l80790K68870J12831
7077C041539K5468j78877J49232J60501K9760Q6555j52972j2549J08320J84905
7067C441882O5009j38983j22172K28000J22062j20919K34110j43181L39589k10169
7057C695228J44013N2472j05980J20539J81545j61690J85831J47495j82469P4170
7047D151154K42558P6893m9538K69654p6998J6537J75228J2753J79888J75882
$$ plain form
7037 5174011 5046615 5242565 5296928 5472990 5356616 5412465 5465632 5712125 5822644 5676394
7027 5676394 5957946 5932164 6042184 6101791 6069723 6358436 6286192 6547129 6758696 6952047
7017 6952047 6979354 7109649 7218963 7423477 7345667 7683544 7837064 7965306 7904595 8121470
7007 8121470 8252965 8567564 8658947 9027468 9228034 9277584 9407759 9478372 9715442 10046084
6997 10046084 10184012 10495155 10739634 11003858 11158748 11449454 11670865 11959290 12271538
6988 12271538 12594488 12850841 13239569 13709400 13942653 14040362 14387066 14861719 15250233 15631816
6978 15631816 16117335 16498942 16997777 17330423 17901426 18231802 18772888 19199337 19589803
6969 19589803 20203021 20692261 21435640 22076459 22342699 23040192 23569559 24063533 24871657
$$ packed form
7037E174011j27396J95950N4363J76062j16374N5849N3167K46493J10519j46250
7027E676394K81552k5782J10020N9607l2068K88713p2244K60937K11567J93351
7017F952047K7307J30295J09314K04514p7810L37877J53520J28242o0711K16875
7007H121470J31495L14599R1383L68521K00566M9550J30175P0613K37070L30642
6997A0046084J37928L11143K44479K64224J54890K90706K21411K88425L12248
6988A2271538L22950K56353L88728M69831K33253R7709L46704M74653L88514L81583
6978A5631816M85519L81607M98835L32646N71003L30376N41086M26449L90466
6969A9589803O13218M89240P43379O40819K66240O97493N29367M93974Q08124
$$ plain form
6960 24871657 25532649 26192200 26783576 27771996 28477614 29067560 30154207 30744711 31650585
6951 31650585 32440592 33616895 34463322 35270784 35881024 36842459 37816379 38605482 39272534
6942 39272534 40236902 41026475 41867400 42737231 43548224 44272137 45003091 45869914 46439245
6933 46439245 47193236 47736113 48330251 49040635 49523372 50288005 50598922 51133508 51347922
6924 51347922 51645308 51796778 52115057 52275645 52245289 52230681 51847319 51605445 51488657 51036828
6914 51036828 50731320 50295229 49806210 49119185 48596521 47834369 47160916 46476218 45813795
6905 45813795 44914370 44078130 43093979 42364230 41561582 40688471 39450739 38662692 37577203
6896 37577203 36694148 35585048 34643908 33828701 32702204 31659978 30569575 29686838 28726872
$$ packed form
6960B4871657O60992O59551N91376R88420P05618N89946J086647N90504R05874
6951C1650585P90007J176303Q46427Q07462O10240R61435R73920P89103O67052
6942C9272534R64368P89573Q40925Q69831Q10993P23913P30954Q66823N69331
6933D6439245P53991N42877N94138P10384M82737P64633L10917N34586K14414
6924E1347922K97386J51470L18279J60588l0356j4608l83362k41874j16788m51829
6914E1036828l05508m36091m89019o87025n22664p62152o73453o84698o62423
6905D5813795q99425q36240r84151p29749q02648q73111j237732p88047j085489
6896C7577203q83055j109100r41140q15207j126497j042226j090403q82737r59966
$$ plain form
6887 28726872 27693505 26758547 25847938 24963014 24037210 23428036 22396480 21624813 20890220
6878 20890220 20374991 19695626 18885555 18090500 17548748 16951050 16331714 15971666 15274118
6869 15274118 14884046 14447796 13784831 13513461 13154250 12794439 12367868 12002162 11702239
6860 11702239 11443953 11146951 10765369 10439891 10097986 9922742 9683753 9488885 9259354
6851 9259354 9057400 8840317 8408294 8173715 8230804 7937495 7766077 7395215 7532308 7465237
6841 7465237 7223720 7063085 6781770 6754014 6892449 6530507 6512656 6413715 6148490 5930050
6831 5930050 6104912 5825932 5837496 5688690 5417860 5614069 5406962 5138108 5322791 5244938
6821 5244938 5028529 4986174 4862436 4862335 4712790 4669563 4628060 4503942 4445513 4364894 4315437
$$ packed form
6887B8726872j033367r34958r10609q84924r25804o09174j031556p71667p34593
6878B0890220n15229o79365q10071p95055n41752n97698o19336l60048o97548
6869A5274118l90072m36250o62965k71370l59211l59811m26571l65706k99923
6860A1702239k58286k97002l81582l25478l41905j75244k38989j94868k29531
6851I259354k01954k17083m32023k34579N7089k93309j71418l70862J37093o7071
6841G465237k41517j60635k81315k7756J38435l61942j7851r8941k65225k18440
6831E930050J74862k78980J1564j48806k70830J96209k07107k68854J84683p7853
6821E244938k16409m2355j23738j01j49545m3227m1503j24118n8429q0619m9457
$$ plain form
6810 4315437 4339110 4277180 4073502 4169114 4155638 4063607 3873475 3883496 4056146 3846671 3729073
6799 3729073 3486953 3636293 3869945 3675727 3894099 3649811 3418815 3475999 3551970 3270594
6789 3270594 3555443 3406126 3535016 3489427 3235485 3432166 3262267 3226279 3304589 3064446
6779 3064446 3144400 3131577 3021101 3179959 3128932 2993328 3092161 3022146 3091528 2710936 2962892
6768 2962892 3001301 2977524 2890825 2988299 2806844 2830278 2934253 2955971 2660563 2829060 2810543
6757 2810543 2623539 2667508 2603644 2848676 2603809 2706113 2706432 2730092 2621878 2915586 2744814
6746 2744814 2758269 2573845 2863949 2618486 2837755 2768767 2588323 2554714 2565388 2650543
6736 2650543 2706411 2748454 2705994 2603430 2705939 2804157 2685014 2589932 2576007 2603864 2550692
$$ packed form
6810D315437K3673o1930k03678R5612j3476r2031j90132J0021J72650k09475j17598
6799C729073k42120J49340K33652j94218K18372k44288k30996N7184P5971k81376
6789C270594K84849j49317J28890m5589k53942J96681j69899l5988P8310k40143
6779C064446P9954j2823j10476J58858n1027j35604R8833p0015O9382l80592K51956
6768B962892L8409k3777q6699R7474j81455K3434J03975K1718k95408J68497j8517
6757B810543j87004M3969o3864K45032k44867J02304L19K3660j08214K93708j70772
6746B744814J3455j84424K90104k45463K19269o8988j80444l3609J0674Q5155
6736B650543N5868M2043m2460j02564J02509R8218j19143r5082j3925K7857n3172
$$ plain form
6725 2550692 2585664 2613346 2469992 2285680 2451735 2473787 2446249 2383549 2363471 2555398 2586868
6714 2586868 2467996 2453075 2444739 2389123 2411719 2517921 2201045 2438170 2146356 2265367
6704 2265367 2430961 2397099 2407153 2283217 2381541 2296935 2306166 2328145 2450232 2421338 2535770
6693 2535770 2357678 2500329 2368986 2299697 2232359 2449014 2410215 2404771 2316319 2319068 2308655
6682 2308655 2228755 2392281 2264143 2433418 2382443 2368240 2560785 2400562 2297292 2450170
6672 2450170 2325290 2349693 2259642 2376517 2405495 2383419 2432223 2381225 2312975 2392598 2323754
6661 2323754 2290623 2353698 2463968 2329454 2401575 2583433 2353796 2432489 2346506 2485594
6651 2485594 2278929 2396722 2352715 2510436 2569000 2431077 2216899 2385009 2513325 2458724
$$ packed form
6725B550692L4972K7682j43354j84312J66055K2052k7538o2700k0078J91927L1470
6714B586868j18872j4921q336n5616K2596J06202l16876K37125k91814J19011
6704B265367J65594l3862J0054j23936R8324q4606R231K1979J22087k8894J14432
6693B535770j78092J42651j31343o9289o7338K16655l8799n444q8452K749j0413
6682B308655p9900J63526j28138J69275n0975j4203J92545j60223j03270J52878
6672B450170j24880K4403r0051J16875K8978k2076M8804n0998o8250P9623o8844
6661B323754l3131O3075J10270j34514P2121J81858k29637P8693q5983J39088
6651B485594k06665J17793m4007J57721N8564j37923k14178J68110J28316n4601
$$ plain form
6641 2458724 2307394 2486289 2302742 2509025 2448221 2571104 2544136 2397534 2456457 2462074
6631 2462074 2535942 2633378 2325961 2576715 2475201 2430007 2587359 2608307 2539750 2585625 2598670
6620 2598670 2429205 2501523 2619434 2576517 2632587 2557297 2471373 2623059 2472023 2532911 2787978
6609 2787978 2605712 2789590 2716815 2652094 2614501 2581192 2532963 2607692 2609297 2634923 2483788
6598 2483788 2372393 2763170 2675656 2676095 2669166 2606705 2910952 2806182 2667408 2825473 2650832
6587 2650832 2708801 2945067 2879014 2867381 2918604 2887999 2878995 2863990 2925684 2972474 2927303
6576 2927303 2958555 2940492 3015907 2921870 2999246 2917916 2873131 3130435 2895019 2938903 2907749
6565 2907749 2965867 3047420 3032744 2941764 3317296 2969677 3111595 3008878 2961390 3141020
$$ packed form
6641B458724j51330J78895j83547K06283o0804J22883k6968j46602N8923N617
6631B462074P3868R7436l07417K50754j01514m5194J57352K0948o8557M5875J3045
6620B598670j69465P2318J17911m2917N6070p5290q5924J51686j51036O0888K55067
6609B787978j82266J83878p2775o4721l7593l3309m8229P4729J605K5626j51135
6598B483788j11395L90777q7514M39o929o2461L04247j04770j38774J58065j74641
6587B650832N7969K36266o6053j1633N1223l0605r004j5005O1694M6790m5171
6576B927303L1252j8063P5415r4037P7376q1330m4785K57304k35416M3884l1154
6565B907749N8118Q1553j4676r0980L75532l47619J41918j02717m7488J79630
$$ plain form
6555 3141020 3146433 3253032 3029795 3166219 3101066 3001794 3012278 3158193 3149426 3090903 3007144
6544 3007144 3153072 3149412 3132947 3291831 3307773 3289150 3339518 3210540 3223807 3117178 3159474
6533 3159474 3175160 3132773 3279544 3386970 3400129 3318016 3345416 3420701 3301560 3357014 3546213
6522 3546213 3635742 3251557 3514233 3536618 3637741 3384139 3444343 3331480 3532144 3497354
6512 3497354 3470312 3666739 3567806 3761796 3658288 3689679 3678840 3650368 3778748 3854148 3639608
6501 3639608 3758093 3642737 3857871 3655347 3688494 3894879 3924748 3823340 3913357 3919637
6491 3919637 4079376 3930680 4125030 4141648 4103093 3903393 3991756 4084997 4267833 4260958 4287676
6480 4287676 4096394 4156240 4218656 4394542 4371685 4389731 4465782 4389075 4614397 4541130 4513035
$$ packed form
6555C141020N413J06599k23237J36424o5153r9272J0484J45915q767n8523q3759
6544C007144J45928l660j6465J58884J5942j8623N0368j28978J3267j06629M2296
6533C159474J5686m2387J46771J07426J3159q2113K7400P5285j19141N5454J89199
6522C546213Q9529l84185K62676K2385J01123k53602O0204j12863K00664l4790
6512C497354k7042J96427r8933J93990j03508L1391j0839k8472J28380P5400k14540
6501C639608J18485j15356K15134k02524L3147K06385K9869j01408R0017O280
6491C919637J59739j48696J94350J6618l8555j99700Q8363R3241J82836o875K6718
6480D287676j91282N9846O2416J75886k2857J8046P6051p6707K25322p3267k8095
$$ plain form
6469 4513035 4632527 4592922 4565046 4649883 4567605 4407913 4580618 4797839 4814953 4767041 4750743
6458 4750743 5020150 5035426 5154134 4971495 5193688 4978619 5178412 5272812 5355157 5247366
6448 5247366 5287209 5327906 5428042 5236347 5668244 5496290 5589306 5395828 5455829 5647914
6438 5647914 5882508 5737816 5888273 6126260 5970424 6032267 6056481 6100345 6314196 6185554
6428 6185554 6306310 6236751 6486097 6602766 6666098 6784196 6839896 6865771 6923783 7063456
6418 7063456 7220174 7155961 7366166 7188392 7226271 7569174 7703198 7633008 7866471 7689736
6408 7689736 8104961 8083640 8468796 8438500 8349605 8593821 8638075 8693103 8756397 8968783 9186453
6397 9186453 9352107 9255942 9441474 9589400 9752203 9602916 9829193 10146504 10231294 10500453
$$ packed form
6469D513035J19492l9605k7876Q4837q2278j59692J72705K17221J7114m7912j6298
6458D750743K69407J5276J18708j82639K22193k15069J99793R4400Q2345j07791
6448E247366L9843M0697J00136j91695M31897j71954R3016j93478O0001J92085
6438E647914K34594j44692J50457K37987j55836O1843K4214M3864K13851j28642
6428F185554J20756o9559K49346J16669O3332J18098N5700K5875N8012J39673
6418G063456J56718o4213K10205j77774L7879L42903J34024p0190K33463j76735
6408G689736M15225k1321L85156l0296q8895K44216M4254N5028O3294K12386K17670
6397I186453J65654r6165J85532J47926J62803j49287K26277L17311Q4790K69159
$$ plain form
6387 10500453 10630314 10704018 10961756 11188242 11538816 11354229 11453229 11732536 11929125 12219463
6377 12219463 12238813 12525541 12619379 12900040 13368610 13571622 13688875 13995745 14292226 14742593
6367 14742593 14915692 15030465 15414350 15664744 16029734 16305256 16719521 16935890 17396037
6358 17396037 17776607 18148097 18490729 18894404 19435584 19751938 20332539 20626695 21116865
6349 21116865 21452294 21886066 22555065 22916518 23486595 24080238 24651688 25034098 25812387
6340 25812387 26138586 26837719 27469999 28304096 28882438 29440012 30048171 30829192 31655475
6331 31655475 32305708 32998011 33998762 34758781 35447283 36412566 37131694 37992109 39088450
6322 39088450 40232990 40890417 41822157 42915705 43603744 44710994 45965081 46757801 47650471
$$ packed form
6387A0500453J29861P3704K57738K26486L50574j84587R9000K79307J96589K90338
6377A2219463J9350K86728R3838K80661M68570K03012J17253L06870K96481M50367
6367A4742593J73099J14773L83885K50394L64990K75522M14265K16369M60147
6358A7396037L80570L71490L42632M03675N41180L16354N80601K94156M90170
6349B1116865L35429M33772O68999L61453N70077N93643N71450L82410P78289
6340B5812387L26199O99133O32280Q34097N78342N57574O08159P81021Q26283
6331C1655475O50233O92303J000751P60019O88502R65283P19128Q60415J096341
6322C9088450J144540O57427R31740J093548O88039J107250J254087P92720Q92670
$$ plain form
6313 47650471 48665819 49556203 50452761 51370209 52102000 52971499 53903455 54633305 55396696
6304 55396696 56202732 56934600 57741642 58417411 58982327 59540685 60170745 60555311 61120511
6295 61120511 61722872 61864310 62045516 62138515 62238929 62174977 62002050 61939430 61569034 61019953
6285 61019953 60701909 60284850 59603272 58975846 58284452 57571591 56862473 56138195 55177716
6276 55177716 54189869 53307256 52558381 51617408 50289951 49438614 48482469 47437210 46302196
6267 46302196 45240493 44457622 43234125 42330657 41117779 40308767 39025677 37984557 37087821
6258 37087821 36133789 35291898 34383354 33609688 32584613 31672015 30804933 30274759 29338692
6249 29338692 28740661 27980223 27315654 26896557 26189699 25921863 25213562 24515314 24140368
$$ packed form
6313D7650471J015348Q90384Q96558R17448P31791Q69499R31956P29850P63391
6304E5396696Q06036P31868Q07042O75769N64916N58358O30060L84566N65200
6295F1120511O02361J41438J81206R2999J00414o3952j72927o2620l70396n49081
6285F1019953l18044m17059o81578o27426o91394p12861p09118p24278r60479
6276E5177716r87847q82613p48875r40973j327457q51337r56145j045259j135014
6267D6302196j061703p82871j223497r03468j212878q09012j283090j041120q96736
6258C7087821r54032q41891r08544p73666j025075r12598q67082n30174r36067
6249B9338692n98031p60438o64569m19097p06858k67836p08301o98248l74946
$$ plain form
6240 24140368 23591926 23113009 22708878 22516135 22161168 21870307 21470796 21024695 20858650
6231 20858650 20532058 20407376 20112710 20088958 19971831 19602363 19267276 19308446 19032165 19083207
6221 19083207 18876265 18833532 18575294 18708225 18455035 18614521 18503148 18266273 18498085 18437890
6211 18437890 18362478 18255793 18273228 18117967 18241120 18262995 18296366 18368379 18552743 18481090
6201 18481090 18573959 18485841 18801421 18639647 18856628 18912588 18844003 19114950 19070974 19524112
6191 19524112 19506030 19657735 19876343 19850077 19936837 20146190 20287148 20534912 20582319 20886541
6181 20886541 21030997 21125532 21480715 21686527 21877161 22096119 22227479 22546593 22763278 22964962
6171 22964962 23512147 23689714 24059620 24237845 24689527 24835602 25214314 25534654 25946078
$$ packed form
6240B4140368n48442m78917m04131j92743l54967k90861l99511m46101j66045
6231B0858650l26592j24682k94666k3752j17127l69468l35087M1170k76281N1042
6221A9083207k06942m2733k58238J32931k53190J59486j11373k36875K31812o0195
6211A8437890p5412j06685J7435j55261J23153K1875L3371P2013J84364p1653
6201A8481090R2869q8118L15580j61774K16981N5960o8585K70947m3976M53138
6191A9524112j8082J51705K18608k6266Q6760K09353J40958K47764M7407L04222
6181B0886541J44456R4535L55183K05812J90634K18958J31360L19114K16685K01684
6171B2964962N47185J77567L69906J78225M51682J46075L78712L20340M11424
$$ plain form
6162 25946078 26385016 26555434 27049521 27334080 27754738 28263430 28403197 28799733 29417384
6153 29417384 29754893 30396499 30712190 30995107 31540617 32041906 32538796 33085226 33456862
6144 33456862 34169188 34716865 35112471 35615778 36234502 36869834 37295463 37979925 38679300
6135 38679300 39260522 40117355 40564659 41174713 42044343 42793919 43622243 44518475 45408372
6126 45408372 46214813 46901419 47978604 48888429 50282858 51042512 52211644 53110119 54343606
6117 54343606 55855802 57017574 58475219 59729703 61243005 62484166 64337926 65690766
6109 65690766 67402364 69138233 70896016 72749272 74707562 76625910 78681631 80803321
6101 80803321 83072716 85413885 87884298 90519407 92994619 95847151 98495499 101481535
$$ packed form
6162B5946078M38938J70418M94087K84559M20658N08692J39767L96536O17651
6153B9417384L37509O41606L15691K82917N45510N01289M96890N46430L71636
6144C3456862P12326N47677L95606N03307O18724O35332M25629O84462O99375
6135C8679300N81222Q56833M47304O10054Q69630P49576Q28324Q96232Q89897
6126D5408372Q06441O86606J077185R09825J394429P59654J169132Q98475J233487
6117E4343606J512196J161772J457645J254484J513302J241161J853760J352840
6109F5690766J711598J735869J757783J853256J958290J918348K055721K121690
6101H0803321K269395K341169K470413K635109K475212K852532K648348K986036
$$ plain form
6093 101481535 104062797 107300973 110140251 112919814 115934341 119224595 122189770 125502572
6085 125502572 128859810 132364634 136094368 140048244 143757333 147626037 151643705 155754240
6077 155754240 159876670 163960803 168304576 172850357 177188806 181662385 186525100 191182427
6069 191182427 196103443 201262253 206621868 212172691 217683857 224013499 230345796 236738847
6061 236738847 243762700 250660996 257795998 265152754 272672289 280465916 288276550 295900022
6053 295900022 304060604 311652126 319301269 326443510 332918778 338507988 342994771 346773055
6045 346773055 349334450 351040981 351639089 351360698 350053053 348199948 345382470 341977315
6037 341977315 337571497 332397283 326519117 320214693 313519524 306501796 299185499 292036908
$$ packed form
6093A01481535K581262L238176K839278K779563L014527L290254K965175L312802
6085A25502572L357238L504824L729734L953876L709089L868704M017668M110535
6077A55754240M122430M084133M343773M545781M338449M473579M862715M657327
6069A91182427M921016N158810N359615N550823N511166O329642O332297O393051
6061B36738847P023853O898296P135002P356756P519535P793627P810634P623472
6053B95900022Q160582P591522P649143P142241O475268N589210M486783L778284
6045C46773055K561395J706531N98108k78391j307645j853105k817478l405155
6037C41977315m405818n174214n878166o304424o695169p017728p316297p148591
$$ plain form
6029 292036908 284743287 277521025 270169833 263155421 256289385 249736549 243035936 236841358
6021 236841358 230592149 225200776 219416939 213748531 208434295 203513048 198636934 193694687
6013 193694687 188701211 184432142 179926070 175636456 171691766 167349080 163411690 159414074
6005 159414074 155451837 151732626 147671069 144121684 140505661 136785162 133485643 130041743
5997 130041743 126454715 123234405 119946838 116754301 113561351 110597164 107630345 104728517
5989 104728517 101731574 98888920 96490727 93644695 90892021 88210071 85850749 83247476
5981 83247476 80928759 78751481 76400414 74213653 72014968 69862338 67812595 65953745
5973 65953745 63973058 62065345 60180690 58503902 56671406 54971317 53444373 51942075
$$ packed form
6029B92036908p293621p222262p351192p014412o866036o552836o700613o194578
6021B36841358o249209n391373n783837n668408n314236m921247m876114m942247
6013A93694687m993476m269069m506072m289614l944690m342686l937390l997616
6005A59414074l962237l719211m061557l549385l616023l720499l299519l443900
5997A30041743l587028l220310l287567l192537l192950k964187k966819k901828
5989A04728517k996943k842654k398193k846032k752674k681950k359322k603273
5981H3247476k318717k177278k351067k186761k198685k152630k049743j858850
5973F5953745j980687j907713j884655j676788j832496j700089j526944j502298
$$ plain form
5965 51942075 50563134 49010995 47681871 46010518 45114226 43784204 42678967 41271829
5957 41271829 40243769 39261416 38184611 37234855 36219934 35278033 34268584 33467202 32729156
5948 32729156 31909260 31048190 30260152 29800728 29073761 28326899 27637363 27384251 26527210
5939 26527210 25809953 25392068 25000952 24538229 23889646 23619711 22998697 22562265 22104195
5930 22104195 21673643 21384737 20756931 20460636 20214612 19729058 19371896 19125081 18704975
5921 18704975 18485556 18162240 18004866 17557113 17386122 17065898 16737871 16462101 16051877
5912 16051877 15832099 15765081 15600852 15233877 15067023 14662729 14476906 14312201 14293098 13929466
5902 13929466 13974981 13579914 13292224 13341087 12852428 12812836 12928452 12503273 12415274 12150974
$$ packed form
5965E1942075j378941j552139j329124j671353q96292j330022j105237j407138
5957D1271829j028060r82353j076805r49756j014921r41901j009449q01382p38046
5948C2729156q19896q61070p88038m59424p26967p46862o89536k53112q57041
5939B6527210p17257m17885l91116m62723o48583k69935o21014m36432m58070
5930B2104195m30552k88906o27806k96295k46024m85554l57162k46815m20106
5921A8704975k19419l23316j57374m47753j70991l20224l28027k75770m10224
5912A6051877k19778o7018j64229l66975j66854m04294j85823j64705j9103l63632
5902A3929466M5515l95067k87690M8863m88659l9592J15616m25179q7999k64300
$$ plain form
5892 12150974 12129260 11810357 11891368 11527626 11426138 11248369 11186624 11235503 10899503 10699018
5882 10699018 10609146 10799540 10360471 10304317 10176404 10068354 10154477 9860333 9669720 9707056
5872 9707056 9567395 9321300 9282258 9511085 9157224 8927820 9169723 8868930 8617659 8688794
5862 8688794 8655198 8438798 8475411 8425361 8191752 8052777 8014944 8033370 7877717 7723254
5852 7723254 7673206 7731406 7706432 7602239 7564602 7310175 7240669 7225529 7318175 7116682 7359260
5841 7359260 6996705 6879615 6742285 6817288 6873890 6595859 6558800 6515177 6487718 6431961 6498616
5830 6498616 6446699 6367433 6157506 6215020 6296495 6227247 6151818 6183336 5993600 5749613 6094053
5819 6094053 5819908 5904367 5490657 5622148 5698652 5585328 5642659 5467649 5655796 5564039
$$ packed form
5892A2150974k1714l18903Q1011l63742j01488j77769o1745M8879l36000k00485
5882A0699018q9872J90394m39069n6154j27913j08050Q6123k94144j90613L7336
5872I707056j39661k46095l9042K28827l53861k29404K41903l00793k51271P1135
5862H688794l3596k16400L6613n0050k33609j38975l7833J8426j55653j54463
5852G723254n0048N8200k4974j04193l7637k54427o9506j5140R2646k01493K42578
5841G359260l62555j17090j37330P5003N6602k78031l7059m3623k7459n5757O6655
5830F498616n1917p9266k09927N7514Q1475o9248p5429L1518j89736k43987L44440
5819F094053k74145Q4459m13710J31491P6504j13324N7331j75010J88147r1757
$$ plain form
5809 5564039 5393635 5322468 5319255 5372197 5440323 5230796 5062435 5040221 5159165 4984129 5058348
5798 5058348 5044548 5018279 4880870 4788733 5049604 4868426 4943830 4852387 4852948 4792401 4777182
5787 4777182 4808644 4920754 4846558 4965932 4838378 4759286 4877612 4637420 4651285 4866097
5777 4866097 4758236 4748229 4570891 4696515 4780839 4641855 4505596 4535216 4732639 4693378
5767 4693378 4548036 4628153 4714891 4510195 4540053 4615296 4638225 4605814 4335400 4546010 4394326
5756 4394326 4632903 4639384 4298822 4481321 4429643 4393732 4424111 4476106 4492909 4410280 4157055
5745 4157055 4413535 4404524 4358389 4379339 4414499 4360146 4346987 4334416 4119026 4551028 4380446
5734 4380446 4390731 4382047 4287486 4353106 4265983 4117115 4288209 4261688 4082011 4083740 3999171
$$ packed form
5809E564039j70404p1167l213N2942O8126k09527j68361k2214J18944j75036P4219
5798E058348j3800k6269j37409r2137K60871j81178P5404r1443N61o0547j5219
5787D777182L1462J12110p4196J19374j27554p9092J18326k40192J3865K14812
5777D866097j07861j0007j77338J25624Q4324j38984j36259K9620J97423l9261
5767D693378j45342Q0117Q6738k04696K9858P5243K2929l2411k70414K10610j51684
5756D394326K38577O481l40562J82499n1678l5911L0379N1995J6803q2629k53225
5745D157055K56480r011m6135K0950L5160n4353j3159j2571k15390M32002j70582
5734D380446J0285q684r4561O5620q7123j48868J71094k6521j79677J729q4569
$$ plain form
5723 3999171 3957050 4245254 4124477 4047643 4192494 4149089 4034209 4025080 3990940 4090974 4015390
5712 4015390 4115481 4135772 3990544 4012008 3907132 4236140 3948838 4054646 3937044 3690610
5702 3690610 3856623 3910911 3965267 4044592 3893171 3768524 3777237 3799716 3834014 3704366 3921661
5691 3921661 3764995 3665382 3618576 3648698 3904576 3699317 3854461 3860950 3732616 3745425 3826738
5680 3826738 3550067 3766597 3665106 3747458 3617369 3686715 3724187 3710677 3620217 3715159 3768796
5669 3768796 3658883 3633001 3711023 3562536 3583794 3514213 3599053 3448632 3456286 3628858 3577051
5658 3577051 3870402 3676304 3841983 3701796 3584378 3710978 3595973 3626316 3695609 3674139
5648 3674139 3805096 3872303 3765239 3698384 3767823 3674826 3734712 3970573 3909313 3643683 3825953
$$ packed form
5723C999171m2121K88204j20777p6834J44851m3405j14880r129l4140J00034p5584
5712D015390J00091K0291j45228K1464j04876L29008k87302J05808j17602k46434
5702C690610J66013N4288N4356P9325j51421j24647Q713K2479L4298j29648K17295
5691C921661j56666r9613m6806L0122K55878k05259J55144O489j28334J2809Q1313
5680C826738k76671K16530j01491Q2352j30089O9346L7472j3510r0460R4942N3637
5669C768796j09913k5882P8022j48487K1258o9581Q4840j50421P654J72572n1807
5658C577051K93351j94098J65679j40187j17418J26600j15005L0343O9293k1470
5648C674139J30957O7207j07064o6855O9439r2997N9886K35861o1260k65630J82270
$$ plain form
5637 3825953 3902027 3983339 3811754 3862422 3892698 3883581 4048177 4004913 3973470 4224521 4148668
5626 4148668 3974449 4355699 4432719 4214826 4159737 4269691 4138699 4279015 4308549 4372555
5616 4372555 4286685 4234837 4226484 4553004 4521517 4563804 4926185 4640714 4905142 4940105 4779471
5605 4779471 4873868 5057229 5177652 5329242 5400444 5198390 5486946 5504484 5633544 5665624
5595 5665624 5976872 5645668 5805989 5871043 5944499 5949053 6022349 5977862 6126072 6012375 6142121
5584 6142121 6261397 6055889 6207782 6113389 6103885 6205181 6310015 6202180 6301389 6268864
5574 6268864 6389823 6139854 6658103 6441925 6549169 6399088 6693981 6537816 6768637 6929055
5564 6929055 6833565 6891289 7083892 7082958 6937599 7185622 7029718 7299998 7586158 7473754
$$ packed form
5637C825953P6074Q1312j71585N0668L0276r117J64596m3264l1443K51051p5853
5626D148668j74219L81250P7020k17893n5089J09954j30992J40316K9534O4006
5616D372555q5870n1848q353L26520l1487M2287L62381k85471K64428L4963j60634
5605D779471R4397J83361J20423J51590P1202k02054K88556J7538J29060L2080
5595E665624L11248l31204J60321O5054P3456M554P3296m4487J48210j13697J29746
5584F142121J19276k05508J51893r4393r504J01296J04834j07835R9209l2525
5574F268864J20959k49969N18249k16178J07244j50081K94893j56165K30821J60418
5564F929055r5490N7724J92603r34j45359K48023j55904K70280K86160j12404
$$ plain form
5554 7473754 7318076 7730460 7505217 7942035 7945863 8094082 8151515 8244476 8183520 8327115
5544 8327115 8464034 8590992 8540780 8613531 9020920 8961803 9120167 9377696 9671142 9749547
5534 9749547 9855787 10007240 10161054 10357421 10606109 10751072 10786842 11056230 11426365 11305090
5524 11305090 11930092 12178302 12171085 12596959 12459792 12852614 12996597 13382372 13707883 13832220
5514 13832220 14127433 14594853 14956546 15078000 15350073 15862015 16089598 16496443 16935566
5505 16935566 17024802 17432276 17811185 18207866 18753516 18998828 19506770 19900061 20302034 20891176
5495 20891176 21163824 21833505 22329947 22725851 23166855 23810207 24232725 24681994 25346256
5486 25346256 26023520 26546311 27142227 27618386 28400264 28874669 29639812 30241807 30832940
$$ packed form
5554G473754j55678M12384k25243M36818L828J48219N7433R2961o0956J43595
5544H327115J36919J26958n0212P2751M07389n9117J58364K57529K93446P8405
5534I749547J06240J51453J53814J96367K48688J44963L5770K69388L70135j21275
5524A1305090O25002K48210p217M25874j37167L92822J43983L85775L25511J24337
5514A3832220K95213M67420L61693J21454K72073N11942K27583M06845M39123
5505A6935566Q9236M07474L78909L96681N45650K45312N07942L93291M01973N89142
5495B0891176K72648O69681M96442L95904M41004O43352M22518M49269O64262
5486B5346256O77264N22791N95916M76159P81878M74405P65143O01995N91133
$$ plain form
5477 30832940 31388665 31985544 32668517 33267975 34045272 34541340 35306159 35888176 36626860
5468 36626860 37265342 37900018 38559087 39084482 39657824 40105736 40808967 41257154 41649095
5459 41649095 42346517 42737750 43312160 43763487 44062664 44425211 44880590 45320567 45458709
5450 45458709 46020597 46073261 46459610 46738818 46920488 47280838 47471564 47593222 47557950 47746377
5440 47746377 47877478 47830159 47910170 47904502 47776724 47925073 47625668 47590376 47588670 47067634 47089869
5429 47089869 46628223 46353778 46246244 45838546 45503704 44944080 44490178 44118781 43752594
5420 43752594 43186327 43007737 42411413 41839188 41260550 40603413 40042458 39688329 38854365
5411 38854365 38276273 37774203 37106483 36548214 35806890 35172740 34761509 33985842 33378506
$$ packed form
5477C0832940N55725N96879O82973N99458P77297M96068P64819N82017P38684
5468C6626860O38482O34676O59069N25395N73342M47912P03231M48187L91941
5459D1649095O97422L91233N74410M51327K99177L62547M55379M39977J38142
5450D5458709N61888N2664L86349K79208J81670L60350J90726J21658l5272J88427
5440D7746377J31101m7319Q0011n668j27778J48349k99405l5292j706n21036K2235
5429D7089869m61646k74445j07534m07698l34842n59624m53902l71397l66187
5420D3752594n66267j78590n96324n72225n78638o57137n60955l54129q33964
5411C8854365n78092n02070o67720n58269p41324o34150m11231p75667o07336
$$ plain form
5402 33378506 32657903 32272829 31514903 30987183 30351554 29674408 29133965 28433756 28040281
5393 28040281 27483787 26627227 26237709 25535660 25153994 24807373 24387386 23592836 23441485
5384 23441485 22836558 22422823 22064807 21699419 21159330 20746297 20561459 20305687 19858042
5375 19858042 19683588 19343955 19177926 18895777 18751832 18475340 18204388 17981852 18209376
5366 18209376 17980610 17622003 17781867 17779397 17607399 17609733 17825403 17609126 17558498 17549408 17945798
5355 17945798 17848986 17981070 18126906 18240530 18282777 18427665 18532051 18932431 19087685 19370123
5345 19370123 19785267 19941482 20288312 20659201 20776431 21383173 21949548 22052900 22735285
5336 22735285 23194141 23568276 24140312 24575610 25412992 25999653 26299110 26648511 27149720
$$ packed form
5402C3378506p20603l85074p57926n27720o35629o77146n40443p00209l93475
5393B8040281n56494q56560l89518p02049l81666l46621m19987p94550j51351
5384B3441485o04927m13735l58016l65388n40089m13033j84838k55772m47645
5375A9858042j74454l39633j66029k82149j43945k76492k70952k22536K27524
5366A8209376k28766l58607J59864k470j71998K334K15670k16277n0628r090L96390
5355A7945798r6812J32084J45836J13624M2247J44888J04386M00380J55254K82438
5345A9370123M15144J56215L46830L70889J17230O06742N66375J03352O82385
5336B2735285M58856L74135N72036M35298Q37382N86661K99457L49401N01209
$$ plain form
5327 27149720 27791616 28312891 28616472 29130098 29511787 29718586 30261752 30861003 31302542
5318 31302542 31628480 32201064 32657962 33166974 33476897 34202101 34899125 35396866 36136327
5309 36136327 36703674 37594992 38077475 38902382 39556617 39875553 40732074 41383585 41874772
5300 41874772 42147852 42294074 42518476 42874582 42835414 42920899 42693365 42257786 42056818 41781705
5290 41781705 41321321 40389112 39776557 38738866 37872003 36865825 35820077 34896502 33897303
5281 33897303 32698027 31523568 30440500 29302311 28056982 27059903 26115565 25001925
5273 25001925 24045512 22891991 22037072 21085392 20175827 19470085 18506146 17916370 17134811
5264 17134811 16495248 15779500 15042767 14802097 14199701 13809568 13281154 12909250 12506957
$$ packed form
5327B7149720O41896N21275L03581N13626L81689K06799N43166N99251M41539
5318C1302542L25938N72584M56898N09012L09923P25204O97024M97741P39461
5309C6136327N67347Q91318M82483Q24907O54235L18936Q56521O51511M91187
5300D1874772K73080J46222K24402L56106l9168Q5485k27534m35579k00968k75113
5290D1781705m60384r32209o12555j037691q66863j006178j045748r23575r99199
5281C3897303j199276j174459j083068j138189j245329r97079r44338j113640
5273B5001925r56413j153521q54919r51680r09565p05742r63939n89776p81559
5264A7134811o39563p15748p36733k40670o02396l90133n28414l71904m02293
$$ plain form
5255 12506957 12246799 11653662 11337340 11146941 10838625 10636871 10314945 10048612 9741762
5246 9741762 9778611 9406844 9185574 9353189 8888687 8708496 8369132 8535106 8467766 8113845
5236 8113845 7963423 7756493 7796690 7722270 7765469 7644080 7261711 7299672 7250449 7123409
5226 7123409 7083643 7186790 7045344 6883159 6971160 6788912 6746058 6788373 6727827 6719274 6538413
5215 6538413 6542853 6613705 6338765 6517263 6395262 6446277 6128650 6239709 6286133 6134864
5205 6134864 6159669 6086075 6083990 6154983 6197741 6064208 6019260 6003304 6002934 5955807 5955608 6018599
5193 6018599 6013447 5817881 5829613 5921830 5769409 5647623 5717293 5631236 5659619 5519719 5647421
5182 5647421 5733502 5639842 5657779 5716505 5748176 5764025 5564753 5668358 5414712 5578896 5580222
$$ packed form
5255A2506957k60158n93137l16322j90399l08316k01754l21926k66333l06850
5246I741762L6849l71767k21270J67615m64502j80191l39364J65974o7340l53921
5236H113845j50422k06930M0197p4420M3199j21389l82369L7961m9223j27040
5226G123409l9766J03147j41446j62185Q8001j82248m2854M2315o0546q553j80861
5215F538413M440P0852k74940J78498j22001N1015l17627J11059M6424j51269
5205F134864K4805p3594k085P0993M2758j33533m4948j5956l70m7127j99O2991
5193F018599n152j95566J1732R2217j52421j21786O9670q6057K8383j39900J27702
5182E647421Q6081r3660J7937N8726L1671J5849j99272J03605k53646J64184J326
$$ plain form
5171 5580222 5626083 5455735 5621970 5674022 5504359 5610692 5557902 5553430 5618804 5518466 5499528
5160 5499528 5458132 5479982 5479019 5219328 5615258 5381290 5678726 5582809 5538486 5643524 5540596
5149 5540596 5662938 5636796 5633563 5554663 5493343 5746584 5536704 5712719 5619942 5527844 5513601
5138 5513601 5625610 5740606 5790429 5580966 5662835 5763148 5591996 5871024 5722203 5948820
5128 5948820 5676939 5900866 5834196 5785060 5973480 5838630 5897850 5770686 5843717 6039847
5118 6039847 5977701 6052795 6098979 6227826 6231752 6285050 6201087 6220194 6272096 6357480 6306173
5107 6306173 6336877 6376777 6195909 6417066 6579749 6447784 6539116 6800406 6749440 6845632
5097 6845632 6814703 6862292 7053662 7013679 6926827 7054118 7295090 7493856 7319761 7643633
$$ packed form
5171E580222M5861j70348J66235N2052j69663J06333n2790m472O5374j00338j8938
5160E499528m1396K1850r63k59691L95930k33968K97436r5917m4323J05038j02928
5149E540596J22342k6142l233p8900o1320K53241k09880J76015r2777r2098j4243
5138E513601J12009J14996M9823k09463Q1869J00313j71152K79028j48821K26617
5128E948820k71881K23927o6670m9136J88420j34850N9220j27164P3031J96130
5118F039847o2146P5094M6184J28847L926N3298q3963J9107N1902Q5384n1307
5107F306173L0704L9900j80868K21157J62683j31965R1332K61290n0966R6192
5097F845632l0929M7589J91370l9983q6852J27291K40972J98766j74095L23872
$$ plain form
5087 7643633 7535520 7565234 7698137 7713647 7856140 7789916 8015650 7969304 7856381 8198144
5077 8198144 8399354 8531985 8346001 8668119 8882891 8856632 9041470 9112882 9224115 9421386
5067 9421386 9412458 9625807 9613866 9709724 9903076 10112256 10227929 10327450 10168418 10455131
5057 10455131 10595169 10767807 10882463 11008313 11376076 11436641 11497320 11641201 11779782 12004695
5047 12004695 11982475 12403482 12545593 12575447 13002723 13208404 13262770 13480554 13607536 13964117
5037 13964117 14089708 14543041 14568781 14711043 15055215 15155926 15483926 15683890 15986301 16336515
5027 16336515 16681613 16957881 17115311 17647753 17990657 18133980 18718322 18910535 19302679
5018 19302679 19897733 20082495 20414348 20971848 21627177 21821987 22296137 22823136 23349154
$$ packed form
5087G643633j08113K9714J32903J5510J42493o6224K25734m6346j12923L41763
5077H198144K01210J32631j85984L22118K14772k6259J84838P1412J11233J97271
5067I421386q928K13349j1941R5858J93352K09180J15673R9521j59032K86713
5057A0455131J40038J72638J14656J25850L67763O0565O0679J43881J38581K24913
5047A2004695k2220M21007J42111K9854M27276K05681N4366K17784J26982L56581
5037A3964117J25591M53333K5740J42262L44172J00711L28000J99964L02411L50214
5027A6336515L45098K76268J57430N32442L42904J43323N84342J92213L92144
5018A9302679N95054J84762L31853N57500O55329J94810M74150N26999N26018
$$ plain form
5009 23349154 24129538 24364141 25076333 25636362 26173452 26582830 27460489 28115379 28609377
5000 28609377 29442476 30252014 30784545 31607150 32333025 33003396 34065016 34806134 35816115
4991 35816115 36912379 37621899 38545170 39596020 40748296 41564803 42638538 43660638 45008477
4982 45008477 46131598 47320876 48559976 49698067 51049434 52627150 53965626 55508545
4974 55508545 56747543 58253058 59831163 61305675 63042071 64704591 66463725 68130902
4966 68130902 69985291 71471585 73370585 75003946 76795354 78452209 80051287 81907080
4958 81907080 83342378 84845021 86379911 87844035 89239007 90305379 91575728 92588776
4950 92588776 93672314 94592226 95478177 95963044 96584146 97079762 97161464 97258872 97413909 97118047
$$ packed form
5009B3349154P80384K34603P12192N60029N37090M09378Q77659O54890M93998
5000B8609377Q33099Q09538N32531Q22605P25875O70371J061620P41118J009981
4991C5816115J096264P09520R23271J050850J152276Q16507J073735J022100J347839
4982D5008477J123121J189278J239100J138091J351367J577716J338476J542919
4974E5508545J238998J505515J578105J474512J736396J662520J759134J667177
4966F8130902J854389J486294J899000J633361J791408J656855J599078J855793
4958H1907080J435298J502643J534890J464124J394972J066372J270349J013048
4950I2588776J083538R19912Q85951M84867O21102M95616Q1702R7408J55037k95862
$$ plain form
4940 97118047 97096091 96706426 96131773 95353245 94801345 93786528 92884980 91712065 90499453
4931 90499453 89110513 87925566 86270830 84767357 82992623 81381378 79879391 77908408
4923 77908408 76048497 74342387 72257017 70405482 68645977 66669201 64803878 63223621
4915 63223621 61243185 59292810 57692237 56010272 54400144 52704597 50956824 49590903
4907 49590903 48185566 46491114 45403176 43894245 42677662 41508906 40375812 39217066
4899 39217066 38056368 37398566 36053940 35320482 34404995 33836615 32737816 32090902 31542548
4890 31542548 30665573 30052687 29747309 29220786 28984601 28229083 27953047 27488758 26923085
4881 26923085 26666193 26516895 26262831 26101679 25592821 25608143 25376892 25153023 25011241 25067299
$$ packed form
4940I7118047k1956l89665n74653p78528n51900j014817r01548j172915j212612
4931I0499453j388940j184947j654736j503473j774734j611245j501987j970983
4923G7908408j859911j706110k085370j851535j759505j976776j865323j580257
4915F3223621j980436j950375j600573j681965j610128j695547j747773j365921
4907D9590903j405337j694452j087938j508931j216583j168756j133094j158746
4899C9217066j160698o57802j344626p33458r15487n68380j098799o46914n48354
4890C1542548q76975o12886l05378n26523k36185p55518k76036m64289n65673
4881B6923085k56892j49298k54064j61152n08858J5322k31251k23869j41782N6058
$$ plain form
4871 25067299 24660278 24702775 24694971 24793490 24396851 24549526 24543710 24509521 24487871 24534358 24663128
4860 24663128 24768311 24931858 25018826 25135320 25105783 25407816 25496549 25513001 25751798 25987536
4850 25987536 26115103 26260904 26505647 26870122 27145692 27422619 27557648 27942915 28266577
4841 28266577 28676863 28966232 29280845 29716004 30090908 30777535 31057028 31607637 31758726
4832 31758726 32545272 32825023 33238388 33683843 34241914 34455244 35035320 34914857 35468907
4823 35468907 36084628 36376208 36788505 37114397 37452316 37932358 38217643 38603803 39033567
4814 39033567 39425007 40071591 40605850 40850969 41490792 42106002 42782391 43270918 43986865
4805 43986865 44796385 45311268 46275410 47180430 48008892 49101206 49902565 51005388 52040396
$$ packed form
4871B5067299m07021M2497p804R8519l96639J52675n816l4189k1650M6487J28770
4860B4663128J05183J63547Q6968J16494k9537L02033Q8733J6452K38797K35738
4850B5987536J27567J45801K44743L64475K75570K76927J35029L85267L23662
4841B8266577M10286K89369L14613M35159L74904O86627K79493N50609J51089
4832C1758726P86546K79751M13365M45455N58071K13330N80076j20463N54050
4823C5468907O15721K91580M12297L25892L37919M80042K85285L86160M29764
4814C9033567L91440O46584N34259K45119O39823O15210O76389M88527P15947
4805D3986865Q09520N14883R64142R05020Q28462J092314Q01359J102823J035008
$$ plain form
4796 52040396 53066674 54408859 55502557 56618063 57759177 59087838 60397570 61927997
4788 61927997 63316694 64783831 66510155 67877263 69444498 70951468 72573747 74499190
4780 74499190 76400437 78023996 79834255 81765224 83824288 85740856 88088717 90280827
4772 90280827 92451346 94805808 97338520 99760704 102255444 104851082 107692223 110648097
4764 110648097 113437352 116773596 120101418 123414273 126768618 130211192 133980225 137683296
4756 137683296 141645276 145655687 149508868 153585207 157571479 161684161 165616297 169561034
4748 169561034 173339538 176927525 180317772 183536588 186442644 188978666 191369788 193328464
4740 193328464 194971388 195891943 196635330 197068168 196878670 196309295 195498912 194145824 192193092
$$ packed form
4796E2040396J026278J342185J093698J115506J141114J328661J309732J530427
4788F1927997J388697J467137J726324J367108J567235J506970J622279J925443
4780G4499190J901247J623559J810259J930969K059064J916568K347861K192110
4772I0280827K170519K354462K532712K422184K494740K595638K841141K955874
4764A10648097K789255L336244L327822L312855L354345L442574L769033L703071
4756A37683296L961980M010411L853181M076339L986272M112682L932136L944737
4748A69561034L778504L587987L390247L218816K906056K536022K391122J958676
4740A93328464J642924R20555P43387M32838j89498n69375q10383j353088j952732
$$ plain form
4731 192193092 189806790 187064831 184215097 181089392 177265087 173535746 169702876 165329794
4723 165329794 160923273 156459073 151876658 147317179 142847490 138162320 133736965 129298509
4715 129298509 125020189 120869204 116704665 112650630 108904023 105003987 101585744 98021388
4707 98021388 94652006 91776402 88826723 86084313 83227933 80843503 78327591 76085354
4699 76085354 73625900 71760950 69751128 68050875 66133384 64426863 62789107 61577848
4691 61577848 60088170 58612000 57537573 56274335 55021238 54506909 53348073 52282743
4683 52282743 51531997 50698208 49928110 49266537 48544630 47987795 47348396 46879919 46258055
4674 46258055 45914725 45539917 45289908 44940299 44799465 44292141 44183927 43949849 43657725
$$ packed form
4731A92193092k386302k741959k849734l125705l824305l729341l832870m373082
4723A65329794m406521m464200m582415m559479m469689m685170m425355m438456
4715A29298509m278320m150985m164539m054035l746607l900036l418243l564356
4707I8021388l369382k875604k949679k742410k856380k384430k515912k242237
4699G6085354k459454j864950k009822j700253j917491j706521j637756j211259
4691F1577848j489678j476170j074427j263238j253097n14329j158836j065330
4683E2282743p50746q33789p70098o61573p21907n56835o39399m68477o21864
4674D6258055l43330l74808k50009l49609j40834n07324j08214k34078k92124
$$ plain form
4665 43657725 43624539 43608898 43261716 43123367 43228503 43365675 43567815 43288451 43487501 43516984
4655 43516984 43903324 43897004 43804863 44375980 44691021 44866554 45249409 45565939 46054505 46572240
4645 46572240 47110776 47408626 48006134 48527549 48962542 49626868 50280246 50923894 51775253
4636 51775253 52246372 53188745 53811918 54551563 55192883 56142319 56901636 57723592 58379199
4627 58379199 59414684 60006013 60770066 61513300 62570779 63249310 63833101 64568567 65560618
4618 65560618 66197474 67193617 67920952 68554723 69354063 70352411 71089833 72196721 72979005
4609 72979005 73692670 74814631 75786283 76826242 77914611 79082336 80333284 81632686
4601 81632686 82926580 84342487 85710406 87455808 88888863 90662242 92404648 94204752
$$ packed form
4665D3657725l3186j5641l47182j38349J05136J37172K02140k79364J99050K9483
4655D3516984L86340o320r2141N71117L15041J75533L82855L16530M88566N17735
4645D6572240N38536K97850N97508N21415M34993O64326O53378O43648Q51359
4636E1775253M71119R42373O23173P39645O41320R49436P59317Q21956O55607
4627E8379199J035485N91329P64053P43234J057479O78531N83791P35466R92051
4618F5560618O36856R96143P27335O33771P99340R98348P37422J106888P82284
4609G2979005P13665J121961R71652J039959J088369J167725J250948J299402
4601H1632686J293894J415907J367919J745402J433055J773379J742406J800104
$$ plain form
4593 94204752 96250077 97939694 99989345 102027750 104174632 106222618 108114008 110158191
4585 110158191 112454427 114671457 116813710 118904599 120858523 122674867 124489369 126269785
4577 126269785 128450659 129762266 131482851 132818195 134247873 135490518 136609725 137541983
4569 137541983 138323849 138969934 139578072 140388482 140765340 141071354 141225721 141091193 141172893
4560 141172893 140674893 140512927 140109179 139614229 138646929 137920863 137212518 136113553 135136597
4551 135136597 133722885 132562931 130981164 129614241 127775561 125893907 124338846 122308384
4543 122308384 120130641 118043182 116016563 113964051 111561546 109266612 106995174 104551824
4535 104551824 101886378 99426734 97014943 94700398 92216973 89644344 87305019 84940372
$$ packed form
4593I4204752K045325J689617K049651K038405K146882K047986J891390K044183
4585A10158191K296236K217030K142253K090889J953924J816344J814502J780416
4577A26269785K180874J311607J720585J335344J429678J242645J119207R32258
4569A37541983P81866O46085O08138Q10410L76858L06014J54367j34528Q1700
4560A41172893m98000j61966m03748m94950r67300p26066p08345j098965r76956
4551A35136597j413712j159954j581767j366923j838680j881654j555061k030462
4543A22308384k177743k087459k026619k052512k402505k294934k271438k443350
4535A04551824k665446k459644k411791k314545k483425k572629k339325k364647
$$ plain form
4527 84940372 82767573 80568562 78299857 76417229 74164910 72356770 70363306 68672526
4519 68672526 66968738 65364078 63867104 62354006 61142593 59643023 58466209 57343523
4511 57343523 56474002 55002258 53900971 53020357 52013844 51003864 50277968 49153818 48519839
4502 48519839 47872654 46891542 46036017 45280977 44256694 43560026 42884297 42034407 41206643
4493 41206643 40436085 39729043 38789967 37861564 37105743 35969295 35255113 34134962 33593360
4484 33593360 32858121 32005119 31157465 30602525 29797985 28665137 27996639 27548445 26342928
4475 26342928 25933984 25187429 24570523 23799459 23079578 22549419 21896343 21404093 20754980
4466 20754980 20248826 19675936 19253999 18675012 18149528 17853301 17288761 16869540 16562685
$$ packed form
4527H4940372k172799k199011k268705j882628k252319j808140j993464j690780
4519F8672526j703788j604660j496974j513098j211413j499570j176814j122686
4511E7343523q69521j471744j101287q80614j006513j009980p25896j124150o33979
4502D8519839o47185r81112q55525p55040j024283o96668o75729q49890q27764
4493D1206643p70558p07042r39076r28403p55821j136448p14182j120151n41602
4484C3593360p35239q53002q47654n54940q04540j132848o68498m48194j205517
4475B6342928m08944p46555o16906p71064p19881n30159o53076m92250o49113
4466B0754980n06154n72890m21937n78987n25484k96227n64540m19221l06855
$$ plain form
4457 16562685 16154180 15670512 15345823 15102885 14633076 14340123 14037369 13612518 13250844
4448 13250844 12976869 12803095 12595767 12337949 12217560 11902892 11514013 11322804 11341428 11066638
4438 11066638 10722971 10560348 10466332 10162333 9980647 9794040 9610479 9437506 9367381 9002383
4428 9002383 9021452 8784182 8831852 8475679 8580427 8393846 8227268 8070313 8090955 7898979
4418 7898979 7738511 7680585 7557863 7281382 7228133 6989881 7024214 7091415 6894148 6588757
4408 6588757 6700880 6498684 6543620 6278103 6313330 6128106 6087608 6126993 6021655 5904085
4398 5904085 6000612 5844181 5501375 5640044 5567519 5417963 5421417 5254596 5372647 5185652
4388 5185652 5276935 5132190 5089371 5124212 4934111 4813979 4699741 4749961 4596522 4724476
$$ packed form
4457A6562685m08505m83668l24689k42938m69809k92953l02754m24851l61674
4448A3250844k73975j73774k07328k57818j20389l14668l88879j91209J8624k74790
4438A1066638l43667j62623r4016l03999j81686j86607j83561j72973p0125l64998
4428I002383J9069k37270M7670l56173J04748j86581j66578j56955K0642j91976
4418G898979j60468n7926j22722k76481n3249k38252L4333O7201j97267l05391
4408F588757J12123k02196M4936k65517L5227j85224m0498L9385j05338j17570
4398E904085R6527j56431l42806J38669p2525j49556L454j66821J18051j86995
4388E185652R1283j44745m2819L4841j90101j20132j14238N0220j53439J27954
$$ plain form
4378 4724476 4549967 4643447 4357297 4472175 4467119 4279739 4294062 4249502 4209136 4147901 4031211
4367 4031211 4133285 4154653 4075479 4099322 4018017 3962846 3887926 3812935 3922965 3794727 3719212
4356 3719212 3702221 3592502 3452692 3531095 3563358 3634048 3219732 3219774 3517631 3555191 3175816
4345 3175816 3210542 3526183 3266557 3207008 3166469 3227099 3188576 3172524 3167905 3101548 3124037
4334 3124037 3124922 3013532 3021989 2971565 3062571 3016057 2893254 3016350 2997075 3011049 2996077
4323 2996077 2826554 2935960 2835453 2993434 2753082 2881121 2775776 2774410 2821399 2790280
4313 2790280 2794285 2764504 2667751 2804147 2592939 2795067 2726794 2677330 2591319 2711238 2535011
4302 2535011 2374131 2418163 2613782 2588609 2357042 2488100 2500204 2378564 2410697 2263789
$$ packed form
4378D724476j74509R3480k86150J14878n056j87380J4323m4560m0366o1235j16690
4367D031211J02074K1368p9174K3843q1305n5171p4920p4991J10030j28238p5515
4356C719212j6991j09719j39810P8403L2263P0690m14316M2K97857L7560l79375
4345C175816L4726L15641k59626n9549m0539O0630l8523j6052m619o6357K2489
4334C124037Q85j11390Q457n0424R1006m6514j22803J23096j9275J3974j4972
4323B996077j69523J09406j00507J57981k40352J28039j05345j366M6989l1119
4313B790280M005k9781r6753J36396k11208K02128o8273m9464q6011J19919j76227
4302B535011j60880M4032J95619k5173k31567J31058J2104j21640L2133j46908
$$ plain form
4292 2263789 2392409 2288498 2347567 2288235 2279679 2485252 2408254 2288835 2101710 2201037 2304236
4281 2304236 2188550 1965979 2119028 2046185 2191122 2091404 2274545 2135408 2109366 2102341
4271 2102341 1984675 1852691 2079245 2020842 1791577 1754695 1781811 1857655 1914723 1805924
4261 1805924 1880826 1880734 2028333 1924994 1919915 1961471 1833446 1780756 1820812 1875675 1865859 1787004
4249 1787004 1759311 1743619 1779060 1952374 1708578 1702471 1841259 1747159 1778157 1904068 1647250
4238 1647250 1558669 1708082 1510471 1841303 1558435 1476819 1400307 1538662 1449515 1660032
4228 1660032 1487348 1252434 1403800 1351751 1325207 1404658 1471825 1332474 1410941 1287077
4218 1287077 1194605 1309432 1206713 1307424 1423345 1103801 1291542 1277964 1077758 1139329
$$ packed form
4292B263789J28620j03911N9069n9332q556K05573p6998j19419j87125R9327J03199
4281B304236j15686k22571J53049p2843J44937r9718J83141j39137k6042p025
4271B102341j17666j31984K26554n8403k29265l6882K7116P5844N7068j08799
4261A805924P4902r2J47599j03339n079M1556j28025n2690M0056N4863r816p8855
4249A787004k7693j5692L5441J73314k43796o107J38788r4100L0998J25911k56818
4238A647250q8581J49413j97611L30832k82868q1616p6512J38355q9147K10517
4228A660032j72684k34914J51366n2049k6544P9451O7167j39351P8467j23864
4218A287077r2472J14827j02719J00711J15921l19544J87741j3578k00206O1571
$$ plain form
4208 1139329 1315079 1099352 900557 1208758 1088172 1059424 869257 769206 793630 876415
4198 876415 828281 967719 868466 950522 990571 775022 717105 589827 876696 576992 795326
4187 795326 936195 857184 764942 830292 726518 695368 747562 725701 519028 745243 531621
4176 531621 632274 544616 585406 551831 354598 650884 569108 641779 553521 481008 440865
4165 440865 329653 482499 440459 416356 445075 298056 344525 500936 504022 557331 381161
4154 381161 378619 176354 342774 183026 370292 326731 292329 295094 456356 267866 260758
4143 260758 274901 346891 314989 391106 278973 301308 299755 261946 166768 104060 205599
4132 205599 222758 363779 346883 82994 270482 182335 315869 344075 354502 149901 372424
$$ packed form
4208A139329J75750k15727j98795L08201j20586k8748j90167j00051K4424Q2785
4198H76415m8134J39438r9253Q2056M0049k15549n7917j27278K86869k99704K18334
4187G95326J40869p9011r2242O5350j03774l1150N2194k1861k06673K26215k13622
4176E31621J00653q7658M0790l3575j97233K96286q1776P2671q8258p2513m0143
4165D40865j11212J52846m2040k4103K8719j47019M6469J56411L086N3309j76170
4154C81161k542k02265J66420j59748J87266m3561l4402K765J61262j88490p108
4143B60758J4143P1990l1902P6117j12133K2335j553l7809r5178o2708J01539
4132B05599J7159J41021j6896k63889J87488q8147J33534K8206J0427k04601K22523
$$ plain form
4121 372424 327747 193195 333009 237341 67201 211710 312696 114124 109237 348381
4111 348381 86797 162144 59791 163525 156145 86525 198304 207126 78871 142742 69202
4100 69202 -59712 314523 111478 209821 149247 -15745 101617 54243 -10257 57442 115911
4089 115911 144619 55029 155288 234861 191440 86607 -6234 -31516 38759 14289 -10794
4078 -10794 -155707 -45588 1262 -10021 -117682 -8697 -139135 85513 -27527 -37333 -110448
4067 -110448 -47618 79937 -24329 -181579 -279695 -19184 60658 -7401 -151982 -158009 -197516
4056 -197516 -32242 -169835 -43147 -83087 11781 -31437 -164620 -133167 -154414 -199908 -152983
4045 -152983 -99979 -128919 -148780 -187672 -198714 -976 -184430 -147393 -196741 -160413 -199952
$$ packed form
4121C72424m4677j34552J39814r5668j70140J44509J00986j98572m887K39144
4111C48381k61584P5347j02353J03734p380o9620J11779Q822j28255O3871p3540
4100F9202j28914L74235k03045R8343o0574j64992J17362m7374o4500O7699N8469
4089A15911K8708q9590J00259P9573m3421j04833r2841k5282P0275k4470k5083
4078a0794j44913J10119M6850j1283j07661J08985j30438K24648j13040r806p3115
4067a10448O2830J27555j04266j57250r8116K60511P9842o8059j44581o027l9507
4056a97516J65274j37593J26688l9940R4868m3218j33183L1453k1247m5494M6925
4045a52983N3004k8940j9861l8892j1042J97738j83454L7037m9348L6328l9539
$$ plain form
4034 -199952 -163544 -114147 -57943 -211088 -246336 -216725 -125190 -137495 -161716 -126036 -448598
4023 -448598 -243637 -360113 -157230 -444257 -291268 -124261 -34668 -126004 -129815 -63387 -50715
4012 -50715 -370485 -92492 -121137 -2025 28929 -186750 -31272 -245179 -229098 -148987 42968
4001 42968 -128146 -38644 -115476 49254 -185332 -146978 -297752 -5471 -267978 -143270
3991 -143270 -262472 -44193 -119854 -186359 -34088 -259544 -152480 -246680 -279071 -60052
3981 -60052 -102071 -273073 -71036 11288 5773 -159378 72998 33912 -61490 -172667 -20416
3970 -20416 31502 -171196 -64764 -202211 -235590 -28195 -353381 38474 62696 -31523 -363250
3959 -363250 38827 -136799 -189364 -8564 -196779 1810 -245556 -143571 -244683 9173
$$ packed form
4034a99952L6408M9397N6204j53145l5248K9611R1535j2305k4221L5680l22562
4023d48598K04961j16476K02883k87027J52989J67007Q9593r1336l811O6428J2672
4012e0715l19770K77993k8645J19112L0954k15679J55478k13907J6081Q0111J91955
4001D2968j71114Q9502p6832J64730k34586L8354j50774K92281k62507J24708
3991a43270j19202K18279p5661o6505J52271k25456J07064r4200l2391K19019
3981f0052m2019j71002K02037Q2324n515j65151K32376l9086r5402j11177J52251
3970b0416N1918k02698J06432j37447l3379K07395l25186L91855K4222r4219l31727
3959c63250M02077j75626n2565J80800j88215J98589k47366J01985j01112K53856
$$ plain form
3949 9173 -131941 -254634 20442 -256570 -211457 -20100 -42298 -195067 -152991 -325711 -305507
3938 -305507 -380663 -140304 -144663 -155646 -216782 30871 -360238 -259071 -122434 -340337 -186553
3927 -186553 -279861 -135759 -259852 -282566 -325596 -241007 -367960 -259986 -449699 -317423
3917 -317423 -307209 -380261 -237246 -216630 -238150 -154389 -517140 -362477 -379892 -417480 -517126
3906 -517126 -423133 -416428 -366131 -508301 -145597 -351856 -399100 -415023 -420129 -180406 -352963
3895 -352963 -433173 -354168 -304195 -416253 -253440 -524153 -531303 -404267 -365179 -517885 -350975
3884 -350975 -410526 -492184 -420361 -414137 -644112 -404160 -509819 -498114 -579299 -405461 -459120
3873 -459120 -319770 -556396 -536803 -631601 -425937 -478858 -566431 -503943 -495419 -602108 -581437
$$ packed form
3949I173j41114j22693K75076k77012M5113J91357k2198j52769M2076j72720K0204
3938c05507p5156K40359m359j0983o1136K47653l91109J01167J36637k17903J53784
3927a86553r3308J44102j24093k2714m3030Q4589j26953J07974j89713J32276
3917c17423J0214p3052J43015K0616k1520Q3761l62751J54663j7415l7588r9646
3906e17126R3993O705N0297j42170L62704k06259m7244j5923n106K39723j72557
3895c52963q0210P9005M9973j12058J62813k70713p150J27036L9088j52706J66910
3884c50975n9551q1658P1823O224k29975K39952j05659J1705q1185J73838n3659
3873d59120J39350k36626J9593r4798K05664n2921q7573O2488Q524j06689K0671
$$ plain form
3862 -581437 -698048 -612870 -556290 -537072 -552729 -432778 -418222 -484379 -528404 -667091 -469586
3851 -469586 -598003 -434874 -652941 -513075 -544432 -361026 -502631 -623855 -449661 -573189
3841 -573189 -741766 -671431 -541472 -583168 -488831 -377769 -495222 -481694 -641581 -366380
3831 -366380 -596755 -532157 -667304 -455160 -495203 -410767 -596017 -602277 -652195 -673097 -521793
3820 -521793 -683270 -563372 -668415 -632297 -748733 -545489 -533282 -680019 -780190 -787371
3810 -787371 -717186 -685716 -537360 -694987 -491830 -699509 -607683 -621994 -513430 -577582 -581220
3799 -581220 -647450 -667849 -701405 -607357 -670692 -673853 -657095 -738842 -623694 -606832 -520263 -574665
3787 -574665 -758347 -791747 -659950 -828036 -606810 -696555 -713024 -726482 -678508 -630211 -647936
$$ packed form
3862e81437j16611Q5178N6580J9218j5657J19951J4556o6157m4025j38687J97505
3851d69586j28417J63129k18067J39866l1357J83406j41605j21224J74194j23528
3841e73189j68577P0335J29959m1696R4337J11062j17453J3528j59887K75201
3831c66380k30375O4598j35147K12144m0043Q4436j85250o260m9918k0902J51304
3820e21793j61477J19898j05043L6118j16436K03244J2207j46737j00171p181
3810g87371P0185L1470J48356j57627K03157k07679R1826j4311J08564o4152l638
3799e81220o6230k0399l3556R4048o3335l161J6758q1747J15148J6862Q6569n4402
3787e74665j83682l3400J31797j68086K21226q9745j6469j3458M7974M8297j7725
$$ plain form
3776 -647936 -534919 -452705 -708988 -534731 -805425 -770088 -621921 -718579 -865434 -601014
3766 -601014 -371309 -781998 -522912 -659609 -624757 -753728 -670429 -818629 -824377 -699215
3756 -699215 -709657 -851585 -631000 -636069 -649934 -500168 -728283 -680375 -684780 -393370 -678477
3745 -678477 -704874 -691632 -830063 -703855 -622738 -764132 -790504 -647926 -773475 -759601 -801813
3734 -801813 -716778 -761450 -440453 -766577 -603775 -669284 -740683 -767343 -542301 -653393 -552844
3723 -552844 -757611 -663282 -720685 -585004 -625422 -630191 -748598 -659608 -682333 -768858 -810956
3712 -810956 -678989 -668371 -859394 -816418 -701794 -694469 -511823 -787830 -548148 -525415 -659019
3701 -659019 -628315 -761798 -798376 -700512 -747328 -883178 -730688 -717479 -622505 -477070 -683583
$$ packed form
3776f47936J13017Q2214k56283J74257k70694L5337J48167r6658j46855K64420
3766f01014K29705m10689K59086j36697L4852j28971Q3299j48200n748J25162
3756f99215j0442j41928K20585n069j3865J49766k28115M7908m405K91410k85107
3745f78477k6397J3242j38431J26208Q1117j41394k6372J42578j25549J3874m2212
3734h01813Q5035m4672L20997l26124J62802o5509p1399k6660K25042j11092J00549
3723e52844k04767R4329n7403J35681m0418m769j18407Q8990k2725q6525m2098
3712h10956J31967J0618j91023M2976J14624P325J82646k76007K39682K2733j33604
3701f59019L0704j33483l6578R7864m6816j35850J52490J3209R4974J45435k06513
$$ plain form
3690 -683583 -697194 -756203 -825585 -837861 -739597 -675054 -669664 -944225 -673371 -762827 -666569
3679 -666569 -916350 -755531 -622710 -877876 -507565 -740440 -573514 -830540 -755249 -564203
3669 -564203 -820360 -737521 -733002 -693287 -726360 -808940 -556391 -690083 -802124 -704257 -585157
3658 -585157 -733137 -651706 -573075 -558120 -619635 -695043 -864344 -787109 -778206 -750715 -626717
3647 -626717 -809642 -573565 -700982 -674204 -852339 -801615 -725436 -671944 -729053 -578720 -729375
3636 -729375 -763145 -675338 -1034016 -721889 -545204 -482667 -754517 -674200 -606550 -575563 -766363
3625 -766363 -818714 -510143 -630417 -771453 -710264 -748337 -782400 -961634 -522716 -663676
3615 -663676 -752372 -748686 -649167 -767917 -749298 -807045 -800451 -794003 -751664 -876540 -742316 -890140
$$ packed form
3690f83583j3611n9009o9382j2276R8264O4543N390k74561K70854q9456R6258
3679f66569k49781J60819J32821k55166L70311k32875J66926k57026P5291J91046
3669e64203k56157Q2839M519L9715l3073q2580K52549j33692j12041R7867J19100
3658e85157j47980Q1431P8631J4955o1515p5408j69301P7235Q903K7491J23998
3647f26717j82925K36077j27417K6778j78135N0724P6179N3492n7109J50333j50655
3636g29375l3770Q7807l58678L12127J76685O2537k71850Q0317O7650L0987j90800
3625g66363n2351L08571j20274j41036O1189l8073l4063j79234M38918j40960
3615f63676q8696L686R9519j18750J8619n7747O594O448M2339j24876J34224j47824
$$ plain form
3603 -890140 -591488 -658303 -741782 -622109 -767819 -585579 -739311 -608526 -607630 -664386 -726047
3592 -726047 -653581 -727861 -747151 -740874 -837886 -810674 -737905 -682001 -660655 -629189 -666656 -594934
3580 -594934 -690734 -774649 -781461 -628971 -877390 -728020 -522576 -655676 -891636 -617596
3570 -617596 -614744 -737420 -710980 -539152 -713565 -589751 -859132 -591055 -725176 -724063 -664460
3559 -664460 -719072 -756285 -735881 -594004 -693640 -750556 -637047 -728951 -521169 -627595 -749305
3548 -749305 -547021 -655802 -728445 -763821 -750120 -714742 -516070 -670631 -638821 -804402 -849694
3537 -849694 -716013 -544675 -739885 -698615 -710168 -728708 -540589 -652381 -654462 -683985 -495273
3526 -495273 -651584 -629207 -722307 -779716 -625197 -683919 -587333 -729261 -674684 -719261 -808438
$$ packed form
3603h90140K98652o6815q3479J19673j45710J82240j53732J30785Q96n6756o1661
3592g26047P2466p4280j9290O277r7012K7212P2769N5904K1346L1466l7467P1722
3580e94934r5800q3915o812J52490k48419J49370K05444j33100k35960K74040
3570f17596K852j22676K6440J71828j74413J23814k69381K68077j34121J113N9603
3559f64460n4612l7213K0404J41877r9636n6916J13509r1904K07782j06426j21710
3548g49305K02284j08781p2643l5376J3701L5378J98672j54561L1810j65581m5292
3537h49694J33681J71338j95210M1270j1553j8540J88119j11792k081k9523J88712
3526d95273j56311K2377r3100n7409J54519n8722R6586j41928N4577m4577q9177
$$ plain form
3515 -808438 -709437 -699683 -720753 -642399 -780890 -606399 -680712 -796555 -600524 -636027 -759035
3504 -759035 -527859 -530212 -723694 -704919 -726965 -567111 -642323 -576972 -763466 -631875 -680328
3493 -680328 -811307 -718575 -647969 -443633 -562240 -716042 -663011 -733229 -604443 -754155
3483 -754155 -818305 -610222 -786612 -799581 -743484 -796049 -723359 -725754 -747758 -728171 -847955
3472 -847955 -752841 -523124 -468871 -577632 -583389 -640223 -667400 -549186 -779375 -569657 -652868
3461 -652868 -555104 -578868 -583818 -631670 -668647 -684954 -450624 -778468 -584505 -407956 -580598
3450 -580598 -619634 -501513 -700972 -533213 -527174 -886023 -580450 -628533 -425398 -505261 -592352
3439 -592352 -525214 -645575 -475539 -811102 -383549 -592717 -474461 -747858 -641201 -573098
$$ packed form
3515h08438R9001R754k1070P8354j38491J74491p4313j15843J96031l5503j23008
3504g59035K31176k353j93482J8775k2046J59854p5212O5351j86494J31591m8453
3493f80328j30979R2732P0606K04336j18607j53802N3031p0218J28786j49712
3483g54155o4150K08083j76390j2969N6097n2565P2690k395k2004J9587j19784
3472h47955R5114K29717N4253j08761n757n6834k7177J18214k30189K09718q3211
3461f52868R7764k3764m950m7852l6977j6307K34330l27844J93963J76549j72642
3450e80598l9036J18121j99459J67759O039l58849L05573m8083K03135p9863q7091
3439e92352O7138j20361J70036l35563M27553k09168J18256k73397J06657O8103
$$ plain form
3429 -573098 -637390 -643159 -418534 -516202 -615073 -379327 -680493 -775895 -779866 -539567 -506565
3418 -506565 -454323 -477354 -562241 -606946 -418603 -526489 -508996 -458112 -295301 -364992 -435251
3407 -435251 -395426 -515580 -435243 -485667 -392094 -398257 -307908 -320725 -564137 -430123 -476763
3396 -476763 -406417 -510153 -256684 -335707 -425274 -438024 -311781 -415026 -203313 -460256
3386 -460256 -357404 -535700 -532667 -325408 -456601 -326659 -475268 -327347 -283173 -304410
3376 -304410 -317057 -310870 -232889 -295294 -235990 -318466 -214452 -313427 -323141 -261713 -109001 -325579
3364 -325579 -193438 -211089 -239324 -9877 -160702 -77378 -138776 72944 92 45451 -46152
3353 -46152 157849 82548 252781 136570 292488 375173 258198 266201 471834 305607 514111
$$ packed form
3429e73098o4292n769K24625r7668r8871K35746l01166r5402l971K40299L3002
3418e06565N2242k3031q4887m4705J88343j07886J7493N0884J62811o9691p0259
3407d35251L9825j20154Q0337n0424R3573o163R0349j2817k43412J34014m6640
3396d76763P0346j03736K53469p9023q9567j2750J26243j03245K11713k56943
3386d60256J02852j78296L033K07259j31193J29942j48609J47921M4174k1237
3376c04410j2647O187P7981o2405N9304q2476J04014r8975r714O1428J52712k16578
3364c25579J32141j7651k8235K29447j50825Q3324o1398K11720p2852M5359r1603
3353d6152K04001p5301J70233j16211J55918Q2685j16975Q003K05633j66227K08504
$$ plain form
3342 514111 384897 300896 599937 529418 489711 509355 620387 821170 754576 820390 944248
3331 944248 929751 759591 991368 1182072 1159026 1111419 1349505 1264803 1403228 1607908
3321 1607908 1451086 1491687 1680613 1713306 1731054 1862965 1821333 2053388 2018582 2284737
3311 2284737 2428038 2729235 2894845 2816435 2970501 3368394 3464304 3606193 4038460 4122949
3301 4122949 4430872 4585490 4639954 4785567 4862280 5060817 4986061 4887608 5011034 4744196
3291 4744196 4748538 4560641 4620426 4463615 4260808 4106317 3983037 3670727 3588645 3333343
3281 3333343 2887331 2638648 2722529 2242893 2198008 2291181 1834496 1914501 1610733 1213927
3271 1213927 1437785 1193645 933740 1130153 945012 918195 848710 783307 643314 580249
$$ packed form
3342E14111j29214q4001K99041p0519l9707J9644J11032K00783o6594O5814J23858
3331I44248j4497j70160K31777J90704k3046m7607K38086q4702J38425K04680
3321A607908j56822M0601J88926L2693J7748J31911m1632K32055l4806K66155
3311B284737J43301L01197J65610p8410J54066L97893R5910J41889M32267Q4489
3301D122949L07923J54618N4464J45613P6713J98537p4756r8453J23426k66838
3291D744196M342j87897N9785j56811k02807j54491j23280l12310q2082k55302
3281C333343m46012k48683Q3881m79636m4885R3173m56685Q0005l03768l96806
3271A213927K23858k44140k59905J96413j85141k6817o9485o5403j39993o3065
$$ plain form
3261 580249 570755 427360 410878 363279 339862 193014 361903 166759 111135 207247 145589
3250 145589 52222 71905 -75095 -41962 -58712 -188960 -233876 -214844 -218783 -377167 -368126
3239 -368126 -312444 -370633 -337650 -368877 -329282 -346366 -457633 -335049 -322274 -254369 -422378
3228 -422378 -382409 -464475 -390916 -436669 -388225 -371609 -628109 -453257 -335899 -623524 -464915
3217 -464915 -447756 -583307 -464771 -731888 -399008 -532268 -457172 -384360 -479008 -557068 -645681
3206 -645681 -468029 -553411 -613449 -349070 -632585 -478302 -620787 -379720 -553873 -711978
$$ packed form
3261E80249r494j43395j6482m7599k3417j46848J68889j95144n5624R6112o1658
3250A45589r3367J9683j47000L3133j6750j30248m4916J9032l939j58384R041
3239c68126N5682n8189L2983l1227L9595j7084j11267J22584J2775O7905j68009
3228d22378L9969q2066P3559m5753M8444J6616k56500J74852J17358k87625J58609
3217d64915J7159j35551J18536k67117L32880j33260P5096P2812r4648p8060q8613
3206f45681J77652q5382o0038K64379k83515J54283j42485K41067j74153j58105
$$ [...]
##END NTUPLES=NMR SPECTRUM
##END=
