##TITLE=abcd
##JCAMPDX= 6.0         $$ Bruker NMR JCAMP-DX V2.0
##DATA TYPE= NMR SPECTRUM
##DATA CLASS= NTUPLES
##ORIGIN= UXNMR, Bruker Analytische Messtechnik GmbH
##OWNER= root
$$ XWIN-NMR		Version 3.5
$$ Fri Oct 24 18:49:52 2025 Russian Standard Time (UT+4h)  servis@DPX200
##.OBSERVE FREQUENCY= 200.131235884673
##.OBSERVE NUCLEUS= ^1H
##.ACQUISITION MODE= SIMULTANEOUS
##.ACQUISITION SCHEME= undefined
##.AVERAGES= 19
##.DIGITISER RES= 18
##SPECTROMETER/DATA SYSTEM= spect
##.PULSE SEQUENCE= zg
##.SOLVENT NAME= CDCl3
##.SHIFT REFERENCE= (INTERNAL, CDCl3, 0, 16.4885)
##AUDIT TRAIL= $$ (NUMBER, WHEN, WHO, WHERE, WHAT)
$$ ##TITLE= Audit trail, XWIN-NMR		Version 3.5
$$ ##JCAMPDX= 5.01
$$ ##ORIGIN= Bruker BioSpin GmbH
$$ ##OWNER= servis
$$ F:\spectra/data/av/nmr/H1/1/pdata/1/auditp.txt
$$ ##AUDIT TRAIL=  $$ (NUMBER, WHEN, WHO, WHERE, WHAT)
(   1,<2025-10-24 18:48:45.34 +0400>,<servis>,<DPX200>,
      <created by zg, POWCHK disabled, PULCHK disabled
       terminated by command 'halt'
       configuration hash MD5:
       00 E9 B6 7A A2 85 ED C7 34 08 36 98 17 FE 4E 26
       data hash MD5: 32K
       78 34 90 91 8F 47 02 EE 98 AE 74 2D 7D 96 D2 B5>)
(   2,<2025-10-24 18:48:48.15 +0400>,<servis>,<DPX200>,
      <Start of raw data processing
       efp BC_mod = 2 LB = 0.05 FT_mod = 6 PKNL = 1 PHC0 = -268.1076 PHC1 = 6.501565 SI = 16K 
       data hash MD5: 16K
       17 4A F8 42 6B 47 90 35 44 4B C5 8A 1A 2F 6A 46>)
(   3,<2025-10-24 18:48:53.50 +0400>,<servis>,<DPX200>,
      <abs ABSG = 5 
       data hash MD5: 16K
       75 CF 4F E1 89 A2 8B 75 C0 0A 13 98 C1 1A 64 AA>)
$$ ##END=
$$ 
$$ hash MD5
$$ 70 5F 01 00 74 5E 52 C8 C5 F5 1B 6E D8 90 42 CE
##$RELAX= 
##$RELAX= 
##$RELAX= 
##$RELAX= 
##$RELAX= 
##$RELAX= 
##$RELAX= 
##$RELAX= 
$$ Bruker specific parameters
$$ --------------------------
##$DU= <F:\spectra>
##$EXPNO= 1
##$NAME= <H1>
##$PROCNO= 1
##$TYPE= <nmr>
##$USER= <av>
##$AMP= (0..31)
100 100 100 100 100 100 100 100 100 100 100 100 100 100 100 100 100 100 
100 100 100 100 100 100 100 100 100 100 100 100 100 100 
##$AQSEQ= 0
##$AQ_mod= 1
##$AUNM= <au_zg>
##$AUTOPOS= <>
##$BF1= 200.13
##$BF2= 200.13
##$BF3= 200.13
##$BF4= 200.13
##$BF5= 500.13
##$BF6= 500.13
##$BF7= 500.13
##$BF8= 500.13
##$BYTORDA= 1
##$CFDGTYP= 0
##$CFRGTYP= 5
##$CHEMSTR= <none>
##$CNST= (0..31)
1 1 145 1 1 1 1 1 1 1 1 1 1 1 1 1 1 1 1 1 1 1 1 1 1 1 1 1 1 1 1 1 
##$CPDPRG= <>
##$CPDPRG1= <>
##$CPDPRG2= <>
##$CPDPRG3= <>
##$CPDPRG4= <mlev>
##$CPDPRG5= <mlev>
##$CPDPRG6= <mlev>
##$CPDPRG7= <mlev>
##$CPDPRG8= <mlev>
##$CPDPRGB= <>
##$CPDPRGT= <>
##$D= (0..31)
0 2 0 0 0 0 0 0 0 0.06 0 0 0 0 0 0 0.0002 0 0 0 0 0 0 0 0 0 0 0 0 0 0 
0 
##$DATE= 1761317324
##$DBL= (0..7)
120 120 120 120 120 120 120 120 
##$DBP= (0..7)
150 150 150 150 150 150 150 150 
##$DBP07= 0
##$DBPNAM0= <>
##$DBPNAM1= <>
##$DBPNAM2= <>
##$DBPNAM3= <>
##$DBPNAM4= <>
##$DBPNAM5= <>
##$DBPNAM6= <>
##$DBPNAM7= <>
##$DBPOAL= (0..7)
0.5 0.5 0.5 0.5 0.5 0.5 0.5 0.5 
##$DBPOFFS= (0..7)
0 0 0 0 0 0 0 0 
##$DE= 6
$$ [...]
##$SUBNAM5= <"">
##$SUBNAM6= <"">
##$SUBNAM7= <"">
##$SUBNAM8= <"">
##$SUBNAM9= <"">
##$SW= 20.6817932712277
##$SWIBOX= (0..15)
0 0 3 0 0 0 0 0 0 0 0 0 0 0 0 0 
##$SW_h= 4139.07284768212
##$TD= 32768
##$TD0= 1
##$TE= 0
##$TE2= 300
##$TE3= 300
##$TEG= 300
##$TL= (0..7)
0 120 120 120 120 120 120 120 
##$TP= (0..7)
150 150 150 150 150 150 150 150 
##$TP07= 0
##$TPNAME0= <>
##$TPNAME1= <>
##$TPNAME2= <>
##$TPNAME3= <>
##$TPNAME4= <>
##$TPNAME5= <>
##$TPNAME6= <>
##$TPNAME7= <>
##$TPOAL= (0..7)
0.5 0.5 0.5 0.5 0.5 0.5 0.5 0.5 
##$TPOFFS= (0..7)
0 0 0 0 0 0 0 0 
##$TUNHIN= 0
##$TUNHOUT= 0
##$TUNXOUT= 0
##$USERA1= <user>
##$USERA2= <user>
##$USERA3= <user>
##$USERA4= <user>
##$USERA5= <user>
##$V9= 5
##$VALIST= <valist>
##$VCLIST= <CCCCCCCCCCCCCCC>
##$VD= 0
##$VDLIST= <DDDDDDDDDDDDDDD>
##$VPLIST= <PPPPPPPPPPPPPPP>
##$VTLIST= <TTTTTTTTTTTTTTT>
##$WBST= 1024
##$WBSW= 30
##$XGAIN= (0..3)
0 0 0 0 
##$XL= 0
##$YL= 0
##$YMAX_a= 1957967
##$YMIN_a= -1310523
##$ZGOPTNS= <>
##$ZL1= 120
##$ZL2= 120
##$ZL3= 120
##$ZL4= 120
##$ABSF1= 16.48848
##$ABSF2= -4.193441
##$ABSG= 5
##$ABSL= 3
##$ALPHA= 0
##$AQORDER= 0
##$ASSFAC= 0
##$ASSFACI= 0
##$ASSFACX= 0
##$ASSWID= 0
##$AUNMP= <proc_1d>
##$AZFE= 0.1
##$AZFW= 0.1
##$BCFW= 0
##$BC_mod= 2
##$BYTORDP= 0
##$COROFFS= 0
##$CY= 18.4799938201904
##$DATMOD= 1
##$DC= 0
##$DFILT= <>
##$DTYPP= 0
##$F1P= 9.9274215381318
##$F2P= -0.165520771350173
##$FCOR= 1
##$FTSIZE= 16384
##$FT_mod= 6
##$GAMMA= 0
##$GB= 0
##$INTBC= 1
##$INTSCL= 4.127829e-11
##$ISEN= 128
##$LB= 0.05
##$LEV0= 0
##$LPBIN= 0
##$MAXI= 10000
##$MC2= 0
##$MEAN= 0
##$ME_mod= 0
##$MI= 50
##$NCOEF= 0
##$NC_proc= -4
##$NLEV= 6
##$NOISF1= 3.799351
##$NOISF2= 2.8
##$NSP= 0
##$NTH_PI= 0
##$NZP= 0
##$OFFSET= 16.48848
##$PC= 4
##$PHC0= -268.1076
##$PHC1= 6.501565
##$PH_mod= 1
##$PKNL= yes
##$PPARMOD= 0
##$PSCAL= 4
##$PSIGN= 0
##$REVERSE= no
##$SF= 200.130005582386
##$SI= 16384
##$SIGF1= 3
##$SIGF2= 2
##$SINO= 400
##$SIOLD= 16384
##$SREGLST= <1H.CDCl3>
##$SSB= 0
##$STSI= 16384
##$STSR= 0
##$SW_p= 4139.07284768211
##$SYMM= 0
##$S_DEV= 0
##$TDeff= 32768
##$TDoff= 0
##$TI= <>
##$TILT= no
##$TM1= 0
##$TM2= 0
##$TOPLEV= 0
##$USERP1= <user>
##$USERP2= <user>
##$USERP3= <user>
##$USERP4= <user>
##$USERP5= <user>
##$WDW= 1
##$XDIM= 16384
##$YMAX_p= 408451597
##$YMIN_p= -875020
$$ End of Bruker specific parameters
$$ ---------------------------------
##NTUPLES= NMR SPECTRUM
##VAR_NAME=  FREQUENCY,     SPECTRUM/REAL,   SPECTRUM/IMAG
##SYMBOL=    X,             R,               I
##VAR_TYPE=  INDEPENDENT,   DEPENDENT,       DEPENDENT
##VAR_FORM=  AFFN,          ASDF,            ASDF
##VAR_DIM=   16384,         16384,           16384
##UNITS=     HZ,            ARBITRARY UNITS, ARBITRARY UNITS
##FACTOR=    0.252644378177508, 1,           1
##FIRST=     3299.83951724647, 0,            0
##LAST=      -839.233330435636, 0,           0
##MIN=       -839.233330435636, -875020,     0
##MAX=       3299.83951724647, 408451597,    0
$$ Real data points
##PAGE= N=1
##DATA TABLE= (X++(R..R)), XYDATA
$$ [...]
8708C684629n4436o2802r8633l5690o9776n1829p0540q4561l9504r8422m5632
$$ 3684629 3630193 3567391 3468758 3433068 3363292 3311463 3240923 3156362 3116858 3018436 2972804
8697B972804p1691r3104j01568o9402j18753j13069j23055q1201j18701q4124
$$ 2972804 2901113 2808009 2706441 2637039 2518286 2405217 2282162 2200961 2082260 1998136
8687A998136p6672p5757n6535l8648k8725l0630k9728J7936N8533L4781K6582
$$ 1998136 1921464 1845707 1789172 1750524 1721799 1691169 1661441 1679377 1737910 1772691 1799273
8676A799273N5290P1903J06166J7935J26400N8553J16184K7L9550L7938J2415
$$ 1799273 1854563 1926466 2032632 2050567 2176967 2235520 2351704 2351731 2391281 2429219 2441634
8665B441634l3668j0660p5249n9287m0346k7422p4207o3563l6095o6141l5503
$$ 2441634 2407966 2397306 2322057 2262770 2222424 2195002 2120795 2057232 2021137 1954996 1919493
8654A919493k0589q9959M3946J8119k2820L0355Q5738J04609J03148J42698K17893
$$ 1919493 1898904 1808945 1852891 1871010 1848190 1878545 1964283 2068892 2172040 2314738 2532631
8643B532631J71546J77028J63257R0201Q1736M5001l6996J2063j5232l4114N589
$$ 2532631 2704177 2881205 3044462 3134663 3216399 3261400 3224404 3236467 3221235 3187121 3192710
8632C192710L606N4535J15694R0558Q6737R4067P0602k5229p5130j29915j32426
$$ 3192710 3196316 3250851 3366545 3457103 3543840 3637907 3708509 3683280 3608150 3478235 3345809
8621C345809j69034j89960j97764j88252j53779j62798r0743q4200j1702o7180
$$ 3345809 3176775 2986815 2789051 2600799 2447020 2284222 2193479 2109279 2097577 2030397
8611B030397k4362M3008J14925M2978J38329K9618R960L6670p6979o43m6178j10021
$$ 2030397 2006035 2049043 2163968 2206946 2345275 2374893 2384853 2421523 2344544 2343901 2297723 2187702
8599B187702p1088K5867k6504P0028R7450P5927P3038P0311K9682l2751p2426
$$ 2187702 2116614 2142481 2115977 2186005 2283455 2359382 2432420 2502731 2532413 2499662 2427236
8588B427236j19457j07938j74456j61936k00832j59051j77372j35142j74513o4034
$$ 2427236 2307779 2199841 2025385 1863449 1662617 1503566 1326194 1191052 1016539 952505
8578I52505j39819j04685j01714o6861l3340o3572p7248l5793N417m1755j00092
$$ 952505 812686 708001 606287 539426 506086 442514 365266 329473 334890 293135 193043
8567A93043K4961j2345j2265l9103r790k7980L2011k0163J9387K8769O439r609
$$ 193043 218004 205659 193394 154291 144501 116521 148532 128369 147756 176525 182964 173355
8555A73355M4332m4993K2280L3847J3381O699n2310L7631J2526l0109j6679j567
$$ 173355 217687 172694 194974 228821 242202 248901 196591 234222 246748 216639 199960 198393
8543A98393k0122k3391O461j1413m4407l0896K3299n725K1738k17338K2278k4670
$$ 198393 178271 154880 161341 149928 105521 74625 97924 92199 113937 -103401 -81123 -105793
8531a05793O0960k1661L460m4537q402l738L746r292j8569K9779r512j8910N6650
$$ -105793 -44833 -66494 -63034 -107571 -115973 -119711 -115965 -125257 -143826 -114047 -123559 -142469 -85819
8518h5819o7227Q443O3994J0675q753L4970K5069J2403M5629j8320L7627N0538
$$ -85819 -153046 -144603 -80609 -69934 -78687 -43717 -18648 -6245 39384 21064 58691 109229
8506A09229L3878j7749P4166l2887J7332J2565K840k6669j5248l3494N4112j5843
$$ 109229 143107 125358 199524 166637 183969 196534 199374 172705 157457 123963 178075 162232
8494A62232k4882k3330n709n1467K853m867j3207L1998j0680j2966L482O5604
$$ 162232 137350 114020 108311 56844 59697 54830 41623 73621 62941 49975 53457 119061
8482A19061k5728L5159J4995J7233K4502k8111M1497j2887j2630l7770J2539j7228
$$ 119061 93333 128492 143487 160720 185222 157111 198608 185721 173091 135321 147860 130632
8470A30632K7807m7759k9482l9298n4031K9449o034l3295j605l4048N258l6116
$$ 130632 158439 110680 81198 41900 -12131 17318 11284 -22011 -23616 -57664 -52406 -88522
8458h8522J8998j1987J5782r846J4020N1562o5140M8833m5105N2687n1202M2450
$$ -88522 -69524 -81511 -65729 -75575 -61555 -9993 -75133 -26300 -71405 -18718 -69920 -27470
8446b7470k5427R61k3112K208j1007O1181o0776k9558k9829l647k6730j7223j6974
$$ -27470 -52897 -51936 -75048 -72840 -83847 -22666 -83442 -113000 -142829 -146476 -173206 -190429 -207403
8433b07403M7711k9883k6950j3588O615j3119p900l607l6687K2466j587J4158
$$ -207403 -159692 -189575 -216525 -230113 -223498 -236617 -244517 -248124 -284811 -262345 -263932 -249774
8421b49774L6842l3284j005L2173j8106J5797l5863L1562n795k6562j6065k1819
$$ -249774 -212932 -246216 -247221 -215048 -233154 -217357 -253220 -221658 -227453 -254015 -270080 -291899
8409b91899L9253n017l0058K1765l3982N417J4703l2161q895k814m6556L3652
$$ -291899 -252646 -257663 -287721 -265956 -299938 -294521 -279818 -311979 -320874 -323688 -370244 -336592
8397c36592J074j6310J6000k6396K9025Q523k7292K6558N924m2851j5846K0692
$$ -336592 -335518 -351828 -335828 -362224 -333199 -324676 -351968 -325410 -319486 -362337 -378183 -357491
8385c57491k3731J059M702J4385k1564j1154k5396J8060j1628J7772j5061M590
$$ -357491 -381222 -380163 -375461 -361076 -382640 -393794 -419190 -401130 -412758 -394986 -410047 -405457
8373d05457k0395J6442k874j0974P29j822j7735k2371J3436K0081j0381k075m4080
$$ -405457 -425852 -409410 -412284 -423258 -422529 -424351 -442086 -464457 -451021 -430940 -441321 -443396 -487476
8360d87476M7894J4275j2626j0921l8608L2516O254n1687N7853l251j8685j980
$$ -487476 -439582 -425307 -437933 -448854 -487462 -454946 -448692 -500379 -442526 -445777 -464462 -466442
8348d66442k8474K4904k2460K8957j8712l003M8182n0305K7832q650M1770j2696
$$ -466442 -494916 -470012 -492472 -463515 -482227 -485230 -437048 -487353 -459521 -468171 -426401 -439097
8336d39097m9790K0718j785P696j5996q258J7419j5564K0798J2976j9099Q435
$$ -439097 -488887 -468169 -469954 -462258 -478254 -486512 -469093 -484657 -463859 -450883 -469982 -461547
8324d61547L871k11q730J861j2778J0973K2389J968j0239r881J4341q042L3308
$$ -461547 -457676 -457887 -466617 -464756 -477534 -466561 -444172 -442204 -452443 -462324 -447983 -456025 -422717
8311d22717n8076K4127j5552M4056o4144O5446M33l0528m061k1788j4925L8554
$$ -422717 -480793 -456666 -472218 -428162 -492306 -426860 -426427 -456955 -461016 -482804 -497729 -459175
8299d59175L0750j5741L21m4049l690L2808J2127k6326M7279k1321m2162k210
$$ -459175 -428425 -444166 -443845 -487894 -491584 -458776 -446649 -472975 -425696 -447017 -489179 -491389
8287d91389j6536J6122J9686j836j47k009k1338N9655m7329J4459q690R640m55
$$ -491389 -507925 -491803 -472117 -473953 -474100 -476109 -497447 -437792 -485121 -470662 -479352 -469712 -470167
8274d70167M486j8353k1763K509L73J5459p903K8048j6378Q800q61n6321L6263
$$ -470167 -465681 -484034 -505797 -503288 -502915 -487456 -495359 -467311 -483689 -474889 -475750 -532071 -495808
8261d95808n473N673J5719l3551L2622m112j223J458j7238j8510O2608m0559L6762
$$ -495808 -501281 -495608 -479889 -513440 -480818 -484930 -486153 -484695 -501933 -520443 -457835 -498394 -461632
8248d61632m0084M145m64k4587k3333L3274j01j2415J715j0196M1581k7621j5146
$$ -461632 -501716 -497571 -498035 -522622 -545955 -512681 -512782 -525197 -523482 -533678 -492097 -519718 -534864
8235e34864K1362l718k0050M7852m2958J5514K7932k5422K6833O745n8196n695
$$ -534864 -513502 -517220 -537270 -489418 -532376 -516862 -488930 -514352 -487519 -480774 -538970 -544665
8223e44665K2861J5437J817k7372R978L1269k0313J8122K5232p2610m74L2422
$$ -544665 -521804 -506367 -504550 -531922 -521944 -490675 -510988 -492866 -467634 -540244 -540718 -508296
8211e08296K2785p8559N6577l3204J2616J9501k7805M9074o8693L4563L5517j0860
$$ -508296 -485511 -564070 -507493 -540697 -528081 -508580 -536385 -487311 -556004 -521441 -485924 -496784
8199d96784m531m3911O2615l3913o3882O6368k9497r3657J51513q6590Q3609n8036
$$ -496784 -501315 -545226 -482611 -516524 -580406 -514038 -543535 -637192 -485679 -572269 -488660 -546696
8187e46696K1324j0343m8916K0141N9170n4914K7964J9698j2473m182j5346K9937
$$ -546696 -525372 -535715 -584631 -564490 -505320 -560234 -532270 -512572 -525045 -529227 -544573 -514636
8175e14636j1326j6065K0508j9918L0774N376L772J5880m6713L4159n7615J8950
$$ -514636 -525962 -542027 -521519 -541437 -510663 -505287 -501515 -485635 -532348 -498189 -555804 -536854
8163e36854J144J8411j6114K8516j948n065K2745l7251k0202K5889k727J0826
$$ -536854 -535710 -517299 -533413 -504897 -506845 -511910 -489165 -526416 -546618 -520729 -523456 -512630
8151e12630j2694K2588J1568k5312J2042l4049J5205J3864O52J6601l5008J4687
$$ -512630 -525324 -502736 -491168 -516480 -504438 -538487 -523282 -509418 -508766 -492165 -527173 -512486
8139e12486j4519P601J7504J9796r0720K5767j0619L5681l1980J0659j6812J0190
$$ -512486 -527005 -519404 -501900 -482104 -572824 -547057 -557676 -521995 -553975 -543316 -560128 -549938
8127e49938J656J0731j4785q928O8777r7717L7548k7048J6772J0994k1249M5919
$$ -549938 -548282 -537551 -552336 -561264 -492487 -590204 -552656 -579704 -562932 -551938 -573187 -527268
8115e27268l2470q333j681J2473j7121Q780K370M46k9161Q610j3864L6857k2828
$$ -527268 -559738 -568071 -569752 -557279 -574400 -565620 -563250 -562804 -591965 -583355 -597219 -560362 -583190
8102e83190Q662J6961J0962n4472P5972j7515n1831M5316o328j6879L5239n495
$$ -583190 -574528 -557567 -546605 -601077 -525105 -542620 -594451 -549135 -555463 -572342 -537103 -542598
8090e42598k525k4414L1056k3074J3536j855p371j5171K917O6837k9490K4798
$$ -542598 -545123 -569537 -538481 -561555 -548019 -549874 -557245 -572416 -569499 -502662 -532152 -507354
8078e07354l7815K486J216L2577k8343J4063l3958J0280j6096m297O1532k2333
$$ -507354 -545169 -542683 -541467 -508890 -537233 -523170 -557128 -546848 -562944 -567241 -505709 -528042
8066e28042J289k8767L0238l7862N0021m2533j8302K4659J9955k464j4043N911
$$ -528042 -526753 -555520 -525282 -563144 -513123 -555656 -573958 -549299 -529344 -531808 -545851 -539940
8054e39940j9866J3359L4359j8037k2152R958p260J3112J5867J2823K5877k0733
$$ -539940 -559806 -546447 -512088 -530125 -552277 -542319 -549579 -536467 -520600 -507777 -481900 -502633
8042e02633K3619L090m4575K5620k836l7401J0735Q402k8198K6649L3071j2715
$$ -502633 -479014 -475924 -520499 -494879 -497715 -535116 -524381 -515979 -544177 -517528 -484457 -497172
8030d97172K552J1001J6302m847N198J2011k4652O2867k5442K6263k5101o268
$$ -497172 -494620 -483619 -467317 -472164 -466966 -454955 -479607 -416740 -442182 -415919 -441020 -447288
8018d47288M285k7833K0427k8591K8751l3362K2546k1336R859K229k3820Q386
$$ -447288 -443003 -470836 -450409 -479000 -450249 -483611 -461065 -482401 -472542 -470313 -494133 -485747
8006d85747k4274m771q845k9296O7570k4782k3623l565J3927O869j1104J6010
$$ -485747 -510021 -514792 -523637 -552933 -485363 -510145 -533768 -537333 -523406 -516537 -527641 -511631
7994e11631M1139p2142L71j3250J0722M353l5518J9442k9508K4314K6414k9869
$$ -511631 -470492 -542634 -542263 -555513 -544791 -540438 -575956 -556514 -586022 -561708 -535294 -565163
7982e65163k0368K9123J1112k197j5346k2758K4079P034j2445J2914j2327k7249
$$ -565163 -585531 -556408 -545296 -547493 -562839 -585597 -561518 -554484 -566929 -554015 -566342 -593591
7970e93591p938K6821k35n734j440L4796l8132J8178k0885K2742l0292K158L72
$$ -593591 -601529 -574708 -574943 -580677 -582117 -547321 -585453 -567275 -588160 -565418 -595710 -593552 -593180
7957e93180j344k400J5236k8414J3588J8411m9030K5832K5880k9543L0659l033
$$ -593180 -594524 -596924 -581688 -610102 -596514 -578103 -627133 -601301 -575421 -604964 -574305 -577338
7945e77338p253l9323L8263j4542J370o942N2438j4017M866j4553k2167L6592
$$ -577338 -584591 -623914 -585651 -600193 -598823 -605765 -553327 -567344 -562478 -577031 -599198 -562606
7933e62606J2614o6236M5224K1896j0003J4370n998J6040J3165J0392J2999p415
$$ -562606 -549992 -616228 -571004 -549108 -559111 -544741 -550739 -534699 -521534 -511142 -498143 -505558
7921e05558o388J3899N213j5069K1607L1833m7353L9522l2992k339j3313K5726
$$ -505558 -511946 -498047 -492834 -507903 -486296 -454463 -501816 -462294 -495286 -497625 -510938 -485212
7909d85212j8807P724k1673M0565o0329N0581o9662O5459m4896J7130j2317K0672
$$ -485212 -504019 -496295 -517968 -477403 -537732 -487151 -556813 -491354 -536250 -519120 -531437 -510765
7897e10765l5649R77K3357Q141j6570L0817n6213K7965L2928p085K2136J6629
$$ -510765 -546414 -545437 -522080 -513939 -530509 -499692 -555905 -527940 -495012 -502097 -479961 -463332
7885d63332L281k687M582N6476m8526K6117j3930k5940K0203J0153j2019J4471
$$ -463332 -460051 -462738 -458156 -401680 -450206 -424089 -438019 -463959 -443756 -433603 -445622 -431151
7873d31151K913k4560Q979n8435O500J0987k2558j2181K9866o0278J3365J3441
$$ -431151 -428238 -452798 -443819 -502254 -495754 -484767 -507325 -519506 -489640 -549918 -536553 -523112
7861e23112j0329j0369M321J2098R496L493m4888j6292L1348K1982j4351m7714
$$ -523112 -533441 -543810 -539489 -527391 -517895 -514402 -559290 -575582 -544234 -522252 -536603 -584317
7849e84317R8174o3780l753k4992K4451k3499j103k9599P0536o049m0414J2054
$$ -584317 -486143 -549923 -553676 -578668 -554217 -577716 -578819 -608418 -537882 -543931 -584345 -572291
7837e72291Q573k1453j715j644k234k3876L9905k2266J2786M160l5027J6500K8992
$$ -572291 -563718 -585171 -586886 -588530 -590764 -614640 -574735 -597001 -584215 -580055 -615082 -598582 -569590
7824e69590k6630K1814m77j8818q757K0788J9921l8019L9997j1800j0570r88J3295
$$ -569590 -596220 -574406 -574883 -593701 -602458 -581670 -561749 -599768 -559771 -571571 -582141 -583129 -569834
7811e69834k6640n503K0965Q812k0404m0878M0636l2461J0868J4514J0076O097
$$ -569834 -596474 -601977 -581012 -572200 -592604 -633482 -592846 -625307 -614439 -599925 -589849 -583752
7799e83752n829n512P694O003j3717O95N90L4661k8283M496j6099k1943p009L2623
$$ -583752 -589581 -595093 -587399 -581396 -595113 -594418 -593828 -559167 -587450 -582954 -599053 -620996 -628005 -595382
7785e95382O561k860q28j3753M6476j9685k3933L0485j21l6672J0958n267L1641
$$ -595382 -588821 -591681 -592509 -606262 -559786 -579471 -603404 -572919 -573040 -609712 -598754 -604021 -572380
7772e72380j9371J9566L6618q0023O1177j1978J1660k3136K1034L046k6152M2137
$$ -572380 -591751 -572185 -535567 -615590 -554413 -566391 -554731 -577867 -556833 -553787 -579939 -537802
7760e37802k2650O360l0996K3587N046j5726L0586K0204m3219N5773j6594r966
$$ -537802 -560452 -554092 -585088 -561501 -556455 -572181 -541595 -521391 -564610 -508837 -525431 -535397
7748e35397K0969J1010K4238k5507k2573K646j0867L3588r663K0245j3172K7232
$$ -535397 -514428 -503418 -479180 -504687 -527260 -524614 -535481 -501893 -511556 -491311 -504483 -477251
7736d77251j667m978p509R085K5342k95J9259j932J4465N736K9401l3575j39M2502
$$ -477251 -478918 -483896 -491405 -482320 -456978 -457273 -438014 -439946 -425481 -419745 -390344 -423919 -424058 -381556
7722c81556K0272M5991n0578M4438j782L3590n31R567j1663L3129k0731O3744
$$ -381556 -361284 -315293 -365871 -321433 -323215 -289625 -290156 -280589 -292252 -259123 -279854 -216110
7710b16110k8471J3707M7036M204M0536M8824L2445J0168L3779O6879K0665Q7185
$$ -216110 -244581 -230874 -183838 -179634 -139098 -90274 -57829 -47661 -13882 52997 73662 160847
7698A60847L7319L6985P2353R7552R6755O4522O9014R6838J40236R6181R7933
$$ 160847 198166 235151 307504 405056 501811 566333 635347 732185 872421 968602 1066535
7687A066535J64518J15212J68039J49162J80889J28302J17361K12628J15652J43819
$$ 1066535 1231053 1346265 1514304 1663466 1844355 1972657 2090018 2302646 2418298 2562117
7677B562117J04380J63371K9296P9315K5221O713k2600p030l6350o3627r0629
$$ 2562117 2666497 2829868 2859164 2938479 2963700 2970413 2947813 2940783 2904433 2840806 2750177
7666B750177r7153r4851p2887j46678j40981j15512j20050j10596j23397j12360
$$ 2750177 2653024 2558173 2485286 2338608 2197627 2082115 1962065 1851469 1728072 1615712
7656A615712j62856j30912j17401j17823q8118j11025r1338j36627j06696q4743
$$ 1615712 1452856 1321944 1204543 1086720 998602 887577 796239 659612 552916 468173
7646D68173o1712n7645j33439n6250k6780m5043m0752q4564l3966p1123l2082
$$ 468173 406461 348816 215377 159127 132347 87304 46552 -38012 -71978 -143101 -175183
7635a75183M899l6251K0466n9842p441j6414m8924M5130j6912m2623j3978j0451
$$ -175183 -170284 -206535 -186069 -245911 -253352 -269766 -318690 -273560 -290472 -333095 -347073 -357524
7623c57524k0627J1699k2660N718O17l4537j3841J1970k1206L443o2240J8476
$$ -357524 -378151 -366452 -389112 -383394 -382777 -417314 -431155 -419185 -440391 -436948 -499188 -480712
7611d80712j3340j6138J9260l4467l2013M763n244J1931k4112m794l06J6373k825
$$ -480712 -494052 -510190 -490930 -525397 -557410 -552647 -557891 -545960 -570072 -574866 -575172 -558799 -561624
7598e61624l7535O157L2582J2326l412l6467M4653k2792o87L7179l4701K8881
$$ -561624 -599159 -593002 -560420 -548094 -551506 -587973 -543320 -566112 -566799 -529620 -564321 -535440
7586e35440j5024L2338o067q772J9331l2938N7497L493n1267J087L196l0590J4524
$$ -535440 -550464 -518126 -524193 -532965 -513634 -546572 -489075 -485582 -536849 -535762 -532566 -563156 -548632
7573e48632m9083l966R429j4278m919q046l5723K0613J4805o4589L8616k1946
$$ -548632 -597715 -601681 -592252 -606530 -611449 -619495 -655218 -634605 -619800 -684389 -645773 -667719
7561f67719O497k3314N6839l6808j6435k0023M8604j5355j9958M040m784J7709
$$ -667719 -661222 -684536 -627697 -664505 -680940 -700963 -652359 -667714 -687672 -683632 -688416 -670707
7549f70707K629j3267Q658r128j2882J6466K8136j654r059n786L7912K288J4669
$$ -670707 -668078 -681345 -672687 -681815 -694697 -678231 -650095 -651749 -660808 -666594 -628682 -626394 -611725
7536f11725m4744j1847O8131m0929l2269R741L5740k1488l7705O250J8718j741
$$ -611725 -656469 -668316 -600185 -641114 -673383 -663642 -627902 -649390 -687095 -680845 -662127 -663868
7524f63868J8016l9389l3248L2228J5129n1250L6689n8781L2527Q977M5530k9177
$$ -663868 -645852 -685241 -718489 -686261 -671132 -722382 -685693 -744474 -711947 -702970 -657440 -686617
7512f86617N461j8736J4456J0917O417l4489J2246J0852j1382J3800J3351J7230
$$ -686617 -681156 -699892 -685436 -674519 -668102 -702591 -690345 -679493 -690875 -677075 -663724 -646494
7500f46494j5011L435J0895Q75P985m413J2302k893j5154J2249K7922j5436j2512
$$ -646494 -661505 -658070 -647175 -646300 -638315 -642728 -630426 -633319 -648473 -636224 -608302 -623738 -636250
7487f36250Q546m160L0009k041n2188M2165k4494n841M8710l6242K6767j9428
$$ -636250 -627704 -631864 -601855 -603896 -656084 -613919 -638413 -644254 -595544 -631786 -605019 -624447
7475f24447L7621o950k1347J869k9180M1642n665k2029k8877L6652k6873j0926
$$ -624447 -586826 -593776 -615123 -613254 -642434 -600792 -606457 -628486 -657363 -620711 -647584 -658510
7463f58510L9854L797k8168J0447J3820P313k161K2994L2415J0556k3301K9895
$$ -658510 -618656 -614859 -643027 -632580 -618760 -611447 -613608 -590614 -558199 -547643 -570944 -541049
7451e41049N3497J8156M6139R282J1331j5335L9459p442k2485K7176j1021P783
$$ -541049 -487552 -469396 -423257 -413975 -402644 -417979 -378520 -385962 -408447 -381271 -392292 -384509
7439c84509j5509k6427M1984o2885j8558k2032L0073m172q882k1228N1046l4758
$$ -384509 -400018 -426445 -384461 -447346 -465904 -487936 -457863 -462035 -470917 -492145 -441099 -475857
7427d75857J1422l1512j4975J2602m2976M8383k1411k8751m541k9542J5851m0250
$$ -475857 -464435 -495947 -510922 -498320 -541296 -492913 -514324 -543075 -547616 -577158 -561307 -601557
7415f01557k0156K6274q436q65j4719N772m0893M003J429j4766k6000J3655J528
$$ -601557 -621713 -595439 -603875 -604740 -619459 -613687 -654580 -650577 -649148 -663914 -689914 -676259 -674731
7402f74731K161J9795j4263j3093j2927q928J550O3686l9313N865J8548K6981
$$ -674731 -672570 -652775 -667038 -680131 -693058 -701986 -700436 -636750 -676063 -670198 -651650 -624669
7390f24669j1333m532M4802K3719j0950J773J1743R775k5906O574k0560J4478
$$ -624669 -636002 -640534 -595732 -572013 -582963 -581190 -569447 -559672 -585578 -579004 -599564 -585086
7378e85086m6133K853k9140j0490j3093l9391L9867k8019K716L504L9592m3815
$$ -585086 -631219 -628366 -657506 -667996 -681089 -720480 -680613 -708632 -705916 -702412 -662820 -706635
7366g06635M2640m25j8315j2807j9120K0490r809r253O856j4406J1974n359n2227
$$ -706635 -663995 -664420 -682735 -695542 -714662 -694172 -703981 -713234 -706378 -720784 -708810 -714169 -766396
7353g66396N4129l9983N624k0048j550L0053j7286L919J6276l7600J5657J4485
$$ -766396 -712267 -752250 -746626 -766674 -768224 -738171 -755457 -751538 -735262 -772862 -757205 -742720
7341g42720j309q623J7035k5413N9727j4237K9184n3343N7373k0640r59l752K7375
$$ -742720 -744029 -752652 -735617 -761030 -701303 -715540 -686356 -739699 -682326 -702966 -703925 -707677 -680302
7328f80302K407m7495K4070O249k80l9261n979R713Q645k4457J5168L4357R411
$$ -680302 -677895 -725390 -701320 -695071 -695351 -734612 -740591 -730878 -722233 -746690 -731522 -697165 -687754
7315f87754l2372J0614J5166k5677o311o41K4046k8972L5848p771J1369l6108
$$ -687754 -720126 -709512 -694346 -720023 -726334 -726975 -702929 -731901 -696053 -703824 -692455 -728563
7303g28563K301L9017k8041J4603j9744M3228l2649j8916j0892L6666n4819M4734
$$ -728563 -726262 -687245 -715286 -700683 -720427 -677199 -709848 -728764 -739656 -702990 -757809 -713075
7291g13075L1776m481L9316j0635J6375J7015J791R125M267j3095j9442j2044
$$ -713075 -681299 -685780 -646464 -657099 -640724 -623709 -621918 -612793 -608526 -621621 -641063 -653107
7279f53107J7218l7781L502J0841l4713J3785j8519j9215l2779M6743l0913k4598
$$ -653107 -635889 -673670 -670168 -659327 -694040 -680255 -698774 -717989 -750768 -704025 -734938 -759536
7267g59536k2550M0540n2467L4006l7062l1172M0847j6467N0771p3944J0102K4164
$$ -759536 -782086 -741546 -794013 -760007 -797069 -828241 -787394 -803861 -753090 -827034 -816932 -792768
7255g92768O791j4067j6894L8196r378J0101K5924k2079O6293n8280K9445K1900
$$ -792768 -785977 -800044 -816938 -778742 -788120 -778019 -752095 -774174 -707881 -766161 -736716 -714816
7243g14816R969K9577n070M0532R419O5955m4784K6585J0969k0005j6853R307
$$ -714816 -704847 -675270 -680340 -639808 -630389 -564434 -609218 -582633 -571664 -591669 -608522 -599215
7231e99215m206m6968m5514r252m0984l279J0308j3699m442n5932J4626j2257
$$ -599215 -603421 -650389 -695903 -705155 -746139 -749418 -739110 -752809 -757251 -813183 -798557 -810814
7219h10814k2539L5591k2642m186k294l745R816m9919K7927J0911J978m0575M8875
$$ -810814 -833353 -797762 -820404 -824590 -826884 -830629 -820813 -870732 -842805 -831894 -829916 -870491 -821616
7206h21616K157L5399r906l7816k498P5546l4508p549J7181J3814p999J8038k6516
$$ -821616 -819459 -784060 -793966 -831782 -834280 -758734 -793242 -800791 -783610 -769796 -777795 -759757 -786273
7193g86273L7521m9639P0975n0123L7221k1569J6671k8467J487J5042l3380K7005
$$ -786273 -748752 -798391 -727416 -777539 -740318 -761887 -745216 -773683 -772196 -757154 -790534 -763529
7181g63529j1324l5543n134J643k1480J0063m855l9024L5047K1417l2773J7121
$$ -763529 -774853 -810396 -815530 -813887 -835367 -825304 -830159 -869183 -834136 -812719 -845492 -828371
7169h28371j7270r53J4899K5412l4190K782K4146k0035J2407K9544j3509k5193
$$ -828371 -845641 -846594 -831695 -806283 -840473 -837691 -813545 -833580 -821173 -791629 -805138 -830331
7157h30331K2224k4568m2345M2627K4702k8911J5677J5332l7631N007M3929J7703
$$ -830331 -808107 -832675 -875020 -832393 -807691 -836602 -820925 -805593 -843224 -838217 -794288 -776585
7145g76585L1664l4417K1498j3072o6378L6656L4655k7053K8440J0121L0367J0335
$$ -776585 -744921 -779338 -757840 -770912 -837290 -800634 -765979 -793032 -764592 -754471 -724104 -713769
7133g13769m0602J5815o673O515O3582l4178K4351l518J499J1177j0136l452J8811
$$ -713769 -754371 -738556 -745229 -738714 -675132 -709310 -684959 -688477 -686978 -675801 -685937 -689389 -670578
7120f70578k2938K7363m4879K2675k4500r924j2038L9119k9336N2840m7850K6076
$$ -670578 -693516 -666153 -711032 -688357 -712857 -722781 -734819 -695700 -725036 -672196 -720046 -693970
7108f93970J2984j2638J7793m0952K9382J0012K9271k150N3081J1186r471M7683
$$ -693970 -680986 -693624 -675831 -716783 -687401 -677389 -648118 -650268 -597187 -586001 -595472 -547789
7096e47789J9414L2303j526N46N0874R169o362J2J7339j4247J0367j841K7666
$$ -547789 -528375 -496072 -497598 -497052 -446178 -437009 -443371 -443359 -426020 -440267 -429900 -431741 -404075
7083d04075Q731l9134O6140j9956L7802J0293L3650K5453L6358L3636P763N1551
$$ -404075 -395344 -434478 -368338 -388294 -350492 -340199 -306549 -281096 -244738 -211102 -203339 -151788
7071a51788q255L50n897R527m4414J6715n5401n4796N556l7853k8237k7486M2922
$$ -151788 -160043 -159693 -165590 -156063 -200477 -183762 -239163 -293959 -288403 -326256 -354493 -381979 -339057
7058c39057n1802Q3549p2845L1505k4062K9314R777o446K8780j7026r606K9651
$$ -339057 -390859 -307310 -380155 -348650 -372712 -343398 -333621 -340067 -311287 -328313 -337919 -308268
7046c08268o750k6940M094m3177M191r953j0854Q178q1052N2108P086m007j9009
$$ -308268 -315018 -341958 -337864 -381041 -376850 -386803 -397657 -389479 -470531 -418423 -411337 -415344 -434353
7033d34353K231o358P080J2705k065M119m6612L1983k11k5170M9376j8290M189
$$ -434353 -432122 -438480 -431400 -418695 -420760 -416641 -463253 -431270 -431481 -456651 -407275 -425565 -421376
7020d21376L9147R048n47K5703L0371L2367n396K4810R249J7511M5938K9125K3096
$$ -421376 -382229 -373181 -373728 -348025 -317654 -285287 -290683 -265873 -256624 -239113 -193175 -164050 -140954
7007a40954O2403k2168M6286L9229l6588N2457R740J3524J6713o450M7436O3740
$$ -140954 -78551 -100719 -54433 -15204 -51792 665 10405 23929 40642 34192 81628 145368
6995A45368j183J06481N7599N6367N8024J59354Q8627J74435J60575J50319K10505
$$ 145368 144185 250666 308265 364632 422656 582010 670637 845072 1005647 1155966 1366471
6984A366471K07413K17729K27738K56500K46685K54522K16491J60078J75840N3193
$$ 1366471 1573884 1791613 2019351 2275851 2522536 2777058 2993549 3153627 3329467 3382660
6974C382660k6162r6070j43693j87427j47629k92032j70088k92139k03644j38704
$$ 3382660 3356498 3260428 3116735 2929308 2781679 2489647 2319559 2027420 1823776 1685072
6964A685072j96386j67205j85191j23155j61981p6331j59841q5738k7100r0988
$$ 1685072 1488686 1321481 1136290 1013135 851154 774823 614982 529244 502144 411156
6954D11156n8320r4325p0787m7027m7416m0151l405p3611J3935n7224j6614j9066
$$ 411156 352836 258511 187724 140697 93281 53130 49725 -23886 -9951 -67175 -83789 -102855
6942a02855k1848P182k3710J3366j4933J2608K5443k1181k1278M5284N4766o329
$$ -102855 -124703 -117521 -141231 -127865 -142798 -130190 -104747 -125928 -147206 -101922 -47156 -53485
6930e3485P657N1652j149L9221J8096N5118M2010K4515L4297N0309N1405N7408
$$ -53485 -45828 5824 4675 43896 61992 117110 159120 183635 217932 268241 319646 377054
6918C77054M4911O3183K6066Q7912L8281J0992J9281J8075O781O0291n3675K9025
$$ 377054 421965 485148 511214 599126 637407 648399 667680 685755 692536 752827 699152 728177
6906G28177k818m0643K8384L3070n299K0257R58K0305J6715l939M3918K1517K141
$$ 728177 725359 684716 713100 746170 740871 761128 762086 782391 799106 795167 839085 860602 862743
6893H62743m0965O7198M3612o9317P1487K2426L2959N0303M7688j5995R0400K9513
$$ 862743 821778 888976 932588 863271 934758 957184 990143 1040446 1088134 1072139 1162539 1192052
6881A192052O3315O8615N7059q402O5385K6580O9793J304N5218J0632M3311J9653
$$ 1192052 1255367 1323982 1381041 1372639 1438024 1464604 1534397 1535701 1590919 1601551 1644862 1664515
6869A664515K7063K1398O3218L7434O9763j7926O3447L4984P6790L7357J12147
$$ 1664515 1691578 1712976 1776194 1813628 1883391 1865465 1928912 1963896 2040686 2078043 2190190
6858B190190M3613J26554P2705J43380Q8935J13553R9928J18109R7696J01760
$$ 2190190 2233803 2360357 2433062 2576442 2665377 2778930 2878858 2996967 3094663 3196423
6848C196423J09881J19547Q3200J17924R8387O0372J07065J00631Q8509Q5347
$$ 3196423 3306304 3425851 3509051 3626975 3725362 3785734 3892799 3993430 4081939 4167286
6838D167286J48316R0385J59441J34029J49860J61447J41231J90929J63536J46378
$$ 4167286 4315602 4405987 4565428 4699457 4849317 5010764 5151995 5342924 5506460 5652838
6828E652838J99092J62706K44096J60573K99759K65982L01938L68212L51388M44148
$$ 5652838 5851930 6014636 6258732 6419305 6719064 6985046 7286984 7655196 8006584 8450732
6818H450732M87343N75559O69809P53337Q97898R90245J049458J205241J222314
$$ 8450732 8938075 9513634 10183443 10936780 11834678 12824923 13874381 15079622 16301936
6809A6301936J414709J612807J858345K104170K222288K203528K122169K018476
$$ 16301936 17716645 19329452 21187797 23291967 25514255 27717783 29839952 31858428
6801C1858428J864746J763613J799821J777403J749676J619266J499590J447524
$$ 31858428 33723174 35486787 37286608 39064011 40813687 42432953 43932543 45380067
6793D5380067J312787J311793J515838J639620J969444K372517K835548L160053
$$ 45380067 46692854 48004647 49520485 51160105 53129549 55502066 58337614 61497667
6785F1497667L317673L423607L411596L485474L883291M360898M935842N340625
$$ 61497667 64815340 68238947 71650543 75136017 79019308 83380206 88316048 93656673
6777I3656673N092751M389210L056671J445518n3341j285456k203138k797914
$$ 93656673 98749424 103138634 106195305 107640823 107587482 106302026 104098888 101300974
6769A01300974k925335k856782k230258j135684l659J049846K007104K765811
$$ 101300974 98375639 95518857 93288599 92152915 92149256 93199102 95206206 97972017
6761I7972017L237117L318445L154572K637948J390241q4439j694318l304907
$$ 97972017 101209134 104527579 107682151 110320099 111710340 111625901 109931583 106626676
6753A06626676m756535n813109o385352o596578o540632o174001n620885m893924
$$ 106626676 101870141 96057032 89671680 83075102 76534470 70360469 64739584 59845660
6745E9845660m189845l360065k650745k002413j218431l57206M63972J295324
$$ 59845660 55655815 52295750 49645005 47642592 46424161 46066955 46530927 47826251
6737D7826251J957166K664565L285071L869497M446978N018530N527374O063192
$$ 47826251 49783417 52447982 55733053 59602550 64049528 69068058 74595432 80658624
6729H0658624O171039N937807N317602M457613L134232J564735R6804j305007
$$ 80658624 86829663 92767470 98085072 102542685 105676917 107241652 107338456 106033449
6721A06033449k245271k909413l081598k936526k669585k174755j440208n41494
$$ 106033449 103788178 100878765 97797167 94860641 92191056 90016301 88576093 88034599
6713H8034599M81398J596349K483163K897379K795268K192030J067030j44417
$$ 88034599 88515997 90112346 92595509 95492888 98288156 100480186 101547216 101402799
6705A01402799j435035k645578l561989m263461m578577m550780m303273m008758
$$ 101402799 99967764 97322186 93760197 89496736 84918159 80367379 76064106 72055348
6697G2055348l695075l481173l336244l229482k999492k669391k267732k032735
$$ 72055348 68360273 64879100 61542856 58313374 55313882 52644491 50376759 48344024
6689D8344024j713366j620020j501199j422635j460842j407886j422393j421444
$$ 48344024 46630658 45010638 43509439 42086804 40625962 39218076 37795683 36374239
6681C6374239j473095j588759j689121j761595j796968j862793j942559j886179
$$ 36374239 34901144 33312385 31623264 29861669 28064701 26201908 24259349 22373170
6673B2373170j920788j765242j661458j397987j345080j123916j032706r96742
$$ 22373170 20452382 18687140 17025682 15627695 14282615 13158699 12125993 11129251
6665A1129251q32381p71863o82511o30110n69847n07459m58498m20264l57030
$$ 11129251 10296870 9525007 8842496 8212386 7642539 7135080 6676582 6256318 5899288
6656E899288l68780k73700l03821k01163j85529k50648j55423j47579j79631p8263
$$ 5899288 5530508 5256808 4952987 4751824 4566295 4315647 4160224 4012645 3833014 3754751
6646C754751j18535j31255j22965r5515j27704j40180o8684q7601j31814j08500
$$ 3754751 3636216 3504961 3381996 3286481 3158777 3018597 2949913 2862312 2730498 2621998
6636B621998j35850q8699q6718j54765j11384m0604j02058j00392o0057n2115
$$ 2621998 2486148 2397449 2310731 2155966 2044582 2003978 1901920 1801528 1741471 1689356
6626A689356p6385l8186l2295l3057l3875o4747m2215p8226l2309m7823l0919
$$ 1689356 1612971 1574785 1542490 1509433 1475558 1410811 1368596 1290370 1258061 1210238 1179319
6615A179319l3091o3085j4707r3925m9570o3813p0276l8002k8529l6799r0753
$$ 1179319 1146228 1083143 1068436 974511 924941 861128 790852 752850 724321 687522 596769
6604E96769m2914n7455j7459k6071J7696m6147k9174p0499L9676l2486l9495k7580
$$ 596769 553855 496400 478941 452870 470566 424419 395245 324746 364422 331936 292441 264861
6592B64861l7513j0947o623m9104k6458k1452p719o792m9958o8336O5879l7536
$$ 264861 227348 216401 209778 160674 134216 112764 105045 98253 48295 -20041 45838 8302
6580H302O546j2822k6580m668j99K148J4804l5402K6081o76J2763j5209L5292
$$ 8302 14848 2026 -24554 -29222 -29421 -27273 -12469 -47871 -21790 -22466 -9703 -24912 10380
6567A0380l1544l474L7169J9681Q212j0903k0998K8660K3065m1587p175J0286
$$ 10380 -21164 -24638 12531 32212 40424 29521 8523 37183 60248 18661 11486 21772
6555B1772J1371J8551m916L5322k2705R061M8056m5437K9881L3493K1263l7171
$$ 21772 33143 51694 46778 82100 59395 68456 116512 71075 100956 134449 155712 118541
6543A18541O533N934k3884L7662j740k5786K1058K0535Q069l1721M6090m2307
$$ 118541 125074 131008 107124 144786 143046 117260 138318 158853 166922 135201 181291 138984
6531A38984j8235L5935m900m5486N3276l9196q16J6748k4849K6502J6448J4q671
$$ 138984 120749 156684 151784 106298 159574 120378 119562 136310 111461 137963 154411 154425 145754
6518A45754K7122O691J3917J901K244k9549M3450k7870J1193J3424L2410j4354
$$ 145754 172876 179567 193484 195385 197629 168080 211530 183660 194853 208277 240687 226333
6506B26333K6717K4000N5455K3275L8630N9380K6572P1644P1748J10833Q8782
$$ 226333 253050 277050 332505 355780 394410 453790 480362 552006 623754 734587 823369
6495H23369N6613P7664J51610J20441Q8320J38679J64543J01759J76434J95345
$$ 823369 879982 957646 1109256 1229697 1318017 1456696 1621239 1722998 1899432 2094777
6485B094777J62705J61168K36225K19854J93551J26438Q4708L1317l7039k6366
$$ 2094777 2257482 2418650 2654875 2874729 3068280 3194718 3279426 3310743 3273704 3247338
6475C247338j01957j46813j92998j60664k19121j82791j94283j37416k22230j41850
$$ 3247338 3145381 2998568 2805570 2644906 2425785 2242994 2048711 1911295 1689065 1547215
6465A547215j34706j86708r4348p2990p6973n1983m6430q5927j881l1677J446
$$ 1547215 1412509 1225801 1131453 1058463 981490 929507 883077 797150 795269 763592 765038
6454G65038k0860l1118K7023o5180L2809l8662J6868m1679j18107M4363m2737
$$ 765038 744178 713060 740083 674903 707712 669050 685918 644239 526132 570495 527758
6443E27758j5420k3376r739L0596j3010m8630P3284K3280l700L9963J2522K4555
$$ 527758 512338 488962 479223 509819 496809 448179 521463 544743 541043 581006 593528 618083
6431F18083M4277N8730k7536N3844K0346P2866n949J2454q515L3749L9484M0887
$$ 618083 662360 721090 693554 747398 767744 840610 834661 847115 838600 872349 911833 952720
6419I52720L5324K2925K8319M5343J6499K589Q456k7111J7877m0545l3903m6455
$$ 952720 988044 1010969 1039288 1084631 1101130 1103719 1112175 1085064 1102941 1062396 1028493 982038
6407I82038p9015l8021q7133l8092n1850j15250m1392q5708j5802j02976N052
$$ 982038 903023 865002 777869 739777 687927 572677 531285 445577 429775 326799 331851
6396C31851m6244l4614o0021l5348n7763L7619q2089O539m9987J600j3499l2540
$$ 331851 285607 250993 190972 155624 97861 135480 53391 59930 9943 11543 -1956 -34496
6384c4496J8553l323j5753l199j4837O926P367M0123k6017J3867N266K8440o663
$$ -34496 -15943 -19266 -35019 -38218 -53055 -46129 -38762 1361 -24656 -10789 -5523 22917 16254
6371A6254P305k867k7039K7812K776j7509M4258n23j7427k007J7606j0532J6182
$$ 16254 23559 20692 -6347 21465 24241 6732 50990 50467 33040 31033 48639 38107 54289
6358E4289L880K5938k7602L4872K3896J1014K1514P107J124K8637Q183k4346J9714
$$ 54289 58169 84107 56505 91377 115273 126287 147801 154908 156032 184669 192852 168506 188220
6345A88220J8775l157j8886j3085L1352r547J2282k5650j1782L1967k2933L2060
$$ 188220 206995 203838 184952 171867 203219 193672 205954 180304 168522 200489 177556 209616
6333B09616k851l6045L1657m0768n572L1373J3976N745J4560N130O126P766P768
$$ 209616 206765 170720 202377 161609 156037 187410 201386 207131 221691 226821 232947 240713 248481
6320B48481j2609K7021J6396N774k543Q783J9268k4769O0443K540M4298L4753
$$ 248481 235872 262893 279289 285063 282520 291303 310571 285802 346245 348785 393083 427836
6308D27836J00108L7357R0229L7927J03993L2575R2134M0522Q9851M0280M7976
$$ 427836 527944 565301 655530 693457 797450 830025 922159 962681 1052532 1092812 1140788
6297A140788L3497O3826L5686M7129L4394O5515Q3749J10181O7014M7383R8833
$$ 1140788 1174285 1238111 1273797 1320926 1355320 1420835 1504584 1614765 1681779 1729162 1827995
6286A827995J07748O5824J03502J05467J45839J45811P1551J56568R3168M7835
$$ 1827995 1935743 2001567 2105069 2210536 2356375 2502186 2573737 2730305 2823473 2871308
6276B871308J02018k3640l755k7056k7859p2396o4588o2268l6407r1295l6990
$$ 2871308 2973326 2949686 2945931 2918875 2891016 2818620 2754032 2691764 2655357 2564062 2527072
6265B527072q0328n6054o9582l9602l8647p6996p989m4933j8054M460k5881K9926
$$ 2527072 2446744 2390690 2321108 2281506 2242859 2165863 2157874 2112941 2094887 2099347 2073466 2103392
6253B103392R172k1357m056k1735n7660m2868m438o3089n9061k8550J785m5890
$$ 2103392 2112564 2091207 2087151 2065416 2007756 1964888 1960450 1897361 1838300 1809750 1811535 1765645
6241A765645j0989L600P917J9962J0520L7192M0904P7091P0927M1710J03903N5107
$$ 1765645 1754656 1758256 1766173 1786135 1796655 1833847 1874751 1951842 2022769 2064479 2168382 2223489
6229B223489J10223P5170O7978J09094J10699R1956M1627J31331O9075P6097J17524
$$ 2223489 2333712 2408882 2476860 2585954 2696653 2788609 2830236 2961567 3030642 3106739 3224263
6218C224263M1259J17943J16278P7598L8151J50310Q9724J35064J17317J66503
$$ 3224263 3265522 3383465 3499743 3577341 3615492 3765802 3855526 3990590 4107907 4274410
6208D274410J44975J81829J40081K39095J81161K07471K16859K21051K93791K22568
$$ 4274410 4419385 4601214 4741295 4980390 5161551 5369022 5585881 5806932 6100723 6323291
6198F323291K69670K97792L12573K97508L22432L65175L15059L11721M00684L61462
$$ 6323291 6592961 6890753 7203326 7500834 7823266 8188441 8503500 8815221 9215905 9577367
6188I577367L96064L80772M31554M43896M37355M82206N02446N93688O82229O81249
$$ 9577367 9973431 10354203 10785757 11229653 11667008 12149214 12651660 13245348 13927577 14608826
6178A4608826Q04604R87899J042824J237883J454786J671183K080098K314452
$$ 14608826 15413430 16401329 17444153 18682036 20136822 21808005 23888103 26202555
6170B6202555K764244L230521L764908M268336N001875N754865O534566P480169
$$ 26202555 28966799 32197320 35962228 40230564 45232439 50987304 57521870 65002039
6162F5002039Q400165R327801J0183485J0965329J1466320J1929879J2160779
$$ 65002039 73402204 82730005 92913490 103878819 115345139 127275018 139435797
6155A39435797J2049050J1471904J0222313Q197943N766818K948617J64190k477212
$$ 139435797 151484847 162956751 173179064 181377007 187143825 190092442 190256632 187779420
6147A87779420m883972p126083q939068j0354469j1281510j1604602j1621650
$$ 187779420 182895448 175769365 166830297 156475828 145194318 133589716 121968066
6140A21968066j1362107j0934772j0358024r520664q734897p762570o886530o073467
$$ 121968066 110605959 99671187 89313163 79792499 71057602 63295032 56408502 50335035
6132E0335035n347749m696743m145065l651627l185856k830965k471030k169662
$$ 50335035 44987286 40290543 36145478 32493851 29307995 26477030 24006000 21836338
6124B1836338j956365j751136j540133j397710j264811j158811j037389r20633
$$ 21836338 19879973 18128837 16588704 15190994 13926183 12767372 11729983 10809350
6116A0809350q37589p39463o76143o80619n50455n34046m17959m14110l33204
$$ 10809350 9971761 9232298 8556155 7875536 7325081 6791035 6373076 5958966 5625762
6107E625762l55886k92835k17785k61136j98736j71967j76953j34599j32557j37850
$$ 5625762 5269876 4977041 4759256 4498120 4299384 4127417 3950464 3815865 3683308 3545458
6097C545458j81642j24590j40180j03677j24564j13267j71225n7770j59781j15840
$$ 3545458 3363816 3239226 3099046 2995369 2870805 2757538 2586313 2528543 2368762 2252922
6087B252922o7836j21358j23675j42337l4453o5022q7366j24118o0253m3898o2116
$$ 2252922 2185086 2063728 1940053 1797716 1763263 1698241 1610875 1486757 1426504 1382606 1320490
6076A320490k3845m7975j4444n4450J9390m2128k9113M2558j3836m1044J2271
$$ 1320490 1296645 1248670 1234226 1179776 1199166 1157038 1127925 1170483 1156647 1115603 1127874
6065A127874j8320J1673n8508j8226m1386n939l6822o1784k2740l2255q3563k3231
$$ 1127874 1109554 1121227 1062719 1044493 1003107 997168 960346 898562 875822 843567 760004 736773
6053G36773k9943p7439j4079l2762o7430l4365k5428l5832k7529j05629l1906
$$ 736773 706830 629391 615312 582550 515120 480755 455327 419495 391966 286337 254431
6042B54431m3837k4750j09719m1952m7411n5131k7028r0600j6215n4952k7469
$$ 254431 210594 185844 76125 34173 -13238 -68369 -95397 -185997 -202212 -257164 -284633
6031b84633o1804j0464l3522l4250j8341l5092L5550o355l1876O0660r216J9047
$$ -284633 -346437 -356901 -390423 -424673 -443014 -478106 -442556 -448911 -480787 -420127 -429343 -410296
6019d10296L306M7292j360J6618J2041K6058M5815l4798M3599M9735O0079L6363
$$ -410296 -406990 -359698 -361058 -344440 -332399 -306341 -260526 -295324 -251725 -201990 -141911 -105548
6007a05548k5386M7675M992N3501P037K1529J0026Q106J0048L5630N9882l0499
$$ -105548 -130934 -83259 -78267 -24766 -17729 3800 13826 21932 31980 67610 127492 96993
5995I6993J0797J8206l4790N4295j0948N309K7052k5954N197k8312J97K2087l8664
$$ 96993 107790 125996 91206 145501 134553 139862 166914 140960 146157 117845 118042 140129 101465
5982A01465j168j4580M499N198J5569l2166R501M283l0846L8936m6078K7321K4771
$$ 101465 100297 85717 90216 95414 110983 78817 88318 92601 61755 100691 54613 81934 106705
5969A06705k3866M264J6089n6023L7008l7756J4932k6028M035k3238P134m1614
$$ 106705 82839 87103 103192 47169 84177 46421 61353 35325 39360 16122 23256 -18358
5957a8358O440K181q907q077j0021n4633K7317J7585k9899q527J0283L6567m0342
$$ -18358 -11918 -9737 -18644 -26721 -36742 -91375 -64058 -46473 -76372 -84899 -74616 -38049 -78391
5944g8391L6593j5356N9880J6867L638k2650J144m3898R259j3989n032m7573m3979
$$ -78391 -41798 -57154 2726 19593 23231 581 1725 -42173 -32914 -46903 -51935 -99508 -143487
5931a43487J572l0376J9737o8216L186L4767j697J2191l0629K5279K2776o801
$$ -143487 -141915 -172291 -152554 -220770 -217584 -182817 -184514 -172323 -202952 -177673 -154897 -161698
5919a61698L502k3546M4156k2583k1722L9483k7223r922j786M946l0088N802M760
$$ -161698 -158196 -181742 -137586 -160169 -181891 -142408 -169631 -179553 -181339 -176393 -206481 -200679 -195919
5906a95919O356J8759m4603L9972J1961m8134O7456L0897M0263L4731N0111M2820
$$ -195919 -189563 -170804 -215407 -175435 -163474 -211608 -144152 -113255 -72992 -38261 11850 54670
5894E4670l400Q8556K5433N2439N3815O0552Q3467K1123P4742N379R2867q166
$$ 54670 51270 139826 165259 217698 271513 332065 415532 436655 511397 516776 609643 601477
5882F01477J5441j4767j2151j0545l7174k9452j12622k1398n3066j6835o4054
$$ 601477 616918 602151 590000 579455 542281 512829 400207 378809 325743 308908 244854
5871B44854o6818K478l4047m7003m4847O658l8556m5582j0190m728m4703J5303
$$ 244854 178036 180514 146467 99464 54617 61275 22719 -22863 -33053 -37781 -82484 -67181
5859f7181P188l795l590J4899j9947J9348j6481K6926j5341N3443L824K0251Q5072
$$ -67181 -59993 -63788 -67378 -52479 -72426 -53078 -69559 -42633 -57974 -4531 -707 19544 104616
5846A04616k7552N3678K8725J3358K1159N62L9557R3802J5166L4547J7736M6564
$$ 104616 77064 130742 159467 172825 193984 194546 234103 327905 343071 377618 395354 441918
5834D41918Q308N5955M8961J00922k1228Q5753M9404N6947M5965L9122N8323M323
$$ 441918 450226 506181 555142 656064 634836 720589 769993 826940 872905 912027 970350 974673
5822I74673L5440M7339J5438M7514M6422N098N2230m0147j0481K8400l9783M2837
$$ 974673 1010113 1057452 1072890 1120404 1166826 1171924 1224154 1184007 1173526 1201926 1162143 1204980
5810A204980l1168l0745m2586l3607O4324L0676L1147k3629M6118P3309L4341
$$ 1204980 1173812 1143067 1100481 1066874 1131198 1161874 1193021 1169392 1215510 1288819 1323160
5799A323160Q1168N6593R6691J22777O1175P9420M4364J12280J209O8325K7853
$$ 1323160 1404328 1460921 1557612 1680389 1741564 1820984 1865348 1977628 1978837 2047162 2075015
5788B075015k0957J2596p841m875j0094j5677K4006O0235L6100N4987L4290m113
$$ 2075015 2054058 2066654 2058813 2053938 2043844 2028167 2052173 2112408 2148508 2203495 2237785 2233672
5776B233672L7249J4942k3695j0250O766J9252k7103M0856J0847P7846M9634J38601
$$ 2233672 2270921 2285863 2262168 2251918 2258684 2277936 2250833 2291689 2302536 2380382 2430016 2568617
5764B568617R9665J14817J81731J84389K58694K24733K24626K40072K33375K09486
$$ 2568617 2668282 2783099 2964830 3149219 3407913 3632646 3857272 4097344 4330719 4540205
5754D540205K29544J54938J28443J58157J49911P5812J19207P6088J35998J16269
$$ 4540205 4769749 4924687 5053130 5211287 5361198 5437010 5556217 5632305 5768303 5884572
5744E884572P6177N1545n905L3301m6006J4258K888Q2182J20864J6596R7851M7143
$$ 5884572 5960749 6012294 6006389 6039690 5993684 6007942 6010830 6093012 6213876 6230472 6328323 6375466
5732F375466k525j9099R468j7202K3333k5329K0651M4295P7190J14094R6455J13244
$$ 6375466 6372941 6353842 6363310 6346108 6369441 6344112 6364763 6409058 6486248 6600342 6696797 6810041
5720F810041Q1844P1629P0219M3444l485M4234p9545j02269j43015j65271j60918
$$ 6810041 6891885 6963514 7033733 7077177 7073692 7117926 7038381 6936112 6793097 6627826 6466908
5709F466908j71363j12687j76775j16774r4591l2763q8076l6173m0125k610L8714
$$ 6466908 6295545 6182858 6006083 5889309 5794718 5761955 5673879 5637706 5597581 5594971 5633685
5698E633685J5914K6692P1029N07P0924N7604M8731N0710L4807O7140O2301O2537
$$ 5633685 5649599 5676291 5747320 5747827 5818751 5876355 5925086 5975796 6010603 6077743 6140044 6202581
5686F202581O3816O1455M7047M4907M1073J2824k4739K9766p10l9482n3935l2222
$$ 6202581 6266397 6327852 6374899 6419806 6460879 6473703 6448964 6478730 6478020 6438538 6384603 6352381
5674F352381p2467r3470n7193p5191j09348j09615l9858o1841j02838m5955j24863
$$ 6352381 6279914 6186444 6129251 6054060 5944712 5835097 5795239 5733398 5630560 5584605 5459742
5663E459742j9769n1381l6963l6327k0272O557M7177n800P5707O9264K9858J16810
$$ 5459742 5439973 5388592 5351629 5315302 5295030 5301587 5348764 5342964 5418671 5487935 5517793 5634603
5651E634603P3154P6060J69956J93425J39667J72076K15731K12299K43027K80175
$$ 5634603 5707757 5783817 5953773 6147198 6286865 6458941 6674672 6886971 7129998 7410173
5641G410173L89640L03709L03833K81481J86276J93921J28358L4829R2387Q551
$$ 7410173 7799813 8103522 8407355 8688836 8875112 9069033 9197391 9232220 9324607 9333158
5631I333158n0001K0248N6956Q2271O6636R2816J40101J11567J04690J85218J35071
$$ 9333158 9283157 9303405 9360361 9442632 9509268 9602084 9742185 9853752 9958442 10143660 10278731
5620A0278731J97289K77481J51506L52733K95689L12741M08914M00588M53960
$$ 10278731 10476020 10753501 10905007 11257740 11553429 11866170 12275084 12675672 13129632
5611A3129632N40363M64502O17777O59167O28976O79494P42261P57106Q36811
$$ 13129632 13669995 14134497 14752274 15411441 16040417 16719911 17462172 18219278 19056089
5602A9056089Q20855Q87896Q86571R42739R78629R60741J019625J070246J102174
$$ 19056089 19876944 20764840 21651411 22594150 23572779 24533520 25553145 26623391 27725565
5593B7725565J084717J150174J191608J162828J205818J261217J334847J526078
$$ 27725565 28810282 29960456 31152064 32314892 33520710 34781927 36116774 37642852
5585C7642852J652882J824485K150191K310668K760472L097613L711537M247148
$$ 37642852 39295734 41120219 43270410 45581078 48341550 51439163 55150700 59397848
5577E9397848N006302N831842O717988P792847Q825869J0100031J1307553J2649929
$$ 59397848 64404150 70235992 76953980 84746827 93572696 103672727 114980280 127630209
5569A27630209J4139683J5534706J7064886J8334599J9306929K0127173K0745052
$$ 127630209 141769892 157304598 174369484 192704083 212011012 232138185 252883237
5562B52883237K0925328K0482836J9197187J6707821J3175793R046916M515325
$$ 252883237 273808565 294291401 313488588 330196409 343372202 352419118 356934443
5555C56934443l19976m958679r618153j4017251j7693716k0386507k2069652k2706312
$$ 356934443 356614467 351655788 342037635 328020384 310326668 289940161 267870509 245164197
5547B45164197k2635099k2088286k1000352j9702379j7862466j6017293j4184988
$$ 245164197 222529098 200440812 179440460 159738081 141875615 125858322 111673334
5540A11673334j2332954j0853220r457191q124771o951066n867408n014306m288830
$$ 111673334 99340380 88487160 79029969 70905198 63954132 58086724 53072418 48783588
5532D8783588l719414l188650k830449k505784k219539j976975j829156j609362
$$ 48783588 45064174 41875524 39045075 36539291 34319752 32342777 30513621 28904259
5524B8904259j441486j406632j210898j108862j049399r57231r58190q70406q05457
$$ 28904259 27462773 26056141 24845243 23736381 22686982 21729751 20771561 19901155 19095698
5515A9095698p69239p66616o99528n94118o46873n49000n04919m41922m21121
$$ 19095698 18326459 17559843 16860315 16266197 15619324 15070324 14565405 14123483 13702362
5506A3702362m35027l36076l12972l18090k73216j98641k05925j78548r4031r9888
$$ 13702362 13267335 12931259 12618287 12300197 12026981 11828340 11622415 11443867 11349836 11249948
5496A1249948n5285l8725M9304P3156J26199K11399K50778L66316L93746M17445
$$ 11249948 11194663 11155938 11205242 11278398 11404597 11615996 11866774 12233090 12626836 13044281
5486A3044281M58367M73142N16930M76131M18417L87830L77027K79492K33943
$$ 13044281 13502648 13975790 14492720 14968851 15387268 15775098 16152125 16431617 16665560
5477A6665560J79585R9367J0829m6536j95849k07773l74146m37799m57423n01277
$$ 16665560 16845145 16944512 16955341 16908805 16712956 16505183 16131037 15693238 15235815 14734538
5467A4734538o14823n36769n13201n04812m69308l92719m20354l42363l40980
$$ 14734538 14119715 13582946 13069745 12564933 12095625 11702906 11282552 10940189 10599209
5458A0599209k95917j80771k68870j33867j72357j18560j22263q5786l8027j03054
$$ 10599209 10303292 10122521 9853651 9719784 9547427 9428867 9306604 9220818 9182791 9079737
5448I079737p2915l492j66297o677l1309L059Q691J0036L328K3563O3407M0307
$$ 9079737 9006822 9003330 8837033 8830356 8799047 8802106 8810797 8820833 8824161 8847724 8911131 8951438
5436H951438O2249K2521P3233J6311N7801R7208N8138O8583L1167Q8018J13945
$$ 8951438 9013687 9036208 9109441 9125752 9183553 9280761 9338899 9407482 9438649 9526667 9640612
5425I640612J38865J28008K08246K08599K08532K05156J95047K57731K15800K66282
$$ 9640612 9779477 9907485 10115731 10324330 10532862 10738018 10933065 11190796 11406596 11672878
5415A1672878L57837K68941L59971L84302N36581M29090N43924O38424O59768
$$ 11672878 12030715 12299656 12659627 13043929 13580510 14009600 14553524 15191948 15851716
5406A5851716O49192P04682P31740P67261P54273O47648M80505L47567L69576
$$ 15851716 16500908 17205590 17937330 18704591 19458864 20106512 20587017 20934584 21304160
5397B1304160M62141L36651M28669M60595M96589N31266O14365P53908Q30237
$$ 21304160 21766301 22102952 22531621 22992216 23488805 24020071 24634436 25388344 26218581
5388B6218581Q45812R46629J283521J873880K852420L291942L750919M344560
$$ 26218581 27064393 28011022 29294543 31168423 34020843 37312785 41063704 45408264
5380D5408264N093225O233532P747091R473074J1447001J5339897K0002671K0050606
$$ 45408264 50501489 56735021 64482112 73955186 85402187 100742084 120744755 140795361
5372A40795361J7693133J9321223K2528166K7309838L3260239M3001334M4774315
$$ 140795361 158488494 177809717 200337883 227647721 260907960 303909294 348683609
5365C48683609K8980461J9784500J1003027q091619j5030803j9329114k6574000
$$ 348683609 377664070 397448570 408451597 400359978 385329175 366000061 339426061
5358C39426061l4120479l7826035l3738627k7767413k1732431j6997505j5867923
$$ 339426061 305305582 267479547 233740920 205973507 184241076 167243571 151375648
5351A51375648j7458024j3938644r429884o441311m288870j747432N27126K531279
$$ 151375648 133917624 119978980 110549096 104107785 99818915 98071483 98598609 101129888
5343A01129888M496781O601531Q753469J1275655J4068392J5890762J6846474
$$ 101129888 105626669 112228200 120981669 132257324 146325716 162216478 179062952
5336A79062952J8135343K0699168K3926803K6869466K7777851K4487104J8085899
$$ 179062952 197198295 217897463 241824266 268693732 296471583 320958687 339044586
5329C39044586J0255641J264593o321109j2106992j7250388k2092464k5572876
$$ 339044586 349300227 350564820 344243711 332136719 314886331 292793867 267220991
5322B67220991k6267372k5132433k2721749k0171757j8361319j7276718j5544769
$$ 267220991 240953619 215821186 193099437 172927680 154566361 137289643 121744874
5315A21744874j3187609j0918826r007204p609781o524160n599285m990470m413766
$$ 121744874 108557265 97638439 88631235 81021454 74497294 68898009 63907539 59493773
5307E9493773m037013l707697l552242l384623l221506l047891k733254k606472
$$ 59493773 55456760 51749063 48196821 44812198 41590692 38542801 35809547 33203075
5299C3203075k353715k268504k109675j893040j752347j560084j460924j155489
$$ 33203075 30849360 28580856 26471181 24578141 22825794 21265710 19804786 18649297
5291A8649297j137057r34028p92156o51667n67708m12239l65666l51511k08328
$$ 18649297 17512240 16578212 15786056 15134389 14566681 14154442 13788776 13437265 13228937
5282A3228937k13383j25534j58821j47060j45054k16175j69989j96771j98244
$$ 13228937 13015554 12890020 12731199 12584139 12439085 12222910 12052921 11856150 11657906
5273A1657906k46002k29789k02119k10439j87962j39495k15302j01194j62933
$$ 11657906 11411904 11182115 10979996 10769557 10581595 10442100 10226798 10125604 9962671
5264I962671p2920j14463m2033p0050n234j05331k5443n5080j39860j44634r6144
$$ 9962671 9889751 9775288 9733255 9663205 9657971 9552640 9527197 9472117 9332257 9187623 9091479
5253I091479j28640j08175l4610m4127l4209o4406j67884j28707j27268j57050
$$ 9091479 8962839 8854664 8820054 8775927 8741718 8677312 8509428 8380721 8253453 8096403
5243H096403j45050j06967q9517k4836M3153J60080J79831K75016K80538L90178
$$ 8096403 7951353 7844386 7754869 7730033 7773186 7933266 8113097 8388113 8668651 9058829
5233I058829M31577N03994M73937O11456N70846N14644M85475L27028J93006j3945
$$ 9058829 9490406 9994400 10468337 11079793 11650639 12165283 12650758 12977786 13170792 13156847
5223A3156847k07891k96568m34134n14548n38184n47901n32710m46579l53827
$$ 13156847 12948956 12652388 12218254 11703706 11165522 10617621 10084911 9638332 9284505
5214I284505k42858j65659m9613J26848K54663M41026N73122Q15925J133314J287690
$$ 9284505 9041647 8875988 8826375 8953223 9207886 9648912 10222034 11037959 12171273 13458963
5204A3458963J331432J448638J548005J748326J974963K176643K081416J515639
$$ 13458963 14790395 16239033 17787038 19535364 21510327 23686970 25768386 27284025
5196B7284025R65981K04701n48527j025082j346350j723388k143576k248603k079878
$$ 27284025 28250006 28454707 27906180 26881098 25534748 23811360 21667784 19419181 17339303
5187A7339303j921285j641746j423385j298845j295314j075706r42571o96165
$$ 17339303 15418018 13776272 12352887 11054042 9758728 8683022 7740451 7044286
5179G044286o69448n01379m37464l36155l16684k23097j49081j81987j19228j22849
$$ 7044286 6374838 5873459 5435995 5099840 4783156 4560059 4410978 4228991 4109763 3986914
5169C986914q0861o0849l260m8027m7595K3319K8214N6881N6891J00239R5447
$$ 3986914 3906053 3845204 3841944 3793917 3746322 3769641 3797855 3854736 3911627 4011866 4107313
5158D107313J26485R9947R8030N0688j1834M7122r7572J0753r9996j6256p5525
$$ 4107313 4233798 4333745 4431775 4482463 4470629 4517751 4420179 4430932 4330936 4314680 4239155
5147D239155n8846k7668O5878m3570o1266N656n0892j24473n0671j18999j47630
$$ 4239155 4180309 4152641 4218519 4174949 4113683 4119339 4068447 3943974 3893303 3774304 3626674
5136C626674j17230n9900j04368p4272m8673j1813m4892Q995k2839N1726q618
$$ 3626674 3509444 3449544 3345176 3270904 3222231 3210418 3165526 3174521 3151682 3203408 3194790
5125C194790M7512L2263j6173M3886J0366p6223m5706o2232r2673m7739j17262
$$ 3194790 3242302 3274565 3258392 3302278 3312644 3236421 3190715 3128483 3035810 2988071 2870809
5114B870809m5578n9442k0130K7272Q303k2528K2347M7975N0238K0055O2473K476
$$ 2870809 2825231 2765789 2745659 2772931 2781234 2758706 2781053 2829028 2879266 2899321 2961794 2964270
5102B964270n1852m3486r5544N874q2129m9017k0857R146K0683J9609P5256J12071
$$ 2964270 2912418 2868932 2773388 2779262 2697133 2648116 2627259 2636405 2657088 2676697 2751953 2864024
5090B864024J00874K14891J12196R5763J5209m4082r3557q9167j61502j52190
$$ 2864024 2964898 3179789 3291985 3387748 3402957 3358875 3265318 3176151 3014649 2862459
5080B862459j46886j97430j63066m9325j32708r056o8961o465O8078k6962J16541
$$ 2862459 2715573 2518143 2355077 2305752 2173044 2163988 2095027 2088562 2156640 2129678 2246219
5069B246219Q5141O9178J23473O5334O0606R2777P573q6008p5383p6236j15831
$$ 2246219 2331360 2400538 2524011 2589345 2649951 2742728 2750301 2664293 2588910 2512674 2396843
5058B396843j80223r8386j59172j41060j10037j01832j47185j27558o5846j08156
$$ 2396843 2216620 2118234 1959062 1818002 1707965 1606133 1458948 1331390 1265544 1157388
5048A157388m4578q7908k7431q8242j3264n1304j0684O877p1657N8055j2632n1187
$$ 1157388 1112810 1024902 997471 909229 895965 844661 833977 840854 769197 827252 814620 763433
5036G63433M0515l7200K0432K5448M0066O847N0138O2035O4198M1944L4923P2180
$$ 763433 803948 766748 787180 812628 852694 859541 909679 971714 1035912 1077856 1112779 1184959
5024A184959O4964J32707J60473P3561N9829P5420p4218l5030o5386q3382j26608
$$ 1184959 1249923 1382630 1543103 1616664 1676493 1751913 1677695 1642665 1577279 1493897 1367289
5013A367289j13601j31702r7143o6644p6312q8008q6560l8063m2532M746k3511
$$ 1367289 1253688 1121986 1024843 958199 881887 793879 707319 669256 626724 631470 607959
5002F07959n2988J6827j6952m487l1375L984j862j3325K09j9469K8194k3672p307
$$ 607959 554971 571798 554846 550359 518984 522968 521106 507781 507990 488521 516715 493043 485736
4989D85736m4954O8647n106L836J180l0461M5028J9672j4895L3529j1123N1703
$$ 485736 440782 509429 504323 508159 509339 478878 523906 543578 528683 562212 551089 602792
4977F02792k3966j915M0813m8296N9435R221m603K289L6651N0332N787k042l3744
$$ 602792 578826 576911 617724 569428 628863 638084 633481 635770 672421 722753 728540 726498 692754
4964F92754N2474n62P4271L7998m51M1865J3364N1450L1826K9884j147M2732P2844
$$ 692754 745228 744666 818937 856935 856484 898349 911713 963163 994989 1024873 1023726 1066458 1139302
4951A139302J0343J0209P9091j0529K7642K283K2391P363N96r259M7187k5166
$$ 1139302 1149645 1159854 1238945 1228416 1256058 1258341 1280732 1288095 1288691 1279432 1326619 1301453
4939A301453J4212J2930j6797K5423J9659K9357K8443L4184K3131N1250R782K1346
$$ 1301453 1315665 1328595 1311798 1337221 1356880 1386237 1414680 1448864 1471995 1523245 1533027 1554373
4927A554373K1571O6311O4135N3023M9644P3001O0976P7796N8556N0498J19778
$$ 1554373 1575944 1642255 1706390 1759413 1809057 1882058 1943034 2020830 2079386 2129884 2249662
4916B249662M2630P9240O4806R2009N0733J0459L2803n9618J9633j9216n2211
$$ 2249662 2292292 2371532 2436338 2528347 2579080 2589539 2622342 2562724 2582357 2563141 2510930
4905B510930J3008k9484K175k752L1605M4852N1097P9648O8587J14076J20805
$$ 2510930 2523938 2494454 2496629 2493877 2525482 2570334 2621431 2701079 2769666 2883742 3004547
4894C004547J19907J43837J62622J31973J36573J72949M5264P3282O2277k0359
$$ 3004547 3124454 3268291 3430913 3562886 3699459 3872408 3917672 3990954 4053231 4032872
4884D032872m7506m6872j04778p3879j33378p0427o1466m0031p6772l1735K4449
$$ 4032872 3985366 3938494 3833716 3759837 3626459 3556032 3494566 3454535 3377763 3346028 3370477
4873C370477K2111M2238Q80M6873P5381Q3853l678Q5373L6236K6508K4964J1059
$$ 3370477 3392588 3434826 3435706 3482579 3557960 3641813 3638135 3723508 3759744 3786252 3811216 3822275
4861C822275L0284M7670p748O5161l5471P136N0335p0922j4593k5863l5901j6684
$$ 3822275 3852559 3900229 3892481 3957642 3922171 3929307 3979642 3908720 3894127 3868264 3832363 3815679
4849C815679k9946J7863l8407j1278K7828k2210M2568k4382R473K673J5910K0148
$$ 3815679 3785733 3803596 3765189 3753911 3781739 3759529 3802097 3777715 3787188 3789861 3805771 3825919
4837C825919j0339O323k0219n6707o0492K1475r0229j05032l2939q9631n6602
$$ 3825919 3815580 3821903 3801684 3744977 3684485 3705960 3615731 3510699 3477760 3388129 3331527
4826C331527j7446p7128m1285l2078l4204n296j4615N0616N2739J0275O1095P9442
$$ 3331527 3314081 3236953 3195668 3163590 3129386 3124090 3109475 3160091 3212830 3223105 3284200 3363642
4814C363642Q5061L5214J50849Q2706R4055J14747M8630O8452J55684K3598N3455
$$ 3363642 3448703 3483917 3634766 3717472 3811527 3926274 3974904 4043356 4199040 4222638 4276093
4803D276093N3258n538O36l1502k5672p8144J9599l3423M0391j5885K2887P6867
$$ 4276093 4329351 4323813 4324449 4292947 4267275 4189131 4208730 4175307 4215698 4199813 4222700 4299567
4791D299567K7444J7682P0649k278L6972R3543J073Q7979Q883R9557J11768Q3064
$$ 4299567 4327011 4344693 4415342 4413064 4450036 4543579 4544652 4632631 4641514 4741071 4852839 4935903
4779D935903J22263P1104J00296k8829n50j4508l4078o6855m7534q0319L6l3742
$$ 4935903 5058166 5129270 5229566 5200737 5200187 5185679 5151601 5084746 5037212 4956893 4956929 4923187
4767D923187k1899L5744J621k4086m726j7374j898m7661O1746j2303K1143j5436
$$ 4923187 4901288 4937032 4938653 4914567 4909841 4892467 4890569 4842908 4904654 4892351 4913494 4898058
4755D898058O4588K6671N1327J8360P6872O877L1091j6254M2778K111q431K4998
$$ 4898058 4962646 4989317 5040644 5059004 5135876 5142753 5173844 5157590 5200368 5202479 5194048 5219046
4743E219046J5221L0888K2585j139K1007L6639L5985M4199K9876Q7627K1150P3731
$$ 5219046 5234267 5265155 5287740 5286601 5307608 5344247 5380232 5424431 5454307 5541934 5563084 5636815
4731E636815O3500M0248J09184M4975K2260Q9074R6926O0750R2260Q0039J36455
$$ 5636815 5700315 5740563 5849747 5894722 5916982 6006056 6102982 6163732 6255992 6336031 6472486
4720F472486P582J39051N7631J38191P2483J60271N4619J16452J23810R5784J46143
$$ 6472486 6480068 6619119 6676750 6814941 6887424 7047695 7102314 7218766 7342576 7438360 7584503
4709G584503J01124J29517J17821J25434Q5894J35342P9832J03529J33626O5556
$$ 7584503 7685627 7815144 7932965 8058399 8144293 8279635 8359467 8462996 8596622 8662178
4699H662178J14123J06935O3029J22973P0865J04535N8136Q9953M2725J21841
$$ 8662178 8776301 8883236 8946265 9069238 9140103 9244638 9302774 9392727 9435452 9557293
4689I557293N5894P4967K7628J58271L0044k281P7579M6975L0753O7198L8373
$$ 9557293 9613187 9688154 9715782 9874053 9904097 9901816 9979395 10026370 10057123 10124321 10162694
4678A0162694N084L9375l65L0557j8311M7250j1662L9391J3444L028J808P232
$$ 10162694 10167778 10207153 10206788 10237345 10219034 10266284 10254622 10294013 10307457 10310485 10312293 10319525
4666A0319525R297k8480K5128L3968J3076l395M2893R737K4461O6008J8630L2850
$$ 10319525 10328822 10300342 10325470 10359438 10372514 10369119 10412012 10421749 10446210 10512218 10530848 10563698
4654A0563698M7153J7089Q8127J1635O4047j259O8201K2708O1881P672P5124L5127
$$ 10563698 10610851 10627940 10716067 10727702 10791749 10790490 10858691 10881399 10943280 10950952 11026076 11061203
4642A1061203P093J8913o894q12k7128n9544N503r215m1728q4149l8988r4144
$$ 11061203 11068296 11087209 11080315 11079503 11052375 10992831 10998334 10989119 10947391 10863242 10824254 10730110
4630A0730110m7048l6237o3808q6075n3700q0044n6087r6284o3530n4307j07432
$$ 10730110 10683062 10646825 10583017 10496942 10443242 10363198 10307111 10210827 10147297 10092990 9985558
4619I985558o2032m0400k6030o8088k1888n4442o0194m2351k9242m8122j019m2408
$$ 9985558 9923526 9883126 9857096 9789008 9767120 9712678 9652484 9610133 9580891 9532769 9531750 9489342
4607I489342J0535k7043l2058m5642J3394L1486k7868R81K3143l485J4827M0948
$$ 9489342 9499877 9472834 9440776 9395134 9408528 9440014 9412146 9413127 9436270 9432785 9447612 9488560
4595I488560K5169M0203P8105o119M6697N2127M3009M1237O154P0594K1533J28728
$$ 9488560 9513729 9553932 9632037 9625918 9672615 9724742 9767751 9808988 9815142 9885736 9907269 10035997
4583A0035997P569L2631K4922O5954K2936M4076L9233P0038k3414J28687J4787
$$ 10035997 10043566 10076197 10101119 10167073 10190009 10234085 10273318 10343356 10319942 10448629 10463416
4572A0463416J127R4709J11666O4825L3391O7578J02802J01071N4594J24960J13676
$$ 10463416 10464543 10559252 10670918 10735743 10769134 10836712 10939514 11040585 11095179 11220139 11333815
4561A1333815P1368J18339Q8493J11604P2809Q3789Q4707J10620j56M1668J02012
$$ 11333815 11405183 11523522 11612015 11723619 11796428 11880217 11964924 12075544 12075388 12117056 12219068
4550A2219068O8260k64Q1651M3398k4695Q9831m355R7101l9988Q0139L1348O1287
$$ 12219068 12287328 12287064 12368715 12412113 12387418 12477249 12472894 12569995 12530007 12610146 12641494 12702781
4538A2702781K0378K1855M9162O7331L4572M9618K7473N0057J1453P5959K1606
$$ 12702781 12723159 12745014 12794176 12861507 12896079 12945697 12973170 13023227 13034680 13110639 13132245
4527A3132245J9333O72K6280j640L592k1859K3622m6781K4994o311j6785N2590
$$ 13132245 13151578 13152250 13178530 13176890 13180482 13158623 13182245 13135464 13160458 13154147 13137362 13189952
4515A3189952L073M1227Q209j2336M3231L4912L7837L9726O2195K2724L6474M8595
$$ 13189952 13193025 13234252 13242461 13230125 13273356 13308268 13346105 13385831 13448026 13470750 13507224 13555819
4503A3555819N2063L9750o293O2047j6588J3223J5216L1385J7160m451K0032N439
$$ 13555819 13607882 13647632 13641339 13703386 13686798 13700021 13715237 13746622 13763782 13759331 13779363 13784802
4491A3784802l6202J29044K5255K9948M0908J7035R6187Q5568P0093R2783N1610
$$ 13784802 13748600 13877644 13902899 13932847 13973755 13990790 14086977 14172545 14242638 14335421 14387031
4480A4387031J32173J08845M8980J29037P3079R9352J01503L2948M7019J07328
$$ 14387031 14519204 14628049 14677029 14806066 14879145 14978497 15080000 15112948 15159967 15267295
4470A5267295Q8978J30551Q3064J09883O8704J07672J66804J34745J10148J32117
$$ 15267295 15356273 15486824 15569888 15679771 15748475 15856147 16022951 16157696 16267844 16399961
4460A6399961J62750J30165J96648J65880J72255K08606K25000J56699K06624
$$ 16399961 16562711 16692876 16889524 17055404 17227659 17436265 17661265 17817964 18024588
4451A8024588K47822J79575K13468K15706K07168K18695J76663K05635K03892
$$ 18024588 18272410 18451985 18665453 18881159 19088327 19307022 19483685 19689320 19893212
4442A9893212J75259J74935K35057J75856J81472J95108J38983K19151J76880
$$ 19893212 20068471 20243406 20478463 20654319 20835791 21030899 21169882 21389033 21565913
4433B1565913K40149J32056K43691J74578K39217J77398K34120J82901K74268
$$ 21565913 21806062 21938118 22181809 22356387 22595604 22773002 23007122 23190023 23464291
4424B3464291K48311K10161K90991K21293K52747K93840K77499K83736K97552
$$ 23464291 23712602 23922763 24213754 24435047 24687794 24981634 25259133 25542869 25840421
4415B5840421K90080L43823L44143K46818M01710L28153L87016L64530M25423
$$ 25840421 26130501 26474324 26818467 27065285 27466995 27795148 28182164 28546694 28972117
4406B8972117L75649M36387M36694M58018M96077N01100N25122M97835O12236
$$ 28972117 29347766 29784153 30220847 30678865 31174942 31676042 32201164 32698999 33311235
4397C3311235N42181N84637N53550O08737O03172O08414O11740O87074O53606
$$ 33311235 33853416 34438053 34991603 35600340 36203512 36811926 37423666 38110740 38764346
4388C8764346O44762P26029P37514P27151P90860P93633Q87079Q75529Q88617
$$ 38764346 39409108 40135137 40872651 41599802 42390662 43184295 44071374 44946903 45835520
4379D5835520R61730J004620J084114J108533J089554J236509J277875J280744
$$ 45835520 46797250 47801870 48885984 49994517 51084071 52320580 53598455 54879199
4371E4879199J380225J352022J411125J453808J441660J540986J432141J544788
$$ 54879199 56259424 57611446 59022571 60476379 61918039 63459025 64891166 66435954
4363F6435954J515519J519665J519977J575553J503269J607019J611482J671461
$$ 66435954 67951473 69471138 70991115 72566668 74069937 75676956 77288438 78959899
4355G8959899J784709J784093J902684K004068K236938K380403K560489K833851
$$ 78959899 80744608 82528701 84431385 86435453 88672391 91052794 93613283 96447134
4347I6447134L098538L441091L863001M157738M662164N152444N695867O351857
$$ 96447134 99545672 102986763 106849764 111007502 115669666 120822110 126517977 132869834
4339A32869834O998589P722123Q519115R331511J0213108J1182330J2057512J2785982
$$ 132869834 139868423 147590546 156109661 165441172 175654280 186836610 198894122 211680104
4331B11680104J3469972J3824108J3991894J3592231J2900447J1497535R498925
$$ 211680104 225150076 238974184 252966078 266558309 279458756 290956291 300455216
4324C00455216O850062L940786Q53969k038080m618215o858241q680663r991129
$$ 300455216 307305278 311246064 312100033 310061953 305443738 298585497 289904834 279913705
4316B79913705j0893726j1290510j1315614j1117676j0750871j0226904r593639
$$ 279913705 269019979 257729469 246413855 235296179 224545308 214318404 204724765
4309B04724765q865315q091312p429368o682525o149098n596568n187838m746466
$$ 204724765 195859450 187768138 180338770 173656245 167507147 161910579 156722741 151976275
4301A51976275m462047m193890l966979l790140l743694l621986l533594l527928
$$ 151976275 147514228 143320338 139353359 135563219 131819525 128197539 124663945 121136017
4293A21136017l468658l404331l373171l304451l243166l131981l050226k976397
$$ 121136017 117667359 114263028 110889857 107585406 104342240 101210259 98160033 95183636
4285I5183636k869729k720176k571885k472340k327057k195916k066350j910700
$$ 95183636 92313907 89593731 87021846 84549506 82222449 80026533 77960183 76049483
4277G6049483j856366j674549j626831j499496j376172j356718j282647j158134
$$ 76049483 74193117 72518568 70891737 69392241 68016069 66659351 65376704 64218570
4269F4218570j225920j087104j042128j013381j029287r43562q70854q74525q37898
$$ 64218570 62992650 61905546 60863418 59850037 58820750 57877188 57006334 56131809 55293911
4260E5293911q10013p51701p40417o62688p09312o11462n88757n83728n56880
$$ 55293911 54483898 53732197 52991780 52329092 51619780 51008318 50419561 49835833 49278953
4251D9278953n11913n36634m71663m82258m40214m51974l38913m47030l46055
$$ 49278953 48767040 48230406 47758743 47276485 46836271 46384297 46045384 45598354 45252299
4242D5252299m14145l55502l74566l84059l91311l81790l82516m12795l52271
$$ 45252299 44838154 44482652 44108086 43724027 43332716 42950926 42568410 42155615 41803344
4233D1803344m28305m20566l74385m05474l83631l79948l78474m11264m12854
$$ 41803344 41375039 40954473 40580088 40174614 39790983 39411035 39032561 38621297 38208443
4224C8208443m11378l97088l70271m18856m03653l70150l58270l57016l65851
$$ 38208443 37797065 37399977 37029706 36610850 36207197 35837047 35478777 35121761 34755910
4215C4755910l39044k68252l15823k88340l23951k86681k53460k98073k74775
$$ 34755910 34416866 34148614 33832791 33544451 33220500 32933819 32680359 32382286 32107511
4206C2107511l06191k21025k83171k62203k42751k20830k06453j29634j81201
$$ 32107511 31801320 31580295 31297124 31034921 30792170 30571340 30364887 30235253 30054052
4197C0054052j55314j50247j34124j57409j32960q9919j32030r8175m5921q6847
$$ 30054052 29898738 29748491 29614367 29456958 29323998 29234079 29102049 29003874 28957953 28871106
4187B8871106j02909l7916p3404j25221p4375p4268j06938j47884j13084j44908
$$ 28871106 28768197 28730281 28656877 28531656 28457281 28383013 28276075 28128191 28015107 27870199
4177B7870199j45635j56272j88930k25754j74896k08590k15417j60526k12172
$$ 27870199 27724564 27568292 27379362 27153608 26978712 26770122 26554705 26394179 26182007
4168B6182007j91284k16190j38970k16260j36466j84145j72281j50864j75559
$$ 26182007 25990723 25774533 25635563 25419303 25282837 25098692 24926411 24775547 24599988
4159B4599988r3347j20805j21675j61055j67863j39666j58255j80830k28029k13109
$$ 24599988 24506641 24385836 24264161 24103106 23935243 23795577 23637322 23456492 23228463 23015354
4149B3015354j71123k77124k25326k87174k87032j92632l11634k61158k12305
$$ 23015354 22844231 22567107 22341781 22054607 21767575 21574943 21263309 21002151 20789846
4140B0789846j89406l06595j89222j57078k09946j38690j68290j35440j36853
$$ 20789846 20600440 20293845 20104623 19947545 19737599 19598909 19430619 19295179 19158326
4131A9158326o4758j12668q2894n2164l9828o2611k5492p2159j1525k9006n2913
$$ 19158326 19093568 18980900 18898006 18845842 18806014 18743403 18717911 18645752 18634227 18605221 18552308
4120A8552308K1m4919K1708k3171m6166k041j9998L6415K0254M2952P7065N8037
$$ 18552308 18552329 18507410 18529118 18505947 18459781 18457740 18437742 18474157 18494411 18537363 18614428 18672465
4108A8672465R7563J55252J21706J79164J38603J85462K08555J68930K40161J93751
$$ 18672465 18770028 18925280 19046986 19226150 19364753 19550215 19758770 19927700 20167861 20361612
4098B0361612K23745K44529K61476K74510K72228L20730L28725K36958L73584
$$ 20361612 20585357 20829886 21091362 21365872 21638100 21958830 22287555 22524513 22898097
4089B2898097K74631K63541K43962K26489K54024K55931K05299K74124K25873
$$ 22898097 23172728 23436269 23680231 23906720 24160744 24416675 24621974 24896098 25121971
4080B5121971K91968K54181K95911L11367L51446L46161M03789M34194M28751
$$ 25121971 25413939 25668120 25964031 26275398 26626844 26973005 27376794 27810988 28239739
4071B8239739O08420N43568O39640O83750P32283Q46402Q39961R49979R28354
$$ 28239739 28848159 29391727 30031367 30715117 31447400 32293802 33133763 34083742 35012096
4062C5012096J067745J129996J162446J261615J346763J361146J448702J603514
$$ 35012096 36079841 37209837 38372283 39633898 40980661 42341807 43790509 45394023
4054D5394023J552288J669878J590775J644068J629458J555946J527356J456752
$$ 45394023 46946311 48616189 50206964 51851032 53480490 55036436 56563792 58020544
4046E8020544J399196J354160J377942J321109J399483J490719J563117J699243
$$ 58020544 59419740 60773900 62151842 63472951 64872434 66363153 67926270 69625513
4038F9625513J886121K079986K438842K646637K922816L257427L561618L833011
$$ 69625513 71511634 73591620 76030462 78677099 81599915 84857342 88418960 92251971
4030I2251971M016216M166294M184619M088433L877137L422956K787606J904257
$$ 92251971 96268187 100434481 104619100 108707533 112584670 116007626 118795232 120699489
4022A20699489J105154K99499l22926o98306r87205j115230j094608q02016n13647
$$ 120699489 121804643 122104142 121781216 121082910 120095705 118980475 117885867 117083851 116570204
4013A16570204o9231M32817P34337J192272J477002J754618J961702K058922K044097
$$ 116570204 116500973 116933790 117668127 118860399 120337401 122092019 124053721 126112643 128156740
4004A28156740J847441J474976R59893N08497q773o31874j219119j783975k384569
$$ 128156740 130004181 131479157 132439050 132947547 132938774 132306900 131087781 129303806 126919237
3995A26919237k765794l052801l098907l110536l034329k876504k627897k239490
$$ 126919237 124153443 121100642 118001735 114891199 111856870 108980366 106352469 104112979
3987A04112979j907001j677422j466216j345305j360820j356315j533687j692906
$$ 104112979 102205978 100528556 99062340 97717035 96356215 94999900 93466213 91773307
3979I1773307k018058k270566k608381k910748l140126l306335l422600l503961
$$ 91773307 89755249 87484683 84876302 81965554 78825428 75519093 72096493 68592532
3971F8592532l406074l362770l283717k974080k854109k630736k449260k206011
$$ 68592532 65186458 61823688 58539971 55565891 52711782 50081046 47631786 45425775
3963D5425775j960866j819170j624292j470798j384779j237343j214337j154851
$$ 45425775 43464909 41645739 40021447 38550649 37165870 35928527 34714190 33559339
3955C3559339j116492j045588j075185j037988r99586r73151r78442q58314r45490
$$ 33559339 32442847 31397259 30322074 29284086 28284500 27311349 26332907 25474593 24529103
3946B4529103q72929q31617p42147p61344o82573o92737n74648o13863n42736
$$ 24529103 23656174 22824557 22082410 21321066 20638493 19945756 19371108 18757245 18214509
3937A8214509n37815m58720m14662m18202l64689l20929k43278k95933j94933
$$ 18214509 17676694 17217974 16803312 16385110 16020421 15699492 15456214 15160281 14965348
3928A4965348k51328k14125k37029j63741k46009j80341k22955k39049k50802
$$ 14965348 14714020 14499895 14262866 14099125 13853116 13672775 13449820 13210771 12959969
3919A2959969k33092k41816l36627k52011k96578k49512k82584k49436k92988
$$ 12959969 12726877 12485061 12148434 11896423 11599845 11350333 11067749 10818313 10525325
3910A0525325k38949k21369k33072j74804j74275j94752r7709j43410n9566j16956
$$ 10525325 10286376 10065007 9831935 9657131 9482856 9288104 9190395 9046985 8987419 8870463
3900H870463j28577p3183j42167j67519j19634j38899j43163j58814j51813j57568
$$ 8870463 8741886 8668703 8526536 8359017 8239383 8100484 7957321 7798507 7646694 7489126
3890G489126j48160j89198j65081j46549j55499j77013j77729j49792j32619j15280
$$ 7489126 7340966 7151768 6986687 6840138 6684639 6507626 6329897 6180105 6047486 5932206
3880E932206j15904j56186j51496j01260o1337q1058j22558n9754j05494l0874
$$ 5932206 5816302 5660116 5508620 5407360 5346023 5264965 5142407 5082653 4977159 4946285
3870D946285j09558n0329j26092K3356p4105n3807m4713l2856l6605m5006o4491
$$ 4946285 4836727 4786398 4660306 4683662 4609557 4555750 4511037 4478181 4441576 4396570 4332079
3859D332079m1615l0837J6264l4203j5213l1994k3715j985m3509l1877p250k329
$$ 4332079 4290464 4259627 4275891 4241688 4226475 4194481 4170766 4168781 4125272 4093395 4086145 4083816
3847D083816l3832J6619k5795j3808k3298J2214R210m9157P673m4184m5777K3152
$$ 4083816 4049984 4066603 4040808 4027000 4003702 4015916 4025126 3975969 3983642 3939458 3893681 3916833
3835C916833k8641m0190k4371J330l2385n8082L189l2052O940l6972k5438K8202
$$ 3916833 3888192 3848002 3823631 3824961 3792576 3734494 3737683 3705631 3712571 3675599 3650161 3678363
3823C678363l3831j0849m8277l6849j3326O412k5676K9223l3574j1153n649k299
$$ 3678363 3644532 3633683 3585406 3548557 3535231 3541643 3515967 3545190 3511616 3500463 3494814 3492515
3811C492515m2770k950p763J2420l9146K9891r2708K3880j9605l4090l3031J3319
$$ 3492515 3449745 3446795 3439032 3451452 3412306 3442197 3349489 3373369 3353764 3319674 3286643 3299962
3799C299962m0223k9040J7139k8065l153o615j1615j0186r800k1440n257p343
$$ 3299962 3259739 3230699 3247838 3219773 3216620 3210005 3198390 3188204 3178404 3156964 3151707 3144364
3787C144364j333l2866L3186j2933k194J2636l6433N2359p181K1315m9340L4552
$$ 3144364 3143031 3110165 3143351 3130418 3128224 3140860 3104427 3156786 3149605 3170920 3121580 3156132
3775C156132l4334K2649r258n4858O854j9788m9302l1886L3684K142j8300k5202
$$ 3156132 3121798 3144447 3135189 3080331 3087185 3067397 3018095 2986209 3019893 3022035 3003735 2978533
3763B978533m922m0503L3471N976Q351l7604m152L4471R941j26p173k3743m8195
$$ 2978533 2973611 2933108 2966579 2972555 2980906 2943302 2939150 2973621 2983562 2983436 2976263 2952520 2904325
3750B904325K7940p7665L0423m5240k2900k0560m9390r053j0250k9059m7513R194
$$ 2904325 2932265 2854600 2885023 2839783 2816883 2796323 2746933 2737880 2727630 2698571 2651058 2660252
3738B660252j803n1933k8965R554k1436M404k9132O135l1474o8743j9049l0822
$$ 2660252 2658449 2606516 2577551 2587105 2565669 2570073 2540941 2547076 2515602 2446859 2427810 2396988
3726B396988n090p8614o909p1677n924l8906j8880k9273l9217l2180J7324n4136
$$ 2396988 2391898 2313284 2306375 2234698 2228774 2189868 2170988 2141715 2102498 2070318 2087642 2033506
3714B033506J0348n1947L4650n5283j5717j0871L8073m1779k0776j3706k9433
$$ 2033506 2043854 1991907 2026557 1971274 1955557 1944686 1982759 1940980 1920204 1906498 1877065
3703A877065j9302O4770r557k8883J5647l6864j8475k9172n060r697k4689Q5J6284
$$ 1877065 1857763 1922533 1912976 1884093 1899740 1862876 1844401 1815229 1810169 1800472 1775783 1775868 1792152
3690A792152l0172k8232K7390l4124o8486L0953l0365J1620k1361j3904O517l6774
$$ 1792152 1761980 1733748 1761138 1727014 1658528 1689481 1659116 1670736 1649375 1635471 1641988 1605214
3678A605214k9985j6668J9948l7305k1024N3672p1878J7549k9924j2499k5304
$$ 1605214 1575229 1558561 1578509 1541204 1520180 1573852 1501974 1519523 1489599 1477100 1451796
3667A451796j3645j0256j7656J3597k9562M2813n4931L304J4041k5192j3755K7682
$$ 1451796 1438151 1427895 1410239 1423836 1394274 1437087 1382156 1385460 1399501 1374309 1360554 1388236
3655A388236j6303k116N66J6690l2740k4383L8688m2980J9175r149N320k9065
$$ 1388236 1371933 1369817 1370383 1387073 1354333 1329950 1368638 1325658 1344833 1335684 1341004 1311939
3643A311939O07n0409K0619m962l1351L8024p5701K9226m9126R961m46j8680l8012
$$ 1311939 1312546 1262137 1282756 1277794 1246443 1284467 1208766 1237992 1188866 1198827 1198381 1179701 1141689
3630A141689m3168M8150m7365j4799M5422l4896p3307J0747j8237q732r739n2752
$$ 1141689 1098521 1146671 1099306 1084507 1129929 1095033 1021726 1032473 1014236 1005504 995765 943013
3618I43013M0049J9903n4392j2405j13M189q399M367k1662j9905P412l7006k5962
$$ 943013 983062 1002965 948573 936168 936055 940244 931845 936212 914550 894645 902057 865051 839089
3605H39089L0332k4495Q522M099k0824o839J0784l0078P103r946q305N654K5203
$$ 839089 869421 844926 853448 857547 836723 829884 840668 810590 817693 807747 799442 805096 830299
3592H30299o7752J9224q795M531l4491j2093m5953L7398l5296O152j3372j4739
$$ 830299 762547 781771 772976 777507 743016 730923 684970 722368 687072 693224 679852 665113
3580F65113j3862K5759k6189k4584M0151m0407l888N177l2000J5904K9855l3166
$$ 665113 651251 677010 650821 626237 666388 625981 622093 627270 595270 611174 641029 607863
3568F07863J6274k3867L058L142J5201l5004K6857K9804o5097O464K4295k7543
$$ 607863 624137 600270 603328 606470 621671 586667 613524 643328 578231 584695 608990 581447
3556E81447j4131J5825j5403j6155n190P907l8399o0705N4395m3073K5773J4485
$$ 581447 567316 583141 567738 551583 546393 554300 515901 455196 509591 466518 492291 506776
3544E06776l9443Q33o292J9409m5986K8486j3599j4043j0780Q93O195l1229r86
$$ 506776 467333 468166 461874 481283 435297 463783 450184 436141 425361 426254 432449 401220 400234
3531D00234K9966J2679l1868r020O426J8742L661n0897J9829R274m2230p6M687
$$ 400234 430200 442879 411011 401991 408417 427159 430820 379923 399752 409026 366796 366720 371407
3518C71407j7977J6264j7231J7175o463J7252l0420J9745L4665m7540N472l9456
$$ 371407 353430 369694 352463 369638 363175 380427 350007 369752 404417 356877 362349 322893
3506C22893L8782l0249J2107k7092P1383j6613M620l2763q285j0792m839j996
$$ 322893 361675 331426 343533 316441 387824 371211 375831 343068 334783 323991 319152 317156
3494C17156K3132J4015k0109l0529l0675M453J0894n276M6418l6428p311J8126
$$ 317156 340288 354303 334194 303665 272990 277443 288337 283061 329479 293051 285740 303866
3482C03866K311K257K474K0957n0309M113Q81J3001J1825j562m290l0915j7246
$$ 303866 306177 308434 310908 331865 281556 285669 286550 299551 311376 309814 305524 274609 257363
3469B57363L2421K6695l3796L3208n7200K420L1788j4721l591J8719K2533n4177
$$ 257363 289784 316479 282683 315891 258691 261111 292899 278178 274587 293306 315839 261662
3457B61662K3910J2646j5822K3594m356l7642K3060K8312k5442L8930k1362L929
$$ 261662 285572 298218 282396 305990 301634 263992 287052 315364 289922 328852 307490 311419
3445C11419j6126K631p183Q754K8767o7971J5610k3584k6183O6754k5776K9026
$$ 311419 295293 297924 290741 299495 328262 260291 275901 252317 226134 292888 267112 296138
3433B96138m3347P910q192L8463j8613j1118n734q201K7439J102k6319J8143p850
$$ 296138 252791 260701 252509 290972 272359 261241 255507 247306 274745 275847 249528 267671 259821
3420B59821j4484L5726l9240L4062K107k0203K6132j1249j1616J0019K5228j4942
$$ 259821 245337 281063 241823 275885 277992 257789 283921 272672 261056 271075 296303 281361
3408B81361R734J711j6178q790J1987j9331M9044l643K1188J958J6810m0752L0256
$$ 281361 291095 292806 276628 267838 279825 260494 309538 305895 327083 329041 345851 305099 335355
3395C35355J2398r675j1813l106K8606k4853M583k4263J4619L3896l1195j2975
$$ 335355 347753 338078 326265 323159 351765 326912 331495 307232 321851 355747 324552 311577
3383C11577M9472j6716j9730L1783L7283l4496R069K3175k7464L6139J4905J8317
$$ 311577 361049 344333 324603 356386 393669 359173 368242 391417 363953 400092 414997 433314
3371D33314J5684K6995j5392L0528M844o739J677O8877L8514j5207k052j8802
$$ 433314 448998 475993 460601 491129 495973 489234 490911 559788 598302 583095 581043 562241
3359E62241L6775k211J1476L3154J0225K4992J6540L0396m600L1720R8343R7099
$$ 562241 599016 596805 608281 641435 651660 676652 693192 723588 718988 750708 849051 946150
3347I46150R2924Q8081P0322J83699K09910J62987K49844K19380K49674L18459
$$ 946150 1039074 1127155 1197477 1381176 1591086 1754073 2003917 2223297 2472971 2791430
3337B791430M49301P28899O82558N68173P07805R43610J324449J190673J056830
$$ 2791430 3240731 3969630 4652188 5220361 5928166 6871776 8196225 9386898 10443728
3328A0443728R89919L0033j70438k52296m22500n53030r20708j062259r51610
$$ 10443728 11433647 11463680 11293242 11040946 10618446 10065416 9144708 8082449 7130839
3319G130839q35377q06668n95045p00161o93964n09430m31009l03989k92794k24502
$$ 7130839 6295462 5488794 4893749 4193588 3499624 2990194 2559185 2255196 1962402 1737900
3309A737900k25597j89186j03042r5410j58789p8189m6679q4255n3530q6836j0636
$$ 1737900 1512303 1323117 1220075 1124665 965876 887687 841008 756753 703223 616387 605751
3298F05751o6995k27o8784l5791K7923p7149m1754K1940m9083K8081l166n5778
$$ 605751 538756 538529 469745 433954 461877 384728 342974 364914 315831 343912 340746 284968
3286B84968K6513k1237q942L360j4010k2353j2238k323J4981l2207M4966j5195
$$ 284968 311481 290244 281302 284662 270652 248299 236061 233738 248719 216512 261478 246283
3274B46283l732k4688R789Q215j7756j8002K2697J339k1599l177r370R79P978
$$ 246283 242551 217863 227652 235867 218111 200109 222806 224145 202546 199369 189999 190978 198956
3261A98956K9440m4471l15k3243K4626r261k0946m3116L6464p865L1506k4016
$$ 198956 228396 183925 183610 160367 184993 175732 154786 111670 148134 140269 171775 147759
3249A47759J5652J5994j9688j2982J3908l4658n081M4375O695Q978k7502m78N506
$$ 147759 163411 179405 159717 146735 160643 125985 120904 165279 171974 180952 153450 152972 158478
3236A58478J5188q166K2367m3247k4022J0773J8274k3924j6319K8241l0841J0023
$$ 158478 173666 165500 187867 144620 120598 131371 149645 125721 109402 137643 106802 116825
3224A16825k8883O3668k4473m034r58J1832J4650j5542q37m3477J198l7298J7833
$$ 116825 87942 151610 127137 123103 122145 133977 148627 133085 132248 88771 89969 52671 70504
3211G0504K1262J5428J3907p0205K2909j2852r067J8401k527l1930L1747k3395
$$ 70504 91766 107194 121101 50896 73805 60953 51886 70287 67760 35830 67577 44182
3199D4182L0764p346J2210n877p844j4548K5500q128L5189j4520j7457J5057J0633
$$ 44182 74946 67600 79810 73933 66089 51541 77041 68913 104102 89582 72125 87182 97815
3186I7815n0645N2439j6931J0958m9500M2844k2147l5198O0406K4738m1423L2768
$$ 97815 47170 99609 82678 93636 44136 86980 64833 29635 90041 114779 73356 106124
3174A06124J611p556k3250K7310j6714l265m3545Q1077k3493k3093K0840j9417
$$ 106124 107735 100179 76929 104239 87525 84260 40715 121792 98299 75206 96046 76629
3162G6629J0562n8135Q4263k0483o4486N3499J289J2672k841k6567J3473n032
$$ 76629 87191 29056 113319 92836 28350 81849 83138 95810 92969 66402 79875 74843
3150G4843K186R709m7404K0586J7926k1309m0112M6080P111k3625o778J5793n937
$$ 74843 77029 86738 39334 59920 77846 56537 16425 62505 69616 45991 39213 55006 49069
3137D9069J6783k2625J5801K6477k4670j7226L3263L18R840q297N265k8822K048
$$ 49069 65852 43227 59028 85505 60835 43609 76872 77190 87030 78733 83998 55176 57224
3124E7224j1460L7889p83j2766l7515M6933n6407J1974J513J0191j3205M0188
$$ 57224 45764 83653 82870 70104 32589 79522 23115 35089 36602 46793 33588 73776
3112G3776k6886M802M04L198j3662l29L1708M63q273j6947K1916j5190K9943k902
$$ 73776 46890 51692 52096 55294 41632 41303 73011 73474 65201 48254 70170 54980 84923 82021
3098H2021j5046J5794p12j4741P100J1411J4638J5913R935k8728P896J8354J5604
$$ 82021 66975 82769 82057 67316 74416 85827 100465 116378 126313 97585 105481 123835 139439
3085A39439o2479Q174P700k3336j9644j298O456k2539K4625o040k1171L441l023
$$ 139439 76960 85134 92834 69498 49854 48556 55012 32473 57098 51058 29887 33328 30305
3072C0305O613j5186N484P569j6310R054k006L0067l5047R826J263M363J1045
$$ 30305 36918 21732 27216 34785 18475 27529 25523 55590 20543 30369 31632 35995 47040
3059D7040n2077M5919n221p456j4757K8217k6528J1846K1307l0781N769K8377
$$ 47040 -5037 40882 35661 28205 13448 41665 15137 26983 48290 17509 23278 51655
3047E1655m3261J7591j4374O1124l5702J4070l8777K9351r786J4152M178P967
$$ 51655 8394 25985 11611 72735 37033 51103 12326 41677 31891 46043 50221 58188
3035E8188k8330j3413j1398L3134o653O878j910k3124M9178o8419K6126L2705
$$ 58188 29858 16445 5047 38181 31528 38406 36496 13372 62550 -5869 20257 52962
3023E2962l299k5422o218K1373k627j9710J8235l876j6527M3068q7659L3574K3400
$$ 52962 49663 24241 18023 39396 36769 17059 35294 31418 14891 57959 -29700 3874 27274
3010B7274k1387L2270j477k931M160l4714j51L2540Q18p827J6444j9211l8119
$$ 27274 5887 38157 36680 33749 37909 3195 3044 35584 36402 28575 45019 25808 -12311
2997a2311K5180J1141m608J1175L365m3338N222K8891l0892N3327k7297Q551q441
$$ -12311 12869 24010 19402 30577 33942 -9396 -4174 24717 -6175 47152 19855 28406 19965
2984A9965O890m5346M7307j1294k1125l086K8936l994r263J3222Q905l078k6152
$$ 19965 26855 -18491 28816 17522 -3603 -6689 22247 18253 8990 22212 31117 28039 1887
2971A887L7966l53k0849k4567m211J5987J9316J2277m0291L560N1793l2297l3327
$$ 1887 39853 39500 18651 -5916 -10127 5860 25176 37453 -2838 722 52515 20218 -13109
2958a3109K7253K2464p497j9500J617K9074M146j6692J5652m6587M3104n7354
$$ -13109 14144 36608 29111 9611 11228 40302 44448 27756 43408 -3179 39925 -17429
2946a7429L2849m8926L2246K7651k31J9424l4143j3307J8802l773R001o726j9258
$$ -17429 15420 -33506 -1260 26391 26160 45584 11441 -1866 16936 13163 22164 15438 -3820
2933c820l602J2919N877o931k695P595j4273J6896J90j651j5809J4374j4296P429
$$ -3820 -7422 5497 11374 4443 1748 9343 -4930 11966 12156 10505 -5304 9070 -5226 2203
2919B203L8590k4171n722r765L4974k8079M644R256j4850L1028n2907L4416O759
$$ 2203 40793 16622 10900 1135 36109 8030 12674 21930 7080 38108 -14799 19617 26376
2906B6376J6821n8727J5787l307K5287r386K4627k4524q293N888K4705m3922p761
$$ 26376 43197 -15530 257 -3050 22237 12851 37478 12954 4661 10549 35254 -8668 -16429
2893a6429K8403J3794k6002l6353L2829P784j0094k3723J6339K1002N891j4833
$$ -16429 11974 25768 -234 -36587 -3758 4026 -6068 -29791 -13452 7550 13441 -1392
2881a392J3639m0856K1868K1958J7928k5204R520k4095N651k9261M1651J9119
$$ -1392 12247 -28609 -6741 15217 33145 7941 17461 -6634 -983 -30244 11407 30526
2869C0526o3435Q365N3494j8383j5815K2980k1125J0021l1166M3306j4118r523
$$ 30526 -32909 -24544 28950 10567 -5248 17732 -3393 6628 -24538 18768 4650 -4873
2857d873l139k6144L4438k579l7468K4669L064M611Q710P702k7047J4544j9447
$$ -4873 -8012 -34156 282 -2297 -39765 -15096 -12032 -7421 1289 8991 -18056 -3512 -22959
2844b2959L5950M457j9184k8891P428j1798L1812J3410q588J1647R787l6981K7267
$$ -22959 12991 17448 -1736 -30627 -23199 -34997 -3185 10225 1637 13284 23071 -13910 13357
2831A3357j7713K5007o5531J7983K4592K6420j184j0306k4356N805j4277J4856
$$ 13357 -4356 20651 -44880 -26897 -2305 24115 22931 12625 -11731 -5926 -20203 -5347
2819e347J7402k4450L4392n240j6142J1113P191k4169j7684J185J7765O734k1657
$$ -5347 12055 -12395 21997 16757 615 11728 18919 -5250 -22934 -21749 -3984 2750 -18907
2806a8907K2436q471m466m68J7270J869l2750L1152j2297k2974L3388l8059J0611
$$ -18907 3529 -4942 -9408 -9876 7394 9263 -23487 7665 -4632 -27606 5782 -32277 -21666
2793b1666k5975L3990K8265n342m1402N2337l8875l5960M0914q433j737j0612
$$ -21666 -47641 -13651 14614 9272 -32130 20207 -18668 -54628 -13714 -22147 -23884 -34496
2781c4496r823P870j830K4652K8120P819l9020p273O887J707k506K0432j3176
$$ -34496 -44319 -36449 -38279 -13627 14493 22312 -16708 -23981 -17094 -15387 -17893 2539 -10637
2768a0637J7844j8304n367j5342J7344K1929j326P525l0665k7583L6995k2421
$$ -10637 7207 -11097 -16464 -31806 -14462 7467 6141 13666 -16999 -44582 -7587 -30008
2756c0008n906O517J8051J5736o32o735k8398L2289k3670K2261l993j9674J7095
$$ -30008 -35914 -29397 -11346 4390 3758 -2977 -31375 914 -22756 -495 -4488 -24162 -7067
2743g067M162K175k1600K6109l0593L2285l2122l461j788P584M8314n2749J4254
$$ -7067 -2905 -730 -22330 3779 -26814 5471 -26651 -30112 -31900 -24316 23998 -28751 -14497
2730a4497j9288j7264K1889L0417j9118M1927o7617R777M472L440M0523n0763
$$ -14497 -33785 -51049 -29160 1257 -17861 24066 -43551 -33774 -29302 -25862 14661 -36102
2718c6102j6819O3248l6243J1535J1362n072k9317K8175k5688q25J5661J6117
$$ -36102 -52921 10327 -25916 -14381 -3019 -8091 -37408 -9233 -34921 -35746 -20085 -3968
2706c968j3000N720J4975n2394P3001p0027K9113l0207L8350P434N122l2455r745
$$ -3968 -16968 -11248 3727 -48667 24334 -45693 -16580 -46787 -8437 -1003 4119 -28336 -38081
2693c8081R388P163k4858L7014o043k3097n173J3825L358K5984j4611j0853j9741
$$ -38081 -28693 -21530 -46388 -9374 -15417 -38514 -43687 -29862 -26504 -520 -15131 -25984 -45725
2680d5725Q143P459J4867J9970l0089M538O788J0349J0307j870n4289K5672p704
$$ -45725 -37582 -30123 -15256 4714 -25375 -20837 -14049 -3700 6607 4737 -49552 -23880 -31584
2667c1584p897j2539M1005q250m156K384J7231J7940n0078M6049k8757L483J663
$$ -31584 -39481 -52020 -11015 -19265 -23421 -21037 -3806 14134 -35944 10105 -18652 -15169 -13506
2654a3506J5805n235K3081m1557J6400l8998R244q334k1762N1558j4120q921K5785
$$ -13506 2299 -2936 20145 -21412 -5012 -44010 -34766 -43100 -64862 -13304 -27424 -36345 -10560
2641a0560k9631K2010Q918N415M681k3151m0193K3516J6830L1579j5161m2489
$$ -10560 -40191 -18181 -9263 -3848 833 -22318 -62511 -38995 -22165 9414 -5747 -48236
2629d8236J9897O8609l6206j2577P770k8672J6497k0108M0449J552m8991Q348
$$ -48236 -28339 40270 4064 -8513 -743 -29415 -12918 -33026 7423 8975 -40016 -31668
2617c1668L5343p7831M7139J8442j8996M9114o5063M5690j5309j6191K7042k3899
$$ -31668 3675 -74156 -27017 -8575 -27571 21543 -43520 2170 -13139 -29330 -2288 -26187
2605b6187P087l8923J0906L8825q836K9267l7276K0222j322j3412J0339j6725
$$ -26187 -19100 -58023 -47117 -8292 -17128 12139 -25137 -4915 -6237 -19649 -9310 -26035
2593b6035O989N289J4227k9593L575q941L5469j6666p352q884j8327M821L0786
$$ -26035 -19046 -13757 470 -29123 -25548 -34489 980 -15686 -23038 -31922 -50249 -45428 -14642
2580a4642R483q540l3156M0427l7087N3302l3449K9168n6136J4830N135L4858
$$ -14642 -5159 -13699 -46855 -6428 -43515 9787 -23662 5506 -50630 -35800 -30665 4193
2568D193n3224Q523j3168j8086J4634L3951k925N220j7966K1132l1619L2694R744
$$ 4193 -49031 -40508 -53676 -71762 -57128 -23177 -26102 -20882 -38848 -17716 -49335 -16641 -6897
$$ [...]
##END NTUPLES=NMR SPECTRUM
##END=
