##TITLE=abcd
##JCAMPDX= 6.0         $$ Bruker NMR JCAMP-DX V2.0
##DATA TYPE= NMR SPECTRUM
##DATA CLASS= NTUPLES
##ORIGIN= UXNMR, Bruker Analytische Messtechnik GmbH
##OWNER= root
$$ XWIN-NMR		Version 3.5
$$ Fri Oct 24 18:58:00 2025 Russian Standard Time (UT+4h)  servis@DPX200
##.OBSERVE FREQUENCY= 200.131235884673
##.OBSERVE NUCLEUS= ^1H
##.ACQUISITION MODE= SIMULTANEOUS
##.ACQUISITION SCHEME= undefined
##.AVERAGES= 23
##.DIGITISER RES= 18
##SPECTROMETER/DATA SYSTEM= spect
##.PULSE SEQUENCE= zg
##.SOLVENT NAME= CDCl3
##.SHIFT REFERENCE= (INTERNAL, CDCl3, 0, 16.4885)
##AUDIT TRAIL= $$ (NUMBER, WHEN, WHO, WHERE, WHAT)
$$ ##TITLE= Audit trail, XWIN-NMR		Version 3.5
$$ ##JCAMPDX= 5.01
$$ ##ORIGIN= Bruker BioSpin GmbH
$$ ##OWNER= servis
$$ F:\spectra/data/av/nmr/H1/1/pdata/1/auditp.txt
$$ ##AUDIT TRAIL=  $$ (NUMBER, WHEN, WHO, WHERE, WHAT)
(   1,<2025-10-24 18:57:29.14 +0400>,<servis>,<DPX200>,
      <created by zg, POWCHK disabled, PULCHK disabled
       terminated by command 'halt'
       configuration hash MD5:
       00 E9 B6 7A A2 85 ED C7 34 08 36 98 17 FE 4E 26
       data hash MD5: 32K
       97 4C 6F 69 D2 2D 26 E3 A3 F3 A8 D2 04 A8 93 44>)
(   2,<2025-10-24 18:57:30.95 +0400>,<servis>,<DPX200>,
      <Start of raw data processing
       efp BC_mod = 2 LB = 0.05 FT_mod = 6 PKNL = 1 PHC0 = -268.1076 PHC1 = 6.501565 SI = 16K 
       data hash MD5: 16K
       73 38 CB 5A 65 F5 3F 16 88 92 1B 46 15 3E DC DC>)
$$ ##END=
$$ 
$$ hash MD5
$$ A5 42 F7 27 A6 C5 28 25 E2 21 96 98 5D 62 03 80
##$RELAX= 
##$RELAX= 
##$RELAX= 
##$RELAX= 
##$RELAX= 
##$RELAX= 
##$RELAX= 
##$RELAX= 
$$ Bruker specific parameters
$$ --------------------------
##$DU= <F:\spectra>
##$EXPNO= 1
##$NAME= <H1>
##$PROCNO= 1
##$TYPE= <nmr>
##$USER= <av>
##$AMP= (0..31)
100 100 100 100 100 100 100 100 100 100 100 100 100 100 100 100 100 100 
100 100 100 100 100 100 100 100 100 100 100 100 100 100 
##$AQSEQ= 0
##$AQ_mod= 1
##$AUNM= <au_zg>
##$AUTOPOS= <>
##$BF1= 200.13
##$BF2= 200.13
##$BF3= 200.13
##$BF4= 200.13
##$BF5= 500.13
##$BF6= 500.13
##$BF7= 500.13
##$BF8= 500.13
##$BYTORDA= 1
##$CFDGTYP= 0
##$CFRGTYP= 5
##$CHEMSTR= <none>
##$CNST= (0..31)
1 1 145 1 1 1 1 1 1 1 1 1 1 1 1 1 1 1 1 1 1 1 1 1 1 1 1 1 1 1 1 1 
##$CPDPRG= <>
##$CPDPRG1= <>
##$CPDPRG2= <>
##$CPDPRG3= <>
##$CPDPRG4= <mlev>
##$CPDPRG5= <mlev>
##$CPDPRG6= <mlev>
##$CPDPRG7= <mlev>
##$CPDPRG8= <mlev>
##$CPDPRGB= <>
##$CPDPRGT= <>
##$D= (0..31)
0 2 0 0 0 0 0 0 0 0.06 0 0 0 0 0 0 0.0002 0 0 0 0 0 0 0 0 0 0 0 0 0 0 
0 
##$DATE= 1761317848
##$DBL= (0..7)
120 120 120 120 120 120 120 120 
##$DBP= (0..7)
150 150 150 150 150 150 150 150 
##$DBP07= 0
##$DBPNAM0= <>
##$DBPNAM1= <>
##$DBPNAM2= <>
##$DBPNAM3= <>
##$DBPNAM4= <>
##$DBPNAM5= <>
##$DBPNAM6= <>
##$DBPNAM7= <>
##$DBPOAL= (0..7)
0.5 0.5 0.5 0.5 0.5 0.5 0.5 0.5 
##$DBPOFFS= (0..7)
0 0 0 0 0 0 0 0 
##$DE= 6
##$DECBNUC= <off>
##$DECIM= 32
##$DECNUC= <off>
##$DECSTAT= 4
##$DIGMOD= 1
##$DIGTYP= 9
##$DL= (0..7)
0 120 120 120 120 120 120 120 
##$DP= (0..7)
$$ [...]
##$SUBNAM4= <"">
##$SUBNAM5= <"">
##$SUBNAM6= <"">
##$SUBNAM7= <"">
##$SUBNAM8= <"">
##$SUBNAM9= <"">
##$SW= 20.6817932712277
##$SWIBOX= (0..15)
0 0 3 0 0 0 0 0 0 0 0 0 0 0 0 0 
##$SW_h= 4139.07284768212
##$TD= 32768
##$TD0= 1
##$TE= 0
##$TE2= 300
##$TE3= 300
##$TEG= 300
##$TL= (0..7)
0 120 120 120 120 120 120 120 
##$TP= (0..7)
150 150 150 150 150 150 150 150 
##$TP07= 0
##$TPNAME0= <>
##$TPNAME1= <>
##$TPNAME2= <>
##$TPNAME3= <>
##$TPNAME4= <>
##$TPNAME5= <>
##$TPNAME6= <>
##$TPNAME7= <>
##$TPOAL= (0..7)
0.5 0.5 0.5 0.5 0.5 0.5 0.5 0.5 
##$TPOFFS= (0..7)
0 0 0 0 0 0 0 0 
##$TUNHIN= 0
##$TUNHOUT= 0
##$TUNXOUT= 0
##$USERA1= <user>
##$USERA2= <user>
##$USERA3= <user>
##$USERA4= <user>
##$USERA5= <user>
##$V9= 5
##$VALIST= <valist>
##$VCLIST= <CCCCCCCCCCCCCCC>
##$VD= 0
##$VDLIST= <DDDDDDDDDDDDDDD>
##$VPLIST= <PPPPPPPPPPPPPPP>
##$VTLIST= <TTTTTTTTTTTTTTT>
##$WBST= 1024
##$WBSW= 30
##$XGAIN= (0..3)
0 0 0 0 
##$XL= 0
##$YL= 0
##$YMAX_a= 150883
##$YMIN_a= -97867
##$ZGOPTNS= <>
##$ZL1= 120
##$ZL2= 120
##$ZL3= 120
##$ZL4= 120
##$ABSF1= 0
##$ABSF2= 0
##$ABSG= 0
##$ABSL= 0
##$ALPHA= 0
##$AQORDER= 0
##$ASSFAC= 0
##$ASSFACI= 0
##$ASSFACX= 0
##$ASSWID= 0
##$AUNMP= <proc_1d>
##$AZFE= 0.1
##$AZFW= 0.1
##$BCFW= 0
##$BC_mod= 2
##$BYTORDP= 0
##$COROFFS= 0
##$CY= 18.4799938201904
##$DATMOD= 1
##$DC= 0
##$DFILT= <>
##$DTYPP= 0
##$F1P= 9.9274215381318
##$F2P= -0.165520771350173
##$FCOR= 1
##$FTSIZE= 16384
##$FT_mod= 6
##$GAMMA= 0
##$GB= 0
##$INTBC= 1
##$INTSCL= 4.127829e-11
##$ISEN= 128
##$LB= 0.05
##$LEV0= 0
##$LPBIN= 0
##$MAXI= 10000
##$MC2= 0
##$MEAN= 0
##$ME_mod= 0
##$MI= 50
##$NCOEF= 0
##$NC_proc= -8
##$NLEV= 6
##$NOISF1= 3.799351
##$NOISF2= 2.8
##$NSP= 0
##$NTH_PI= 0
##$NZP= 0
##$OFFSET= 16.48848
##$PC= 4
##$PHC0= -268.1076
##$PHC1= 6.501565
##$PH_mod= 1
##$PKNL= yes
##$PPARMOD= 0
##$PSCAL= 4
##$PSIGN= 0
##$REVERSE= no
##$SF= 200.130005582386
##$SI= 16384
##$SIGF1= 3
##$SIGF2= 2
##$SINO= 400
##$SIOLD= 16384
##$SREGLST= <1H.CDCl3>
##$SSB= 0
##$STSI= 16384
##$STSR= 0
##$SW_p= 4139.07284768211
##$SYMM= 0
##$S_DEV= 0
##$TDeff= 32768
##$TDoff= 0
##$TI= <>
##$TILT= no
##$TM1= 0
##$TM2= 0
##$TOPLEV= 0
##$USERP1= <user>
##$USERP2= <user>
##$USERP3= <user>
##$USERP4= <user>
##$USERP5= <user>
##$WDW= 1
##$XDIM= 16384
##$YMAX_p= 472793885
##$YMIN_p= -4145961
$$ End of Bruker specific parameters
$$ ---------------------------------
##NTUPLES= NMR SPECTRUM
##VAR_NAME=  FREQUENCY,     SPECTRUM/REAL,   SPECTRUM/IMAG
##SYMBOL=    X,             R,               I
##VAR_TYPE=  INDEPENDENT,   DEPENDENT,       DEPENDENT
##VAR_FORM=  AFFN,          ASDF,            ASDF
##VAR_DIM=   16384,         16384,           16384
##UNITS=     HZ,            ARBITRARY UNITS, ARBITRARY UNITS
##FACTOR=    0.252644378177508, 1,           1
##FIRST=     3299.83951724647, 0,            0
##LAST=      -839.233330435636, 0,           0
##MIN=       -839.233330435636, -4145961,    0
##MAX=       3299.83951724647, 472793885,    0
$$ Real data points
##PAGE= N=1
##DATA TABLE= (X++(R..R)), XYDATA
$$ [...]
8230b43757M93024L46334m67384o36l57539M93211o19175o70330P86378K03013
8220c6861M95932r03260L36506K9396O7580l84925N5807N59019r57363K62961
8210d75208q2719J37203j49019k53952K0933K13564k12232J151813k071555K068366
8200C47194j381653J85867Q90337o21273L07506q7563O3211Q69940j839077N69583
8190f95928q96663J717354n90925j2204K34650k99454M47681o2178k9903L38093
8180A50523n24080J87210P39028r38664K17107o03092K93098n4046P49505q08859
8170e92270k04716J258430j162911l93554L47503J97178M25908k97730q09638
8161a231800O87395k00669N19138j94384l05798O58931n98604O16380o84662K85482
$$ y = [-243757, 249267, 595601, 128217, 127581, -229958, 263253, -355922, -1026252, -239874, -36861, 459071, -444189, -107683, -78287, -10707, -395632, -339825, 219194, -738169, -475208, -557927, -420724, -569743, -823695, -802762, -589198, -801430, 350383, -1721172, 347194, -1034459, -848592, 41745, -579528, -272022, -359585, -296374, 573566, -1265511, -695928, -1592591, 124763, -466162, -478366, -243716, -543170, -95489, -157667, -187570, 150523, -373557, -186347, 552681, -385983, -168876, -771968, -478870, -532916, 216589, -592270, -796986, 461444, -701467, -1095021, -747518, -550340, -124432, -422162, -1231800, -544405, -745074, -225936, -420320, -726118, -67187, -665791, -49411, -734073, -448591]
8151d48591M22456r43345L62259N23176k0147q13596J117518l28426r2722l46861
8141e68279O39055k48992q6861k09129l2728L96558K54342n58546L55753L74665
8131C15838j058219l9166K65739O3389k55015M54619Q26566p33877l63458O08458
8121H4874m55678J24097k82136R99713k03142o28620q2444M47083l78306Q3380
8111b91179K53811l75723p5612J09538o0196J52797n9994J068184j166276l3026
8101d77676J87748r9436l14079J11650J42761l20721O53382O23783p32254j24742
8091c49584k67887P88597K495j062658Q22032m74628N01110l33552J24817L49619
8081A00361l0844K25632o90472J62659l36147M47306j19912l86811M61995J28862
$$ y = [-448591, -26135, -969480, -607221, -84045, -104192, -917788, 199730, -128696, -221418, -568279, 70776, -178216, -265077, -474206, -506934, -110376, 143966, -414580, -58827, 315838, -742381, -781547, -515808, -452419, -707434, -252815, 573751, -160126, -523584, 84874, -370804, -246707, -528843, 470870, 267728, -360892, -443336, 3747, -374559, -291179, -37368, -413091, -488703, -379165, -439361, -286564, -346558, 721626, -444650, -477676, -289928, -389364, -703443, -591793, -449032, -769753, -116371, 507412, -224842, -349584, -617471, 171126, 173621, -889037, -67005, -541633, -40523, -374075, -249258, 100361, 69517, 295149, -395323, -232664, -568811, -121505, -241417, -628228, -166233, -37371]
8071c7371j59330r4578k547l17765P1183k67535P42333J23374M5024L1933m9071
8060H5650k90839j69413j66037L5610K94701J38048R5875k67060n0080N85442
8050B91897p47549j57392L95707L02261k07513n90658J077624p40065J66988O75903
8040D67203J62614p66303R551m72384J267063j152540l22378P58791P70844q98254
8030a75793j38953K23271O58110j402699N74005r2079j83120N24968J93751j26632
8020E4829k33661j64050n10208O52750M2985j82888K18514k97076L17158m71577
8010e73224l15207K23931J56386O57036p97411O03640j58268q6132k64636J67758
8000c86127J4411N84052m70790J42803N15244q25725m30229R25385j00720j85833
$$ y = [-37371, -196701, -291279, -293826, -611591, -540408, -807943, -65610, 57764, 102788, 134721, 85650, -205189, -374602, -540639, -505029, -210328, -72280, 23595, -243465, -293545, 291897, -455652, -613044, -217337, 84924, -122589, -713247, 364377, -375688, -208700, 467203, 629817, -136486, -126935, -599319, 667744, -484796, -807174, -48383, 722461, -175793, -314746, -91475, 566635, -836064, -262059, -354138, -537258, -12290, 181461, 54829, -178832, -342882, -853090, -200340, -157355, -340243, -121729, -418805, -101647, -573224, -888431, -664500, -508114, 148922, -648489, -44849, -203117, -289249, -553885, -386127, -371716, 212336, -258454, -115651, 399593, -426132, -856361, 69024, -31696, -217529]
7990b17529O30406p60366k68035N31707l55857j55095L46175J26884P6593L45624
7980C00507N1099q56712M55706k01971L25456k80316K08713l34946k28577P02938
7970A41897n37616J09909M35068K52599q31816l94827R44481k74023o0441l21131
7960e35900L06787j88262Q9311M03189k74067j92271M69407p9607P01310j123337
7950d23440j88762P59752l51485L11708k32383r30864K01572M68290R14218o79820
7940a51214J26840o79580O18119M68437q80534K89832k35065j34241K69482J72049
7930a35875q4970K72408n93832N37189k92765N38531k35048J11660k23347o4423
7920a70472k52479k79757O19531p86249M77612j53441P5802N86220o33204N19265
$$ y = [-217529, 412877, -347489, -615524, -83817, -439674, -594769, -248594, -121710, -45117, 300507, 351606, -505106, -49400, -251371, 74085, -206231, 2482, -332464, -561041, 141897, -395719, -285810, 149258, 401857, -429959, -824786, 119695, -154328, -214769, -535900, -229113, -417375, -328064, 75125, -198942, -391213, 78194, -1413, 699897, -423440, -612202, 147550, -203935, 107773, -124610, -1055474, -853902, -385612, 528606, -151214, -24374, -703954, -85835, 382602, -497932, -208100, -443165, -577406, -307924, -135875, -220845, 51563, -542269, -5080, -297845, 240686, 5638, 117298, -106049, -170472, -422951, -702708, -83177, -869426, -391814, -545255, -469453, 116767, -516437, 2828]
7910B828k50120N4425j73428m251N8186j62554K61138O07027m83077J85600l02005
7899b06231k18476m3956K08611k27156L55615J54727J71269n89978M34804l71461
7889c32232O8345L41742k01339Q750l46936N27933k1691L78065p01664J88228
7879i0799l22038L79629l30435N28786m5080l25855l93011P70243k17025l19956
7869c65541N92542l51433j66539L37332k68094L34506L21110j470842L80006R46414
7859B89461k65680P6531J28883p42040L61351J30706k76494j24149K78328j55615
7849b98718l348601O267249k746479K65489n12991k7012J35245L25454K29791
7840B89427m56324K77436m79777l52137M53596o5718J11086n56024Q12508k29831
$$ y = [2828, -247292, -192867, -366295, -370546, -312360, -474914, -213776, 393251, -89826, 95774, -206231, -424707, -468663, -260052, -487208, -131593, 23134, 194403, -395575, 39229, -332232, -263887, 77855, -123484, -114734, -461670, 66263, 44572, 422637, -279027, -90799, -412837, -33208, -363643, 165143, 120063, -205792, -598803, 171440, -45585, -365541, 227001, -124432, -290971, 46361, -221733, 112773, 433883, -1036959, -656953, 289461, 23781, 100312, 229195, -512845, -151494, -20788, -297282, -421431, -143103, -298718, -3647319, 2619930, -126549, 138940, -374051, -401063, -265818, 59636, 289427, -166897, 110539, -369238, -721375, -267779, -333497, -222411, -778435, 34073, -195758]
7830a95758p3669l61261M18858j27330q6050k48474K22896K08681k12892j29758
7820e84757L04521r657j97343R1546O3582q307j79396K17301P7945M16351r07661
7809g15875k7284M50209n06920L51819O78667l29173j70005L87133o58489L25295
7799b14623j11131o8533k47989Q21308k00235N35105r60399J58057l31121L50869
7789b68692K14550M24653l50879m494l48236N0767j63226O03108q33666o5K09202
7778d66978j13874k64116L64713P77129n11856j88878L41899k77831n6890K71092
7768a25590j04687K0812n27095K74977R0473r5798J93977L02719L5856k8981o05269
7757e68606J050534q7831o07798J82299N6215p97760L73771J05548j51569N90256
$$ y = [-195758, -269427, -630688, -211830, -339160, -425210, -673684, -450788, -242107, -454999, -584757, -280236, -289893, -487236, -395690, -332108, -340415, -519811, -302510, -224565, 191786, -715875, -743159, -292950, -799870, -448051, 230616, -98557, -268562, 118571, -539918, -214623, -325754, -394287, -642276, 179032, -21203, 513902, -446497, -288440, -619561, -268692, -54142, 370511, 19632, 15138, -333098, -282331, -445557, 157551, -676115, -676180, -466978, -580852, -844968, -480255, 296874, -214982, -403860, -61961, -339792, -396682, -125590, -230277, -209465, -736560, -461583, -371110, -466908, -272931, 29788, 65644, 36663, -568606, 481928, 394097, -213701, -31402, 24813, -772947, -399176, -293628, -445197, 145059]
7747A45059m02683j86776J1512P23189L79179m50934J7511k99202J10185l90453
7737c43413o85885N46281j6943p2878J60207k14405L09252k56069K24314M51836
7727A02297L34774q3655q79695Q0244j79998N2284M71066q23828L87512M13106
7717a25893o46485J251727j065505l190P39554p55180K57215J63143N97858p25593
7707c12349L71141j42769n32490N99888N3063K2692n55322O07481m5028J16951
7697A83258j35989j62833m42328J017655m17312R20067j007507M03151p38991
7688c80829M02078l15911j62265K31436L11865k15671j44126M33799J157J13945
7678B75478l48775j26853P73112q58776J80042K87182k84502N28249n22417K86746
$$ y = [145059, -257624, -444400, -432888, 290301, 669480, 218546, 236057, -63145, 47040, -343413, -1029298, -483017, -499960, -572838, -412631, -627036, -317784, -573853, -349539, 102297, 437071, 353416, -526279, -446035, -626033, -573749, -102683, -926511, -538999, -125893, -772378, 479349, -586156, -589346, 150208, -604972, -347757, -184614, 413244, -312349, 58792, -83977, -616467, -16579, 36484, 59176, -496146, 111335, 66307, 183258, 47269, -115564, -557892, 459763, 42451, 962518, -44989, 358162, -380829, 21249, -294662, -456927, -225491, 86374, -129297, -273423, 160376, 161533, 275478, -73297, -200150, 572962, -285814, -105772, 181410, -103092, 425157, -97260, 189486]
7668A89486j10422M99545o26722J31903j22549L9935K4474l06918L72230q14333
7658g23371P19694L85938R1448j081072L48200N7516J76780K12605l52836M28486
7648B63388r82247R71897N1816j94819k56800J79431p78658R63938o87111L24202
7638a44963O07143n20372K76074m56156o38066k75488J103282n12318L76511m96913
7628f81266R27908m23508p88850O81238l95300O58339k79456L25511m51055j92657
7618f19096L63314l56134J266526j848372O92677O03225j022025K29648K36360
7609d53877N23951l40286l75190O18926K29910q01114P79352o14986J017151p13525
7599a29688K28390J242N33499r54900N98338m84989l0434j2794N94461k32174
$$ y = [189486, 79064, 578609, -48113, 83790, -38759, 1176, 25650, -281268, 90962, -723371, -3677, 382261, 473709, -607363, -259163, -201647, -24867, 187738, -165098, 263388, -718859, 253038, 304854, 110035, -146765, 32666, -745992, 217946, -469165, -144963, 462180, -58192, 217882, -238274, -876340, -1151828, -48546, -560864, -184353, -681266, 246642, -176866, -965716, -284478, -679778, -21439, -300895, 24616, -426439, -619096, -255782, -611916, 654610, -1193762, -501085, 102140, -919885, -690237, -453877, 70074, -270212, -645402, -26476, 203434, -597680, 181672, -433314, 583837, -129688, 98702, 99944, 633443, -321457, 276881, -208108, -238542, -251336, 343125, 110951]
7589A10951m50196j8160L95055n35551k67626M64122J44102l5584K53714m14527
7579c53700m450j9664N99162K0760k96305o93214M77027K9222m99447N47894l80453
7568e73168Q56062o42516P06367q62094J18399k8034Q64900K7764p08507J11798
7558a29029p2633p14683P85875K82453o43747J71278K06749j73682J75843n0428
7548a62004O0430l83495K5840M03927q62292J005559L53855m19040l00372P7220
7538b00372m51191O60188l66298j47504K59708k83669N27061k18013J92049J31087
7528A03046l03323L67952J42256p12654J80970P304k64854M31365j08695J15011
7518d1622k57713J66188N51696m87399k28891N95509J70320p94444O52357j65932
$$ y = [110951, -339245, -357405, 37650, -497901, -765527, -301405, -157303, -192887, 60827, -353700, -358150, -377814, 221348, 242108, -54197, -747411, -270384, -241162, -740609, -192715, -573168, 282894, -359622, 346745, -515349, -396950, -424984, 439916, 467680, -240827, -129029, -201662, -916345, -130470, 151983, -491764, -320486, -113737, -287419, -111576, -162004, -101574, -485069, -459229, -55302, -917594, 87965, 441820, 22780, -277592, -200372, -651563, 8625, -357673, -505177, -245469, -529138, -2077, -220090, -28041, 103046, -200277, 167675, 309931, -402723, -221753, -214449, -479303, -47938, -156633, -41622, -299335, -133147, 418549, -68850, -297741, 297768, 468088, -326356, 326001, 160069]
7508A60069j74100j77385L25416n6156K44402l93877p8852j3827M13944o64726
7498d15092Q29333M6542n70088K99448L00003p2669j04609l55473q3694o05695
7488g31994R54647N73536p77747R4520L57548o10092r5299m10044N35315k00267
7478c09877K03200m76430N29255N65397j62144k18166k89522J28119k98512Q32132
7468E03452j33285K56945L5319k47640n1924K23618l53272j00725k04212N26682
7458D54958l84741k9919k77636N96916P0016O1676r08731P93797k74288q2298
7448A9750o7127Q7961K26381K66077k41928k54425J20682O44990l43782o55724
7438a97145O64796r04126M59392m72388P68581K75873p17548N68887m63545K64785
$$ y = [160069, -14031, -191416, 134000, 77844, 322246, -71631, -150483, -164310, 249634, -415092, 414241, 460783, -109305, 190143, 490146, 417477, 312868, -42605, -126299, -731994, 222653, 796189, 18442, 112962, 470510, -139582, -234881, -644925, -109610, -309877, -106677, -583107, -53852, 511545, 349401, 131235, -158287, -30168, -328680, 503452, 370167, 627112, 662431, 414791, 362867, 586485, 233213, 132488, -71724, 454958, 70217, 40298, -237338, 359578, 429594, 491270, -417461, 376336, 102048, 19750, -47377, 40584, 266965, 533042, 291114, 36689, 157371, 802361, 458579, -197145, 467651, -436475, 22917, -449471, 319110, 594983, -122565, 446322, -17223, 247562]
7428B47562p19321M6057L92322J03849j76576o23055J101387l08424l12490q0147
7418c28836J59984O42810q76774O00705L00389n00929k17276k16866O52855o12028
7408c95966O3586K17989J15795m37836L04807j11600N69383k77308l629M61530
7398E06751p47175L9014O89281j63669m00498L61820o09306N31090j015332O92321
7388a15703J12496n3542K52434K66561L5589j31652j84622l28613O84752j75227
7378C62473n46841j54046L08661M1059l75706O39769n89053n5567P61802r15339
7368e22788K167M98419K26026p38481O42560l64644R18426j61101j260468L38276
7358d21608N49393j02729L46190K4759m68089L46858j7510J50376o42763L39422
$$ y = [247562, -471759, -425702, -33380, 70469, -106107, -729162, 372225, 63801, -248689, -328836, -168852, 473958, -402816, 197889, 498278, -2651, -219927, -436793, 216062, -395966, -332380, -114391, 1404, -436432, -131625, -243225, 326158, 48850, 45221, 506751, -240424, -201410, 487871, 324202, -76296, 285524, -323782, 207308, -808024, -115703, -3207, -56749, 195685, 462246, 497835, 366183, 181561, -147052, 537700, 362473, -184368, -338414, -29753, 11306, -364400, 275369, -313684, -369251, 392551, -522788, -520621, -22202, 203824, -534657, 107903, -256741, 661685, 500584, -759884, -421608, 127785, 25056, 371246, 396005, -72084, 274774, 257264, 407640, -235123, 104299]
7348A04299M5423n64444n5289l8718L53279P19924m36410n28045N71480J1244
7338A82743l79743M48116k83074O39222n21363k75379l88340M34966J54565j57853
7328a46140p0919k20755O31613j45108J11411n60152Q05338k98959k15091O04227
7318D95465k15123n4596p7391L2635o82831N05059J83234o71231R64693l20708
7308A59206l27957L48685p00155J381J77213m82658N26955l95467K35729j15624
7298e72692K88945N53381m38955O8675J9786J80600o57200N57170k60207K15845
7288d4652l00996N92523m39309J0502K97831m31636J38145M24465N1668J27010
7278D25551m12992L00677J66354n88572J83121l82079N7913M89557j22764K68370
$$ y = [104299, 149722, -414722, -470011, -508729, -155450, 564474, 128064, -399981, 171499, 182743, -197000, 251116, -31958, 607264, 85901, -189478, -577818, -142852, 11713, -146140, -217059, -437814, 193799, 48691, 160102, -400050, 405288, 106329, -108762, 495465, 280342, 225746, 148355, 180990, -501841, 3218, 186452, -484779, 479914, 159206, -168751, 179934, -520221, -518840, -341627, -824285, -297330, -692797, -457068, -572692, -283747, 269634, -169321, -100646, -80860, 99740, -557460, -290, -260497, -44652, -345648, 246875, -192434, -181932, 115899, -315737, -177592, 246873, 298541, 425551, 12559, 313236, 479590, -108982, 74139, -307940, -250027, 239530, 116766, 385136]
7268C85136q77310M62926l3465K86703k18268j59235K30136Q2442J91513n62478
7258b11900j40342Q04961r0638o2539o91246K71399k08918m05205N10551j83893
7248d07770J37920M2181K67981o26193J055780J36622p39247K73587k16824P94629
7238G18666r93422J083468p78699J96669K66869n19655o0280Q38509m30836J5942
7228C37231L30912m56047N57673k20429j00371m06440m83098P49577K20959k87469
7218B42498k56909J71745j96097P8376K92736j92022L5699L42755j46871N38704
7208I10614n55615k20193j37281K02439R57543l13956m59445O64721k34738O93960
7198A508049k32259r70334J49855l1937J32248m97726L25325K87683j24165O43362
$$ y = [385136, -492174, -29248, -62713, 223990, 5722, -153513, 76623, 159065, 350578, -211900, -352242, 452719, 362081, 299542, -391704, -120305, -329223, -734428, -223877, -407770, -269850, -227669, 40312, -585881, 469899, 606521, -132726, 140861, -75963, 718666, -274756, 808712, 30013, 226682, 493551, -26104, -86384, 752125, 321289, 337231, 668143, 212096, 769769, 549340, 448969, 42529, -440569, 309008, 529967, 242498, -14411, 157334, -38763, 39613, 332349, 140327, 176026, 518781, 371910, 910614, 354999, 134806, -2475, 199964, 1157507, 843551, 384106, 1048827, 814089, 1508049, 1275790, 305456, 455311, 423374, 555622, 57896, 383221, 670904, 546739, 1190101]
7188A190101l64967p93768O39074M56412j302843j4941J28929R83445l35212K25442
7178H11672q8495L05637L71710p64977j21835L60937k04033M12725K32158k99148
7168A016351p45426J016445k61021j94355O77155J62971l21499k84028L65192
7159A431785l10290N23999j35900m73820P46526p1629M4245m24008k90381J138356
7149B178883R3217p70599K55055j05437m35676J0494P98418k94745O4334N45588
7139B339532o30226j11343M28589l03236n5962N22869O29845j053924k29655M10942
7129A947431j17461m7820j42080J98676j012344M89456P10249j224656J09645
7120I11096M66542j43466k97726J35047K01479N0388l55235J72792j17722L78583
$$ y = [1190101, 825134, 31366, 670440, 1126852, -175991, -190932, -62003, 921442, 586230, 811672, 723177, 1028814, 1400524, 635547, 513712, 874649, 670616, 1083341, 1315499, 1016351, 270925, 1287370, 1026349, 831994, 1509149, 1672120, 1350621, 1066593, 1431785, 1121495, 1645494, 1509594, 1035774, 1782300, 1710671, 1754916, 1330908, 1040527, 2178883, 2272100, 1501501, 1756556, 1651119, 1215443, 1225937, 2024355, 1729610, 1793944, 2339532, 1709306, 1597963, 2026552, 1723316, 1667354, 2190223, 2820068, 1766144, 1536489, 1947431, 1829970, 1782150, 1640070, 1838746, 826402, 1315858, 2026107, 801451, 911096, 1377638, 1234172, 936446, 1071493, 1272972, 1323360, 968125, 1140917, 1023195, 1401778]
7110A401778J62071n28581J97732L50182M9623q11455n4156M57573L56258l51285
7100A229740l40326K05770J7891m29908L74804N16818J81419j192516N91402R8112
7090A253206m72774M38248j14971j17821k01810o1726L80509K18172l04497J08558
7080A125094K82064l90480n16019J038199O09282o95162R1142m51963M75362j14463
7070A453056j76726l6832K46703j48130K49937K76472o77951N80503N2382K60451
7060B079865m33640L79547M2605N90297m56888Q9883q7881j77486M64563k10954
7050B279911k4858l47029N87325k83043l92056R79018j54297j70632L51556l98458
7040B427437J37033J15545J33482k57009L11002o07459J080661l28133M52269
$$ y = [1401778, 1563849, 1035268, 1233000, 1583182, 1632805, 821350, 767194, 1224767, 1581025, 1229740, 889414, 1095184, 1113075, 683167, 1057971, 1574789, 1756208, 563692, 1155094, 1253206, 780432, 1218680, 1103709, 985888, 784078, 722352, 1102861, 1321033, 1016536, 1125094, 1407158, 1016678, 500659, 1538858, 2148140, 1452978, 1544120, 1092157, 1567519, 1453056, 1276330, 1239498, 1486201, 1338071, 1588008, 1864480, 1186529, 1767032, 1819414, 2079865, 1646225, 2025772, 2068377, 2658674, 2201786, 2291669, 2203788, 2026302, 2490865, 2279911, 2255053, 1908024, 2495349, 2212306, 1820250, 2799268, 2644971, 2474339, 2825895, 2427437, 2564470, 2680015, 2813497, 2556488, 2867490, 2260031, 3340692, 3012559, 3464828]
7031C464828j39138J17201m96620N38909j07848M17140J36176j12246j93184L62013
7021C987231O868n79417k02156J55162l74191L69979m17831j01673L90512L30653
7011C565137j286423J243200q00697J03275O1741n02130M8488j21230Q86257o20290
7001B577328m69252O25435m88900N15123m19385O38631L95156o93103K69807o27026
6991B323814Q17188k98221K16711J28790R4134N13402n34726j00720r2340L4370
6981C102402K21597k81790K40436m27057N79975p3245K78189k14419k55830j11104
6971C059154P40829l86096j2315K37173j98770J47970J95397M76027N5792l61522
6961C953639N68374K025j7334k76597N26374k31643M21224m85430m69327N40871
$$ y = [3464828, 3325690, 3442891, 2946271, 3485180, 3377332, 3794472, 3930648, 3818402, 3625218, 3987231, 3994099, 3414682, 3212526, 3367688, 2993497, 3363476, 2945645, 2843972, 3234484, 3565137, 2278714, 3521914, 2721217, 2824492, 2886233, 2384103, 2432591, 2311361, 3197618, 2577328, 2108076, 2733511, 2244611, 2759734, 2340349, 2978980, 3374136, 2681033, 2950840, 2323814, 3141002, 2842781, 3059492, 3188282, 3282416, 3795818, 3261092, 3160372, 3068032, 3102402, 3323999, 3042209, 3282645, 2855588, 3435563, 3362318, 3640507, 3426088, 3170258, 3059154, 3799983, 3413887, 3401572, 3638745, 3439975, 3587945, 3783342, 4259369, 4315161, 3953639, 4522013, 4524038, 4506704, 4230107, 4756481, 4524838, 4946062, 4460632, 3991305, 4532176]
6951D532176K87119k6341K61817O6136M51471m38307J58311r8208M75041j70802
6941E498413l27854j98802R71023k68430K52036J46797m45457P34787l1936J90195
6931F520772K10029O7349m38926J45950j81395O74042K62183K40119k74390L12826
6921G538559j01170M27013L85475n0175P45833m96280J52258N045M55928J54213
6911I216699J50784M79143M25299l18187J235120J15494j27792J94243l17004
6902A1053799J379334j4471N82021l17667M93368J062456N07481P1125L20054
6893A5137500R51125P89757Q78734R87689N31039J056584J235938J334284J715725
6884B4618375J382543J920039J654913J286806J847848J383054J075425P76607
$$ y = [4532176, 4819295, 4792954, 5054771, 5120907, 5572378, 5134071, 5292382, 5194174, 5669215, 5498413, 5170559, 4971757, 5942780, 5674350, 5926386, 6073183, 5627726, 6362513, 6330577, 6520772, 6730801, 6798150, 6359224, 6505174, 6323779, 6997821, 7260004, 7500123, 7225733, 7538559, 7437389, 7864402, 8249877, 8199702, 8945535, 8449255, 8601513, 8606558, 9062486, 9216699, 9367483, 9846626, 10271925, 9953738, 11188858, 11304352, 11176560, 11370803, 11053799, 12433133, 12418662, 13000683, 12683016, 13176384, 14238840, 14746321, 14817446, 15137500, 16088625, 16878382, 17757116, 18744805, 19275844, 20332428, 21568366, 22902650, 24618375, 26000918, 27920957, 29575870, 30862676, 32710524, 34093578, 35169003, 35945610]
6876C5945610J288022N65077K231492J69054J576091J150608J676946J440240
6868D6043140J727353J781057J646133K340968J376022K273876J630681J670115
6860F0489345K971132K075927K028038K617804J770615J862579K391230J487877
6852G7694547L075585L213464K505677K626075K738852M172795M329759M874106
6844A05230860N920661O404031O353640O315327O980184O111062O260443L785496
6836A53361704L048908N16761J103150r92969o64797N21609P90745J982309K156472
6827A61823892K744667L857666M451338N512027M819168L850048J491032J511138
6819A90060976p316j571637l915940m172873m902523n433893m699398m920058
$$ y = [35945610, 37233632, 37798709, 40030201, 40199255, 41775346, 42925954, 44602900, 46043140, 47770493, 49551550, 51197683, 53538651, 54914673, 57188549, 58819230, 60489345, 63460477, 65536404, 67564442, 70182246, 71952861, 73815440, 76206670, 77694547, 80770132, 83983596, 86489273, 89115348, 91854200, 96026995, 100356754, 105230860, 111151521, 117555552, 123909192, 130224519, 137204703, 143315765, 149576208, 153361704, 156410612, 156927373, 158030523, 157037554, 156372757, 156894366, 157685111, 159667420, 161823892, 164568559, 168426225, 172877563, 178389590, 183208758, 187058806, 188549838, 190060976, 190053660, 188482023, 184566083, 180393210, 175490687, 170056794, 165357396, 160437338]
6811A60437338l769227k150665j527346l79830J314702J850056L607380M092329
6803A63474737M829302M438448M623744L978287K586081R28370K54912j973432
6795A83140449k492462l591840l001428m903895l008891l092487j284517j095784
6787A60669145p36372N11608n15095Q60051o33224M16295j647033m569119m126369
6778A50229887n362792n815497n163179n710963o116714o169606n316008n149119
6770A05426009l983633l416378m156488l114798l119049l642208l064709l158958
6762G7769788k373753l521282k149173k322486l199721k881043l112089j977754
6754E6232487j935157k418564k092385k430469l009185k254450k454884k257015
$$ y = [160437338, 156668111, 154517446, 152990100, 152610270, 153924972, 155775028, 159382408, 163474737, 168304039, 172742487, 177366231, 181344518, 183930599, 184858969, 185113881, 183140449, 180647987, 177056147, 174054719, 169150824, 166141933, 163049446, 161764929, 160669145, 159932773, 160444381, 159929286, 160789337, 160156113, 160572408, 158925375, 154356256, 150229887, 144867095, 139051598, 133888419, 128177456, 122060742, 115891136, 110575128, 105426009, 101442376, 98025998, 93869510, 90754712, 87635663, 83993455, 80928746, 77769788, 75396035, 71874753, 69725580, 67403094, 64203373, 61322330, 58210241, 56232487, 54297330, 51878766, 49786381, 47355912, 44346727, 42092277, 39637393, 37380378]
6746C7380378k093094k912042k036342k131800q51979j768752j498754j371250
6738B2716365j198288j642832j094861q04755r16102p44740q65260l44764j156115
6729A3948648m444o31170r1675p65102j366513M20375m61322j27884n4045p24296
6719A0142572m08828k21004n08068n3991q96244N40382q0284j6525k42298q0756
6709H174956K54152j009365l52071R79841j489402Q76983J47385q66998J33353
6700F848834k83664N0608J07578n36444O6839p8535J11120k34567n87437N65563
6690F029895o96949N73079m34463m42092Q42235l25956K00373l22691j61408K94715
6680E556738k20343m62165N85500r95270Q3195l5566j5622r9478k12700Q8129
$$ y = [37380378, 35287284, 32375242, 30338900, 28207100, 27355121, 25586369, 24087615, 22716365, 21518077, 19875245, 18780384, 17975629, 17059527, 16314787, 15449527, 15104763, 13948648, 13944204, 13313034, 13221359, 12456257, 11089744, 11510119, 11048797, 10920913, 10866868, 10142572, 9733744, 9512740, 9004672, 8950681, 8054437, 8594819, 8514535, 8498010, 8255712, 8174956, 8429108, 7419743, 7067672, 8047513, 6558111, 7435094, 7582479, 6715481, 6848834, 6565170, 6615778, 6723356, 6186912, 6253751, 6175216, 6286336, 6051769, 5464332, 6029895, 5332946, 5906025, 5471562, 5029470, 5871705, 5545749, 5746122, 5423431, 5262023, 5556738, 5336395, 4874230, 5459730, 4464460, 4547655, 4512089, 4496467, 4396989, 4184289, 4272418]
6670D272418j09204k36569O84476m09209Q2165j18961p9851L2228K41293o71093
6660C687693L98106k92376l80570L05124l33246N86673o52303k93960J15429n88124
6650B552446O09304q7139k4912K30889p4399m72347m73822N88120K60840K01707
6640C310687m61800j18103K68741o64264J32192L75460J16926q27259O33757K25324
6630B991661m84354Q6806L38194P5302k54979o70131m00986P68658o8210l12339
6620B069622L4397M68236k99232K88579K38843r7215q32197O77570m50190J69888
6610B268301o58798M46913k80740M48981j13964q77485O04626J88064J53961j046376
6600A133483J009495n02086P35754q39050J293676n70578j72730M99162m93198
$$ y = [4272418, 4163214, 3926645, 4611121, 4201912, 4284077, 4165116, 4085265, 4117493, 4358786, 3687693, 4085799, 3793423, 3412853, 3717977, 3384731, 3971404, 3319101, 3025141, 3140570, 2552446, 3161750, 3074611, 3049699, 3280588, 3206189, 2733842, 2260020, 2848140, 3108980, 3310687, 2848887, 2730784, 2999525, 2335261, 2467453, 2842913, 2959839, 2132580, 2766337, 2991661, 2507307, 2594113, 2932307, 3007609, 2752630, 2082499, 1681513, 2450171, 2381961, 2069622, 2104019, 2572255, 2273023, 2561602, 2800445, 2703230, 1871033, 2548603, 2098413, 2268301, 1609503, 2056416, 1775676, 2224657, 2110693, 1233208, 1837834, 2025898, 2179859, 1133483, 2142978, 1640892, 2376646, 1537596, 2831272, 2260694, 2087964, 2587126, 2093928]
6591B093928M10674l96675l06552J144926o86080l2167N1849K80563q55438O17685
6581B322713m32907j6173N11612m57306K98788k79048j72945K17261L76972N7223
6571B426190K23657k80668j40443n73924M61928J02191O73835j33350m55997N99534
6561B902953n22613m64412j32747Q55323q8052n37930N57185k14610L27099K33679
6551B915875n62725n3063M03013K08866n40035M10684q49780M19095l98178L0344
6541A984096M62904N72911o95722L77311K72141m6238o20069M11619M77014K56234
6531C452201j96788p26483N50811J73503J58288j048276J453380q3510K33220
6522C966346m68340k48353O1151l24078O36753L4596L75899J8161l70421O64029
$$ y = [2093928, 2504602, 2107927, 1801375, 2946301, 2260221, 2228054, 2279903, 2560466, 1705028, 2322713, 1889806, 1873633, 2385245, 1927939, 2226727, 1947679, 1774734, 1991995, 2368967, 2426190, 2649847, 2369179, 2228736, 1654812, 2116740, 2218931, 2892766, 2759416, 2303419, 2902953, 2380340, 1915928, 1783181, 2638504, 2550452, 2012522, 2569707, 2355097, 2682196, 2915875, 2353150, 2300087, 2703100, 2911966, 2371931, 2782615, 1932835, 2351930, 1953752, 1984096, 2447000, 3019911, 2324189, 2701500, 2973641, 2927403, 2307334, 2718953, 3195967, 3452201, 3255413, 2528930, 3079741, 3253244, 3411532, 2363256, 3816636, 3733126, 3966346, 3498006, 3249653, 3310804, 2986726, 3623479, 3658075, 4033974, 4052135, 3681714, 4345743]
6512D345743k21633M60441p05633M38676q39812R29862o43964j81626j9015m80342
6502C082697M55339L84071j265122M48934L76224l83604J38791o11555K46125
6493B871900n13720L259L23538R89q06228Q27245K57853r02566Q35681j457283
6483A440668Q58555n6886n93395R81473p02605l36529Q51600q75862M0271M09956
6473B017246K30455j169842M50745j30576O32513l88312L88978J16700M1206J19671
6463B308784l44725L56623k23033K89989L16233p32130O34614k83057M0029M12662
6453B775989k18271N38365k22762p6463j22323j02841K17383m80576J84286M66348
6443B959135p76501Q61521n99873K06750k47427k15863M32343j08833j36840k56707
$$ y = [4345743, 4124110, 4584551, 3878918, 4317594, 3477782, 4407644, 3763680, 3582054, 3563039, 3082697, 3538036, 3922107, 2656985, 3105919, 3482143, 3098539, 3237330, 2625775, 2871900, 2358180, 2361439, 2684977, 2685966, 1879738, 2706983, 2964836, 2062270, 2897951, 1440668, 2299223, 2242337, 1648942, 2630415, 1927810, 1591281, 2442881, 1567019, 1607290, 2017246, 2247701, 1077859, 1528604, 1398028, 2030541, 1642229, 2031207, 2147907, 2189113, 2308784, 1964059, 2320682, 2097649, 2387638, 2703871, 1971741, 2606355, 2323298, 2363327, 2775989, 2557718, 3096083, 2873321, 2796858, 2674535, 2571694, 2789077, 2308501, 2492787, 2959135, 2182634, 3044155, 2444282, 2651032, 2403605, 2187742, 2620085, 2511252, 2374412, 2117705]
6433B117705N48387n06300J38716m78222N26889j12747p75441R37291n93435j33832
6423A669011j8297M94473l91269k56622P72312j50446m64044k96483N47703k48272
6413A658066J94586J112076j169703l60027M20281k62772Q335M47770n01784l9882
6403A506946N3777K51920M2837m93159M7789P37497J81181P0055n78685p45928
6393A074230J104023J205j294647O52977M73170k91751M76431j063359J340413
6384B472692o89897M64749j002711O56249N5331n09503L95173n61959R22536m44060
6374A758600m8216M44241q36779K59280P22407l97357O067k43691M58958m09329
6364A714181L29840K59210J61243k93850J73153q2706o95525Q81178m98402L3893
$$ y = [2117705, 2666092, 2159792, 2298508, 1820286, 2347175, 2234428, 1458987, 2396278, 1802843, 1669011, 1650714, 2145187, 1753918, 1497296, 2269608, 2119162, 1655118, 1358635, 1906338, 1658066, 1852652, 2964728, 1795025, 1434998, 1855279, 1592507, 1600842, 2048612, 1546828, 1506946, 1560723, 1812643, 1855480, 1362321, 1410110, 2147607, 2328788, 2398843, 1820158, 1074230, 2178253, 2179458, 884811, 1537788, 2010958, 1719207, 2195638, 1132279, 2472692, 1782795, 2247544, 1244833, 1901082, 1956413, 1446910, 1842083, 1280124, 2202660, 1758600, 1710384, 2154625, 1317846, 1577126, 2299533, 1902176, 1908243, 1664552, 2123510, 1714181, 2044021, 2303231, 2464474, 2170624, 2343777, 2261071, 1565546, 2446724, 1948322, 1982215]
6354A982215P00371l67895n99601M60441O18075k58597p04514O32071J74521j94372
6344B442715j74120K6941J43664l47278L99752k47505p2898j69495L48600l0230
6334B320146K39482Q2305j69769k83301M12965j35779p15174k82704N26400P43434
6324B738005R4388N5163k37458j37106l33438L19758J60355l0962L78091J62314
6314C169110K40854m58163L176L69190p09411J163155m26027l98090Q95583J8229
6304C867606m19371L63961O4309r85568J151466n81714j9494J21019q07644J152301
6294C906871J06976p9489K88323l49865R1445L07523r7802p0197J0071k7241Q83020
6283D969635q3413P521j5676o8554K0709J80931M01876P1777l00434n1445M91041
$$ y = [1982215, 2682586, 2314691, 1715090, 2175531, 2793606, 2535009, 1830495, 2462566, 2637087, 2442715, 2268595, 2295536, 2439200, 2091922, 2491674, 2244169, 2171271, 2001776, 2350376, 2320146, 2559628, 2641933, 2472164, 2188863, 2601828, 2466049, 1750875, 1468171, 1994571, 2738005, 2832393, 2887556, 2650098, 2512992, 2179554, 2499312, 2659667, 2628705, 3006796, 3169110, 3409964, 2951801, 2954977, 3324167, 2614756, 3777911, 3351884, 2953794, 3849377, 3867606, 3448235, 3812196, 3876505, 2890937, 4042403, 3460689, 3441195, 3562214, 2754570, 3906871, 4013847, 3934358, 4222681, 3872816, 3964261, 4271784, 4173982, 4103785, 4113856, 4086615, 4969635, 4886222, 4893743, 4878067, 4809513, 4830222, 5011153, 5413029, 5484806, 5184372, 5132927, 5623968]
6272E623968m10168L83513M85669K35015j60627R51O00145m56887M43351N51025
6262G295955j41469Q7326j43399k27747N78433q2091O60301o63625J180119m09078
6252H134725K06231O99106o26793j3850L65239L55651n1517L4926J41124M9196
6242I294038R90262K9575J55009N27890O27779m69551J203425K2462J177971p63910
6232A2794950N47614N16389L44438p344J286085Q53731Q12464M56069Q88577l59059
6222A8133914O82173J576810P67135J217813J230459L88072J312294J04161K482450
6213B7895281J151937J975782K174448K077379J880581K651925L057484L589355
6205D6454172L636456M873697N440944N921190P570959P277812R362129J0173890
$$ y = [5623968, 5213800, 5597313, 6082982, 6317997, 6157370, 6158321, 6758466, 6301579, 6744930, 7295955, 7154486, 7241812, 7098413, 6870666, 7449099, 7367008, 8027309, 7363684, 8543803, 8134725, 8340956, 9040062, 8413269, 8399419, 8764658, 9120309, 9068792, 9103718, 9244842, 9294038, 10284300, 10313875, 10468884, 10996774, 11624553, 11155002, 12358427, 12380889, 13558860, 12794950, 13342564, 13858953, 14203391, 14196047, 15482132, 16335863, 17148327, 17604396, 18492973, 18133914, 18816087, 20392897, 21160032, 22377845, 23608304, 23996376, 25308670, 25412831, 27895281, 29047218, 31023000, 33197448, 35274827, 37155408, 39807333, 42864817, 46454172, 50090628, 54964325, 60405269, 66326459, 73897418, 81175230, 90537359, 100711249]
6197A00711249J1695387J2323094J3598138J4467416J5081200J4363908J5383314
6190A97623706J4231312J2300483J1657541R154744P192192L083103N88411k413892
6182B53417600m167951p113129q798118j0681336j1068473j3236057j2937680
6175A85414856j2965222j3664769j3086372j2436842j1040492j1513910r716195
6168A00991054j0201976p955532p903823p709805n994602n446107n004311m507249
6160D6267649l837795m351848j932057l653519k148673j946323j908540j039345
6152B5449549j165146j554486j075471r70808j568346l06084j353297p14707P180
6143A6748384o86240p32496m36516o11588n84191k32039O8005r96499o29353m71777
$$ y = [100711249, 112406636, 124729730, 138327868, 152795284, 167876484, 182240392, 197623706, 211855018, 224155501, 235813042, 244967786, 252159978, 255243081, 255831492, 253417600, 249249649, 242136520, 233338402, 222657066, 211588593, 198352536, 185414856, 172449634, 158784865, 145698493, 133261651, 122221159, 110707249, 100991054, 90789078, 82833546, 74929723, 67219918, 61225316, 55779209, 50774898, 46267649, 42429854, 38078006, 36145949, 32492430, 30343757, 28397434, 26488894, 25449549, 24284403, 22729917, 21654446, 20683638, 19115292, 18809208, 17455911, 16741204, 16748384, 16062144, 15329648, 14893132, 14281544, 13697353, 13465314, 13533319, 12536820, 11907467, 11435690]
6133A1435690l7690j106203N71681l7824j089606L74363q03782L092l94641j3980
6123H901100q53902K82P81593p65596l6740l89411l97565J23755j27765l05776
6113F929975k46505l40378N23502m27980j73395k27826n96842J41783m48764P69121
6103E902691N9848l77668q42416L67269j5288j05063k00316O39562q47030K19431
6093D801020M9567n46416K89046l53775M85008J60130k95293J09527K72915m55126
6083D516603J472Q3097o1197o89208K28801o28049K33901K4626j8443N19774j93244
6072D018133m06889K3536M72008m11730J79026N31212m41326o20967J93734L77650
6062C914387k97876L99422m20650k39675N46950o31272J75705J54013j09017j45882
$$ y = [11435690, 11398000, 10291797, 10863478, 10825654, 9736048, 10110411, 9306629, 9309721, 8915080, 8901100, 8047198, 8047480, 8829073, 8063477, 8026737, 7637326, 7239761, 7363516, 7235751, 6929975, 6683470, 6343092, 6866594, 6438614, 6265219, 6037393, 5440551, 5582334, 5133570, 5902691, 5962539, 5584871, 4742455, 5109724, 5094436, 4989373, 4789057, 5428619, 4581589, 4801020, 4850587, 4304171, 4593217, 4239442, 4724450, 4884580, 4589287, 4698814, 4971729, 4516603, 4518075, 4601172, 4539975, 3850767, 4079568, 3451519, 3685420, 3710046, 3691603, 4211377, 4018133, 3611244, 3634780, 4106788, 3695058, 3874084, 4405296, 3963970, 3343003, 3536737, 3914387, 3616511, 4015933, 3595283, 3355608, 3902558, 3271286, 3446991, 3601004, 3491987, 3346105]
6052C346105j24203j28258Q46404j191119M66624O23883K10401k6208l11205j58262
6042C554162L79253l7191n84776P22762q16690J529527m97486M93451j16235l96104
6032D230673q2925L38862M07984k31243J66920N72935j183603R3490k21773j07249
6022C984071n6010L16273m73184p3524K50264m04024j42368k18412J61397q32803
6012B511680N56462p02750M63489J92710l10705k68476O90512o5284m47140K6342
6002B646840l09935k22079N13686J46698m12767k27908j41812P41133K0023K4156
5992B778035K4027n82033m0052N85741j115993J069130l97786K24534j45995r2015
5982B307593k4054k97600J53034N54699j26660n56380N02702l59211J47192J17639
$$ y = [3346105, 3221902, 3093644, 3940048, 2748929, 3215553, 3839436, 4049837, 4023629, 3712424, 3554162, 3933415, 3896224, 3311448, 4034210, 3217520, 4747047, 4249561, 4743012, 4626777, 4230673, 4147748, 4486610, 4894594, 4663351, 4830271, 5403206, 4219603, 4313093, 4091320, 3984071, 3928061, 4244334, 3771150, 3697626, 3947890, 3543866, 3401498, 3183086, 3344483, 2511680, 3068142, 2365392, 2828881, 3021591, 2710886, 2442410, 3132922, 3067638, 2620498, 2646840, 2336905, 2114826, 2628512, 2775210, 2362443, 2134535, 1992723, 2733856, 2753879, 2778035, 2802062, 2220029, 2179977, 2765718, 1649725, 2718855, 2321069, 2545603, 2399608, 2307593, 2283539, 1985939, 2138973, 2693672, 2567012, 2010632, 2513334, 2154123, 2301315, 2418954]
5972B418954n83784k01044M27252k35232K66192L7093Q78899j005485M38369p07849
5962A733365J45538Q1948N57886l46388k28086n822M85538l48049N90863k62087
5952B404706J22696m03902j15765L80838l04605Q37273l02234o68402N60649J63995
5942B675249K0634l95903N36115N57640n45018J72083L41421l41969k62461N86044
5932C343835K20683m57486M25225n73711J15717N16107R4119r3841M90727m38533
5922C642842Q18971m86951K61440Q36633m02136k66245O11130m30253J12955P22212
5912E420598j45445r14621L68699j222458J146452k13354j5360K78560j188124
5903C514947R83156p77367j30421K55527J90696N35572j160826J84892L53523
$$ y = [2418954, 1835170, 1634126, 2061378, 1826146, 2092338, 2129431, 3008330, 2002845, 2441214, 1733365, 1878903, 1960851, 2518737, 2172349, 1944263, 1938441, 2423979, 2075930, 2666793, 2404706, 2527402, 2123500, 2007735, 2388573, 2083968, 2921241, 2619007, 1950605, 2511254, 2675249, 2695883, 2299980, 2836095, 3393735, 2848717, 3020800, 3362221, 3020252, 2757791, 3343835, 3564518, 3107032, 3532257, 2958546, 3074263, 3590370, 3684489, 3590648, 4081375, 3642842, 4461813, 3974862, 4236302, 5072935, 4670799, 4404554, 5015684, 4585431, 4698386, 5420598, 5275153, 4360532, 4729231, 3506773, 4653225, 4439871, 4424511, 4703071, 3514947, 4498103, 3720736, 3590315, 3845842, 4036538, 4572110, 3411284, 3596176, 3949699]
5894C949699O4346m79878m94079P27822l89345L63253o48226L93977r8119L62904
5884C752354k79396j91810M58333M41974r22288J16662K86974L92796n56612P75452
5874D274439L707l62517J05212k93174l41247J018210p76698n7449O66833o53583
5864C583733K13023M79428K37977j84776p3323O3795n45968J153262k27831k85259
5854D414061k06890l857J88132N91922p66867r2412K79322J85355m74481K3972
5844D138257R3590J67649k76149N61973l73639K66116q15397j71257L08424J166870
5834E066437l75049l8490l19432R0990K08856l5030j38288j6317L18857n6283
5824D706251M50897p36490j39709J19431J27600O88832q17538J204244q85147
$$ y = [3949699, 4014045, 3534167, 3040088, 3767910, 3378565, 3741818, 3093592, 3487569, 3389450, 3752354, 3472958, 3281148, 3739481, 4181455, 3259167, 3375829, 3662803, 4055599, 3498987, 4274439, 4278146, 3915629, 4020841, 3727667, 3386420, 4404630, 3627932, 3570483, 4237316, 3583733, 3796756, 4276184, 4514161, 4329385, 4256062, 4319857, 3773889, 4927151, 4699320, 4414061, 4207171, 4203314, 4391446, 4983368, 4216501, 4124089, 4403411, 4588766, 4114285, 4138257, 4231847, 4399496, 4123347, 4685320, 4311681, 4577797, 3762400, 3591143, 3899567, 5066437, 4691388, 4652898, 4333466, 4424456, 4633312, 4598282, 4459994, 4443677, 4762534, 4706251, 5157148, 4420658, 4280949, 4400380, 4527980, 5216812, 4399274, 5603518, 4718371]
5815D718371O16895p9705J94313P54395o98643L40746N01345M93894j03314k2598
5805F715699l06992O52188M98697M26864k59611N49752K99042J073272j68352
5796I480559L67742O49807L7310J435212P53711J791648K82910K528947O37570
5787A7965416J460045Q69577J986012P08271R84271N19253k01043j016159j202724
5778B2072919k5435k244576k62895r76936j600326n98474j259846k96964j018731
5769A3788736j434388p22948l12751l32382q77841n25734M09753o11766j86825
5760I193854q36416j99961p69112j16784j07040o92048O29588M59233q93554m91828
5750F175932N65420k97894L36522k74168L75589J22253m56338L09897p40190L79903
$$ y = [4718371, 5335266, 5255561, 5449874, 6204269, 5505626, 5846372, 6347717, 6841611, 6738297, 6715699, 6408707, 7060895, 7559592, 7986456, 7726845, 8276597, 8575639, 9648911, 9480559, 9848301, 10498108, 10535418, 11970630, 12724341, 14515989, 14798899, 17327846, 17965416, 19425461, 20295038, 22281050, 22989321, 23973592, 24492845, 24291802, 23275643, 22072919, 22047484, 19802908, 19540013, 18563077, 16962751, 16364277, 15104431, 14807467, 13788736, 12354348, 11631400, 11318649, 10986267, 10108426, 9582692, 9992445, 9380679, 9193854, 8357438, 8157477, 7388365, 7271581, 7164541, 6472493, 7102081, 7561314, 6667760, 6175932, 6741352, 6443458, 6779980, 6505812, 6881401, 7003654, 6547316, 6857213, 6117023, 6496926]
5740F496926J96060K03585j3679j176452J319190o50216J60780O53890L9621j64296
5730G065409k29417l8597Q04965Q9152o50464k95123J327781l28565m71955R2927
5720G366113K44827L82988k38691M4787j78683K74023k82485N94356n07324O50013
5710H349924j29671J09092K89125L93208n27999k32138J052037j73175L60724
5701I491127J0673K67103N6386J057221j20865K29348M46171K53554M72374L46348
5691A2509440K37017j30244l5803L54089R8373O65432m58018N1923k74258Q25109
5681A3843060J115962j22663K1053M11583M48249j37904M66706N68146M75375
5672A7089567L29459N78475k6460m05630Q79829l7814M63408J153823r13416J038210
$$ y = [6496926, 6692986, 6896571, 6882892, 5706440, 7025630, 6375414, 6536194, 7190084, 7229705, 7065409, 6835992, 6797395, 7602360, 7691512, 7041048, 6745925, 8073706, 7745141, 7273186, 7366113, 7610940, 7993928, 7755237, 7800024, 7621341, 7895364, 7612879, 8207235, 7699911, 8349924, 8220253, 8329345, 8618470, 9011678, 8483679, 8251541, 9303578, 9130403, 9491127, 9501800, 9768903, 9825289, 10882510, 10761645, 10990993, 11437164, 11690718, 12163092, 12509440, 12746457, 12616213, 12580410, 12934499, 13032872, 13698304, 13240286, 13292209, 13017951, 13843060, 14959022, 14836359, 14857412, 15268995, 15717244, 15579340, 16046046, 16614192, 17089567, 17419026, 17997501, 17971041, 17565411, 18445240, 18407426, 18870834, 20024657, 19111241, 20149451]
5662B0149451N44991P31280q1896R88358N98887Q57113L88229Q07988J499171
5653B6483572L32600J372372P51802R85356J381274L83992K387867P06337J218407
5644C6003579J654040J373186O91329K153913J339792J359686K374311R85634
5636D7935470J602241K209857J191866K216077K301431L122734K591074L106238
5628F6276988L328359K626167L474154M727853M378569N084489O087448N887255
5620A01871282O874109O571090Q168971R514252J0263654J0553564J1782801J2480540
5612A78080263J4081169J4922166J6172751J8429660J7018510K0181477K0019215
5605B98905211K1194658K1022335J9902421J8513355J7983678J4109862J1852411
$$ y = [20149451, 20694442, 21425722, 21343826, 22332184, 22931071, 23788184, 24176413, 24984401, 26483572, 26816172, 28188544, 28940346, 29925702, 31306976, 31690968, 34078835, 34785172, 36003579, 37657619, 39030805, 39722134, 41876047, 43215839, 44575525, 46949836, 47935470, 49537711, 51747568, 52939434, 55155511, 57456942, 60579676, 63170750, 66276988, 69605347, 72231514, 75705668, 80433521, 84812090, 89896579, 95984027, 101871282, 108745391, 115316481, 123485452, 132999704, 143263358, 153816922, 165599723, 178080263, 192161432, 207083598, 223256349, 241686009, 258704519, 278885996, 298905211, 320099869, 341122204, 361024625, 379537980, 397521658, 411631520, 423483931]
5598D23483931P829701M406970l40804l324225o830895j0312706j2795799j4504125
5590C87612048j6511682j7531302j8982605j9115480k1034718k0186403k0029895
5583B54219963j8683156j8954935j7224596j6479286j4972395j3630057j2926449
5576A41349089j0986651r676982q742360q340595p396193o449742n388655m517197
5568G9850714m403496m835656k723422m194260l309366k475871k631620j961173
5560E3315850j778821j843339k144615j415873j575494r05395k185437q99052
5552D0567824l92762j654285k257088l82496k52266j847391j22242j190027k57451
5543C2211816j091909O1121j292553L24518j97769p04355M98840K8582j75249
$$ y = [423483931, 431313632, 435720602, 435379798, 432055573, 425224678, 414911972, 402116173, 387612048, 371100366, 353569064, 334586459, 315470979, 294436261, 274249858, 254219963, 235536807, 216581872, 199357276, 182877990, 167905595, 154275538, 141349089, 130362438, 120685456, 111943096, 103602501, 96206308, 89756566, 84367911, 79850714, 75447218, 70611562, 67888140, 63693880, 60384514, 57908643, 55277023, 53315850, 51537029, 49693690, 47549075, 46133202, 44557708, 43652313, 41466876, 40567824, 40175062, 38520777, 36263689, 35881193, 35628927, 33781536, 33659294, 32469267, 32211816, 31119907, 31181028, 29888475, 30212993, 30015224, 29310869, 29809709, 29838291, 29663042]
5534B9663042q44253k90981k20586m54552j077909n60623n33738j058940r20896
5525B3700564j016114m75059n94980o40484n052j055917M71421q89961o56668
5516A8837750m97292n8352m07811K32555k44507R9929j25695p05094K38435L10628
5506A7680546k79848M77776m31145K70441l43882L77464Q96052p93308j22187
5497A7731909N50809Q11606o41101N2815J67977l89533Q24626K22578j31909J69094
5487A9368871o42326J288784p71557P34913l36422l9574K15841Q40894M25629
5478B1085053l53218K38574L72822q8598P44764K41777K94014P20339L03942N68842
5468B4128311K8160K64423J263769N61854o7636P59281M92311R79864Q8387J113083
$$ y = [29663042, 28818789, 28527808, 28307222, 27852670, 26774761, 26214138, 25680400, 24621460, 23700564, 22684450, 22209391, 21614411, 20973927, 20968875, 19912958, 20384379, 19494418, 18837750, 18340458, 18282106, 17874295, 18106850, 17862343, 17962272, 17836577, 17131483, 17369918, 17680546, 17400698, 17878474, 17447329, 17717770, 17373888, 17751352, 18647404, 17854096, 17731909, 18282718, 19094324, 18453223, 18506038, 18674015, 18284482, 19109108, 19331686, 19199777, 19368871, 18726545, 20015329, 19243772, 19978685, 19642263, 19602689, 19818530, 20659424, 21085053, 20731835, 20970409, 21343231, 21254633, 21999397, 22241174, 22535188, 23255527, 23559469, 24128311, 24156471, 24420894, 25684663, 26246517, 26178881, 26938162, 27430473, 28410337, 28498724, 29611807]
5458B9611807O97376J789551J39657Q60460O79421J815213O74249J536476J391861
5449C9196071J907357K132901Q45886J759088K762593J903421K608908K383116
5441E5499341L089074K746206L235654L243229N022127O596097P261944R844545
5433I6538217J0614067J1606033J3969827J8043502J9523017K1799840K8445428
5426B20539931L2130493L4546999L3649735L2907569L3193277L2218766K9890227
5419D49076997J9588530M128358j0082672j4142672k0279159k3173774k3786786
5412C81328822k3502321k8126551k9837306k6847419k3145680k0778868j9331416
5405B09759261k0412931j8530129j5477828j3897470j2390385j0888120r984154
$$ y = [29611807, 30309183, 32098734, 32238391, 33098851, 33778272, 35593485, 36267734, 37804210, 39196071, 41103428, 43236329, 44082215, 45841303, 48603896, 50507317, 53116225, 55499341, 58588415, 61334621, 64570275, 67813504, 72835631, 79431728, 86693672, 96538217, 107152284, 118758317, 132728144, 150771646, 170294663, 192094503, 220539931, 252670424, 287217423, 320867158, 353774727, 386968004, 419186770, 449076997, 468665527, 472793885, 462711213, 448568541, 428289382, 405115608, 381328822, 357826501, 329699950, 299862644, 273015225, 249869545, 229090677, 209759261, 189346330, 170816201, 155338373, 141440903, 129050518, 118162398, 108178244]
5398A08178244p584275o498000o550085n079765m111368l349345j282209k578918
5390G1144279j111444k62287k53797l89872l23861J020443Q36917J739401P68844
5381G3168623J947729K305744K844106K502079L861761M567408N628482P859063
5373A04684995R095773R838958J1107274J3914526J6668318J7679827K1168767
5366B04158438K4884848K7709954K9748663L0363073K9423618K9663194K7587044
5359D03538832K4390508J7293401O841130k597008j0986391j5384324j9019668
5352D04076480k1497918k2776209k4262952k6002854k6374888k2266181k1973557
5345B38921921k0327465j9907607j8936928j7374580j5472817j3092141j2589066
$$ y = [108178244, 100593969, 94095969, 87545884, 82466119, 78354751, 75005406, 73723197, 71144279, 70032835, 69770548, 69516751, 69126879, 68803018, 69823461, 70660378, 72399779, 73168623, 75116352, 77422096, 80266202, 82768281, 86630042, 91197450, 96825932, 104684995, 113780768, 123619726, 134727000, 148641526, 165309844, 182989671, 204158438, 229043286, 256753240, 286501903, 316864976, 346288594, 375951788, 403538832, 427929340, 445222741, 452063871, 449466863, 438480472, 423096148, 404076480, 382578562, 359802353, 335539401, 309536547, 283161659, 260895478, 238921921, 218594456, 198686849, 179749921, 162375341, 146902524, 133810383, 121221317]
5338A21221317j1253858j0134831q781275q636962o410669o732140n399204l951506
5330E9920872l811482l476221l153058k630268k263258k288349j814516k313014
5322C8170706j167448j069531j458931k090820p90239q23611j585362j404116
5314B7780648o71343j240004o60651p43162r27076j06997r30145j080462o32778
5305B0788030J14394r70842o56653k16152n79413p78283j79753K4830o92737j07852
5295A6745569n38153n29322j31584J69083p28857j5445j63813l98428l42613r79775
5285A3086662P87399r52213K8432q72247N16533l00666p08706m19849J248280
5276A2413625j416694K35155R9872p63322N5322M32980n61417J08060J20159J74474
$$ y = [121221317, 109967459, 99832628, 91051353, 82414391, 76003722, 69271582, 63872378, 59920872, 56109390, 52633169, 49480111, 46849843, 44586585, 42298236, 40483720, 38170706, 37003258, 35933727, 34474796, 32383976, 31593737, 30770126, 29184764, 27780648, 27109305, 25869301, 25208650, 24465488, 23538412, 23431415, 22501270, 21420808, 20788030, 20902424, 19931582, 19274929, 19058777, 18479364, 17701081, 17521328, 17546158, 16853421, 16745569, 16207416, 15678094, 15546510, 15715593, 14986736, 14971291, 14807478, 14409050, 14066437, 13086662, 13874061, 12921848, 12950280, 12078033, 12594566, 12293900, 11585194, 11165345, 12413625, 10996931, 11232086, 11331958, 10568636, 10623958, 11056938, 10495521, 10603581, 10723740, 10898214]
5266A0898214k51527r678L3642q11604L37376J197746j77731n09853K11361l97386
5256A0520560M97754k33163N38675l55472k9989P62880k89995K51247p17090Q1796
5246A1027203p4646K30032o63186O38659l72008l93559k38692r98842N72944l94206
5236I333699j15542o69231l17111Q7679k13972m46641o77868K31238M8355J18056
5226G378662r10737J54938m39164l07203K13268K03340j039769J157441m01106
5217F009670j90802k98487L97898k79226l87163q6230N13950j69010l48839j18390
5207E043371J6882J8106R86496k79285q53651j84851o8857K55231k25230M80394
5197E188606Q5185m69686J18335R369J300J66317n90212k11066j17149O32260
$$ y = [10898214, 10646687, 10637009, 10670651, 9859047, 10196423, 11394169, 11216438, 10706585, 10917946, 10520560, 11018314, 10785151, 11323826, 10968354, 10938365, 11701245, 11411250, 11662497, 10945407, 11027203, 10952557, 11182589, 10519403, 11158062, 10786054, 10392495, 10153803, 9154961, 9727905, 9333699, 9218157, 8548926, 8231815, 8319494, 8105522, 7658881, 6981013, 7212251, 7260606, 7378662, 6467925, 6622863, 6183699, 5876496, 6089764, 6293104, 5253335, 6410776, 6009670, 5818868, 5520381, 5918279, 5639053, 5251890, 5165660, 5679610, 5510600, 5161761, 5043371, 5060253, 5078359, 6064855, 5785570, 4931919, 4747068, 4678211, 4933442, 4708212, 5188606, 5273791, 4804105, 4922440, 4931809, 4933109, 5099426, 4509214, 4298148, 4180999, 4813259]
5187D813259m75577L24005M30665j212010Q01389k08518Q3463n92131M12176m28915
5177C947806M22615M62482r02604O64585K64507K39551n86385j00790r48107J155722
5167D619382K13808k12511J11577O3454P03141o22166J2694Q12041q66229K64316
5157E099507o63730k21647N52021o5409k83725K38543m77225Q68094k53637k92345
5147D500447R47754j36884L45187K14776J87073r64231Q91012l21326L77855r0618
5137E951045P1431o29590N0290J38491l43378n97134M63397o21901N59724j223606
5127C818769o31765Q35078o73085K1848M20186m90886M83736k00968k84429O92778
5117C991262o06684J019766l18549k09966P0234l23893l38736L03488K9677K5399
$$ y = [4813259, 4337682, 4661687, 5092352, 3880342, 4681731, 4473213, 4556676, 3964545, 4376721, 3947806, 4370421, 4832903, 3930299, 4594884, 4859391, 5098942, 4512557, 4411767, 3463660, 4619382, 4833190, 4620679, 4732256, 4795710, 5498851, 4876685, 4889379, 5701420, 4835191, 5099507, 4435777, 4214130, 4766151, 4700742, 4417017, 4655560, 4178335, 5046429, 4792792, 4500447, 5448201, 5311317, 5656504, 5871280, 6058353, 5094122, 5985134, 5663808, 6041663, 5951045, 6022476, 5392886, 5443176, 5581667, 5238289, 4641155, 5104552, 4482651, 5042375, 3818769, 3187004, 4022082, 3348997, 3370845, 3791031, 3300145, 3783881, 3582913, 3298484, 3991262, 3384578, 4404344, 4085795, 3875829, 3946063, 3622170, 3283434, 3586922, 3616599, 3641998]
5107C641998j06031l1828Q17956j87673j59126J27712l62351K42873L19469m59811
5097C843188J013863q37647Q47227J8424Q49047j214217K63600J872R14314o23527
5087E076144k81846q7469l21035k4529N01775j183059N05211j21489J7473K16299
5077D297475n01404n03166J48017R0059N30334l72321o08853K83996j72461J12715
5067C304391n22482N57169Q1800m81239m2928L77870o45180L09147M97772l342
5057C432978q08108J100707p76531M26682l61898J82705k65676K18991l55522
5048B794328L20310k23770R5055M2490k85246R92715m80414p39927Q42355r30560
5038B427336L34432N38571p10735K96076p09465O85001K15044O2293n04391P14308
$$ y = [3641998, 3535967, 3504139, 4322095, 4134422, 3975296, 4103008, 3740657, 3983530, 4302999, 3843188, 4857051, 4019404, 4866631, 4885055, 5734102, 4519885, 4783485, 4785357, 5699671, 5076144, 4794298, 4706829, 4385794, 4361265, 4863040, 3679981, 4185192, 4063703, 4081176, 4297475, 3796071, 3292905, 3440922, 3530981, 4061315, 3688994, 3080141, 3364137, 3191676, 3304391, 2781909, 3339078, 3420878, 2939639, 2896711, 3274581, 2629401, 2938548, 3436320, 3432978, 2624870, 3725577, 2949046, 3375728, 3013830, 3196535, 2930859, 3149850, 2794328, 3114638, 2890868, 2985923, 3028413, 2743167, 3735882, 3255468, 2515541, 3357896, 2427336, 2761768, 3300339, 2589604, 2885680, 2176215, 2861216, 3076260, 3138553, 2634162, 3348470]
5028C348470j322070M74857P20021r3916m68904n12659q3876N43408J63968m16944
5018B352355K93919N0361J19947M60017o54269k2612l4799r2890N46256k63085
5008B755200Q14324p13012l43328J30836j24169L24809k68183J11150J67552K79541
4998C134720k27435L97223J8318j08532k1847N4012j01127O01264r39121Q36692
4988C644167m44455k4394k1227J21651L58276k45417N00283l27179J51652L29906
4978D043263o22712k38349J11585Q7690N4773j57792N06858n16155M09919l58083
4968C320997n1797P3758R58817q51304n96541L15079O71138J07188j4713o85719
4958C246903K67263K50910K14510k61292N69627m88005P07043q18048Q57744l86493
$$ y = [3348470, 2026400, 2501257, 3221278, 3127362, 2658458, 2145799, 2061923, 2605331, 2769299, 2352355, 2646274, 2696635, 2816582, 3276599, 2622330, 2599718, 2564919, 2472029, 3018285, 2755200, 3569524, 2856512, 2513184, 2644020, 2519851, 2844660, 2576477, 2687627, 2855179, 3134720, 2907285, 3304508, 3322826, 3214294, 3192447, 3246459, 3145332, 3746596, 2807475, 3644167, 3199712, 3175318, 3154091, 3275742, 3634018, 3388601, 3888884, 3561705, 3713357, 4043263, 3420551, 3182202, 3293787, 3381477, 3436250, 3278458, 3785316, 3269161, 3679080, 3320997, 3269200, 3342958, 4301775, 3450471, 2853930, 3169009, 3840147, 3947335, 3932622, 3246903, 3514166, 3765076, 3979586, 3718294, 4287921, 3799916, 4506959, 3688911, 4546655, 4160162]
4948D160162j62249J8079n0302M1945m03721N90645P47311m14311k36520k00154
4938D090885Q30716j051020M45344j73884L85084k71655j70982L81347K83423
4929D749258q20772P2777J134856j002539P93826L6971q37391P68828o9587Q758
4919D834985J86255o11068Q14375j63431l51030l34752J093180m459K72899m69321
4909E267633O44094p24895P04064j84131J2568J6435n5408J95539n4336M65113
4899F286676K86169l18953m08082J034094l27013L6717Q14350l09761M62015k48219
4889G307993L26228j120611R27371O63657J72330p9692n84961P76771K3105K863
4879H415054L2634L41542K12696J02898P33019O41619q7687o5992L15209L96825
$$ y = [4160162, 3997913, 4015992, 3965690, 4007635, 3603914, 4194559, 4941870, 4527559, 4291039, 4090885, 4921601, 3870581, 4315925, 4142041, 4527125, 4255470, 4084488, 4465835, 4749258, 3928486, 4001263, 5136119, 4133580, 4927406, 4964377, 4126986, 4895814, 4826227, 4834985, 5021240, 4410172, 5224547, 5061116, 4710086, 4375334, 5468514, 5464055, 5736954, 5267633, 5911727, 5186832, 5890896, 5706765, 5719333, 5735768, 5680360, 5875899, 5821563, 6286676, 6572845, 6253892, 5845810, 6879904, 6552891, 6589608, 7403958, 7094197, 7556212, 7307993, 7634221, 6513610, 7440981, 8104638, 8276968, 8197276, 7612315, 8389086, 8412191, 8415054, 8447688, 8789230, 9001926, 9104824, 9837843, 10479462, 10391775, 10325783, 10640992, 11037817]
4869A1037817R77168k20716L86298O62277n08252Q45663O98016K96819K7225J043252
4859A5245567Q08192J0969Q173R22382P01936Q07370N74405N25382M77475J133614
4849B1215465M45408J180838O27867J335440K16977J596975J470230P09230J395929
4840C0194359Q59860J685034J997075Q05266J109192J988247J605786J417185
4832D1662004K251407O79309K141842J294344L74744K409791N94174J770006P51491
4823E3929112J135931J46999L8648J64252n27602J514520j185474n01401j017828
4814E3697157p31951o79146j972493j546846j314784r89811j221489k345554r09474
4805D1985609j795150j641960p69873k065734q68727j694049j418499j476213
$$ y = [11037817, 12014985, 11794269, 12180567, 12842844, 12334592, 13180255, 13878271, 14175090, 14202315, 15245567, 16053759, 16064728, 16072901, 16995283, 17697219, 18504589, 19078994, 19604376, 20081851, 21215465, 21660873, 22841711, 23469578, 24805018, 25021995, 26618970, 28089200, 28798430, 30194359, 31054219, 32739253, 34736328, 35541594, 36650786, 38639033, 40244819, 41662004, 43913411, 44592720, 46734562, 48028906, 48403650, 50813441, 51407615, 53177621, 53929112, 55065043, 55212042, 55250690, 55414942, 54887340, 56401860, 55216386, 54714985, 53697157, 52965206, 52286060, 50313567, 48766721, 47451937, 46462126, 45240637, 42895083, 41985609, 40190459, 38548499, 37778626, 35712892, 34844165, 33150116, 31731617, 30255404]
4797C0255404j035646j327157q95358j238657j365788m93391k382171k30594r50740
4788B0335902l92981o13849n30062q35643q91377o63472j023365j51833j52615
4779A5080705q53582o93831m08609n87656m69429J98671l16574n78365K4275l65117
4769A1030488j57503q41167j76152k38067O25719j642258J41941j96891M48942
4760H995052n40971J37860m30968r15172N48521m14190l35678k2473o64875P33904
4750G091010o43752L5001l75482k74254N02795m33996L71345Q5279l30200j54617
4740E873129j06766k31986l79404O61361n53954n97304j474n4950M45319l00939
4730D753032J24317p99108N63215N0412m39499o7955K17024J27765l09443j50668
$$ y = [30255404, 29219758, 27892601, 26997243, 25758586, 24392798, 23899407, 21517236, 21286642, 20335902, 19942921, 19329072, 18799010, 17963367, 17071990, 16408518, 15385153, 15233320, 15080705, 14227123, 13533292, 13124683, 12537027, 12067598, 12266269, 11949695, 11371330, 11395605, 11030488, 10872985, 10031818, 9855666, 9617599, 10243318, 8601060, 8743001, 8546110, 8995052, 8454081, 8591941, 8160973, 7245801, 7794322, 7380132, 7044454, 7021981, 6357106, 7091010, 6447258, 6482259, 6106777, 5832523, 6335318, 5901322, 6272667, 6357946, 6027746, 5873129, 5766363, 5534377, 5154973, 5816334, 5262380, 4665076, 4663602, 4608652, 5053971, 4753032, 4877349, 4078241, 4641456, 4691868, 4252369, 4184414, 4401438, 4529203, 4219760, 4069092]
4720D069092M61263o63491L63524J2266n55611J06178P84370j469961p5221R22952
4710C955361l54835L64599r334N79545j710157J296323j042705M1901N58044k74775
4700C403967K20080j73563J15232j24803q0533j71769n2662M33924m43734L96463
4690C522602K29243m19498O9411k06164l55434p6910J60660J187947r68812m07953
4680B735092l37187L94596m05793M03271l24576K52180K03957l01117J40014k93670
4670B466767R61677r28994r3354M96842l31578m20931M78806O7658j1693K83540
4660B968740m08073N32929k32999k25604K02570J58206q8311j98814m26359L82597
4650B664882O0423j88370m02581L53896p6530n10940K56105J07813J001451m35433
$$ y = [4069092, 4530355, 3866864, 4230388, 4242654, 3687043, 3793221, 4577591, 3107630, 3032409, 3955361, 3600526, 3965125, 3955791, 4535336, 2825179, 4121502, 3078797, 3120698, 3678742, 3403967, 3624047, 3450484, 3565716, 3440913, 3360380, 3188611, 3135949, 3569873, 3126139, 3522602, 3751845, 3332347, 3401758, 3195594, 2840160, 2763250, 2923910, 4111857, 3143045, 2735092, 2397905, 2792501, 2386708, 2789979, 2465403, 2717583, 2921540, 2620423, 2760437, 2466767, 3428444, 2499450, 2406096, 2902938, 2571360, 2150429, 2629235, 2696893, 2685200, 2968740, 2560667, 3093596, 2860597, 2634993, 2837563, 2995769, 2907458, 2708644, 2282285, 2664882, 2725305, 2536935, 2134354, 2488250, 2411720, 1900780, 2156885, 2264698, 3266149, 2830716]
4640B830716n89455M3852J51454O4617j20707L79814L1901l86842R9368m99679
4630B005039j06307L55548k91528l26125L56495j41975O11744Q1871r23631L23621
4620A944752K72080J93410m46696j02348K55460O6540M62485l74405r4049o2885
4610B114344N61073l05913J21087j38542j79089k08841N57390M8439M6183j77229
4600B438902L72721j41724k30630L5705N4880l32437K52368j80849M11803m53910
4590B226829l20765J26143j57660k92178N83880M32983k41677q56060O87374k93308
4580A895561k5049K37210O94857l9178n40847j2547J1560k25343K77807J54657
4570B428688k04435k17639J53537k42252L06928M13670q8114m29233J87950n19187
$$ y = [2830716, 2241261, 2285113, 2436567, 2501184, 2380477, 2760291, 2792192, 2405350, 2504718, 2005039, 1898732, 2254280, 1962752, 1636627, 1993122, 1851147, 2462891, 2544762, 1621131, 1944752, 2216832, 2410242, 1963546, 1861198, 2116658, 2183198, 2645683, 2271278, 2177229, 2114344, 2675417, 2369504, 2490591, 2352049, 2172960, 1964119, 2521509, 2569948, 2616131, 2438902, 2811623, 2669899, 2439269, 2474974, 2529854, 2197417, 2449785, 2268936, 2680739, 2226829, 1906064, 2032207, 1874547, 1582369, 2166249, 2599232, 2357555, 1501495, 2188869, 1895561, 1870512, 2107722, 2802579, 2763401, 2222554, 2210007, 2221567, 1996224, 2274031, 2428688, 2224253, 2006614, 2160151, 1917899, 2224827, 2638497, 2550383, 2121150, 2309100, 1789913]
4560A789913J62759j45581M70346k27778k5157k19620M74975J05327k25970o84376
4550A474838P07581L07730l36785j30312R1179R1773l83831L6730k09073K47893
4540A897723k93882P16618q7300n8167r1198L58334q72011M49593n2753K26661
4530B193618P3535l03083Q5146O7141k43528l2817N14679r53880O21709K81213
4520B303733J95465j200493P87527N59431p41378L24556j7957J26786N4838m83300
4510A909208N2451L75314l15222k12720L78512O46026n99489K99474l397q22021
4500A708136M51149J99912J62965m67983n05893L60556j30799P31427l86046r5366
4490B028058L84496n27327K16234L3844K18921n0603J91760p58723L69404r6072
$$ y = [1789913, 1952672, 1807091, 2277437, 2049659, 2024502, 1804882, 2279857, 2385184, 2159214, 1474838, 2182419, 2490149, 2153364, 2023052, 2114231, 2206004, 1822173, 1858903, 1649830, 1897723, 1603841, 2320459, 2233159, 2174992, 2083794, 2442128, 1570117, 2019710, 1966957, 2193618, 2267153, 1964070, 2049216, 2116357, 1872829, 1840012, 2354691, 1400811, 2022520, 2303733, 2499198, 1298705, 2086232, 2645663, 1904285, 2228841, 2210884, 2337670, 2392508, 1909208, 1961659, 2336973, 2021751, 1809031, 2187543, 2833569, 2234080, 2533554, 2530157, 1708136, 2159285, 2359197, 2522162, 2054179, 1548286, 1908842, 1778043, 2509470, 2123424, 2028058, 2412554, 1885227, 2101461, 2135305, 2354226, 2303623, 2495383, 1736660, 2106064, 2009992]
4480B009992l31770l53626M28493j17943J4006M55977J2383j002803M68640Q17520
4470B400869p45644M23288L70129n73750R55482j214927K36141n8345M32409l26262
4460A899390N1861O1985m79956N66628j47482M54774j189594O56125p4347R4932
4450A894316j29183J44133l31090K40913K92612M13829k78113j03432J15572m62924
4440A796633l05852R7782K57009k39690n68843J364930n03536N112k55226q9399
4430A558920P14056L1098p08911K95976N82250k01160n20706R26029n93994L520
4420B087078R2416O53904n10209L2008K34949L75072n62880O05109q00314K87144
4410B494277n8849L54666j70572J60694m98852L60379J67779k88085J02497k75360
$$ y = [2009992, 1678222, 1324596, 1753089, 1635146, 1649152, 2105129, 2117512, 1114709, 1583349, 2400869, 1655225, 2078513, 2448642, 1874892, 2830374, 1615447, 1851588, 1793243, 2225652, 1899390, 1951251, 2013236, 1533280, 2099908, 1952426, 2407200, 1217606, 1873731, 1799384, 1894316, 1765133, 1909266, 1578176, 1819089, 2111701, 2525530, 2247417, 2143985, 2259557, 1796633, 1490781, 1588563, 1845572, 1605882, 1037039, 2401969, 1898433, 1903545, 1648319, 1558920, 2272976, 2304074, 1595163, 1891139, 2473389, 2272229, 1751523, 2677552, 2083558, 2087078, 2179494, 2833398, 2323189, 2355197, 2590146, 2965218, 2402338, 3007447, 2207133, 2494277, 2435428, 2790094, 2619522, 2780216, 2281364, 2641743, 2809522, 2521437, 2623934, 2348574]
4400B348574m2713M97433j43255N41735n7379j4395j065457N23533K04124j63184
4390B629016L5554L60648k46784K78597K26181K2023l74907L0148J056264l90917
4380C625823k99719L10214m40931K72169r7328j4388q2361J58630P38614m74465
4370C696258K45841k51108P75365j027192L4575O91561J15386j3009P23426o02981
4360D388122k69681Q52618l20934L13138k9838O45679m76660J58509l85624Q54322
4350E729651j6575M48586q2139p37272O94338k33228R54657O23859k13166n52328
4340F616383J202862J71549J5774L85187N74282J30615R97760L71656J37693R17571
4330A1521332m52465r9763J26176R56392r35079J042342k87320J92692l1294k92826
$$ y = [2348574, 2305861, 2803294, 2660039, 3201774, 3144395, 3130000, 2064543, 2588076, 2792200, 2629016, 2664570, 3025218, 2778434, 3057031, 3283212, 3305235, 2930328, 2960476, 4016740, 3625823, 3326104, 3636318, 3195387, 3467556, 3370228, 3355840, 3273479, 3432109, 4170723, 3696258, 3942099, 3690991, 4466356, 3439164, 3473739, 4165300, 4280686, 4267677, 4991103, 4388122, 4118441, 4971059, 4650125, 4963263, 4933425, 5579104, 5102444, 5260953, 4875329, 5729651, 5713076, 6161662, 6079523, 5342251, 6036589, 5803361, 6758018, 7381877, 7168711, 6616383, 7819245, 7990794, 8006568, 8391755, 8966037, 9096652, 10094412, 10466068, 10603761, 11521332, 11068867, 10969104, 11095280, 12051672, 11116593, 12158935, 11871615, 12064307, 12033013, 11740187]
4320A1740187r20818O28063o25257O4463m17339k64441l6623j112564J38506j80623
4310I013554j68277r1333l29144l84398N9285k39962p48149k10352L47709j319173
4300E929760N39982k40632K63673k52567p62833O0606M75510p08368J61457j90740
4290E275848O5014m34049k71625p52k08453N0522L58438l09661k41075P11875
4280D996082q12026n3345k66306j53341N27505j19270N55968p18938L64988j213413
4270C107904n8339M63147m72265O33939m90356q71642Q65212l44326L21150k23700
4260B930724j45715n4546k1034l75723P41458r0519K07397k07276o34615L52534
4250B702685K11110o2190N7626r495L46l57130k10723M24312q37466M04132n3207
$$ y = [11740187, 10819369, 11447432, 10822175, 10886638, 10469299, 10204858, 10168235, 9055671, 9194177, 9013554, 8845277, 8753944, 8424800, 8040402, 8099687, 7859725, 7111576, 6901224, 7248933, 5929760, 6469742, 6229110, 6492783, 6240216, 5477383, 5537989, 6013499, 5305131, 5466588, 5275848, 5340862, 4906813, 4635188, 4634436, 4425983, 4476505, 4834943, 4525282, 4284207, 4996082, 4184056, 4130711, 3864405, 3711064, 4238569, 4119299, 4675267, 3956329, 4321317, 3107904, 3049565, 3512712, 3040447, 3674386, 3184030, 2312388, 3177600, 2833274, 3154424, 2930724, 2785009, 2730463, 2709429, 2333706, 3075164, 2984645, 3192042, 2984766, 2350151, 2702685, 2913795, 2851605, 2909231, 2899736, 2900082, 2542952, 2332229, 2756541, 1919075, 2323207, 2270000]
4239B270000l53511L73799r6974M55869r34314P14853R1063l83351j16446r0024
4229A930964K92721j03323j5599q3372j14968M26136m87663k20167N54227k95448
4219A883508J31467j62865o30839L43242J207218r22616J85497l50846k7638k57244
4209A398884O20961j86846N75513n42985K86150m02083J79505l07318j41646O58306
4199B138441l65693n3172K53399J13724j36405L48718l34436L05763m32376J2022
4189A849985m83873k17205R11726l93363l9599N216l56157N78311k22276j00789
4179A531976J89395P71851n84246M8871o4539K66514l14312k08997K47532o36670
4169A247375K02243M2910K55183N3080k53794M02871l47201l8787L29447r72595
$$ y = [2270000, 1916489, 2290288, 2193314, 2649183, 1714869, 2429722, 2520785, 2137434, 2020988, 1930964, 2223685, 2120362, 2104763, 2021391, 1906423, 2332559, 1844896, 1624729, 2178956, 1883508, 2014975, 1852110, 1221271, 1564513, 2771731, 1849115, 2034612, 1683766, 1656128, 1398884, 2019845, 1832999, 2408512, 1865527, 2151677, 1749594, 1929099, 1621781, 1480135, 2138441, 1772748, 1719576, 1972975, 2086699, 1950294, 2299012, 1964576, 2270339, 1837963, 1849985, 1366112, 1148907, 2060633, 1667270, 1627671, 1632887, 1276730, 1855041, 1632765, 1531976, 1721371, 2493222, 1908976, 1957847, 1893308, 2159822, 1845510, 1636513, 1884045, 1247375, 1449618, 1492528, 1747711, 1800791, 1546997, 1949868, 1602667, 1563880, 1893327, 920732]
4159I20732K46866j15272K45343j82353P08108q68606J01089J98531J28828q3848
4149A299418k52141K78585j60739q5685M645P11016P2965j45367l5114k59596
4139A427987P03995r96279P6957P3010n0888j8636O9815M58979l68326k026J86386
4128A560974L5609R8871l6587K6862p44577J153671p27833L68773P87718n19121
4118B004360m77082n08544M62892P9098j65143M22288k72162J62464q57552P09109
4108A559728K9143l92715R66968q3048p24776l67882k5227L26559L63372l74502
4098A277620J62137J14861N197l56339k69614P4062M83306l7187M13012k29114
4088A637941L9607n04156P15415K9934r08578N90609L8639M19878n20489o4937
$$ y = [920732, 1167598, 1052326, 1297669, 1115316, 1823424, 954818, 1055907, 1254438, 1383266, 1299418, 1047277, 1325862, 1165123, 1079438, 1084083, 1795099, 1868064, 1722697, 1687583, 1427987, 2131982, 1135703, 1212660, 1285670, 1234782, 1216146, 1285961, 1744940, 1376614, 1374588, 1560974, 1596583, 1695454, 1658867, 1685729, 941152, 2094823, 1366990, 1735763, 2523481, 2004360, 1527278, 1018734, 1481626, 1560724, 1395581, 1817869, 1545707, 1708171, 850619, 1559728, 1588871, 1196156, 2163124, 2080076, 1355300, 987418, 962191, 1288750, 1652122, 1277620, 1439757, 1554618, 1559815, 1203476, 933862, 1007924, 1491230, 1454043, 1867055, 1637941, 1677548, 1173392, 1888807, 1918741, 1010163, 1600772, 1639411, 2059289, 1538800, 1473863]
4078A473863N5075Q20066o80523K44228k25009l58864P94533P5088o76012L72330
4068A894775j83221J35680N88341q57759O10062l65498Q71350o72118K80286P46373
4058C048271l04635l65088p8477Q17724K610k90526J58488j9522k75568N66313
4048C259590J31383J53231L42355n24316k53359N65758k2392n42641M90492M3682
4038C643783j53303l2649Q21402j73106M87798J46926j95960J020156o62483P82606
4028E685170q33514k05404K93924J45725Q2570p44538J038097j229211J118984
4019E351803q58834R13248o33079j66256O38715m11619o87951M36030o35303Q47949
4009D794703J57690Q6745P0499L07108p52575l2938O79679r72607P09621n88621
$$ y = [1473863, 1528938, 2349004, 1668481, 1912709, 1687700, 1328836, 2123369, 2198457, 1522445, 1894775, 1711554, 1847234, 2435575, 1577816, 2187878, 1822380, 2693730, 2021612, 2301898, 3048271, 2743636, 2378548, 2300071, 3117795, 3120405, 2829879, 2988367, 2968845, 2693277, 3259590, 3390973, 3544204, 3886559, 3362243, 3108884, 3674642, 3652250, 3109609, 3600101, 3643783, 3490480, 3457831, 4279233, 4106127, 4593925, 4740851, 4544891, 5565047, 4902564, 5685170, 4851656, 4646252, 4940176, 5085901, 5168471, 4423933, 5462030, 4232819, 5351803, 4492969, 5406217, 4773138, 4606882, 5245597, 4833978, 4146027, 4582057, 3946754, 4794703, 4952393, 5039138, 5109637, 5416745, 4664170, 4631232, 5310911, 4338304, 5047925, 4459304]
3999D459304m9876p8199L0029Q8524L44879R5904j82203P6643l79146j86079P9906
3988D299686r7302K54919q16866n0385K28895O38241l22727l84200m34827m6214
3978C269220k04563N66694m56608P7276n784o9174Q4290q18594K07438j96431
3968B453764m39782L38894K94645n95006J81679k37509k17864N82027o53329J98451
3958A905970K11710l99496k20706K97412m45210J97079O20105p21156m46066J163391
3948B163033o68975n91761O91812k914k67793N8069m0916l0024o61972l74460
3938B74099Q97923K91483l19852J43295k46490P6630o4961M0392Q44378j022910
3928I13987J45146N63670n22380o34700k04178Q66214L34287n65277o7386j27644
$$ y = [4459304, 4409428, 4331229, 4361258, 4449782, 4794661, 4890565, 4708362, 4785005, 4405859, 4219780, 4299686, 4202384, 4457303, 3640437, 3590052, 3818947, 4457188, 4134461, 3750261, 3315434, 3269220, 3064657, 3631351, 3174743, 3252019, 3246235, 3177061, 3261351, 2442757, 2650195, 2453764, 2013982, 2352876, 2647521, 2052515, 2234194, 1996685, 1778821, 2360848, 1707519, 1905970, 2117680, 1718184, 1497478, 1794890, 1349680, 1546759, 2166864, 1445708, 999642, 2163033, 1494058, 902297, 1594109, 1591195, 1323402, 1381471, 1340555, 1310531, 648559, 274099, 1172022, 1463505, 1143653, 1286948, 1040458, 1117088, 1052127, 1092519, 1936897, 913987, 1059133, 1622803, 1100423, 465723, 261545, 1127759, 1462046, 896769, 829383, 701739]
3918G01739n7637O5638J50494m28907K95544K46861l45722k7200J48918K953l17279
3907D35402L47135P69146r36444K37451p1073j90233J74943J25503M62345m84255
3897H69920k41512J0441O68841m89976n47026Q2794O02612K58547j368420J66208
3887A2429R95739M1860m6152j35317J10565m91239J82929L0828N96828r19397
3877C79073J85047j02253O18747q32857J10601O20468o89143J4331Q03327n17686
3867E89655k65604J33786J32245m67957J13599P32129p08055M50642O70741q45435
3857E35746N89518p34427K3898J77893l76651M74249k35685j35635L92028m18759
3847B92175K01585L06940o84574M13817m76541K40741Q2459M55645N19980j219566
$$ y = [701739, 644102, 709740, 860234, 431327, 726871, 973732, 628010, 600810, 749728, 752681, 435402, 782537, 1551683, 615239, 852690, 781617, 591384, 766327, 891830, 1354175, 869920, 628408, 638849, 1307690, 817714, 270688, 353482, 956094, 1214641, -153779, 12429, 1008168, 1050028, 1003876, 868559, 979124, 487885, 670814, 701642, 1298470, 379073, 564120, 461867, 1080614, 247757, 358358, 978826, 289683, 304014, 1107341, 589655, 324051, 457837, 590082, 122125, 235724, 967853, 259798, 710440, 1381181, 535746, 1125264, 390837, 414735, 592628, 215977, 690226, 454541, 318906, 710934, 292175, 493760, 800700, 116126, 529943, 53402, 294143, 376602, 832247, 1352227, 132661]
3837A32661N60601K26038l03686j56095q3402P2688j72811P3847J80704j67929
3827C62616O1814L59985o39718L90183j95806L11894q8117l8263l02095M96099
3817G18592m14204L80851J53320r08828N02624J49338n88558M85220J29109O45595
3807A253059p07041j03517J70949J054k39675Q3957n25524O27431o259r9319r6109
3796C59006p9791K75302k52318K62590J18743l78379R1530o04550N90619n8445
3786C24307o605p50962M40742N55942m90243p7951L78345k77810L64948j15395
3776C45318k06399q2269J57540K15453r1850m62086P10113m54551M35298M55966
3766A022533k95102j1612n88889K35947l43799O58706j26644l3274M40884n30335
$$ y = [132661, 693262, 919300, 615614, 459519, 376117, 448805, 275994, 349841, 530545, 362616, 424430, 784415, 144697, 534880, 339074, 650968, 562851, 524588, 222493, 718592, 304388, 685239, 838559, -70269, 432355, 581693, -6865, 478355, 607464, 1253059, 546018, 442501, 613450, 614504, 374829, 458786, -66738, 560693, 554434, 455115, 359006, 279215, 554517, 302199, 564789, 683532, 305153, 396683, -207867, 382752, 324307, 317702, -433260, 7482, 563424, 73181, -4770, 373575, 95765, 460713, 345318, 138919, 56650, 214190, 429643, 337793, -124293, 585820, 131269, 566567, 1022533, 727431, 715819, 126930, 362877, 19078, 677784, 551140, 517866, 958750, 428415]
3756D28415N8350o4638L26979o62169K86047J16900k90979J84162k92171k42151
3746a51255M92993k05201O72288j127570J010265r20201R94544k66672l08198
3737A90993Q77548n67908q51279J041568j95729K21335p05082L24438M15223m25494
3727C25613j94247l1526M56028k34539J35589M8947j43995j48478k77004O14601
3717E50989k86624j58572N41378l06457L68004M9161o19679L20526L33778l85698
3707D06806M6256O92305r85209J4627M88883Q31n44764J79985J8808L10801m43428
3696A85901R36489j087098O29938r30465L83255K69229L55773m09567o1633L41663
3686F13485M03137k71111J03561o56000K47675O5010J24619O3493P11419j108578
$$ y = [428415, 486765, 422127, 749106, 86937, 372984, 489884, 198905, 383067, 90896, -151255, 341738, 136537, 808825, -318745, 691520, -228681, 765863, 499191, 190993, 1068541, 500633, -350646, 690922, 495193, 716528, 11446, 335884, 751107, 325613, 131366, 99840, 555868, 321329, 456918, 505865, 361870, 213392, -63612, 550989, 264365, 105793, 647171, 340714, 708718, 757879, 138200, 458726, 792504, 406806, 453062, 1145367, 160158, 174785, 663668, 664499, 119735, 299720, 318528, 629329, 185901, 1122390, 35292, 665230, -265235, 118020, 387249, 743022, 333455, 271822, 613485, 1016622, 745511, 849072, 193072, 440747, 505757, 630376, 693869, 1405288, 296710]
3676B96710N63627q76836K76213J13192J12177l5869o74317P65258K7977l00006
3666B68126j88717n9471j53458J16893O06536k70958L87109q9828j36823M58718
3656I38127q14434L19219K68635m56934k36500P85860L14633j426096P54018m64178
3646a7650P22771p08396J067728m98138l92121L79596j03850K01738n40659M76093
3636E87112J60355K43392m77803l45817l71467Q57366r63264P48436L5391m24084
3626D9617J45412M87138J69042n63200M67257J86647k23937k63632k347k5667
3616D26330k78276j46285P13232j49316m6410N20065o12826m06592M80758j6745
3606D83935j88473O77981o1467r07940O3514R43427m55n17113p56757J767166
$$ y = [296710, 860337, -16499, 259714, 372906, 485083, 449214, -225103, 540155, 568132, 268126, 79409, 19938, -133520, -16627, 589909, 318951, 706060, 616232, 479409, 938127, 123693, 442912, 711547, 254613, 18113, 803973, 1118606, -307490, 446528, -17650, 705121, -3275, 1064453, 566315, 174194, 553790, 449940, 651678, 111019, 587112, 747467, 990859, 513056, 167239, -204228, 653138, -310126, 438310, 473701, 49617, 195029, 682167, 851209, 288009, 755266, 941913, 717976, 454344, 451997, 426330, 148054, 1769, 715001, 565685, 519275, 1039340, 426514, 19922, 500680, 483935, 295462, 973443, 911976, 4036, 67550, 1010977, 1010522, 493409, -263348, 1503818]
3596A503818n37978K18332o02639j84114j55648R9929j29516M8264M27229Q2243
3586G69920N4879j57454L70958m23576J22634J15948J53541k82983J038128j385053
3576C76942O57570K21929j56801l2283K48478p05228N87878J43753j81782K74423
3566A434879O9159O61990L43483m13187J1136k69026J74591l5918K42841o44515
3556A575433L59072n72368K90717o229q6186K02557m96644N71437l91560P94663
3546B240892o57814o44602M44759q13008L04872K69540p32503J9939R28794q52836
3536E08033M67783L8356k58287j8470P209J143925m83849r50508O97792o63838
3526D88146P37956k3669L56305p98533O34273m35251n1035K01735K9179p82324
$$ y = [1503818, 965840, 1184172, 581533, 397419, 241771, 341700, 212184, 260448, 687677, 769920, 824799, 667345, 1038303, 614727, 737361, 853309, 1006850, 723867, 1761995, 376942, 1034512, 1256441, 1099640, 1067357, 1315835, 610607, 1198485, 1342238, 1160456, 1434879, 1504038, 2166028, 2509511, 2096324, 2107460, 1838434, 2013025, 1977107, 2219948, 1575433, 1934505, 1362137, 1652854, 1646625, 1560439, 1762996, 1266352, 1837789, 1446229, 2240892, 1583078, 938476, 1383235, 570227, 875099, 1144639, 412136, 432075, 1360869, 508033, 975816, 1014172, 755885, 737415, 744624, 1888549, 1404700, 454192, 1151984, 488146, 1226102, 1202433, 1558738, 760205, 1394478, 959227, 908192, 1109927, 1139106, 356782]
3516C56782Q50031k98500l8132J73730q42858N99424j48784N09526J63374l07293
3506A017300p50667L95989M19874l28110L78226q0855j768L6147Q49900q18361
3496A117675j11619l29741L46624R5013L42239k80866K87153L2230l1619k96391
3486A170698N7212k26178J94476k75266Q48403o96030k16469Q67969j91560k95735
3476A237520j30079P20769m92386j33239J93285K67864J99984n27190L75921M99949
3466B212398m05935J76981L47121j098666P08574K77910l97502R1823j50679M31699
3456B193724m16593K53737K0711P6597K46788Q8938n83065L54927O58541q48448
3446B045857j09726j64068M85521P1905l95250P92553n30446O78412k45214r59910
$$ y = [356782, 1206813, 908313, 870181, 1043911, 201053, 800477, 651693, 1161219, 1324593, 1017300, 266633, 662622, 1082496, 754386, 1132612, 1051757, 1049989, 1086136, 1936036, 1117675, 1006056, 676315, 1022939, 1117952, 1460191, 1179325, 1466478, 1498708, 1467089, 1170698, 1227910, 1001732, 1196208, 920942, 1769345, 1073315, 856846, 1724815, 1533255, 1237520, 1107441, 1828210, 1335824, 1202585, 1395870, 1663734, 1863718, 1336528, 1712449, 2212398, 1806463, 1983444, 2330565, 1231899, 1940473, 2218383, 1820881, 1912704, 1762025, 2193724, 1777131, 2030868, 2051579, 2128176, 2374964, 2463902, 1880837, 2235764, 2894305, 2045857, 1936131, 1772063, 2257584, 2329489, 1934239, 2726792, 2196346, 2874758, 2629544, 1669634]
3436A669634P72186m33975R07946p65931K36097l61063K03998N84338l16499J90659
3426B687390K73559J49615k6079r5699J94670K25032M64283j040745Q26910l55478
3416C303458K51555n6614K32050o90762Q37731M5694J60347L68303L8048J36504
3406D626314n9963L1216k05540K24740K3823L31422l05306J033800k43554l56159
3396E100793N20852P8453J68904o43866N20252q02P13709o89030K16462J165496
3386G151223q44965O39816O41829L07146o98230L74036P3844J056839l4057M19694
3376I087175O65597j10262P5681L21611O12356M83370O51281l89128P38797R2719
3366A2229197P45324P97155l5559N77101P24919J426472M50006J263432Q07768
$$ y = [1669634, 2441820, 2007845, 2915791, 2149860, 2385957, 2024894, 2228892, 2813230, 2496731, 2687390, 2960949, 3110564, 3084485, 2988786, 3183456, 3408488, 3872771, 2832026, 3658936, 3303458, 3555013, 3498399, 3730449, 3039687, 3877418, 3923112, 4083459, 4451762, 4489810, 4626314, 4566351, 4597567, 4392027, 4616767, 4640590, 4972012, 4666706, 5700506, 5456952, 5100793, 5621645, 5700098, 5869002, 5225136, 5745388, 5744586, 6458295, 5769265, 5985727, 7151223, 6306258, 6946074, 7587903, 7895049, 7196819, 7570855, 7644699, 8701538, 8667481, 9087175, 9752772, 9642510, 9718191, 10039802, 10652158, 11135528, 11786809, 11397681, 12136478, 12229197, 12974521, 13771676, 13736117, 14313218, 15038137, 16464609, 16914615, 18178047, 18985815]
3357A8985815J002677J933921M97866J413543J330308J013209K431731J455311
3349C0064381K856919K714254L014992M460545N680242N500395O023004P442347
3341F7757079Q619825J0352225R866311J4855808J6270109J7895774J7288773
3334A62905904J5998323J6447362J6947899J5905368J0202770N83556o058684
3327B32932498p304368r772692j3276061j1700467j1457022j5330656j5479534
3320A48611698j3759625j1119412j0451086r706374j1462860r760790q858028
3313G3493523p794941p048285n735873n114868n182844l873682m078416l163998
3305C1500616l568645j889623k046808j969965j318347j481469j169049j109191
$$ y = [18985815, 19988492, 21922413, 22420279, 23833822, 25164130, 26177339, 28609070, 30064381, 32921300, 35635554, 38650546, 43111091, 48791333, 54291728, 60314732, 67757079, 76376904, 86729129, 96595440, 111451248, 127721357, 145617131, 162905904, 178904227, 195351589, 212299488, 228204856, 238407626, 238991182, 232932498, 225628130, 215855438, 202579377, 190878910, 179421888, 164091232, 148611698, 134852073, 123732661, 113281575, 103575201, 92112341, 82351551, 73493523, 65698582, 58650297, 52914424, 47799556, 42616712, 38743030, 34664614, 31500616, 27931971, 26042348, 23995540, 22025575, 20707228, 19225759, 18056710, 16947519]
3297A6947519p33848j393889o93722m71335j84839j022889p32015o56653r5682
3288A0962647p23713n42547m4033q74767K85595l58436p77244o5362J0278l07038
3278G565380l81165p59974L25098n58435K46099O0714p33879n5938k30962O7041
3268E543979Q4669j30844o91125M75618j051685R00492l94225J6667l2998o75879
3258D044669k0037K89002j066128Q13677j46989J20468o30593L35886k25127k8093
3248C486735q2806l06796p7082j697M59988r34098P39217p40530P72938j69839
3238C146030k04633l89069J97994n4253j19924J9709N60411N6960l02644k81446
3228B629135j03379p6833R7451J33693K84799m37946J61724o63574L66711n04806
$$ y = [16947519, 16213671, 14819782, 14126060, 13654725, 13469886, 12446997, 11714982, 11058329, 10962647, 10238934, 9696387, 9652354, 8777587, 9063182, 8704746, 7927502, 7862140, 7872418, 7565380, 7184215, 6424241, 6749339, 6190904, 6437003, 6497717, 5763838, 5707900, 5476938, 5543979, 5628648, 5497804, 4806679, 5282297, 4230612, 5131104, 4736879, 4753546, 4720548, 4044669, 4024632, 4313634, 3247506, 4061183, 3914194, 4034662, 3404069, 3739955, 3514828, 3486735, 3403929, 3097133, 3020051, 3018354, 3478342, 2544244, 3283461, 2542931, 3315869, 3146030, 2941397, 2552328, 2750322, 2696069, 2576145, 2595854, 3156265, 3213225, 2910581, 2629135, 2525756, 2448923, 2546374, 2680067, 2964866, 2526920, 2688644, 2025070, 2391781, 1886975]
3218A886975K4061N63415n45058L86867J30583k24770m47648M38583l68993K36956
3208B080971j22260l71819j4297N00755n40991P21098j90096k63452L36143J28409
3198B264461k62398k76951l89626K34289o7429j74217J77739l02359P31563q88440
3188A046632K26968R5964j98820M47910m15873N50529j065567M38860R40367l2100
3178B034870q78461K97172P952k67362J27134K64189m4895j49909p39323R97862
3168A649229j20991m5618n16182N34072K5551l34598j26824J003982p11411l74214
3158I82996J52415K91836n43620L31564J12946j47727o2716k21868J00847L5937
3148A032610K56813M14634p52323R2386K5045K67652k50179j24289l56298O65114
$$ y = [1886975, 1911036, 2474451, 1929393, 2316260, 2446843, 2222073, 1774425, 2213008, 1844015, 2080971, 1958711, 1586892, 1572595, 2073350, 1532359, 2253457, 2063361, 1799909, 2136052, 2264461, 2002063, 1725112, 1335486, 1569775, 1502346, 1328129, 1505868, 1203509, 1935072, 1046632, 1273600, 1369564, 1170744, 1618654, 1202781, 1753310, 687743, 1126603, 2066970, 2034870, 1156409, 1453581, 1461533, 1194171, 1321305, 1585494, 1540599, 1390690, 651367, 1649229, 1528238, 1482620, 966438, 1500510, 1526061, 1191463, 1064639, 2068621, 1357210, 982996, 1135411, 1427247, 883627, 1215191, 1328137, 1180410, 1117694, 895826, 996673, 1032610, 1289423, 1704057, 951734, 1044120, 1069165, 1336817, 1086638, 962349, 606051, 1271165]
3138A271165p51381L6937N46120j28975k74947O4169l50035L63795m1088J142922
3128A878682j069068m44239K46511j57484J50162J34429k74352K20408P28278
3119A413327k03384R8819k09444K39687J27113l88860L61546o38400K03764l31014
3109F73154j13190N86156L55360o19617N96515N01049q59600N90791j19291o66594
3099I24733R05302j42429J52051M5009K7108N10601q43829P73619K4463p13809
3089A662819k6655M65295q16097K00911J48844J502l4421l31267J82128k34797
3079A218262N7915m82901O7557M67427n44668P31847j226175L30677O18775m29216
3069H09500K2392p39418O08895q2990O5030L57310k28332k16182j06219L87857
$$ y = [1271165, 519784, 556721, 1102841, 973866, 698919, 763088, 413053, 776848, 735760, 1878682, 809614, 365375, 611886, 454402, 604564, 738993, 464641, 685049, 1413327, 1209943, 1308762, 1099318, 1339005, 1466118, 1077258, 1438804, 800404, 1004168, 673154, 559964, 1146120, 1501480, 881863, 1478378, 1979427, 1119827, 1710618, 1591327, 924733, 1830035, 1687606, 1839657, 1884666, 1911774, 2422375, 1578546, 2352165, 2376628, 1662819, 1636164, 2101459, 1285362, 1486273, 1635117, 1636619, 1602198, 1270931, 1453059, 1218262, 1276177, 793276, 860833, 1328260, 783592, 1515439, 289264, 619941, 1238716, 809500, 831892, 92474, 701369, 618379, 683409, 1040719, 812387, 596205, 489986, 877843]
3059H77843K36866k93932l16100N50376n69132K35044J91263n73316l25671J28753
3049A41994K23816M17469k56862K16003l59226m71484j32890J258103k64347K05850
3039I78426n94303N94034n30459r2756J61593J61469Q331K47206l59917q19018
3029b45394J199160K4930r376n96382N97607k94364j8947k29800L23470l88752
3019C62152N18614l28j02978J12538l94502P11001m80774l76878j52233M54899
3009F51511k73833M88041K19689r9962j37333k8686q11027M57752M01021k4340
2999H42833k47299j7811m88808L44979j53643J14215j46814J47637M70027n96158
2989B69158O96849m87876P66m40999P19811m62207m19847L64499J95370n2400
$$ y = [877843, 1114709, 820777, 504677, 1055053, 485921, 720965, 912228, 338912, 13241, 141994, 365810, 783279, 526417, 742420, 383194, -88290, -221180, 1036923, 772576, 978426, 384123, 978157, 447698, 354942, 516535, 678004, 686335, 933541, 573624, -245394, 953766, 978696, 969320, 372938, 970545, 676181, 657234, 427434, 750904, 362152, 880766, 880438, 777460, 889998, 495496, 1206497, 725723, 348845, 196612, 651511, 377678, 865719, 1085408, 985446, 848113, 819427, 8400, 466152, 867173, 842833, 595534, 577723, 88915, 433894, 280251, 394466, 247652, 395289, 865316, 269158, 966007, 478131, 478897, 37898, 757709, 295502, -124345, 240154, 435524, 383124]
2979C83124l19758K95342p06K25485P84829o07585m09357j43951N23469l12862
2969D18030j96192N39447N237N56k76351o5744M89305p70052N10244K16301r17113
2958d6332N05941l46597K11149j00057M00984m88026Q60678J73377p26052J66507
2948F11572L1160N41724r92263K43342p05737O04741K9331Q470M03058q91332
2938a15934R08130Q0035o21741Q03051l38533M30741j004981M77162o73847P67042
2928G11125n09180m8660j51978K2414o8424R44405n29292j58993R90140r15806
2918B85751M02900m9549K12995q14824k93068N25974K73598L5848R1923p3037
2908E98511m18362J18588o04426J267015k68784J26017K10604m63957J1974Q760
$$ y = [383124, 63366, 358708, 358002, 583487, 1368316, 760731, 351374, 207423, 730892, 418030, 221838, 761285, 766522, 767078, 490727, 424983, 914288, 144236, 654480, 870781, -46332, 459609, 113012, 324161, 224104, 625088, 137062, 997740, 1171117, 445065, 611572, 642732, 1184456, 192193, 435535, -270202, 334539, 363870, 372340, 775398, -115934, 792196, 872231, 250490, 1053541, 715008, 1145749, 140768, 617930, -55917, 711125, 201945, 153285, 1307, 23721, -44703, 899702, 370410, 211417, 1201557, 285751, 688651, 639102, 852097, 37273, -255795, 270179, 543777, 579625, 671548, 598511, 180149, 298737, -305689, 961326, 692542, 818559, 1029163, 565206, 577180, 585940]
2898E85940l77642l0307J29685M05210L4127n2935M32712j017223O91134k57451
2888E43250N84338r39683j7972k77676O61337p06802P40586o2857k04948l88495
2878f8922R77273J73451o22784r0192r9799K41469l67407k45164L89109K83211
2868E70245r505o3407L65723J01731p44829o2012M13909o16496N01263K07895
2858F64517p12330Q21462j50736r3257J40213n31187O04640m89870j10865M28783
2848E71370o20794K40430M37633k06855K68172l0519k93338j06475J62062q4193
2838C37493P88389j60201r16639M96714j33652n39823k6606L41658J08879Q59513
2828A155725n30013k62442J6306L8446L5145K29806r81095M54392M48325J01494
$$ y = [585940, 208298, 177991, 307676, 712886, 747013, 694078, 1126790, 109567, 800701, 543250, 1127588, 187905, 169933, -107743, 553594, -153208, 587378, 524521, 319573, -68922, 908351, 1081802, 459018, 368826, 269027, 510496, 143089, -102075, 287034, 570245, 560740, 497333, 863056, 964787, 219958, 157946, 571855, -44641, 456622, 664517, -47813, 773649, 622913, 529656, 669869, 138682, 743322, 253452, 142587, 571370, -49424, 191006, 628639, 421784, 689956, 659437, 366099, 259624, 421686, 337493, 1125882, 965681, 49042, 545756, 412104, -127719, -154325, 187333, 296212, 1155725, 625712, 363270, 379576, 418022, 453167, 682973, -298122, 156270, 604595, 706089]
2818G06089p21721N49950q0763j56822j09287M7798r3193l77763P00650j22926
2808C42012l14255O37732n34425P4478m1275N20838m35970j7583Q44863r4471
2798I81944p31062L94255J57655m23621m63727J0167M81920K32130o38405Q2407
2788H3663K80890L02827O51887j185499M92817m41201j74724l26749P34476J11814
2778E30201k29328m45023O15411p16087J11022R78187j094201O61060m57326N94671
2768E48587p56544J47350N81169l41756K17715Q9588k57970r3511N74899j92921
2758E16606K94300l53980N65204n50382n76132O42383K61854m86569N5750n15422
2748a46388N22368M8674l53308M82014j53038K51858j02836n35525K39858M57617
$$ y = [706089, -15632, 534318, 453555, 296733, 187446, 235244, 142051, -235712, 464938, 342012, 27757, 665489, 131064, 205542, 164267, 685105, 249135, 231552, 1076415, 981944, 250882, 645137, 802792, 379171, -84556, -74389, 407531, 639661, 1256, 83663, 364553, 667380, 1319267, 133768, 626585, 185384, 10660, -316089, 418387, 530201, 300873, -144150, 471261, -244826, -133804, 844383, -249818, 411242, -46084, 548587, -207957, -60607, 520562, 178806, 396521, 486109, 228139, 134628, 709527, 516606, 810906, 456926, 1022130, 471748, -104384, 537999, 799853, 313284, 369034, -146388, 375980, 424654, 71346, 553360, 400322, 652180, 549344, 13819, 253677, 711294]
2738G11294n65956N45472l35157L99183L3375m51479k88728m56243K51233Q68151
2728G11145p44436O25245j207784R26520K12651p7077l94543K39388L84000m19812
2718B55297k93841J72487j5427k28992N00105K05395n34302P43661k14366j65082
2708D24935O31804n51469k96854P7472J36288m4960l50487P10508m27066J50147
2698D60318J04551l85411P38760j193695M54464L55435k74762k37630M31962o25834
2688a71842J38407P20134n44197L36316n17668m93968Q97454N65018o09015R8813
2678D19452k58524N75398l92367J65248M75393j046228K05258m0086m9344O68176
2668G22376o73514O9364r5427J28518K48197m31882M80521J5652n19811M90949
$$ y = [711294, 145338, 690810, 355653, 754836, 788211, 336732, 48004, -408239, -157006, 711145, -33291, 591954, -615830, 310690, 523341, 446264, 51721, 291109, 675109, 255297, -38544, 133943, 118516, -110476, 389629, 595024, 60722, 804383, 590017, 424935, 1056739, 505270, 208416, 285888, 422176, 377216, 26729, 737237, 310171, 460318, 564869, 179458, 918218, -275477, 178987, 534422, 259660, 22030, 453992, -171842, -33435, 686699, 142502, 478818, -38850, -532818, 364636, 929654, 320639, 419452, 160928, 736326, 343959, 509207, 984600, -61628, 143630, 103544, 54200, 722376, 48862, 118226, 22799, 151317, 399514, -32368, 448153, 463805, -56006, 434943]
2658D34943n26274O09122n93012J334287j417520j66414J97551O03555m18692
2649E7546N45335n45173n12168R38202k96837P7328L77373l32549k91950R9188
2639A16295n2733J57398L5823L58245n19715j40437J38773Q90095o16233j13284
2629B54227r9998M16444l33995p2262J83654l17105l8003N73681K93878m93980
2619C66541o2513j20580L11419m37816K25061O34962j204600M35895k5225K92963
2609D16107L53840m36444l83520j59385N12472J56414m17476K8681m60636O80995
2599B91048k84244K03405K23620j69491l64171O07678j041425O88495l51980Q05267
2589F08202k63126L66031N10747r82158K55978J95562r71045Q47285l9250L50406
$$ y = [434943, -91331, 517791, -75221, 1259066, -158454, -324868, -127317, 476238, 57546, 602881, 57708, -454460, 483742, 186905, 264233, 641606, 309057, 17107, 116295, 63562, 220960, 256783, 615028, 95313, -45124, 93649, 983744, 367511, 254227, 154229, 570673, 236678, 164416, 348070, 30965, -7038, 566643, 860521, 366541, 304028, 183448, 494867, 57051, 282112, 917074, -287526, 148369, 123144, 416107, 769947, 333503, -50017, -209402, 303070, 459484, 42008, 70689, -389947, 291048, 6804, 210209, 433829, 264338, -99833, 507845, -533580, 154915, -197065, 608202, 345076, 711107, 1221854, 239696, 495674, 691236, -279809, 567476, 528226, 878632]
2579H78632p01284L66138n73316L80266j28237M42449j4649K24414K08180j107204
2569b4611N01489j92988J66758k99305k82943l655K37437k93102L33426J12604
2559B55110K68040l28797j32834k1000M38196n59948N41537q60287O33995M49843
2549F83855j96336j10694R5238k82740k82732J99933k03176M70948k28405n3848
$$ y = [878632, 177348, 543486, -29830, 350436, 222199, 664648, 649999, 874413, 1082593, -24611, 476878, 283890, 450648, 151343, -131600, -135255, 102182, -190920, 142506, 255110, 523150, 194353, 61519, 40519, 478715, -81233, 460304, -399983, 234012, 683855, 487519, 376825, 472063, 189323, -93409, 106524, -96652, 374296, 145891, 92043]
$$ [...]
##END NTUPLES=NMR SPECTRUM
##END=
