##TITLE=abcd
##JCAMPDX= 6.0         $$ Bruker NMR JCAMP-DX V2.0
##DATA TYPE= NMR SPECTRUM
##DATA CLASS= NTUPLES
##ORIGIN= UXNMR, Bruker Analytische Messtechnik GmbH
##OWNER= root
$$ XWIN-NMR		Version 3.5
$$ Sun Feb 16 10:45:33 2025 Russian Standard Time (UT+4h)  servis@DPX200
##.OBSERVE FREQUENCY= 200.131235884673
##.OBSERVE NUCLEUS= ^1H
##.ACQUISITION MODE= SIMULTANEOUS
##.ACQUISITION SCHEME= undefined
##.AVERAGES= 8
##.DIGITISER RES= 18
##SPECTROMETER/DATA SYSTEM= spect
##.PULSE SEQUENCE= zg
##.SOLVENT NAME= DMSO
##.SHIFT REFERENCE= (INTERNAL, DMSO, 0, 16.4885)
##AUDIT TRAIL= $$ (NUMBER, WHEN, WHO, WHERE, WHAT)
$$ ##TITLE= Audit trail, XWIN-NMR		Version 3.5
$$ ##JCAMPDX= 5.01
$$ ##ORIGIN= Bruker BioSpin GmbH
$$ ##OWNER= servis
$$ F:\spectra/data/av/nmr/H1/1/pdata/1/auditp.txt
$$ ##AUDIT TRAIL=  $$ (NUMBER, WHEN, WHO, WHERE, WHAT)
(   1,<2025-02-16 10:44:58.03 +0400>,<servis>,<DPX200>,
      <created by zg, POWCHK disabled, PULCHK disabled
       terminated by command 'halt'
       configuration hash MD5:
       00 E9 B6 7A A2 85 ED C7 34 08 36 98 17 FE 4E 26
       data hash MD5: 32K
       17 85 E4 75 CD 53 9C CC 62 7A 86 AA 5E 9F 01 9C>)
(   2,<2025-02-16 10:44:59.75 +0400>,<servis>,<DPX200>,
      <Start of raw data processing
       efp BC_mod = 2 LB = 0.05 FT_mod = 6 PKNL = 1 PHC0 = -262.1254 PHC1 = 1.301534 SI = 16K 
       data hash MD5: 16K
       AF 99 08 06 DC 3C 50 93 DD 5E D2 3A 72 B9 84 2F>)
(   3,<2025-02-16 10:45:13.07 +0400>,<servis>,<DPX200>,
      <pk PHC0 = -1 PHC1 = 0 
       data hash MD5: 16K
       6C 5C C8 2B 23 88 3C 50 DB 7C 7E B9 F7 33 E4 4F>)
$$ ##END=
$$ 
$$ hash MD5
$$ 20 B8 6B E0 09 1D 81 F0 41 16 74 3C 0D E1 5F 91
##$RELAX= 
##$RELAX= 
##$RELAX= 
##$RELAX= 
##$RELAX= 
##$RELAX= 
##$RELAX= 
##$RELAX= 
$$ Bruker specific parameters
$$ --------------------------
##$DU= <F:\spectra>
##$EXPNO= 1
##$NAME= <H1>
##$PROCNO= 1
##$TYPE= <nmr>
##$USER= <av>
##$AMP= (0..31)
100 100 100 100 100 100 100 100 100 100 100 100 100 100 100 100 100 100 
100 100 100 100 100 100 100 100 100 100 100 100 100 100 
##$AQSEQ= 0
##$AQ_mod= 1
##$AUNM= <au_zg>
##$AUTOPOS= <>
##$BF1= 200.13
##$BF2= 200.13
##$BF3= 200.13
##$BF4= 200.13
##$BF5= 500.13
##$BF6= 500.13
##$BF7= 500.13
##$BF8= 500.13
##$BYTORDA= 1
##$CFDGTYP= 0
##$CFRGTYP= 5
##$CHEMSTR= <none>
##$CNST= (0..31)
1 1 145 1 1 1 1 1 1 1 1 1 1 1 1 1 1 1 1 1 1 1 1 1 1 1 1 1 1 1 1 1 
##$CPDPRG= <>
##$CPDPRG1= <>
##$CPDPRG2= <>
##$CPDPRG3= <>
##$CPDPRG4= <mlev>
##$CPDPRG5= <mlev>
##$CPDPRG6= <mlev>
##$CPDPRG7= <mlev>
##$CPDPRG8= <mlev>
##$CPDPRGB= <>
##$CPDPRGT= <>
##$D= (0..31)
0 2 0 0 0 0 0 0 0 0.06 0 0 0 0 0 0 0.0002 0 0 0 0 0 0 0 0 0 0 0 0 0 0 
0 
##$DATE= 1739688297
##$DBL= (0..7)
120 120 120 120 120 120 120 120 
##$DBP= (0..7)
150 150 150 150 150 150 150 150 
##$DBP07= 0
##$DBPNAM0= <>
##$DBPNAM1= <>
##$DBPNAM2= <>
##$DBPNAM3= <>
##$DBPNAM4= <>
##$DBPNAM5= <>
##$DBPNAM6= <>
##$DBPNAM7= <>
##$DBPOAL= (0..7)
0.5 0.5 0.5 0.5 0.5 0.5 0.5 0.5 
##$DBPOFFS= (0..7)
0 0 0 0 0 0 0 0 
##$DE= 6
$$ [...]
##$SUBNAM4= <"">
##$SUBNAM5= <"">
##$SUBNAM6= <"">
##$SUBNAM7= <"">
##$SUBNAM8= <"">
##$SUBNAM9= <"">
##$SW= 20.6817932712277
##$SWIBOX= (0..15)
0 0 3 0 0 0 0 0 0 0 0 0 0 0 0 0 
##$SW_h= 4139.07284768212
##$TD= 32768
##$TD0= 1
##$TE= 0
##$TE2= 300
##$TE3= 300
##$TEG= 300
##$TL= (0..7)
0 120 120 120 120 120 120 120 
##$TP= (0..7)
150 150 150 150 150 150 150 150 
##$TP07= 0
##$TPNAME0= <>
##$TPNAME1= <>
##$TPNAME2= <>
##$TPNAME3= <>
##$TPNAME4= <>
##$TPNAME5= <>
##$TPNAME6= <>
##$TPNAME7= <>
##$TPOAL= (0..7)
0.5 0.5 0.5 0.5 0.5 0.5 0.5 0.5 
##$TPOFFS= (0..7)
0 0 0 0 0 0 0 0 
##$TUNHIN= 0
##$TUNHOUT= 0
##$TUNXOUT= 0
##$USERA1= <user>
##$USERA2= <user>
##$USERA3= <user>
##$USERA4= <user>
##$USERA5= <user>
##$V9= 5
##$VALIST= <valist>
##$VCLIST= <CCCCCCCCCCCCCCC>
##$VD= 0
##$VDLIST= <DDDDDDDDDDDDDDD>
##$VPLIST= <PPPPPPPPPPPPPPP>
##$VTLIST= <TTTTTTTTTTTTTTT>
##$WBST= 1024
##$WBSW= 30
##$XGAIN= (0..3)
0 0 0 0 
##$XL= 0
##$YL= 0
##$YMAX_a= 265287
##$YMIN_a= -186751
##$ZGOPTNS= <>
##$ZL1= 120
##$ZL2= 120
##$ZL3= 120
##$ZL4= 120
##$ABSF1= 0
##$ABSF2= 0
##$ABSG= 0
##$ABSL= 0
##$ALPHA= 0
##$AQORDER= 0
##$ASSFAC= 0
##$ASSFACI= 0
##$ASSFACX= 0
##$ASSWID= 0
##$AUNMP= <proc_1d>
##$AZFE= 0.1
##$AZFW= 0.1
##$BCFW= 0
##$BC_mod= 2
##$BYTORDP= 0
##$COROFFS= 0
##$CY= 18.4799938201904
##$DATMOD= 1
##$DC= 0
##$DFILT= <>
##$DTYPP= 0
##$F1P= 9.9274215381318
##$F2P= -0.165520771350173
##$FCOR= 1
##$FTSIZE= 16384
##$FT_mod= 6
##$GAMMA= 0
##$GB= 0
##$INTBC= 1
##$INTSCL= 4.127829e-11
##$ISEN= 128
##$LB= 0.05
##$LEV0= 0
##$LPBIN= 0
##$MAXI= 10000
##$MC2= 0
##$MEAN= 0
##$ME_mod= 0
##$MI= 50
##$NCOEF= 0
##$NC_proc= -7
##$NLEV= 6
##$NOISF1= 3.799351
##$NOISF2= 2.8
##$NSP= 0
##$NTH_PI= 0
##$NZP= 0
##$OFFSET= 16.48848
##$PC= 4
##$PHC0= -263.1254
##$PHC1= 1.301534
##$PH_mod= 1
##$PKNL= yes
##$PPARMOD= 0
##$PSCAL= 4
##$PSIGN= 0
##$REVERSE= no
##$SF= 200.130005582386
##$SI= 16384
##$SIGF1= 3
##$SIGF2= 2
##$SINO= 400
##$SIOLD= 16384
##$SREGLST= <1H.CDCl3>
##$SSB= 0
##$STSI= 16384
##$STSR= 0
##$SW_p= 4139.07284768211
##$SYMM= 0
##$S_DEV= 0
##$TDeff= 32768
##$TDoff= 0
##$TI= <>
##$TILT= no
##$TM1= 0
##$TM2= 0
##$TOPLEV= 0
##$USERP1= <user>
##$USERP2= <user>
##$USERP3= <user>
##$USERP4= <user>
##$USERP5= <user>
##$WDW= 1
##$XDIM= 16384
##$YMAX_p= 366027864
##$YMIN_p= -1364347
$$ End of Bruker specific parameters
$$ ---------------------------------
##NTUPLES= NMR SPECTRUM
##VAR_NAME=  FREQUENCY,     SPECTRUM/REAL,   SPECTRUM/IMAG
##SYMBOL=    X,             R,               I
##VAR_TYPE=  INDEPENDENT,   DEPENDENT,       DEPENDENT
##VAR_FORM=  AFFN,          ASDF,            ASDF
##VAR_DIM=   16384,         16384,           16384
##UNITS=     HZ,            ARBITRARY UNITS, ARBITRARY UNITS
##FACTOR=    0.252644378177508, 1,           1
##FIRST=     3299.83951724647, 0,            0
##LAST=      -839.233330435636, 0,           0
##MIN=       -839.233330435636, -1364347,    0
##MAX=       3299.83951724647, 366027864,    0
$$ Real data points
##PAGE= N=1
##DATA TABLE= (X++(R..R)), XYDATA
$$ [...]
6728I96480R5946o1011k11858N2418J79902l15021J00375j48020j1553J50275
6718H27933q933j29177J53772k18532j03327L60229k43007o7288K2228j02013
6708D91885K03795k37824J05739j40311K46882o7923O3894l2992O856j25751K02786
6697G17036j94802k2473Q1674N4440k2630N2000q2085K0920j34572l9140j281
6686D29087J10982k99654J94923k2916J42687q4534J3381r5199J55103q0333O4005
6675E27532j88639R9832j95037J09673P9072k00414J45416k9886m7595N9159j28136
6664B30977K2454J08016p9966k2097J46742j71935k04349o8623K09994Q1061O8608
6653C20882p3827r6216J71902K4177j71984j71499K58688j50561j27456R5849
$$ y = [996480, 1092426, 1031415, 819557, 871975, 1051877, 736856, 837231, 689211, 677658, 827933, 819000, 689823, 843595, 625063, 521736, 881965, 638958, 571670, 593898, 491885, 695680, 457856, 563595, 423284, 670166, 602243, 666137, 633145, 640001, 514250, 717036, 522234, 499761, 581435, 635875, 613245, 665245, 583160, 604080, 469508, 430368, 429087, 540069, 240415, 435338, 412422, 555109, 470575, 483956, 388757, 543860, 463527, 527532, 338893, 438725, 243688, 353361, 432433, 232019, 377435, 347549, 299954, 359113, 230977, 253431, 361447, 281481, 259384, 406126, 234191, 29842, -38781, 171213, 252274, 320882, 247055, 150839, 322741, 346918, 174934, 3435, 262123, 111562, -15894, 79955]
6643G9955J25654j22041j48980J04475k35611M22247l47231L12574j51977J97260
6633B36325j46352m5727p9502M4441R4975R795m7457m2548n3163J68907j58691
6622a8997L8488o710Q3623P9017J03763q7402L0479q3978O3068j94956J38794
6611A45189j00022J67071j23128J5140J63297J5680j40955j26219M8661q9660
6601b4946J03940n6102L18802j23306r2404L9092q7698j36813J49139O5696q4235
6590G1165M634j2904j10595K10970j10249J31661R8403l01142J94329m6361j8551
6579A11360k6594R4156N4151j84001L0026j44738O6005m3076J9836O4202j80687
6568a39360J68236j36832J20804Q3702k14048J67206j33607Q9537j65020J5297
$$ y = [79955, 205609, 83568, -65412, 39063, -196548, 225699, -121532, 191042, 39065, 236325, 89973, 44246, -35256, 9185, 104160, 113955, 66498, 23950, -29213, 139694, -18997, 19491, 12781, 96404, 175421, 279184, 191782, 222261, 138283, 201351, 6395, 145189, 45167, 212238, 89110, 104250, 267547, 283227, 142272, 16053, 64714, -24946, 78994, 22892, 341694, 218388, 125984, 165076, 77378, -59435, 89704, 155400, 71165, 75799, 62895, -47700, 163270, 53021, 184682, 283085, -18057, 176272, 129911, 111360, 84766, 178922, 233073, 49072, 79098, -65640, 365, -42711, -22875, 41327, -139360, 28876, -107956, 12848, 96550, -117498, 49708, -83899, 5638, -159382, -144085]
6558a44085J69183p9015L2330m9937R6655j00490O0631P1071j51313J20765L9916
6547F5711L4626j43718j04040P151J55423k6260p6178M9382n8328o6332k3658
6536a86221K31107n9106k9151K27800j59022M0538n0432j49018K78799j52457
6526g163m5768j2234O9885q4547Q8956O191j03134P2261J90727k5192j30905K04211
6514B23288k40492K10534j44838J15646k7461m1694N3904m2250J4600J16105k5010
6503B12332r9204K23176j85977N4768l6604J40607o7677o5867K42605j52410J39188
6492D04937j44711m2063J30346k796K4139k30638K23084n2764m9034J7537l7519
6481B40518R4361l8454R1394M9078J27300k30786O8751K22579o2839J58590k40763
$$ y = [-144085, 25098, -53917, -21587, -71524, 25131, -75359, -14728, 56343, -94970, 25795, 65711, 100337, -43381, -147421, -140270, 15153, -11107, -87285, -37903, -96231, -162563, -186221, 44886, -14220, -43371, 184429, 25407, 65945, 15513, -133505, 145294, -7163, -52931, -65165, 4720, -79827, 9129, 15320, -87814, -15553, 175174, 149982, 19077, 223288, -17204, 193330, 48492, 164138, 136677, 94983, 148887, 106637, 121237, 237342, 212332, 113128, 336304, 150327, 205095, 168491, 309098, 241421, 175554, 418159, 265749, 404937, 260226, 218163, 348509, 345713, 369852, 139214, 362298, 309534, 260500, 278037, 240518, 334879, 296425, 387819, 436897, 564197, 333411, 402162, 624741, 561902, 720492, 479729]
6470D79729J62204j10754K8288L5061r3270J50313j712R9722j89899o2522J66074
6459F63234J87473j27700p5188R8678j58635L18259P6208k8400M236r1869k0090
6448H46206J07115M645J22864N2414O6407o5413P7652o5782N9527J02017j51210
6437A156442k0693K66183n8116o0822J14471J02391J22168r8284Q0086N1773j21771
6426A533828M2183Q0564K2888J68745m061J32476k41982J11071K67460n5207J93681
6415B251646j0117q8141J69296m3283j81406R8328J15627L5985J45200k10417
6405B282718K03974L7896M4350J71209K11288j8438K6081J68144Q6801J19355
6395C333378J7689R6465N5534J07188K69705K88129m0786J77081J65205j52961
$$ y = [479729, 641933, 531179, 559467, 594528, 501258, 651571, 649859, 749581, 559682, 497160, 663234, 850707, 723007, 647819, 746497, 587862, 906121, 982329, 953929, 958165, 866296, 846206, 953321, 957966, 1080830, 1133244, 1199651, 1134238, 1211890, 1146108, 1205635, 1307652, 1156442, 1135749, 1401932, 1343816, 1282994, 1397465, 1499856, 1622024, 1523740, 1603826, 1655599, 1533828, 1576011, 1656575, 1679463, 1848208, 1844147, 1976623, 1734641, 1845712, 2113172, 2057965, 2251646, 2241529, 2153388, 2322684, 2279401, 2097995, 2196323, 2311950, 2347935, 2493135, 2282718, 2486692, 2524588, 2568938, 2740147, 2951435, 2932997, 2959078, 3127222, 3214023, 3333378, 3351067, 3447532, 3503066, 3610254, 3879959, 4168088, 4127302, 4304383, 4469588, 4316627]
6385D316627K25823L15769J21693P0351M12264J18917J78388J10801K59959J87185
6375F317777K15746J90824M43141J7238M68029K83822N25315M6894M99268M74565
6365I482619L01199K89815N52643N42434M32921L67249O17703O62949O70822N88527
6355A4508881P26220P55855P86167R00270R69659J075633R17845J257655J034951
6346B2933136J335225J241293J509056J520868J657697J605440J853478J648077
6338C5304270J842416J978845J669502J946423J861861J618613J629863J451870
6330D9303663J403896J448588J209814J304597J330848J201300J379808J289841
6322E9872355J534205R60158J599246J462320J423026J123807J262316P62643
$$ y = [4316627, 4542450, 4858219, 4979912, 5050263, 5462527, 5581444, 5759832, 5870633, 6130592, 6317777, 6533523, 6724347, 7167488, 7184726, 7652755, 7936577, 8461892, 8508786, 9008054, 9482619, 9783818, 10073633, 10626276, 11168710, 11601631, 11968880, 12586583, 13249532, 13920354, 14508881, 15235101, 15990956, 16777123, 17677393, 18647052, 19722685, 20640530, 21898185, 22933136, 24268361, 25509654, 27018710, 28539578, 30197275, 31802715, 33656193, 35304270, 37146686, 39125531, 40795033, 42741456, 44603317, 46221930, 47851793, 49303663, 50707559, 52156147, 53365961, 54670558, 56001406, 57202706, 58582514, 59872355, 61406560, 62366718, 63965964, 65428284, 66851310, 67975117, 69237433, 70000076]
6314G0000076R03317L35192p3378l10508k75502j169414q59869j292896r90541
6305F6266477j492846j564863j478339j211081j400002j270514j298373r14744
6297E5635715j294304j316658j007726r88702j402904j311889j540635j393552
6289D5379345j442617j712666j536406j452854j695175j299537j587781j539211
6281C3113098j284889j368435j130078j252901j208017q96962j095426j165089
6273B3711301o28532q44692o28881p80223p15688n42919o62052n24607o00668
6264A7783039n59912o14862k18883m80083l97984m11668l30599l41779m88888
6255A3938381l06263j10927q636n45647o0639l23054k37833r9148j52450j84628
$$ y = [70000076, 70903393, 71238585, 71165207, 70854699, 70579197, 69409783, 68549914, 67257018, 66266477, 64773631, 63208768, 61730429, 60519348, 59119346, 57848832, 56550459, 55635715, 54341411, 53024753, 52017027, 51028325, 49625421, 48313532, 46772897, 45379345, 43936728, 42224062, 40687656, 39234802, 37539627, 36240090, 34652309, 33113098, 31828209, 30459774, 29329696, 28076795, 26868778, 25971816, 24876390, 23711301, 23082769, 22238077, 21609196, 20828973, 20113285, 19570366, 18908314, 18383707, 17783039, 17223127, 16608265, 16389382, 15909299, 15511315, 15099647, 14769048, 14427269, 13938381, 13632118, 13521191, 13512555, 12966908, 12906269, 12583215, 12345382, 12246234, 12093784, 11909156]
6245A1909156j55633j10286M4659k04074j22334k546n4440n7641j22909N848M993
6234A1134793j22125K59485m0910L4267l5688M7217n0806K546J08879J73093J36755
6223A1647506J94995J55147r1857L61771K46345j1366K88516K45441K10985L81060
6213A3628543J70898L80539L89812L97297L89990J56258M38337N28356N61312
6204A7041342M30910O58168M90471L61049P88987P76665N95438R30690M71546
6195B2545266J199640P99657J058923J009585J159273J355066R96386J518261
6187C1642057J422933J304549J744263J310014J890299J540157J872325J723889
6179D4450486J583858J712797J316271J614396J591904J405276J479172J305356
$$ y = [11909156, 11753523, 11643237, 11687896, 11483822, 11361488, 11358942, 11304502, 11246861, 11123952, 11129800, 11134793, 11012668, 11272153, 11231243, 11265510, 11229822, 11277039, 11226233, 11228779, 11337658, 11510751, 11647506, 11842501, 11997648, 11905791, 12267562, 12513907, 12502541, 12791057, 13036498, 13247483, 13628543, 13799441, 14179980, 14569792, 14967089, 15357079, 15513337, 15951674, 16480030, 17041342, 17472252, 18130420, 18620891, 18981940, 19770927, 20547592, 21143030, 22073720, 22545266, 23744906, 24544563, 25603486, 26613071, 27772344, 29127410, 30123796, 31642057, 33064990, 34369539, 36113802, 37423816, 39314115, 40854272, 42726597, 44450486, 46034344, 47747141, 49063412, 50677808, 52269712, 53674988, 55154160, 56459516]
6171E6459516J263349J295791J318966J365388J481015J203713J777926J444773
6163F7610437J587351J506975J896663J652772J668462J320882J089995J098144
6155G9431681Q05343L12297J07722j73595l15851o83697q70300r05441r45356
6146G6762803j111101p79800r34531j105533p11848o11166r45140o09767n85625
6137F9368292l69986p24188n45874p65222m77663q89087r62250p07800j026648
6128F2899574q88201j004232q03563q48950p08027o60478n18130m71613k0680
6119E6975700k97363R9315l16264N05287K34202M90862O70048Q78720P96365J340615
6109F1377487J332832J730958J746023J755715K417825K464747K855289K721536
$$ y = [56459516, 57722865, 59018656, 60337622, 61703010, 63184025, 64387738, 66165664, 67610437, 69197788, 70704763, 72601426, 74254198, 75922660, 77243542, 78333537, 79431681, 80237024, 80549321, 80657043, 80483448, 80167597, 79483900, 78613600, 77708159, 76762803, 75651702, 74871902, 73937371, 72831838, 72119990, 71508824, 70563684, 69953917, 69368292, 68998306, 68274118, 67728244, 66963022, 66485359, 65596272, 64634022, 63926222, 62899574, 62011373, 61007141, 60203578, 59354628, 58646601, 57986123, 57467993, 56996380, 56975700, 56678337, 56777652, 56461388, 56966675, 57200877, 57691739, 58361787, 59240507, 60036872, 61377487, 62710319, 64441277, 66187300, 67943015, 70360840, 72825587, 75680876, 78402412]
6101G8402412L411734L579816L566810M374457M528790M904772N088824N637576
6093A13495191O046373O349427O727087P202661P469383Q115934Q559713Q474170
6085A72439939R163913R106656R544266Q831861Q978357Q346510P197570O207325
6077B39816397M574482L160092J311981n86990k531971m003868n774429o746249
6069B29219445p719199q352825q909083q883597r080651r171691q612706q507185
6061A59982508q158259p566898p337531o986922o382867o074622n469761n689352
6053A06316296m939090m697990m386523m094399m121542l593893l486271l388795
6045G3607793k973077k877705k590545k718446k573649k335256k164840j898536
$$ y = [78402412, 81814146, 85393962, 88960772, 93335229, 97864019, 102768791, 107857615, 113495191, 119541564, 125890991, 132618078, 139820739, 147290122, 155406056, 163965769, 172439939, 181603852, 190710508, 200254774, 209086635, 218064992, 226411502, 233609072, 239816397, 244390879, 247550971, 248862952, 248275962, 245743991, 241740123, 235965694, 229219445, 221500246, 213147421, 204238338, 195354741, 186274090, 177102399, 168489693, 159982508, 151824249, 144257351, 136919820, 129932898, 123550031, 117475409, 112005648, 106316296, 101377206, 96679216, 92292693, 88198294, 84076752, 80482859, 76996588, 73607793, 70634716, 67757011, 65166466, 62448020, 59874371, 57539115, 55374275, 53475739]
6037E3475739k010227j822121j786392j637038j658979j506972j432551j088458
6029D0533001j651755j137815j174200j182607j013461j059470r98299q64768
6021C1450626r00525q72024q97685q12342o93548o22232p33919n26989o69112
6012B4722250n17458o23607n17635p13140n37506j45073q58344l61591l92867
6003B0055029l35663m37475m91205j55509l65891n23131k29985k94844k08871
5994A7012455m17909m09501j93266p2611l11224l22924k62374j30162j01641m27416
5984A4363427j66648j20793k04155j81582k07077j61368q4182k95041J32359k00104
5974A2874836l82264R2780o0704k56878J77507l53583k3189j65430n6873k23493
$$ y = [53475739, 51465512, 49643391, 47856999, 46219961, 44560982, 43054010, 41621459, 40533001, 38881246, 37743431, 36569231, 35386624, 34373163, 33313693, 32315394, 31450626, 30550101, 29678077, 28780392, 27968050, 27274502, 26652270, 25918351, 25391362, 24722250, 24204792, 23581185, 23063550, 22350410, 21812904, 21667831, 20809487, 20447896, 20055029, 19719366, 19281891, 18790686, 18635177, 18269286, 17746155, 17516170, 17221326, 17012455, 16594546, 16185045, 15991779, 15919168, 15607944, 15285020, 15022646, 14892484, 14790843, 14363427, 14196779, 14075986, 13871831, 13690249, 13483172, 13321804, 13237622, 12942581, 13074940, 12874836, 12492572, 12585352, 12524648, 12267770, 12445277, 12091694, 12068505, 11903075, 11846202, 11622709]
5964A1622709j92236N0460J5940k04203n7153Q5155j64836k919j47514J695R5836
5953A1102934k41693J67995k36622k53561J6129k26630j80793k82527l33803j37319
5943I394110j72804k40452k30032j82911l24l14474r9432k82258M3595k11864
5933G703154k66069k21733J3464j26249j50560R9507j24182o1948k15112r4869
5923F555403m9699j04400Q1744J49201k93227N3747l56043M3535O3012j62484
5913E980789R921k01660J23291n4165n7446R5694j626k35745K97408R8595l41009
5902E714047Q3139l27943K9856K46590J13576l43710j3969K16221Q6343l22049
5892E482101J03520M7643p0167j20126j03428O7615M3148K4789j84440L072k12665
$$ y = [11622709, 11430473, 11480933, 11496873, 11292670, 11235517, 11320672, 11155836, 11152917, 11005403, 11007098, 11102934, 10861241, 11029236, 10792614, 10539053, 10555182, 10328552, 10147759, 9865232, 9531429, 9394110, 9221306, 8980854, 8750822, 8567911, 8567587, 8253113, 8153681, 7871423, 7915018, 7703154, 7437085, 7215352, 7228816, 7102567, 6952007, 7051514, 6927332, 6865384, 6650272, 6555403, 6505704, 6401304, 6483048, 6632249, 6339022, 6392769, 6036726, 6080261, 6143273, 5980789, 5990710, 5789050, 5912341, 5858176, 5800730, 5896424, 5894798, 5659053, 5956461, 6055056, 5714047, 5797186, 5469243, 5499099, 5745689, 5859265, 5515555, 5501586, 5717807, 5804150, 5482101, 5585621, 5633264, 5563097, 5442971, 5339543, 5407158, 5450306, 5475095, 5290655, 5293727, 5081062]
5881E081062O4767o4715j72610L8654k2782l9334o1654j77741j0816r06p5269
5870D558656q8437J91201k23174m3608k27715K00138j15273j20156r7547j05584
5860C928501P6459p719j2438r9854r7001j14424L01922k74288q4432j22763K3317
5849C517280m3073J25810k52700R9154o3453K11165k60402m0830K12977l76790
5839C129138P162K06471j82560m4235j15735m4172K4586j26668j9949j8916M7857
5828B862979k5129k31233p192l2347Q8357j53955J58825k87288K3628n7033r3457
5817B246155N5891m1289J75406j26548k24030j4203R5018n3183R607j65067Q4706
5806B042463k1426j29771J58897k53763J33159j90705J24577p7195J05660k14552
$$ y = [5081062, 5145829, 5081114, 4908504, 4947158, 4924376, 4885042, 4823388, 4645647, 4634831, 4633925, 4558656, 4470219, 4661420, 4438246, 4394638, 4166923, 4367061, 4251788, 4131632, 4034085, 3928501, 4004960, 3997241, 3984803, 3884949, 3787948, 3673524, 3975446, 3701158, 3616726, 3493963, 3517280, 3474207, 3600017, 3347317, 3446471, 3383018, 3594183, 3333781, 3292951, 3505928, 3129138, 3136300, 3342771, 3160211, 3115976, 3000241, 2956069, 2980655, 2853987, 2834038, 2815122, 2862979, 2837850, 2606617, 2599425, 2567078, 2655435, 2501480, 2660305, 2373017, 2396645, 2339612, 2246155, 2302046, 2260757, 2436163, 2309615, 2085585, 2071382, 2166400, 2113217, 2122824, 1957757, 2042463, 2021037, 1891266, 2050163, 1796400, 1929559, 1738854, 1863431, 1786236, 1891896, 1677344]
5796A677344J38732o197J56957k73380J25819j34410M1434N9628N4053j78782
5786A661198M6753Q6841j00517L0540o1055M1068j0724n0139K25164K3256j46568
5775A745817k09792L67452j61003k0555J5066m751j17828J12130P0658n2851r7422
5764A646921L7014J3977j41600J35739p9148J84156k65028Q0235K8551m4092R8675
5753A695400J27767k34743r0519L50797l57787L68853R1793k71924P8505j40782
5743A617360m687P3515k11485K13244Q6417q0758l1463M2809j68040K7880O4517
5732A629309P0414j23580k41763L25306n1543J6701m32551K87783K27243k08520
5722A498799j1585j34730R9743k757K20036j70399r7775J97773j42018L6575O3678
$$ y = [1677344, 1816076, 1809879, 1966836, 1693456, 1819275, 1684865, 1726299, 1785927, 1839980, 1661198, 1707951, 1794792, 1694275, 1724815, 1663760, 1704828, 1694104, 1643965, 1869129, 1892385, 1745817, 1536025, 1903477, 1742474, 1721919, 1736985, 1732234, 1614406, 1726536, 1797194, 1744343, 1646921, 1683935, 1697912, 1556312, 1692051, 1612903, 1797059, 1532031, 1612266, 1640817, 1596725, 1695400, 1823167, 1588424, 1497905, 1848702, 1490915, 1859768, 1951561, 1679637, 1758142, 1617360, 1612673, 1686188, 1474703, 1687947, 1774364, 1693606, 1662143, 1704952, 1536912, 1564792, 1629309, 1699723, 1576143, 1334380, 1659686, 1608143, 1624844, 1192293, 1480076, 1707319, 1498799, 1487214, 1352484, 1452227, 1449470, 1669506, 1499107, 1401332, 1599105, 1457087, 1493662, 1557340]
5711A557340J4915N0003j71411o825L3000n5972J38470j32984J59471l0937j9626
5700A535444k49754K61666r5539O6508n8797j15350j9859O9454q0961J57826j3085
5689A457553k8930N985k12617L07255j74082M3752k55541J76020r1306k8706Q3344
5678A282727M232O5211j12795P9092j13062P4273J31269k06406P6502k3104k0874
5667A237065n1625M0257j28573M6019O4609M379q2012N5597l0607J80182o8498
5656A266793r6686j55521k5605K95633m9130j39579J49113O8621q2506N9258l09716
5645I80675K75828p4726m318o6585Q9466J271O9000m4116o8430J14910N3747k63596
5633A063126R5698P5672p379M8255L3024j25966L2701o8276J65057p4958M9358
$$ y = [1557340, 1572255, 1622258, 1450847, 1444022, 1477022, 1421050, 1559520, 1426536, 1586007, 1555070, 1535444, 1285690, 1547356, 1451817, 1518325, 1459528, 1344178, 1324319, 1393773, 1312812, 1470638, 1457553, 1428623, 1434608, 1221991, 1529246, 1355164, 1398916, 1143375, 1319395, 1228089, 1199383, 1282727, 1286959, 1352170, 1239375, 1318467, 1205405, 1279678, 1410947, 1204541, 1281043, 1257939, 1237065, 1185440, 1225697, 1097124, 1143143, 1207752, 1212131, 1130119, 1185716, 1155109, 1335291, 1266793, 1170107, 1014586, 988981, 1284614, 1235484, 1095905, 1245018, 1313639, 1231133, 1290391, 980675, 1256503, 1181777, 1177459, 1110874, 1200340, 1201611, 1270611, 1226495, 1158065, 1272975, 1326722, 1063126, 1158824, 1234496, 1227117, 1275372, 1308396, 1182430, 1215131, 1146855, 1311912, 1236954, 1286312]
5622A286312O3731l5531j46650R3965O7937J19057j00468o8626J87513K04607
5612A671847k01182o991P356K72586k4001K09079j00743O2641L54287n419M5680
5601B285140J4437M81967M8529r270M04726J23312J47078o3753j38571j62212
5591C131383j78361Q019j70874r3164j38126k86535J28161n5125j28229j42229
5581B074920R4338j78075K11396k25974O9978J8735J47174k00297j31P1211K22186
5570B305461j63592o9348J89965n2825J06760j68007P4742r5402O2018m8385l4364
5559B107023M95646l45632O1049J79194l03213K16876m6466j61786M10844k03099
5549B410436N6235j172n8792K92101j51925J06216N510j1171K46235j47830J819
$$ y = [1286312, 1350043, 1314512, 1167862, 1261827, 1329764, 1448821, 1348353, 1279727, 1467240, 1671847, 1470665, 1463674, 1471030, 1743616, 1719615, 1928694, 1827951, 1890592, 2244879, 2239460, 2285140, 2299577, 2781544, 2830073, 2820803, 3225529, 3348841, 3495919, 3432166, 3293595, 3131383, 2953022, 2961041, 2790167, 2697003, 2558877, 2272342, 2400503, 2345378, 2217149, 2074920, 2169258, 1991183, 2202579, 1976605, 2046583, 2065318, 2212492, 2012195, 2012064, 2083275, 2305461, 2141869, 2072521, 2262486, 2209661, 2316421, 2148414, 2223156, 2127754, 2189772, 2141387, 2107023, 2602669, 2257037, 2318086, 2497280, 2194067, 2410943, 2364477, 2202691, 2613535, 2410436, 2466671, 2465499, 2406707, 2698808, 2546883, 2653099, 2658609, 2647438, 2893673, 2745843, 2747662]
5538B747662K83706j04716K67449K5402L7633P5059K03203r3524L5657m9438M12599
5527C840692p8925p3748K17814K90713K2740L49212n314M9511L19976J44443J37034
5516E214148L53001k00133M20761K87941J67844K93241J26902K31062M44550K17492
5506G556809M36083J88737L91626L08932N86332K28414L80039M86458M58136O83131
5496A1704697M31522O73295K23077Q12543Q11912M67687Q07805N43695P62666
5487A7238899Q44067O34652R48094P15305Q04194O81418J055764R22335R38911
5478B4783639Q78820J169648R24417P87728J211690J257851J033284J076541Q74023
5469C3997641Q52480P85809Q28554J024089O49345P25285O96500P80417Q18150
$$ y = [2747662, 3031368, 2926652, 3194101, 3219503, 3257136, 3332195, 3535398, 3441874, 3477531, 3428093, 3840692, 3761767, 3688019, 3905833, 4196546, 4219286, 4568498, 4563184, 4612695, 4932671, 5077114, 5214148, 5567149, 5367016, 5787777, 6075718, 6243562, 6536803, 6663705, 6894767, 7339317, 7556809, 7992892, 8181629, 8573255, 8882187, 9468519, 9696933, 10076972, 10563430, 11021566, 11704697, 12136219, 12809514, 13032591, 13845134, 14657046, 15124733, 15932538, 16476233, 17238899, 18082966, 18717618, 19665712, 20381017, 21185211, 21866629, 22922393, 23844728, 24783639, 25662459, 26832107, 27756524, 28544252, 29755942, 31013793, 32047077, 33123618, 33997641, 34850121, 35635930, 36464484, 37488573, 38137918, 38863203, 39559703, 40340120, 41158270]
5460D1158270N65419N61387R38522O64462P95929L31789P93595O06689N75028
5451D6991090L86860L22647O02599J37064L87440L35684K83360K43618M8036Q2625
5441D9821023J35148K28684q1564K21679j18406j18426l6753j69348j91088l91497
5431D9299452j58324m20080l15437m41130m06176m33336p45841o62062n20166
5422D5196900o08297o73480o02198j020680q23317m47857q22188p70386q66402
5413C8562095r38573n09961q78633r25518q19367p48489q43495j099884p67053
5404C1031122p72552j005074n44679j004180o58678q10927r44348o36203o66491
5395B3987990q93503o42217o77898p30617m29590o23964p71672p74258k35611
$$ y = [41158270, 41723689, 42285076, 43223598, 43888060, 44683989, 45015778, 45809373, 46416062, 46991090, 47377950, 47700597, 48303196, 48440260, 48827700, 49163384, 49446744, 49690362, 49738398, 49821023, 49956171, 50184855, 50103291, 50324970, 50206564, 50088138, 50051385, 49882037, 49690949, 49299452, 49141128, 48721048, 48405611, 47964481, 47558305, 47124969, 46379128, 45717066, 45196900, 44588603, 43915123, 43312925, 42292245, 41468928, 41021071, 40198883, 39428497, 38562095, 37623522, 37113561, 36234928, 35309410, 34490043, 33741554, 32898059, 31798175, 31031122, 30258570, 29253496, 28708817, 27704637, 27045959, 26235032, 25290684, 24654481, 23987990, 23094487, 22452270, 21774372, 21043755, 20614165, 19990201, 19218529, 18444271, 18208660]
5386A8208660p89386l92362n55722p42643k88395m51863l32151n84636l36048
5377A3735454l92442k57349m90136k95327m60688k603m37427j90541k46894k03542
5367A0758505k42816k45632k12363o5631j49117k24034o8529K06016j67800N6675
5357I645274j91141Q9572k14261R2947J2413K29042p1576J73755J42281J68271
5347A0076577K57588K93481L00360L74595K60214M59247N41012M57750O42901
5338A3663725O93793O43647Q78647J111821J282143J457694J758714K172994J968212
5329B5631390R64502O80587M28882K59848P0128J14699K03231L17928O57485R24348
5319C0253028R13807J370262J748596K144958K431717K561875K485237K869860
$$ y = [18208660, 17419274, 17026912, 16471190, 15728547, 15440152, 14988289, 14656138, 14071502, 13735454, 13343012, 13085663, 12595527, 12300200, 11839512, 11836909, 11399482, 11208941, 10962047, 10758505, 10515689, 10270057, 10057694, 9992063, 9842946, 9618912, 9550383, 9756399, 9588599, 9645274, 9454133, 9543705, 9329444, 9422391, 9434804, 9663846, 9592270, 9766025, 9908306, 10076577, 10334165, 10627646, 10928006, 11302601, 11562815, 12022062, 12563074, 13020824, 13663725, 14357518, 15001165, 15879812, 16991633, 18273776, 19731470, 21490184, 23663178, 25631390, 26595892, 27276479, 27705361, 27965209, 28035337, 28150036, 28353267, 28671195, 29328680, 30253028, 31166835, 32537097, 34285693, 36430651, 38862368, 41424243, 43909480, 46779340]
5311D6779340K535651L027371L010765L186461L059255L387725K536808K170579
5303F9693955K224238K081839J991587J798620J450227O40390J16310n93133r67533
5294G8436500j092305j629526j428120k182630k283724k929578l042274l157234
5286F0691109k878446k989563l240726l242996k902014l177664k971011k835401
5278C6453288k804355k548771j903112k330894j860816j706108j463707j147059
5270B0688466j265340j476414o61204j129490p89627n77983p78756q13818n65966
5261A2629868l20304p04852m16772n14388n10888k72516k37028k50507n94051
5252H808562k70216k28537l50605k18560k84039j59109j89400k46423q7727m48926
$$ y = [46779340, 49314991, 52342362, 55353127, 58539588, 61598843, 64986568, 67523376, 69693955, 71918193, 74000032, 75991619, 77790239, 79240466, 79880856, 79997166, 79404033, 78436500, 77344195, 75714669, 74286549, 72103919, 69820195, 66890617, 63848343, 60691109, 57812663, 54823100, 51582374, 48339378, 45437364, 42259700, 39288689, 36453288, 33648933, 31100162, 29197050, 26866156, 25005340, 23299232, 21835525, 20688466, 19423126, 17946712, 17285508, 16156018, 15366391, 14788408, 14009652, 13195834, 12629868, 12309564, 11604712, 11187940, 10673552, 10162664, 9890148, 9653120, 9402613, 8808562, 8538346, 8309809, 7959204, 7740644, 7456605, 7297496, 7108096, 6861673, 6773946, 6325020]
5242F325020L3741k02221m43646P9866k09365k16573R2948j39810j84227j71062
5232D964671k21523q6344L2083j51112o1525j09128Q0981m5009m2105l21648j60593
5221C878748J52354N6562k88251l0167N5233k1970q9370k45962J34577j59463
5211C442291O4418O2109j43925P9652l58110K09199k41099j14821K76975j88106
5201C088583j23140K6721l8391j32593j02284n6325J15946k5125J58953m1040
5191B871305j60148r2515p344J00528o7448j19913O2661N335j47457n0254J71004
5180B565754m12828M8996Q6362j47508q9296K40665j11381P1964J8535j19072
5170B152191j30604J69632n6527k62239K01515k70145k32K0252N2797j36233J44151
$$ y = [6325020, 6358761, 6156540, 5712894, 5792760, 5583395, 5366822, 5459770, 5319960, 5135733, 4964671, 4743148, 4656804, 4688887, 4537775, 4476250, 4367122, 4448103, 4403094, 4360989, 4039341, 3878748, 4031102, 4087664, 3799413, 3769246, 3824479, 3802509, 3713139, 3467177, 3601754, 3442291, 3506709, 3568818, 3424893, 3504545, 3146435, 3355634, 3114535, 2999714, 3276689, 3088583, 2965443, 2992164, 2953773, 2821180, 2718896, 2662571, 2778517, 2753392, 2912345, 2871305, 2711157, 2618642, 2611298, 2711826, 2644378, 2524465, 2587126, 2592461, 2445004, 2394750, 2565754, 2152926, 2201922, 2288284, 2140776, 2051480, 2292145, 2180764, 2252728, 2271263, 2152191, 2021587, 2191219, 2134692, 1872453, 2073968, 1803823, 1803591, 1823843, 1876640, 1740407, 1884558]
5159A884558n1632k0358n502m6021j38832J76772l5505q6163j83379K98547n6659
5148A735826r3078M679k49709M5615Q0756m1802l9581R1481q1309P9922j38418
5137A394382O0195m5524J72873n2542j24943l8454N0361Q4517J6883j1873k60558
5126A245317R981M1948Q8066J37738j64453o7398J00726r8528o5777J6665n0332
5115A193953J21516n766P13q2806j34070J86333q1167N0708M3351o1606k12094
5104A019065L40377O1513l04231J17399o1915R805J27713m13288K65321J0983
5094A172742J05080p3219m994j21510K56801k05798K05265l0996k30594J87129
5084A259906O5804l3154l2903J7081J1262P8718j2955L1936J26918j57663p1473
$$ y = [1884558, 1832926, 1812568, 1807066, 1761045, 1622213, 1798985, 1763480, 1677317, 1493938, 1792485, 1735826, 1642748, 1647427, 1397718, 1443333, 1524089, 1482287, 1442706, 1534187, 1452878, 1532800, 1394382, 1454577, 1409053, 1581926, 1529384, 1404441, 1365987, 1416348, 1500865, 1517748, 1505875, 1245317, 1255298, 1297246, 1385312, 1523050, 1358597, 1291199, 1391925, 1293397, 1227620, 1244285, 1193953, 1315469, 1309703, 1310416, 1227610, 1093540, 1279873, 1198706, 1249414, 1292765, 1231159, 1019065, 1359442, 1420955, 1116724, 1234123, 1172208, 1182013, 1309726, 896438, 1161759, 1172742, 1277822, 1204603, 1199609, 1078099, 1334900, 1129102, 1334367, 1303371, 1072777, 1259906, 1325710, 1292556, 1259653, 1276734, 1287996, 1366714, 1353759, 1385695, 1512613, 1354950, 1283477]
5073A283477J30961M618J33194j09297M2545r2769J80872J54258k06704R3917
5063A615072P9111j3692K12556j16025K45391N9825m7280k63522J87294j517J45471
5052B102684j7533O9080j40844R0627K11501j27021K50782P1352J41756J3861
5042B666245Q6466m2537J85877Q7115k1344M01945j0456j37107K94610J99880
5032C710694j5323J72130K09292P7077K23259M7918K32687K40989K21418J65879
5022E286020K86713K37002L0457M04338K74155M69318J31678M69668L22754M12994
5012H325097J71901P15159M57395O88487L39249P18358O06732N98484P43635R46594
5002A4311091P91121P28164J012646Q68221J085877R43984R85500R41127J231273
$$ y = [1283477, 1414438, 1419056, 1552250, 1442953, 1485498, 1392729, 1573601, 1727859, 1521155, 1615072, 1694183, 1680491, 1893047, 1777022, 2022413, 2082238, 2034958, 1771436, 1958730, 1957213, 2102684, 2085151, 2154231, 2013387, 2104014, 2315515, 2188494, 2439276, 2510628, 2652384, 2666245, 2752711, 2710174, 2896051, 2983166, 2961822, 3363767, 3353311, 3216204, 3510814, 3710694, 3695371, 3867501, 4076793, 4153870, 4377129, 4425047, 4657734, 4898723, 5120141, 5286020, 5572733, 5809735, 5840192, 6244530, 6518685, 6988003, 7119681, 7589349, 7912103, 8325097, 8496998, 9212157, 9669552, 10358039, 10697288, 11415646, 12022378, 12620862, 13364497, 14311091, 15102212, 15830376, 16843022, 17711243, 18797120, 19741104, 20726604, 21667731, 22899004]
4993B2899004J210515J239955J417387R74103J481512R89895J544773J191630
4985C2948774J178415J087122J328216J210850J271318J282120J391502J032770
4977D2731087J399527J311511R50362J343881J126037J081651J261058J083651
4969E2288765J305132J270406J655941K010361K591626K795424L960947M901894
4961G2780496L115454n70112j804898j989371l806176m452209l987083m300577
4953E4985524l418003l720605l501651l072129k841624k255690k020982k159818
4945C1995022j646136j811320j535152j543682j231061j141578j237139j088610
4937B0760344j236830q07535q66870q28584q95026q93043o16908o14682m20125
$$ y = [22899004, 24109519, 25349474, 26766861, 27740964, 29222476, 30212371, 31757144, 32948774, 34127189, 35214311, 36542527, 37753377, 39024695, 40306815, 41698317, 42731087, 44130614, 45442125, 46392487, 47736368, 48862405, 49944056, 51205114, 52288765, 53593897, 54864303, 56520244, 58530605, 61122231, 63917655, 67878602, 72780496, 75895950, 75325838, 73520940, 71531569, 67725393, 63273184, 59286101, 54985524, 51567521, 47846916, 44345265, 41273136, 38431512, 36175822, 34154840, 31995022, 30348886, 28537566, 27002414, 25458732, 24227671, 23086093, 21848954, 20760344, 19523514, 18715979, 17849109, 17020525, 16125499, 15232456, 14615548, 14000866, 13580741]
4928A3580741n74976o18592m68367m75295m18255l15648l11872m30969p74824
4919I191943J7387m96188k37036m22158l03995l62120l02866k22663k48438K9291
4909F643157l18810j97974l10943k29232j28066j29780M3669k94915j89552k27646
4899D659908r7454n9229K2346k6894k04006l83884J48500r7040o8472j4432m4470
4888C834873j77911j16339M3664L424k75074K13291j46119r404o2438q1170Q9339
4877C316136j95350Q2153p0850O1018j62166J4495N8156j06096J33789j19930
4867C011355r6465J28420K5049M322n5673m271Q5079j05600K00835j00099l6904
4856C056048K90401k22905J9810L01432k2128J83489k13475L12930l9639K82581
$$ y = [13580741, 13005765, 12387173, 11918806, 11443511, 11025256, 10709608, 10397736, 9966767, 9191943, 9209330, 8713142, 8476106, 8053948, 7749953, 7387833, 7084967, 6862304, 6613866, 6643157, 6324347, 6126373, 5815430, 5586198, 5458132, 5328352, 5372021, 5077106, 4887554, 4659908, 4562454, 4503225, 4525571, 4498677, 4294671, 3910787, 4059287, 3962247, 3893775, 3879343, 3834873, 3656962, 3540623, 3584287, 3587711, 3312637, 3525928, 3379809, 3370405, 3307967, 3226797, 3316136, 3120786, 3202939, 3132089, 3193107, 3030941, 3045436, 3103592, 2997496, 3131285, 3011355, 2914890, 3043310, 3068359, 3072681, 3017008, 3012737, 3097816, 2992216, 3193051, 3092952, 3056048, 3346449, 3123544, 3143354, 3444786, 3422658, 3606147, 3392672, 3705602, 3665963, 3948544]
4846C948544L58279m7134L14220L44137K8684K25733L01787K06279L67111K52689
4836F300329K77696O68060P56028O82071R67927R46197P44632L74973k16935k93357
4826A1207621n56066l25364p07068n19739n69719o45117m89258l94795l68641
4817F631854m21694k45324j82526k84109j72599j66775k53802j78164p4103j79620
4807D473138k84169k95080o9214m6552l01546n420j61216K136l17846o3572k20234
4796B710425J83809L6164k24259n5015R8820r0460k37617J77756K2467k78213
4786B343877n0482J55145l0517k12622J02988p7101J18307l18450L2307J15915
4776B179367j0801R337n801K07010j69094J9283m8698n1748K21047L7113k604
$$ y = [3948544, 4306823, 4259689, 4573909, 4918046, 4946730, 5172463, 5474250, 5680529, 6047640, 6300329, 6578025, 7246085, 8002113, 8684184, 9652111, 10598308, 11342940, 11717913, 11500978, 11207621, 10651555, 10326191, 9619123, 9099384, 8529665, 7884548, 7395290, 7000495, 6631854, 6210160, 5964836, 5782310, 5498201, 5325602, 5158827, 4905025, 4726861, 4652758, 4473138, 4188969, 3893889, 3824675, 3778123, 3476577, 3471157, 3309941, 3312077, 2994231, 2930659, 2710425, 2894234, 2930398, 2706139, 2651124, 2749944, 2659484, 2421867, 2599623, 2622090, 2343877, 2293395, 2448540, 2418023, 2205401, 2308389, 2231288, 2349595, 2031145, 2063452, 2179367, 2168566, 2177903, 2172102, 2379112, 2210018, 2229301, 2180603, 2128855, 2349902, 2387015, 2384411]
4765B384411J1569J01630J26840j20240p983K1244j69068J86638P3456K5034k02493
4754B431038J21496l4933m6623j85242J7790M0908j64102K69475n5524O7691K4082
4743B486056l48316K0812J50557m8922K9581m1435P8597j35393j86568L55083
4733B360052N3124q3065J24126k27081K72100k09652R8769l3840J70732k13938
4723B311327J23124P2855p7636q6819J64362N2572j1523J14052j10647J1577J8561
4712B581805J02944P7361K8169P606l5174j20155K99469l759n6149R93k4108M7115
4700B906117J61873j88184Q3026r7525J78768J29888m547L4357j38810K10975
4690C275938j04063p1354K63349l6338J39391l5290L1890n0931K18600j31961
$$ y = [2384411, 2395980, 2497610, 2624450, 2504210, 2496227, 2517471, 2348403, 2535041, 2608497, 2633531, 2431038, 2552534, 2517601, 2470978, 2285736, 2303526, 2344434, 2180332, 2449807, 2394283, 2461974, 2486056, 2137740, 2158552, 2309109, 2260187, 2289768, 2248333, 2326930, 2191537, 2004969, 2360052, 2413176, 2330111, 2454237, 2227156, 2499256, 2289604, 2388373, 2354533, 2525265, 2311327, 2434451, 2507306, 2429670, 2342851, 2507213, 2559785, 2548262, 2662314, 2551667, 2563244, 2581805, 2684749, 2762110, 2790279, 2797885, 2762711, 2642556, 2942025, 2938266, 2882117, 2883110, 2859002, 2906117, 3067990, 2879806, 2962832, 2865307, 3044075, 3173963, 3169416, 3203773, 3064963, 3275938, 3171875, 3100521, 3363870, 3327532, 3466923, 3431633, 3463523, 3412592, 3631192, 3499231]
4680C499231j13631L93614j77415K19018j09117J83415J19083p6609Q6551J31843
4670D155983N6735r8312K61261J44277N703l5500J75735j34583J80893M2109K20027
4659D974328j0189J26392J6989L2397K11432j25585K79588K14717M7241L5174
4649E802484P5702J66511L8714L11500j70565J46541L03343Q8424J15782K11489
4639G089925Q8857K59415L63682J42414K54737J59229L76058K07679L72422k4893
4629I289525J14841M84776M03290L83496M36258K31502L37343M70310K39855O01882
4619A2993078M13006M26763O54506O07693M97854P69086L54151P81012R07249
4610A8404398P31620Q50744J057559R47689J199588R66754J332544J400017J237591
$$ y = [3499231, 3385600, 3779214, 3601799, 3820817, 3711700, 3895115, 4014198, 3937589, 4024140, 4155983, 4212718, 4114406, 4375667, 4519944, 4525647, 4490147, 4665882, 4531299, 4712192, 4754301, 4974328, 4964139, 5090531, 5107520, 5139917, 5351349, 5225764, 5505352, 5720069, 5767310, 5802484, 5878186, 6044697, 6083411, 6394911, 6224346, 6370887, 6674230, 6762654, 6878436, 7089925, 7178782, 7438197, 7801879, 7944293, 8199030, 8358259, 8734317, 8941996, 9314418, 9289525, 9404366, 9889142, 10292432, 10675928, 11112186, 11343688, 11681031, 12151341, 12391196, 12993078, 13406084, 13832847, 14487353, 15095046, 15592900, 16361986, 16716137, 17497149, 18404398, 19136018, 19986762, 21044321, 21992010, 23191598, 24158352, 25490896, 26890913, 28128504]
4601B8128504J530221J512711J818598J702751J959148J942366K213776K323233
4593D3131308K447490K661430K548748K645245L033390K898856K816961K772324
4585F4955752K955528K571723K571628K392150K052735K036314J494306J235573
4577H2265709J075401Q35624O44633K40318j30774m68785n70234q75360j091851
4568H1924681j361944j904733j747929j970030k358282k447279k313556l009067
4560F4811861k498181k445635k691172k534574k220019k368631k278383k178790
4552D5596476k007282j898706j791555j641964j722859j339567j325849j445861
4544C2422833j258492r33946j236910q68694p59598q59129q38384p59719r11680
$$ y = [28128504, 29658725, 31171436, 32990034, 34692785, 36651933, 38594299, 40808075, 43131308, 45578798, 48240228, 50788976, 53434221, 56467611, 59366467, 62183428, 64955752, 67911280, 70483003, 73054631, 75446781, 77499516, 79535830, 81030136, 82265709, 83341110, 84176734, 84821367, 85061685, 84930911, 84462126, 83891892, 83016532, 81924681, 80562737, 78658004, 76910075, 74940045, 72581763, 70134484, 67820928, 64811861, 62313680, 59868045, 57176873, 54642299, 52422280, 50053649, 47775266, 45596476, 43589194, 41690488, 39898933, 38256969, 36534110, 35194543, 33868694, 32422833, 31164341, 30230395, 28993485, 28124791, 27365193, 26506064, 25667680, 24907961, 23996281]
4535B3996281o59325m65760n96643l65250o69212o01740l62732m47654m65992
4526A9361973j90660m53598l79322k71628l11650k56479j05873l18596j35954
4517A6938213k92511l18677r3641j40657J51232j90433k37898J15807k18029J59383
4507A5872789j86047k9294m2313K20143r6803J11121k9718K27462K46592K37764
4497A6531696J2762K77003L01114K93780J66866L51941K79634O04573M18315O63158
4487A9900842M11429M93332N81251N25252P71147O87667Q35471O99459R12431
4478B5818281O19708J171607Q52156J115044Q51511O77792P81709P98167O22915
4469C3308890N93766O06658K38351L89660Q7224J95560L37686P9049L58827K99861
$$ y = [23996281, 23336956, 22871196, 22274553, 21909303, 21240091, 20638351, 20275619, 19827965, 19361973, 19171313, 18717715, 18338393, 18066765, 17755115, 17498636, 17392763, 17074167, 16938213, 16645702, 16327025, 16233384, 16092727, 16243959, 16053526, 15815628, 15931435, 15713406, 15872789, 15686742, 15657448, 15615135, 15835278, 15738475, 15849596, 15819878, 16047340, 16293932, 16531696, 16544458, 16821461, 17122575, 17416355, 17583221, 17935162, 18214796, 18819369, 19237684, 19900842, 20312271, 20805603, 21386854, 21912106, 22683253, 23370920, 24206391, 24905850, 25818281, 26437989, 27609596, 28461752, 29576796, 30428307, 31106099, 31887808, 32685975, 33308890, 33902656, 34509314, 34747665, 35137325, 35224549, 35420109, 35757795, 35836844, 36195671, 36495532]
4459C6495532M28940O90922K94956N33069J011887J186437O65964J115304J487340
4450D3910351J400030J405105J897226J698997K104932K165278K370565K557557
4442E9510041K705855L096608L171064L460851L463307M037204L746814M271269
4434H7463013M296024M577307M808744M692654M622679M547722M435534M284109
4426A23727786L916675L662723L064745K587687K310331J884339J276914J117198
4418A43548398O63222J91283p7425m81512n28431j099069j426483j625800k044637
4409A37119546k398318k675422l084501l286375l673889l820311m310680m124431
4401A09745619l964432m058571m116584m049292m128700l640976l645438l401896
$$ y = [36495532, 36924472, 37615394, 37910350, 38443419, 39455306, 40641743, 41307707, 42423011, 43910351, 45310381, 46715486, 48612712, 50311709, 52416641, 54581919, 56952484, 59510041, 62215896, 65312504, 68483568, 71944419, 75407726, 79444930, 83191744, 87463013, 91759037, 96336344, 101145088, 105837742, 110460421, 115008143, 119443677, 123727786, 127644461, 131307184, 134371929, 136959616, 139269947, 141154286, 142431200, 143548398, 144211620, 144402903, 144325478, 143843966, 143315535, 142216466, 140789983, 139164183, 137119546, 134721228, 132045806, 128961305, 125674930, 122001041, 118180730, 113870050, 109745619, 105781187, 101722616, 97606032, 93556740, 89428040, 85787064, 82141626, 78739730]
4393G8739730l049200l278182k777278k715054k311901k469332k370108j787928
4385E7980747j694188j700160j548923j412431j035632j278809j017204r47760
4377D7345640p07853m96316p94067m10598k84883j42636k29631j51011r0484j20745
4367D3917416Q5624k74274k71871J77795l21659l05387j83524o35152m90979o27336
4357D1070653n83805l49723n71353p13419n28425m77282o74075n03244n0677m28987
4347C6189663l56564j46234k7398m6156k27564j18236J90505J37753Q3230L20802
4337C5999801n8919P47605L44799K33078N91828M42559O26057Q15146Q32585Q38965
4327D1413504Q35235J171868R53111J337202J284293J569619J472648J883724
$$ y = [78739730, 75690530, 72412348, 69635070, 66920016, 64608115, 62138783, 59768675, 57980747, 56286559, 54586399, 53037476, 51625045, 50589413, 49310604, 48293400, 47345640, 46637787, 46141471, 45347404, 44936806, 44651923, 44509287, 44279656, 44128645, 44038161, 43917416, 44003040, 43728766, 43456895, 43634690, 43313031, 43007644, 42824120, 42188968, 41697989, 41070653, 40486848, 40137125, 39565772, 38852353, 38323928, 37846646, 37172571, 36669327, 36618650, 36189663, 35833099, 35686865, 35659467, 35613311, 35385747, 35267511, 35458016, 35595769, 35678999, 35999801, 35940882, 36688487, 37033286, 37266364, 37858192, 38300751, 38926808, 39741954, 40574539, 41413504, 42248739, 43420607, 44373718, 45710920, 46995213, 48564832, 50037480, 51921204]
4319E1921204J896189K101674J950500K466985K444974K940668K858922K916118
4311G1497234L533568L416144L761551M119016M270747M711772M631810M935118
4303A04876960N506955N492415N956142N849839N978150N792759N782693N750764
4295A50986677N756646M878996M854735M242893L553847L135658K441604J834818
4287A81685874J243180N62247J95043p17495j094867j749299k423256k789997
4279A74911430l310093l943785m404972m553165m864798n088098m980032n250075
4271A38516412n151653m848229m732394m511596m365421l966708l689383l643706
4263A03607322l162950l027598k744236k421565k237455k061229k063526j871821
$$ y = [51921204, 53817393, 55919067, 57869567, 60336552, 62781526, 65722194, 68581116, 71497234, 75030802, 78446946, 82208497, 86327513, 90598260, 95310032, 99941842, 104876960, 110383915, 115876330, 121832472, 127682311, 133660461, 139453220, 145235913, 150986677, 156743323, 161622319, 166477054, 170719947, 174273794, 177409452, 179851056, 181685874, 182929054, 183491301, 183686344, 182968849, 181873982, 180124683, 177701427, 174911430, 171601337, 167657552, 163252580, 158699415, 153834617, 148746519, 143766487, 138516412, 133364759, 128516530, 123784136, 119272540, 114907119, 110940411, 107251028, 103607322, 100444372, 97416774, 94672538, 92250973, 90013518, 87952289, 85888763, 84016942]
4255H4016942j524806j479862j500286j447250j848969j544983j475731j540446
4247G1654609j511716j766014j281399j581627j563949j439384j474314j346738
4239E9689468j470935j433575j314275j192359j260927j133540j125330r77626
4231D9780901j115757o94640q04432j175754o45049p79556q19304p02192o45646
4222D2398571o34041m38188o15065k14343n01960l69780l8559l55034k26408k04987
4212C8800206j80093J19407l61963k1061j35391J4029m85033J82438k32421l31409
4202C7368709p9107l12435j33921k41947l98641k96204j56430k03945k83317j07184
4192C5155578k24195j18536j31280Q670K22194N9858J77978J16414N72416L79157
$$ y = [84016942, 82492136, 81012274, 79511988, 78064738, 76215769, 74670786, 73195055, 71654609, 70142893, 68376879, 67095480, 65513853, 63949904, 62510520, 61036206, 59689468, 58218533, 56784958, 55470683, 54278324, 53017397, 51883857, 50758527, 49780901, 48665144, 47970504, 47166072, 45990318, 45345269, 44565713, 43746409, 43044217, 42398571, 41764530, 41326342, 40711277, 40496934, 39994974, 39625194, 39586635, 39231601, 39005193, 38800206, 38620113, 38739520, 38377557, 38356496, 38221105, 38235134, 37750101, 37932539, 37700118, 37368709, 37289602, 36977167, 36843246, 36601299, 36202658, 35906454, 35750024, 35546079, 35262762, 35155578, 34931383, 34812847, 34681567, 34690237, 34912431, 34972289, 35150267, 35266681, 35839097, 36218254]
4182C6218254M88447P51103N04793P79122R24490Q37553J092917J071087J369225
4173D4036991J081566J586505J471755J669099J998728J780094K315297K014685
4165E7954720K260653K508153K370017K665032K501133K513661K543546K320538
4157G7637453K081999K203786J872983J696890J345720R50283O83593Q12179L82158
4148H9667044r9010k46251m04230p90060r76336j308046j719059j830956j798194
4139H0494902k468224k297399k508652k716564k638216k963155k741386k314796
4131E9846510k455470k480466k267074k412741k056486k010702j804490j872410
4123D2486671j375155j499912j256958j413807j206832j074377j018766j071625
$$ y = [36218254, 36706701, 37457804, 37962597, 38741719, 39666209, 40503762, 41596679, 42667766, 44036991, 45118557, 46705062, 48176817, 49845916, 51844644, 53624738, 55940035, 57954720, 60215373, 62723526, 65093543, 67758575, 70259708, 72773369, 75316915, 77637453, 79719452, 81923238, 83796221, 85493111, 86838831, 87789114, 88472707, 89284886, 89667044, 89568034, 89321783, 88917553, 88127493, 87151157, 85843111, 84124052, 82293096, 80494902, 78026678, 75729279, 73220627, 70504063, 67865847, 64902692, 62161306, 59846510, 57391040, 54910574, 52643500, 50230759, 48174273, 46163571, 44359081, 42486671, 41111516, 39611604, 38354646, 36940839, 35734007, 34659630, 33640864, 32569239]
4115C2569239p68725o78058q03022o35198q77748n76539o28153n07303m52083
4106B6642410k97489l21180k84842n17686l26030J87108l13167k96452p2125k68070
4096B4132477j17999j67424J7899j77014k84408m43302m73036j35736l42809q84376
4086B1124272j01153n46964k34320o68680m55515j98952n47731j78432n16362
4077A7676163j96892l42414j70440l91457k53164k55958p00k27102l05341J1265
4067A5543960j53798k67266Q2686p3764k02157j20650n3406L8761j62950K33882
4057A4865298k64744q3702K00452J7909o8465Q2042L597R8644q0003J04436P1396
4046A4946860J91823j551J211J48713L97410q5055L78103k3288J74469K90441
$$ y = [32569239, 31800514, 31122456, 30319434, 29684236, 28806488, 28229949, 27601796, 27094493, 26642410, 26344921, 26023741, 25738899, 25221213, 24895183, 25082291, 24769124, 24472672, 24400547, 24132477, 24014478, 23847054, 23864953, 23687939, 23403531, 22960229, 22487193, 22351457, 22008648, 21124272, 21023119, 20476155, 20241835, 19573155, 19117640, 18918688, 18370957, 18192525, 17676163, 17479271, 17136857, 16966417, 16574960, 16321796, 16065838, 16065138, 15838036, 15532695, 15543960, 15390162, 15122896, 15205582, 15131818, 14929661, 14809011, 14755605, 14794366, 14631416, 14865298, 14600554, 14516852, 14717304, 14735213, 14666748, 14748790, 14752387, 14851031, 14771028, 14875464, 14946860, 15138683, 15137132, 15138343, 15287056, 15684466, 15599411, 15977514, 15954226, 16128695, 16419136]
4036A6419136R3145L28277K71253O9666L77262N14776L50056N02419N32733M02640
4026A9861363N16517N25838L35054J42081L94304j70881R8187J50624J20832J06104
4016B2080023J96353K63127K25907L53987M05892M64115L16595N52528N95592
4007B5454119Q91202M96698O14419J085378R49395J013840J010698R43751P16602
3998C3176102R11412R19866J058305J056951R24615J004893J385347J618422J738194
3989D3794107J595679J982880K308466K407652K512978K776279K947638L490146
3981F3815825L364934L778124M245217M521323N169271N620198N765414O356925
3973A02637231P101754P515630Q013222Q656746R536812J0070571J0814341J1503727
$$ y = [16419136, 16512281, 16840558, 17111811, 17181477, 17558739, 18073515, 18423571, 18925990, 19458723, 19861363, 20377880, 20903718, 21238772, 21380853, 21775157, 21604276, 21702463, 21853087, 21973919, 22080023, 22276376, 22539503, 22765410, 23119397, 23525289, 23989404, 24305999, 24858527, 25454119, 26345321, 26842019, 27456438, 28541816, 29491211, 30505051, 31515749, 32459500, 33176102, 34087514, 35007380, 36065685, 37122636, 38047251, 39052144, 40437491, 42055913, 43794107, 45389786, 47372666, 49681132, 52088784, 54601762, 57378041, 60325679, 63815825, 67180759, 70958883, 75204100, 79725423, 84894694, 90514892, 96280306, 102637231, 109738985, 117254615, 125267837, 133924583, 143461395, 153531966, 164346307, 175850034]
3965A75850034J2578132J3408393J4818160J5522722J6576705J7391855J8081985
3958B84227986J8402156J7878192J6182119J3746446R854580N282419M53966m120776
3950C61907088q164873j1556858j3989338j5626393j6642514j6825421j6711335
3943B62390356j5955952j5590507j4107610j3417907j2407751j1325272j0467559
3936A69117798r698504q882489p995831p361901o760602o385431n791925n609995
3928A10631120m987987m630994m219757m111147l590034l547630l468779k928325
3920G9146467l096226k711991k721329k348708k279535k440926k013873j966458
3912E9567421j889897k045351j772396j611854j487992j566634j240644j368379
$$ y = [175850034, 188428166, 201836559, 216654719, 232177441, 248754146, 266146001, 284227986, 302630142, 320508334, 336690453, 350436899, 360291479, 365573898, 366027864, 361907088, 353742215, 342185357, 328196019, 312569626, 295927112, 279101691, 262390356, 246434404, 230843897, 216736287, 203318380, 190910629, 179585357, 169117798, 159419294, 150536805, 142540974, 135179073, 128418471, 122033040, 116241115, 110631120, 105643133, 101012139, 96792382, 92681235, 89091201, 85543571, 82074792, 79146467, 76050241, 73338250, 70616921, 68268213, 65988678, 63547752, 61533879, 59567421, 57677524, 55632173, 53859777, 52247923, 50759931, 49193297, 47952653, 46584274]
3904D6584274j485533j310977j242701j196433j148847r85895j095184j029609
3896C7089095j143642r51633q63819r25253j015208o67537p52162q09653p12976
3887B9247212o04248o50754p16989p42089m86629p40286n78770k30581o00973
3878B3895893m55766l37601n69257m11256m28927k67110m52464k89075l05433
3869B0379004n06505k07461j69401j61860m10267l20347m41083j51760j79384
3860A7830936l55401j63373k29320l54448O9766n35874k07654l99770k66045k12601
3850A5176216m23101m6613l94623m24584j43424k65367k32936o9714k13165l70026
3840A2592663j86184j94982k75424p8701j34888k01092l15740J61560m55465j50604
$$ y = [46584274, 45098741, 43787764, 42545063, 41348630, 40199783, 39213888, 38118704, 37089095, 35945453, 34993820, 34130001, 33204748, 32189540, 31522003, 30769841, 29960188, 29247212, 28642964, 27992210, 27275221, 26533132, 26046503, 25306217, 24727447, 24496866, 23895893, 23440127, 23102526, 22533269, 22122013, 21693086, 21425976, 20973512, 20684437, 20379004, 19872499, 19665038, 19495637, 19333777, 18923510, 18603163, 18162080, 18010320, 17830936, 17475535, 17312162, 17082842, 16728394, 16798160, 16262286, 16054632, 15654862, 15388817, 15176216, 14753115, 14706502, 14311879, 13887295, 13743871, 13478504, 13245568, 13175854, 12962689, 12592663, 12406479, 12211497, 11936073, 11857372, 11722484, 11521392, 11205652, 11367212, 10911747, 10761143]
3830A0761143j06881n7000q2171m02783j09602o5387k15623j69862L5050m0019
3820I546865l61985O8243k76006N8172k15390k7161k15044k70357J17582r3480
3810H331439j43136k88016K3055l04013P261r9528L7370j29541o8254k30959l0227
3799G105451j41898p9370k34506J08963m4974l23324K83287l06931j14850L04243
3789F556091j37245j43836k27562K14163r9079M6813l16499N5765j80498O1335
3779E829448l2266q7543p8742R2159m3438k15314p0592J73096j04574k0524o6729
3768E374981j38353N1551n215o8876L7009j9376p7283k66195K15726L6188k91668
3757D848489j69496K81303j16974L2925k06701J85554k19377o9812J77741j78143
$$ y = [10761143, 10654262, 10597262, 10515091, 10112308, 10002706, 9937319, 9721696, 9551834, 9586884, 9546865, 9184880, 9253123, 8977117, 9035289, 8819899, 8792738, 8577694, 8307337, 8424919, 8331439, 8188303, 7900287, 7923342, 7619329, 7626590, 7527062, 7564432, 7434891, 7366637, 7135678, 7105451, 6963553, 6884183, 6649677, 6758640, 6713666, 6390342, 6673629, 6366698, 6251848, 6556091, 6418846, 6275010, 6047448, 6261611, 6162532, 6209345, 5892846, 5948611, 5768113, 5829448, 5797182, 5709639, 5630897, 5723056, 5679618, 5464304, 5393712, 5566808, 5462234, 5441710, 5374981, 5236628, 5288179, 5282964, 5214088, 5251097, 5231721, 5154438, 4888243, 5103969, 5140157, 4848489, 4678993, 4960296, 4843322, 4876247, 4669546, 4855100, 4635723, 4565911, 4743652, 4565509]
3747D565509M9968k15850K4605O0105j66051K73746j42852r064j3846m4096k3838
3736D358336J66790n7785q0752j51751R0518p8251L4967O9716Q9248q7810L8843
3725D392069j66578J16622N8005k7787J56505r5505M1563J65738j12035J06166
3715D634763m2051K33412k65537R7034Q1216K5767K58922j85773Q3293j38588
3705D782458J30975r506n9704O5388j57543K5433l26953r8887P6287k84010K49294
3694D393232m01293N7789k1769k61026K03048k67654k12531Q9316q4289L255R1938
3683C590016j02288K8995k67275k03488L38534j91973j1268m4921m4860R4385
3673C185857j58578P4139j6285j70739P737J61438l69014K99984p1130k19592
$$ y = [4565509, 4615477, 4399627, 4424232, 4484337, 4318286, 4592032, 4449180, 4440116, 4426270, 4382174, 4358336, 4525126, 4467341, 4386589, 4234838, 4325356, 4247105, 4282072, 4351788, 4441036, 4353226, 4392069, 4225491, 4342113, 4400118, 4372331, 4528836, 4433331, 4474894, 4640632, 4528597, 4634763, 4592712, 4826124, 4560587, 4657621, 4738837, 4764604, 5023526, 4837753, 4921046, 4782458, 4913433, 4903927, 4844223, 4909611, 4752068, 4777501, 4450548, 4351661, 4427948, 4143938, 4393232, 3991939, 4049728, 4027959, 3766933, 3969981, 3702327, 3489796, 3579112, 3494823, 3498078, 3590016, 3487728, 3516723, 3249448, 3045960, 3384494, 3192521, 3181253, 3136332, 3091472, 3185857, 3027279, 3101418, 3085133, 2914394, 2922131, 3083569, 2714555, 3014539, 2943409, 2723817]
3663B723817K00944j77052o0639M0540j6776J50921l25262K23214k6512j0565
3653B722630J27707j68557P6201m7786j07749J516j7020o2895M2253K3768j28744
3642B461324M6876k8974n7853j01249K7269m0310n1107J24503J80530j85171o9707
3631B306131J20074j14283J793p1811R0933j2476q1501l8515J30485n7337j05693
3620B167800Q3095j06709j37681P4308Q3154J81297k85239J09959j10257O7029
3610B126756m6838k47987K45306K79242k78050m5493R6338m6815k28768R8445
3600A952136O0367m3174k30583L71137k0480k37763J71517j15838R0097k31846
3590A765570R038J88275L0581q5985J29921j80641n1068k8794N4956Q9369p6399
$$ y = [2723817, 2924761, 2747709, 2687070, 2727610, 2710834, 2861755, 2536493, 2759707, 2733195, 2722630, 2850337, 2681780, 2757981, 2710195, 2602446, 2603962, 2586942, 2524047, 2566300, 2590068, 2461324, 2508200, 2479226, 2421373, 2320124, 2347393, 2307083, 2255976, 2380479, 2561009, 2375838, 2306131, 2426205, 2311922, 2313715, 2241904, 2332837, 2320361, 2238860, 2200345, 2330830, 2273493, 2167800, 2250895, 2144186, 2006505, 2080813, 2163967, 2345264, 2060025, 2169984, 2059727, 2126756, 2079918, 1831931, 2077237, 2356479, 2078429, 2032936, 2129274, 2082459, 1853691, 1952136, 2012503, 1969329, 1738746, 2109883, 2089403, 1851640, 2023157, 1907319, 1997416, 1765570, 1774608, 1962883, 1993464, 1907479, 2037400, 1856759, 1805691, 1776897, 1831853, 1921222, 1844823]
3579A844823j57127j27214K20597J37161J413n8253q4712o4138n3100K9776j24654
3568A564572J16436L6735Q1881n8145l1117J17507k80995J29984J57782j18622
3558A716018k15823Q2834J59871q2651o7530j8934Q805L9648p819K03225k24591
3547A593053q9586J80092J00536j25606m8523o9249o6616J76988k44080J51460
3537A558469l5953N7613J41987j36856J35247j2650j66435J60066k26240J9302
3527A494550p0913L51173k73823J762k8283L69158l58500l9580l7287N7489J05946
3516A571692k05314J57606j86074J60598k9719k262j3825k39258M4217J49586
3506A407247o3942n2546J09034M371p115r9491j02099J20530P1603K1862R068
$$ y = [1844823, 1687696, 1560482, 1781079, 1918240, 1919653, 1861400, 1776688, 1712550, 1659450, 1689226, 1564572, 1681008, 1717743, 1799624, 1741479, 1710362, 1827869, 1546874, 1676858, 1834640, 1716018, 1500195, 1583029, 1742900, 1660249, 1592719, 1573785, 1582590, 1622238, 1614419, 1817644, 1593053, 1503467, 1683559, 1784095, 1658489, 1609966, 1540717, 1474101, 1651089, 1407009, 1558469, 1522516, 1580129, 1722116, 1585260, 1720507, 1707857, 1541422, 1701488, 1475248, 1494550, 1423637, 1774810, 1500987, 1502749, 1474466, 1843624, 1485124, 1445544, 1408257, 1465746, 1571692, 1366378, 1523984, 1337910, 1498508, 1468789, 1466527, 1452702, 1213444, 1257661, 1407247, 1343305, 1290759, 1399793, 1404164, 1397049, 1297558, 1195459, 1315989, 1387592, 1409454, 1418522]
3495A418522o4213J88237l56314L95058k09587R5730j72541J82192k31787J40974
3485A386271R4961k37183o5965K5995P6575o4342m5058r8347J27879O1381m7227
3474A214940L6251j16279J42045j78650L7561K24688P5936k79240K7606l0997
3464A153861n8672J33030k44501K01839J0432m2268n1267o5210j25823J64688
3454A076109K13037j05304L3088j83246N9596J22316n3506j96324Q0606J09266
3444A155638m8175m2169L19475l20001L6877n3298J45553m8226l0477k1814J10426
3433A203809j81413J06622p3291O7788M2516J77978j50567r7236J26725l0282
3423A192649k52551l707R9640J09820p721l37063J43835J64211m0817j19637K08848
$$ y = [1418522, 1354309, 1542546, 1186232, 1581290, 1371703, 1467433, 1294892, 1477084, 1245297, 1386271, 1481232, 1244049, 1178084, 1204079, 1280654, 1216312, 1171254, 1072907, 1200786, 1262167, 1214940, 1251191, 1134912, 1276957, 1098307, 1135868, 1360556, 1436492, 1157252, 1184858, 1153861, 1095189, 1228219, 983718, 1185557, 1195989, 1153721, 1102454, 1037244, 911421, 1076109, 1289146, 1183842, 1216930, 1033684, 1093280, 1215596, 1162090, 965766, 1046372, 1155638, 1107463, 1065294, 1384769, 1064768, 1101645, 1048347, 1193900, 1145674, 1115197, 1093383, 1203809, 1022396, 1129018, 1055727, 1123515, 1166031, 1344009, 1193442, 1096206, 1222931, 1192649, 940098, 936391, 1036031, 1145851, 1138130, 801067, 944902, 1109113, 1068296, 948659, 1157507]
3412A157507M0004j07350j16200J34531r1439J8063j5208l4180n3397j5792n0083
3401H66456J9138J30311k27381M06055o9714J17542k06440j08389J39944j83595
3391H83927o3815K36864j80523J01228q6422Q3786P6330M551P5223k0510Q4643
3380A195282k56217J85625j29967j039J88433k82276K13575p4585j10559J08230
3370A036502R6889k01815N8584J79931q5407R577j31764K15715k30400L04686
3360A252498j04486j19890J60048j10370j07966L60643k35886m6750m6185L4293
3350A035949J58001L8209o8366j9790M2406j38258J9259K73143k08495J6382J59191
3339A307631n4337J44580p7693M4909P9653p2312Q188O0939K61565l6900L4108
$$ y = [1157507, 1197511, 1090161, 973961, 1108492, 1017053, 1035116, 1019908, 985728, 932331, 916539, 866456, 885594, 1015905, 788524, 1194579, 1124865, 1242407, 1035967, 927578, 1067522, 883927, 820112, 1056976, 876453, 977681, 891259, 975045, 1051375, 1055926, 1131149, 1110639, 1195282, 939065, 1124690, 994723, 993684, 1182117, 899841, 1113416, 1038831, 928272, 1036502, 1133391, 931576, 990160, 1170091, 1084684, 1094261, 962497, 1178212, 947812, 1252498, 1148012, 1028122, 1188170, 1077800, 969834, 1330477, 1094591, 1047841, 1001656, 1035949, 1193950, 1232159, 1163793, 1144003, 1186409, 1048151, 1067410, 1340553, 1132058, 1148440, 1307631, 1253294, 1397874, 1320181, 1365090, 1444743, 1372431, 1380619, 1441558, 1703123, 1666223, 1700331]
3328A700331k6861L26017o1402J05364j46435M76447L9424J23675l485K61452
3318B794527J52060L64282R588L41766M50244J28553M33433J26083M24944M37007
3308E662487L95667N67729O40057P35208P74052J043387J388898J306501J119467
3299A3633453O28256l03169j33291o03563r08209q60279j079615p46318q70029
3290H757236r64952m81033p80605m64334l82342n26230l03055k85732k88595k17154
3280D063204j70554k51373k56733j57851j95920j36318J36664k55626j92416k15590
3270B367487R1692j06568n8748k13196j76248K24385k92399M1106R8899k91965
3260A684445J52546k21038J88162l29234Q811M3365l3520r4956J22841j81670
$$ y = [1700331, 1673470, 1999487, 1938085, 2043449, 1897014, 2373461, 2412885, 2536560, 2533075, 2794527, 2946587, 3310869, 3320457, 3662223, 4112467, 4241020, 4674453, 4800536, 5225480, 5662487, 6058154, 6625883, 7265940, 8001148, 8775200, 9818587, 11207485, 12513986, 13633453, 14261709, 13958540, 13825249, 13221686, 12313477, 11453198, 10373583, 9627265, 8757236, 7792284, 7311251, 6530646, 6066312, 5683970, 5157740, 4854685, 4568953, 4280358, 4063204, 3892650, 3641277, 3384544, 3226693, 3030773, 2894455, 3031119, 2775493, 2583077, 2367487, 2459179, 2352611, 2293863, 2080667, 1904419, 2128804, 1836405, 1877511, 1976410, 1684445, 1836991, 1615953, 1804115, 1474881, 1483692, 1527057, 1493537, 1398581, 1521422, 1339752]
3250A339752J2397j03863J05292k08865J98331j42879k78508K03626K840J72240
3240A300363l03908J44960j25606O0738J03443Q7567j64110j03653Q8438j39513
3230I48719Q3915k1157J3461j02102L8852k732k08841L41051j39875n9954k9645
3219H61692R3279k43826J26757J01722q4136k83279J90387R1075j40040K61114
3209I74745p2811j42174M4536J36683J49668l25398k668l4083k4108P0108J31458
3198I05956k53371J81219L3916j26474j7240J03784j18066J73645j84887J39655
3188H38137L7351j92143M7848K4054K845Q851R4036k60478J90720r4158L2777
3177G29840L5049p5581N930j1864n1408Q3018n7179L9051j65547J11187K30257
$$ y = [1339752, 1352149, 1248286, 1353578, 1144713, 1343044, 1200165, 921657, 1125283, 1128123, 1300363, 996455, 1141415, 1015809, 1076547, 1179990, 1267557, 1103447, 999794, 1088232, 948719, 1032634, 1011477, 1024938, 922836, 961688, 958956, 750115, 1091166, 951291, 891337, 861692, 954971, 711145, 837902, 939624, 855488, 572209, 762596, 853671, 713631, 974745, 901934, 759760, 804296, 940979, 1090647, 765249, 762581, 728498, 704390, 774498, 905956, 652585, 833804, 867720, 741246, 724006, 827790, 709724, 883369, 698482, 838137, 875488, 683345, 731193, 755247, 758092, 766943, 860979, 600501, 791221, 697063, 729840, 764889, 689308, 695238, 683374, 631966, 714984, 657805, 696856, 531309, 642496, 872753]
3166H72753j28941j14907M1324M8745k21583J88820K3474j00943R7895k83092
3156D23545K19571q1951J57477k62218J71552r3217K36432k12867r0589J06539
3146E74274N1288j3091K4416m1308o9307q4326J19742N0721o5610J04730o4457
3135E87072k04973L32829q5359l5381m1508j75320L24665k31800J03554J82641
3125G56420l14413J23649K0881O5040l7447p0294j37236K2680J74607j40337K47745
3114G11295j75304J22947P4991j40686k54875K98940j74507M2518J87155j67097
3104E25377K8666n0572M358L7181P1450O4231j01195k05291J46943Q641m6405
3093D83384j3577O5384j76323J94677L6328j40080L8667K4768j30263j03482K93239
$$ y = [872753, 743812, 628905, 670229, 718974, 497391, 686211, 709685, 608742, 706637, 423545, 643116, 561165, 718642, 456424, 627976, 534759, 771191, 558324, 467735, 574274, 625562, 612471, 636887, 595579, 526272, 441946, 561688, 612409, 546799, 651529, 587072, 382099, 714928, 629569, 594188, 552680, 377360, 702025, 470225, 573779, 756420, 442007, 565656, 586537, 651577, 614130, 543836, 406600, 429280, 603887, 463550, 711295, 535991, 658938, 733929, 593243, 338368, 637308, 462801, 505319, 692474, 525377, 554043, 503471, 507829, 545010, 616460, 680691, 579496, 374205, 521148, 529789, 483384, 469807, 535191, 358868, 553545, 589873, 449793, 488460, 513228, 382965, 279483, 572722]
3082E72722p8995n790L5688p9837J07487j4298O4297j12615j5223J59161j27456
3071E05141m0744m0072J18185j7622j00396n5130K56241j81820J90173j73259
3061D60697R3470j37550l9129J29551J7047j313J3566j51549K22503q9336k01580
3050C16377K74258k01501N7430J9345J400m0717j8003O7569j50908J07591o5133
3039C67708R7699k1336j552l5537k6192J63626j57500J0236R4475j51414M9588
3028C89801K40371l44791J33399q3642J31076r5587J71362j24643l6055p6486
3018C04805J54874j19383j5078P2008j31998L2569J49536j0780p104r3568K1067
3007C56948n8229K44857j12925J38235k57978O6077L5295j47195J42388n7793
$$ y = [572722, 493727, 487937, 523625, 443788, 551275, 536977, 601274, 488659, 473436, 632597, 505141, 464397, 424325, 542510, 524888, 424492, 369362, 625603, 443783, 633956, 460697, 554167, 416617, 377488, 507039, 524086, 522773, 536339, 384790, 607293, 517957, 316377, 590635, 389134, 446564, 465909, 467309, 426592, 408589, 476158, 325250, 432841, 367708, 465407, 444071, 442519, 406982, 380790, 544416, 386916, 397152, 491627, 340213, 389801, 630172, 285381, 418780, 335138, 466214, 370627, 541989, 417346, 381291, 304805, 459679, 340296, 325218, 397226, 265228, 297797, 447333, 436553, 429449, 335881, 356948, 298719, 543576, 430651, 568886, 310908, 376985, 412280, 265085, 407473, 349680]
2997C49680j12481K22472l5866r0617R787o1589J94875o2028P4214o5249k987
2986D20211J9027j6557m0579q3789O5747p7474K08124l22105J94034o1695J45003
2975D49947j84511O7727j73325K26046l3994K5438q8023M61J16735j25804J44437
2964D25134m1032K1788Q9747p5263m1954p590P0758p5105l9871N9693Q4076k010
2952D68371j86556L1264j37919L09243J148l49948K81334j94707K6728R7073j08896
2941B37135J0844j9573K91743J7448m5355q9208m5172l983J450m7791Q2788p7598
2929C12728M7997K31974k81357R6043k6591L9993j6951N5575n355j83006J5173
2918B86223j831p5691K27293r1703m063K15060l68928K28045p156l1835j9746
$$ y = [349680, 237199, 459671, 423805, 333188, 342975, 281386, 476261, 414233, 488447, 423198, 420211, 439238, 422681, 382102, 298313, 364060, 286586, 494710, 172605, 366639, 304944, 449947, 265436, 333163, 159838, 385884, 351890, 377328, 289305, 289766, 406501, 280697, 425134, 384102, 405890, 495637, 420374, 378420, 370830, 441588, 366483, 326612, 386305, 470381, 468371, 281815, 313079, 175160, 484403, 485551, 135603, 416937, 222230, 248958, 346031, 237135, 247979, 228406, 520149, 537597, 492242, 403034, 357862, 353879, 355329, 307538, 390326, 312728, 360725, 592699, 311342, 407385, 380794, 420787, 403836, 459411, 454056, 271050, 286223, 284392, 208701, 435994, 344291, 340228, 555288, 186360, 414405, 407249, 375414, 355668]
2907C55668n1289Q3280J3004m0190L497r0970L9239M1001k36317J76299J83m1552
2895B51853K25002r4109j1189m2525l78j37716J50705k7112l7464r9610o1927
2884A15530J85020n9338J33242M3306r3064p5559P1863N1293k26754K53882R4430
2873D93851j49640j5604K0887J2363j27669Q2715J45933j37303K9873o2076K1773
2862C15103j83538L9797J01797J25545j70031J02074O6523j21481q0847P4759
2852B69701J34592l8115j10569O1207j3059J664O4057q90j24815N5462J06889
2841D06124n2642n2091O9719j84176j39487J69211K4268N1151j90584M4373J71062
2830C16928n1190k8960K06524k10262j55271P1432K1135N4420P3097j25298Q5715
$$ y = [355668, 304379, 387659, 400663, 360473, 363970, 273000, 312239, 353240, 116923, 293222, 293405, 251853, 476855, 382746, 371557, 329032, 328654, 190938, 341643, 314531, 277067, 177457, 115530, 300550, 241212, 374454, 417760, 324696, 249137, 321000, 372293, 145539, 399421, 493851, 344211, 328607, 349494, 361857, 234188, 316903, 462836, 325533, 355406, 293330, 315103, 131565, 171362, 273159, 398704, 228673, 330747, 397270, 275789, 194942, 269701, 404293, 366178, 255609, 316816, 303757, 305421, 369478, 368588, 243773, 299235, 406124, 353482, 301391, 371110, 186934, 47447, 216658, 240926, 292077, 101493, 145866, 316928, 265738, 236778, 443302, 233040, 77769, 149201, 170336, 224756, 297853, 172555, 258270]
2819B58270J00927j02471N1776O2873j46792J59602k20291q2484J35401J30194
2809C47005p8020J45532j36241J46740j60203q0948p9896Q8103K5158r557J19309
2798C26982J1922l6847j93323L29289m2448j26522r4943J47005o7175J16589j49228
2787B21301O2380j6703k4277k5856q1714J65186r4995L4168L631P4549j24792
2776A92878J02171J18794j20240P4801k32592J7422P8110Q9645q5830n3749K9006
2765B10416J09404j32763J22516P6268j42562k80806K48107j10746P6011j19528
2755E6317J91635p0420J76575j67106J72816j23349K4397n0348J30377j82014
2745A58880k7426J29340o3218J11611p6368R2371k39975Q2813J0965P8205j61963
$$ y = [258270, 359197, 256726, 308502, 371375, 224583, 384185, 163894, 81410, 216811, 347005, 268985, 414517, 278276, 425016, 264813, 183865, 103969, 192072, 217230, 207673, 326982, 338904, 302057, 108734, 438023, 395575, 269053, 174110, 321115, 253940, 370529, 221301, 283681, 266978, 242701, 216845, 135131, 300317, 205322, 239490, 243121, 317670, 192878, 295049, 413843, 293603, 368404, 135812, 153234, 231344, 320989, 235159, 181410, 210416, 319820, 187057, 309573, 385841, 243279, -37527, 210580, 99834, 175845, 56317, 247952, 177532, 354107, 187001, 359817, 236468, 260865, 210517, 340894, 158880, 131454, 260794, 197576, 309187, 232819, 325190, 85215, 168028, 178993, 257198, 95235]
2734I5235M9968k1004N6426m277j00963J0764L8103j2237K4342O4299n576o7012
2722A28068Q3302n110p5366J39825m6898k60645K59514K4146Q672q0457J2119
2711A87170J18182M1476j34230j19795J45582K8595j30261j15726L31623j43704
2701B08912j9890l6971J55222j76024n3183J26904k347j6242M7508q3910J4823
2690A64802L6711j3848j56415P3902J23132q3898K30919l57730J29003k7100O5591
2679A85069M4747K1597k4979m2207L433J50171k92071K13201Q3049n1658l03851
2668a3499J33522p4666R1264K06314o6656j33504J8499R4814j54181j41k0129
2657H1637m800k0171L7068j59857J04591K8710J67912p885o4669j00473K65798
$$ y = [95235, 145203, 124199, 180625, 176348, 75385, 86149, 124252, 112015, 136357, 200656, 195080, 128068, 211370, 206260, 130894, 270719, 223821, -36824, 222690, 246836, 255508, 175051, 187170, 305352, 346828, 212598, 92803, 238385, 266980, 136719, 20993, 352616, 208912, 189022, 152051, 307273, 131249, 78066, 204970, 202623, 186381, 233889, 149979, 164802, 201513, 187665, 31250, 105152, 228284, 144386, 375305, 17575, 146578, 119478, 185069, 229816, 251413, 226434, 184227, 187660, 337831, 45760, 258961, 342010, 290352, -13499, 120023, 45357, 136621, 342935, 276279, 142775, 161274, 256088, 101907, 101766, 81637, 76837, 56666, 93734, -66123, 38468, 67178, 235090, 227205, 162536, 62063, 327861]
2646C27861j87682J05975j71153r521M6363M7673J44752j27496k32915N5171J03856
2635A02884J17513j05928O6203k350J50985l17585P9316K10340l3873K1347j07467
2624A81385k2984j8422n8222P2133j9446r295J93680N9485j60229m5082q7227
2613H5776j48676K30887r283m7602R8383n6154q2080L817J23998N568k67588J78251
2601A15297o4629J72776k37003J33029N5986k26536K20932n2849R770P6630j30629
2590G2774K06559q2188j92413L606K55979l2885j33858J05094r4981J90058P1844
2579C69589k63021n3816J08245j18592J49043K9044n1196j05732P5642J01969
2569B41175j52508J85434j24771K6163m7302k8112J24384p426k09480R9168m8816
$$ y = [327861, 140179, 246154, 75001, 65480, 111843, 159516, 304268, 176772, -56143, -972, 102884, 220397, 114469, 180672, 178322, 329307, 11722, 91038, 301378, 267505, 288852, 181385, 158401, 139979, 81757, 153890, 134444, 125149, 318829, 378314, 218085, 173003, 85776, -62900, 167987, 158704, 111102, 209485, 153331, 71251, 75068, 199066, 204634, -62954, 115297, 50668, 223444, -13559, 119470, 175456, -51080, 169852, 117003, 126773, 203403, 72774, 279333, 197145, 4732, 8338, 264317, 231432, 97574, 202668, 107687, 297745, 369589, 106568, 52752, 160997, 42405, 191448, 220492, 169296, 63564, 139206, 241175, 88667, 274101, 149330, 175493, 128191, 100079, 224463, 217037, 7557, 106725, 57909]
2558E7909J8997N8506J31868m794l17727K24792o0603j56910L1631J60549J10649
2547B54867k43354O7083J7876J61659n1004l29889P2993L54805l15474K25332
2537B14894j58309J31351j15208O4027J4573m1329j0664N7123n0000R154K6725
2526A42337m3791J00758J9913j48520J46512K1995k79561J38310Q5569o2003J43401
2515B64920L9191k23956O9018L9259k01009r051J91340R882k6839J038j6735N4048
2503A91106j16162R7368n3425j78527M9337l4359J25252Q7983j9423j59563P7972
2492F7559j264K0819K07272k21090j68000J93291j66674K36759J38662k62850
2482D4484J0276L6361L8329Q9335k46049K12524r1520m0678N4931m2738O3219
$$ y = [57909, 76906, 135412, 267280, 262486, -55241, 169551, 108948, -47962, -16331, 144218, 254867, 11513, 78596, 96472, 258131, 207127, -122762, -49769, 305036, -10438, 214894, 56585, 187936, 72728, 136755, 151328, 109999, 99335, 156458, 106458, 115612, 142337, 98546, 199304, 219217, 70697, 217209, 239204, -40357, 97953, 183522, 121519, 264920, 304111, 80155, 149173, 188432, -12577, -21628, 169712, 179594, 152755, 153793, 137058, 191106, 74944, 172312, 118887, -59640, -10303, -44662, 80590, 168573, 149150, -10413, 67559, 66295, 87114, 294386, 73296, -94704, 98587, -68087, 168672, 307334, 44484, 54760, 91121, 129450, 218785, -27264, 185260, 93740, 53062, 107993, 65255, 128474]
2471A28474J61182k33672j504L3257r4085n2876J38677J55279k0736k38948K06356
2460A81404k9423r5180k8032q735J42232q1248L3883L4799N4215j89535K20042
2449B34422j98809q9994J36749N3311k31970K72969L5014j98992P9528P4646N0965
2438B17839j99173R2140j17050J41729j55590K22456o1433j78705J5287P4374
2428E1874J01033k84099M11509k51315o3108O9076k4601o7995K61128j00521L5265
2417A38246O1938k06965J07463r0472J53028N5759k21751m2962J72849j09401
2407A7732J72722m2832j14761K49541k64594J19393j72644R9293L467Q7513J2821
2396A67651j45061P9862r9441k8739L4624o762l4019J60676j30621P0480j25146
$$ y = [128474, 289656, 55984, 54480, 87737, -6348, -59224, 79453, 234732, 213996, -24952, 181404, 151981, 56801, 28769, 20034, 162266, 81018, 114901, 149700, 203915, 14380, 234422, 35613, -54381, 82368, 135679, -96291, 176678, 211692, 12700, 92228, 166874, 217839, 18666, 110806, -6244, 135485, -20105, 202351, 140918, -37787, -22500, 51874, 152907, -131192, 280317, 29002, -34106, 34970, 10369, -57626, 203502, 102981, 138246, 200184, -6781, 100682, 10210, 163238, 218997, -2754, -45716, 127133, 17732, 190454, 147622, 32861, 282402, 17808, 137201, -35443, 63850, 67317, 154830, 167651, 22590, 102452, 3011, -25728, 8896, 2134, -31885, 128791, -1830, 68650, -56496]
2385e6496J72728j43711K06322O4658j21615O5006j20376J02457j6258j3957L7928
2374A76686m1012j71790O472R3503K8510Q7925j81537J95545J5974k8252o8936
2363A13088k31433L11168j41032N957O710K4680j3336j59062P7531M9808o6639
2352b2560K5988L0473L0741N0106Q9429q5567k39438Q7005n0134K24782l899R2770
2340B29696n0444n5170K1086j29014k10622K76679K1219K9484j78314O9930J1599
2329C6129J40644l30425K21239R1354j27672k8293M0702L7183j15273L23858l75949
2318h6503J57777j83630K92434k38982n3382O7914M5154J39306l0454R0752j237
2307A99149j14754J15310l97517J16456J97837k09347J82654J14080j24944Q6761
$$ y = [-56496, 116232, -27479, 178843, 243501, 121886, 186892, 66516, 168973, 152715, 138758, 176686, 135674, -36116, -29644, 63859, 92369, 180294, -1243, 194302, 210276, 182024, 113088, -118345, 192823, 51791, 57748, 64458, 89138, 75802, -83260, -5729, 44079, -22560, 3428, 33901, 64642, 114748, 204177, 118610, -120828, -33823, -83957, 140825, 136926, 229696, 179252, 124082, 145168, 16154, -194468, 82211, 103430, 132914, -45400, 24530, 36129, 176773, -153652, 67587, 158941, 31269, 2976, 43678, 80861, -34412, 289446, -86503, 71274, -112356, 180078, -58904, -112286, -44372, 782, 140088, 109634, 200386, 199149, 84395, 199705, -197812, -81356, 116481, -92866, 89788, 203868, 78924, 165685]
2297A65685j22680k7380J24480j60785j54764P2427J75933j85049P0192p465J30029
2286H0623Q211k5959J77851r8498k80774J89858K49943k99417J3167J23051L5188
2275A73244j88993R1552J4175l4890o4153J55492p0101n9412R1558j16610M7148
2264C9010p194o0984J36306k44402R2927J6657Q7392j10046J50974J06813k15471
2253h018Q4275q1606K269m4254l5158O3098O452L3960j27895R0980j77986Q7003
2241a06880J23337N6481N5479j38876j1914R7123j78891J49855k2953J23n1880
2230b8996M785R2021j75368N3618J75454L6074p7361j72613J27843R8160r9121
2219C4496k13703J23641M7869J32852k12697N4105J4419r1414M4981m3424J72364
$$ y = [165685, 43005, 15625, 140105, -20680, -175444, -103017, 72916, -112133, -41941, -49406, 80623, 88834, 62875, 240726, 142228, -138546, 51312, 301255, 1838, 15005, 138056, 173244, -15749, 75803, 89978, 55088, -9065, 146427, 76326, 16914, 108472, -8138, 39010, 31816, -29168, 107138, -137264, -44337, -27680, 59712, -50334, 100640, 207453, -8018, 76257, -5349, -3080, -47334, -82492, -19394, -12942, 21018, -106877, -15897, -193883, -106880, 16457, 72938, 128417, -10459, -22373, 74750, -104141, 45714, 22761, 22884, -28996, -24211, 67810, -107558, -53940, 121514, 157588, 80227, -92386, 35457, 133617, 34496, -179207, -55566, -7697, 125155, -87542, -33437, -19018, -110432, -65451, -108875, 63489]
2208F3489L8515k09478M7175J53028o7095p2503J20624J19378k85003J54730j33652
2197g0792P7230j24916K24788k44959L09311j79772j30258P9047J40472p2833
2187G318n8750k3125J6247M667Q66J91324L5490l46936J71429J38162j8818k0924
2175I6950M015l5555Q0507l30591K48328l9546j51051K65945N6844k80979J29910
2164D4777k09348P4449R7031n5534k0394n4117K57790p5663j69962K06307k5384
2153F9952o4092O4542j01740l7488R743k0536m1797J00949P1226j30671J53968
2142G4056k32213L67083k14773p5471j04510P6359J16848J9920j9171n5912L2754
2131a5030q6385j536O5406m8350K21261j08348n7183J48045j36415J547M8931
$$ y = [63489, 102004, -107474, -60299, 92729, 25634, -46869, 73755, 193133, -91870, 62860, -70792, 6438, -118478, 106310, -138649, 170662, -9110, -139368, -60321, 80151, 7318, -51432, -74557, -58310, -53643, -52777, 138547, 174037, -172899, -1470, 136692, 117874, 96950, 100965, 65410, 145917, -184674, 63654, 24108, -126943, 139002, 195846, -85133, 44777, -164571, -90122, 6909, -48625, -69019, -123136, 134654, 58991, -110971, 95336, 69952, 5860, 70402, -31338, -68826, -59083, -79619, -121416, -20467, 50759, -79912, 74056, -158157, 208926, -5847, -81318, -185828, -109469, 7379, 27299, 8128, -47784, -15030, -101415, -102951, -37545, -85895, 135366, 27018, -30165, 117880, -18535, -16988, 31943]
2120C1943k8825j33646J48080o5494K04211n1374l8800q3249J9512m5613J3573
2109b9682j09773J66734o9190R0946o9804K01385l66080L87572k29155P1482j63784
2098a19349K96611l39558K91784k18864J19441j17317J07383M5051l9278j25598
2088i9694K87492l18786J01179p6351O5507J88705n3521j45046k8072j1106J36801
2077D7108r6338p4576J08121j10898O5452N6497P4179r202k6632j22785R5933
2066F859r5975J75426r4625J0667J19453j84265j11687J27660Q0768k54890K57191
2055C6582K3425P450k38323L01340q9206K3395l0578j59437J78684p3033p0054
2044h9755K09435k18713P1411k0089J43227k32362N4878k7671J13888J29790j25927
$$ y = [31943, 3118, -130528, 17552, -47942, 156269, 104895, 66095, -17154, 2358, -43255, -29682, -139455, 27279, -41911, 49035, -20769, 180616, -185464, 202108, -27047, 44435, -119349, 177262, -162296, 129488, -89376, 30065, -87252, 20131, 65182, 25904, -99694, 187798, -130988, -29809, -106160, -40653, 148052, 94531, -50515, -78587, -89693, 47108, -49230, -123806, -15685, -126583, -61131, -4634, 69545, 60343, 33711, -89074, 6859, -89116, 86310, -8315, 2352, 121805, -62460, -174147, -46487, 34281, -220609, 36582, 60007, 67457, -170866, 130474, 41268, 64663, 34085, -125352, 53332, -19701, -89755, 119680, -99033, -27622, -47711, 95516, -136846, -81968, -109639, 4249, 134039, 8112]
2033H112L9823M5634j91218l5434r1583O2439J50493N5788J5057l1517m0288j27954
2021a40648J42000O4767K8962k36535j18006K56154m4435J75201j47757O3676
2011D3379j77630M4849N7451q6742P3589J10966j45108N2429L2310m6811m4949
2000h6267K35881j02036r2996n9510k6610J48116K9545j70457K04378j42303k61344
1989c23603J88947K8372O7818m1510M3724j36003J72870j15422Q6332M0780K0971
1978C3276O1j14669R4638l1035j12993M36822l65343q2641M1613K9016n1186J99752
1966G7311k30314J13824k3867J24356l3916q0958J9674r4637j05431K34203j38176
1955a37931o016l9569J6193J48116l0186L3788Q4771j15594q7696J22813o813
$$ y = [8112, 47935, 93569, -97649, -133083, -224666, -162227, -11734, 44054, 59111, 27594, -12694, -140648, 1352, 66119, 95081, -141454, -259460, -3306, -47741, 127460, -20297, 43379, -134251, -89402, -31951, -118693, -45104, 65862, -79246, -26817, 5493, -41318, -86267, 149614, 47578, -45418, -104928, -131538, 16578, 46123, -124334, 80044, -62259, -323603, -134656, -106284, -38466, -79976, -36252, -172255, 615, -114807, -28475, 12305, 33276, 33337, -81332, 13306, -17729, -130722, 306100, -59243, -141884, -100271, -71255, -122441, 77311, -153003, -39179, -63046, 61310, 27394, -53564, -33890, -128527, -233958, 245, -137931, -143947, -183516, -167323, -19207, -49393, -15605, 69166, -46428, -134124, -11311, -18124]
1944a8124k5605o1043L7307K5760J02472l4428k260j85443J91098N2025j19339
1933c7580o796j88421J37682K17777K4050j71272o8143Q8351R283R926P6996k22336
1921a30483p3431M9419J01158K2117j36829K48510k30342K00672j13726J37867
1911G4932o67j38768J79723j24736l5155P0933k24248R0296p9213J26009K2742
1900c8152n8267J07492j38924M853R1650o8943L19113m41074J31179k1826R6612
1889a6287J2097q2651l6304L8832j41114M24887l19908J84565J2313m05410K56626
1878g2354J64721k52700m5196J56311j17216J88072K6210k48769K24005q7006
1868f3922J05255J22989j90487k05127J76903j8859q886m762k8887j4764O3761
$$ y = [-18124, -43729, -104772, -67465, -41705, 60767, 26339, 24079, -161364, 29734, 81759, -37580, -44376, -232797, -95115, 122662, 146712, -24560, -92703, -4352, 4931, 14857, 91853, -130483, -203914, -154495, -53337, -31220, -168049, 80461, -149881, 50791, -62935, 74932, 74265, -64503, 115220, -9516, -44671, 26262, -197986, -107690, -186903, -60894, -38152, -96419, 11073, -127851, -122998, -31348, -100291, 218822, -222252, -91073, -112899, -16287, -4190, -86841, -123145, -84313, -225427, 199460, -120448, 64117, 76430, -328980, -72354, 92367, -160333, -205529, -49218, -166434, 21638, 47848, -200921, 23084, -63922, 41333, 164322, -26165, -231292, -54389, -73248, -82134, -86896, -115783, -130547, -66786]
1857f6786L1025p528M7238N8782m4188j16830Q4535j41708O2285Q0951q3567j33818
1845b29609K78292n6793m1057l01980L99201m6146r1095J25837l7898N2725j6417
1834C5060M3979j34616p8294K5225O0985l2094m1883J63907j66333J05008O4715
1823D5659j2700J9360p3313j72944J42578J41680l55912m110L45112k10537J23239
1812a1888n7559j16621J11934o8362L7729n9772m7930R9041R0043j09171l1796
1801a64352j9725R8503M7009j40848K7951j23655N8000J93398j58531J72046P3207
1790F3003r0387P8322q4292p1471Q9089m5111K00498k25292O9865O9552l48981
1779b95205J95422n8942R0023P3302j70773J23940p5386J07933o0075j09341K99436
$$ y = [-66786, -35761, -43289, 3949, 62731, 18543, -98287, -13752, -155460, -93175, -12224, -95791, -229609, 48683, -8110, -49167, -351147, 48054, 1908, -89187, 36650, -1248, 51477, 35060, 79039, -55577, -133871, -108646, -47661, -79755, -121638, 42269, -124064, -19056, 45659, 32959, 52319, -20994, -193938, -51360, 90320, -265592, -269702, 75410, -135127, -11888, -69447, -186068, -74134, -142496, -104767, -164539, -212469, -113428, -23385, -132556, -164352, -184077, -85574, -38565, -179413, -151462, -275117, -217117, -23719, -182250, -10204, 63003, -27384, 50938, -33354, -104825, -15736, -60847, 139651, -85641, -15776, 53776, -295205, -99783, -158725, -68702, 4600, -166173, -42233, -117619, -9686, -69761, -179102, 120334]
1768A20334p2775j96340J76369p1350R8544j43109k3632k6043J9600J93682j1410
1757F3870k51044J17778n3333J9008RP8731p6773J17232j17585J60184j56109
1746i8032O0175j6130k05651J73753P1279m9050Q1376j30919J11698p2519j72098
1735b46118J51471j06941Q0469o0885J21575j12468J4230J17089j20320J04257
1725e7641l1395j42854J86829j01807O3722K0024L4507J6380N7903r0996q9158
1714a34486j77190L89274j01329j0586k61987J18655J93424j22480k8353J62812
1704B7754p1841R1674K1286j48615l7895J5991j56j68849J84288P3594J09989
1693I7220r8214k58152J96661L7538m0392k26914N3601J33302K6791O3324j17286
$$ y = [120334, 47559, -148781, 27588, -43762, 54782, -88327, -111959, -138002, -118402, 75280, 63870, -187174, -69396, -122729, -103721, -103712, -24981, -101754, 15478, -102107, 58077, -98032, -37857, -53987, -259638, -85885, -14606, -63656, 17720, -113199, -1501, -74020, -246118, -94647, -201588, -121119, -182004, -60429, -172897, -158667, -41578, -161898, -57641, -89036, -231890, -45061, -146868, -83146, -63122, -28615, -12235, 45668, -45328, -134486, -311676, 77598, -23731, -34317, -296304, -177649, 15775, -106705, -135058, 27754, -44087, 47587, 68873, -79742, -117637, -101646, -101802, -270651, -86363, -12769, 97220, -994, -259146, -62485, -24947, -65339, -292253, -238652, -105350, -78559, -15235, -132521]
1682a32521Q1854q6111p851N7179k8208J55724j58646j33203K24912j5634j6595
1671e9100j84861K05695o965j61240J38510p0764K04910l7515j80334J62471k40237
1660b29430J45296p7269M5555m5944l3998K89746k18370J6030K7178r0398j35105
1649c06709P7116n5292N7685J47696q0598L1359J38430j07959J2817r783J69795
1638G4557n756j21441q0344m2251M5258l2420Q3362j23158L14002m90654M38393
1627E9548n404R5438l59075J55624J4081N6522m0871k3548K978P2252k55797J88209
1615d0043j28091p2629J22807J03137J05821l93163J80380q859l1461R7340j51840
1604b16601r380J25262j02183K28641p8424k24116Q0485J17417m9034J3776L0548
$$ y = [-132521, -50667, -136778, -144629, -87450, -115658, 40066, -118580, -251783, -26871, -42505, -59100, -243961, -38266, -45231, -206471, -67961, -138725, 66185, 28670, -151664, 10807, -229430, -84134, -161403, -115848, -161792, -195790, 93956, -124414, -108384, -81206, -171604, -306709, -229593, -284885, -227200, -79504, -160102, -128743, 9687, -98272, -85455, -95238, 74557, 68801, -52640, -132984, -175235, -129977, -162397, -79035, -202193, 111809, -378845, 59548, 54144, 149582, -209493, -53869, -39788, 16734, -24137, -47685, -44707, 27545, -228252, -40043, -168134, -240763, -117956, -14819, 91002, -302161, -121781, -130640, -162101, -64761, -216601, -225981, -100719, -202902, 25739, -52685, -276801, -196316, -78899, -127933, -114157, -83609]
1593h3609R0005j59516K8579l5814J62532K4184L7025j79938R6972J5242k07217
1582b11555K78949k38522O5417N9545j4353k5907M040o4925K5196j16831K23052
1571a5894n3374o989R3609o3193j09162J30942J2978M734k04779K14989p1865
1560f8004o8719K09501j5056k185j34229m4584J32132p7009k73882K61532M9698
1549c0805j82707K99797k40584j812R105R8253j34040J73448j29439n6490J06946
1538h8328n2117K0653l2697k5948j21159K16720o3699Q1292k13064n0818K94353
1527c4812j61984J95062j86801J37668J24412R2283k03326r1013O8673K0992O7543
1516B8697k01428J48035p7762O8726N4783j9458j59151J6884J53655q8219q4240
$$ y = [-83609, 6396, -153120, -124541, -160355, 2177, 26361, 63386, -116552, -19580, -4338, -211555, 67394, -171128, -105711, -46166, -60519, -86426, -82386, -147311, -122115, -238946, -15894, -69268, -76257, 17352, -45841, -155003, -24061, -11083, -6349, -211128, 3861, -68004, -136723, 72778, 57722, 55537, -78692, -123276, 8856, -68153, -342035, -80503, -30805, -213512, 86285, -154299, -156111, -147006, -48753, -182793, -9345, -138784, -195274, -88328, -140445, -119792, -152489, -178437, -299596, -82876, -146575, -65283, -278347, -329165, -34812, -196796, -1734, -188535, -50867, 73545, 165828, -37498, -128511, -59838, -38846, 28697, -172731, -24696, -102458, -33732, 21051, 1593, -157558, -140674, 12981, -75238, -159478]
1505a59478m9212J42763k49415K90633j08271O1042N6468k12537M7488o7534M7293
1494b00760O9582M4734l1817q3436J29860K1605j71965J91290k23414J22252j537
1483a33606q4143l2334m0318p748N9879n5079l4810J28267K6734o6069J15534
1472a23693R8462j31552O5136r5493L7395K5145m5337J92852l3100j85419N3457
1461a42147K310j9923l309J7903M8147j24201J47284J24674j24488j45258J36242
1450h2766L4457j63098J33232r2100J92670j67920r4043J05655k08503J80174
1440a62242K74542k89908J08277j30197K9334k164J18255K9434j28364J46901
1430f132j04069k4837N0797j39840L691l3668L14241j51637N3168j88027K3646
$$ y = [-159478, -208690, -65927, -315342, -24709, -132980, -71938, -15470, -228007, -180519, -248053, -200760, -131178, -86444, -118261, -201697, -71837, -50232, -222197, -30907, -254321, -132069, -133606, -217749, -250083, -290401, -298149, -238270, -293349, -328159, -199892, -173158, -239227, -123693, -25231, -156783, -91647, -187140, -149745, -124600, -169937, 22915, -10185, -195604, -142147, -139837, -159760, -163069, -145166, -97019, -221220, -73936, 50738, -73750, -219008, -82766, -48309, -211407, -78175, -170275, 22395, -145525, -239568, -133913, -342416, -162242, 112300, -177608, -69331, -199528, -170194, -172358, -54103, -24669, -153033, -6132, -110201, -135038, -84241, -224081, -220390, -254058, 60183, -91454, -38286, -226313, -202667]
1419b02667k7773O3790j14095J57933O5482J52585j31612n9448Q5298j39267O8286
1408h1488j79144K01051K4237j0687Q2800k12800J15656j75584L9796K40300j23783
1397g9646Q1491l8503j68955O4023O3958j11918n5877J48193J6760l90242J51758
1386c18958K63058j48930J71750J9749l17226J96148j11262Q3968j2395l1339
1376b05437l1530J20221J6067N8930p4397j00748P5519j4050J86467j95347O7707
1365i6598J96921k15038j64973J24790L1259J08439k03884J0631J20928l2373
1355a19898M8839j39609l9910J64413k02208M852R808J64551J01723l54036J97879
1344a63596m6792P0669R5878j94470K04198k45969J26765N2761K3879r1168N2693
$$ y = [-202667, -230440, -166650, -280745, -122812, -57330, 95255, -36357, -95805, -10507, -149774, -81488, -260632, -59581, -35344, -46031, 36769, -176031, -60375, -235959, -196163, 44137, -79646, 1845, -36658, -205613, -141590, -77632, -189550, -245427, -97234, -80474, -470716, -318958, -55900, -204830, -33080, -13331, -330557, -134409, -245671, -161703, -174098, -205437, -236967, -116746, -100679, -41749, -116146, -216894, -141375, -155425, 31042, -164305, -96598, 100323, -114715, -279688, -154898, -123639, -15200, -219084, -208453, -87525, -119898, -71059, -210668, -250578, -86165, -288373, -283521, -273713, -109162, -7439, -361475, -163596, -210388, -139719, -43841, -238311, -34113, -280082, -153317, -100556, -76677, -167845, -115152]
1333a15152J7261K5004k02829J55048k45301J99443k6224J69678l84565L98731
1323h906j59108J7008M5796P7439K6688j49529P019J82494p8659n1595n3976J36031
1311i298j86280P812N6042l951r0289R2887q3956L06658q0590m9623p5001M1844
1299g3745p0081J68052O6810j88202m4046l8402K743m1286N3277Q0387j2803J51469
1287E4173l15625m829P7517o2828M6324J61965j30435J2930o6366o9975O2590
1276b34559L3623J07842j63816K75592J7158P083Q1448l39919J12436q5295P0313
1265a18094k17197J58163J0196j33003J76775j90682R9564o2856O8438L1106J69419
1254h171j99188o6056J02804J16152p2991J58064k37458M2855o5648O2305k1789
$$ y = [-115152, -97891, -72887, -275716, -120668, -365969, -166526, -192750, -23072, -407637, -8906, -168014, -151006, -105210, -27771, -1083, -150612, -143593, 38901, -39758, -91353, -145329, -9298, -195578, -187766, -131724, -135675, -225964, -133077, -217033, 89625, 9035, -40588, -115589, -73745, -143826, 24226, 91036, -97166, -141212, -179614, -176871, -218157, -164880, -84493, -97296, 54173, -261452, -266281, -188764, -251592, -205268, -43303, -173738, -160808, -227174, -297149, -234559, -200936, -93094, -256910, 18682, 35840, 42923, 124371, -215548, -103112, -188407, -118094, -335291, -177128, -166932, -299935, -123160, -313842, -214278, -277134, -208696, -177590, -8171, -207359, -273415, -170611, -54459, -127450, 30614, -206844, -163989, -229637, -167332, -189121]
1243a89121p3780K87877k07494j05933J6780J53578r1186J21494p2101j3998L3240
1232a40644P8350j03952J7471P3603m8179j20556J18570J7352j32156L4546K3590
1221a82005r5168O2395Q555K0970J18737j96252J33919j11204J08609o6483N3548
1210a44379O321j64365J37278R9057j01459J21331j26015k02316L17306n7291
1200a14532r9676k9492j28426K58925j5013J24959l77492K07163j01753R7066
1190a78271k0532j42837K22420j37455K05022Q660l0471q0217O6562j59717J36926
1179a09910q2784J58968L904k082k42255J43905l134P6207k34979J49505j01026
1168b43681Q2100n928M8858k00660K52513j66351J39535j54772n8610L30095k9623
$$ y = [-189121, -262901, 24976, -182518, -288451, -271671, -118093, -209279, -87785, -159886, -173884, -140644, -62294, -166246, -148775, -75172, -123351, -243907, -125337, -107985, -240141, -205595, -182005, -277173, -214778, -206223, -185253, -66516, -262768, -128849, -240053, -131444, -197927, -144379, -138058, -302423, -165145, -66088, -167547, -46216, -172231, -374547, -57241, -114532, -214208, -243700, -372126, -113201, -128214, -3255, -380747, -173584, -275337, -178271, -198803, -341640, -119220, -256675, -51653, -42993, -73464, -153681, -87119, -246836, -109910, -192694, -33726, -29822, -31904, -274159, -130254, -133388, -57181, -292160, -142655, -243681, -161581, -167509, -118651, -319311, -66798, -233149, -93614, -248386, -306996, 23099, -6524]
1157f524k94293J06742l1000j0250K74865k40076k51434J38949J33523k8469L0766
1146a77201P4651o6155L4393l3873q625m2925p2212O6364J71078P5204j96487
1135a75788P15j68192J51190l2810l1630R0087K87400l61131j62433K35116j4844
1124a82320K49178j76158p3385K7521O1250k17562L16704M8088k35356R5574J66985
1113H0519q9269j07376k7736l7383N9376j61880j7631R9693k03355K57007m3887
1102a91922J85640j38261Q4751o5508j07517M9302R0383K4052j98695N4727j13573
1091c26621K57328L9274j21275j28972K87135r252q2786r8465J42539j9886j37818
1080a98799j09885J34457q2791O5098J05693j85931J71904j3003j8657J15668
$$ y = [-6524, -300817, -194075, -225075, -235325, 39540, -200536, -451970, -313021, -179498, -207967, -177201, -102550, -168705, -134312, -168185, -176810, -219735, -291947, -225583, -54505, 20699, -175788, -175073, -343265, -192075, -224885, -256515, -166428, 120972, -240159, -402592, -167476, -182320, 66858, -109300, -182685, -155164, -93914, -311476, 5228, 53316, -182040, -86466, 80519, -8750, -116126, -143862, -181245, -121869, -283749, -301380, -201687, -405042, -148035, -191922, -6282, -144543, -59792, -125300, -232817, -183515, -93132, -69080, -267775, -213048, -326621, -69293, -30019, -151294, -280266, 6869, -2383, -85169, -183634, -41095, -60981, -198799, -308684, -174227, -257018, -191920, -86227, -272158, -100254, -113257, -131914, -16246]
1070a6246m4099k0596j96898p2379K63320m6232L5361j7057o6673M2162N7535
1059h1802r8402R360L5286P837J10421n7166k25331P018P0458k4545O3300k6768
1047b10334M5837j5833Q4154k01550K36796k36377K12541j51523j99574L98731
1037c7132o0721m0010M6617p444k28040K85087k28793O7194Q9640j62492K56768
1026a9326j4793q3952N8921L9569n1709k47313J06715J75280j62245L6990r3979
1015b55842P4301J08316k68757N83R1433N8701R4837o4654o1802L2219N9613K1455
1003a09597o9003M782K0232j14177J8387J54041J27037k45453Q6730K10177k10710
992a27554m8244j78895N3862J22843l8510r0384P5153J03196j34369K9954j71467
$$ y = [-16246, -60345, -80941, -277839, -350218, -86898, -133130, -97769, -114826, -181499, -139337, -81802, -180204, -170844, -135558, -127721, -17300, -74466, -299797, -292779, -222321, -246866, -183566, -210334, -164497, -180330, -96176, -297726, -60930, -297307, -84766, -236289, -435863, -37132, -97853, -137863, -91246, -98690, -326730, -41643, -270436, -203242, -113602, -276094, -19326, -34119, -118071, -59150, -19581, -71290, -318603, -211888, -36608, -198853, -161863, -255842, -181541, -73225, -341982, -341399, -249966, -191265, -96428, -161082, -222884, -190665, -131052, -109597, -178600, -173818, -153586, -267763, -249376, -95335, 31702, -213751, -127021, 83156, -127554, -175798, -354693, -300831, -177988, -216498, -306882, -231729, -128533, -262902, -232948, -404415]
981d04415J68962J76400j23487j56254M0449N3995j06523K98106k91362K85996
971e8133j54966j37592J40936r7148J4313J30113p10J04844j66946N2939k50792
960d23142K95682j5449J1620j55661Q9037N6499j31674N9807K16383l43366K74456
949f5808L4649k30176J76264k88189Q9949J42378P5937k7122j86932J74935R785
938i4330k8484P7028R936P146q3652j78232L8687K05767m7522j7337j91100O036
926b96057O4496K34321j28351r6690J44832k13353J27971N4296j78205K24148
916f2592j68289j09970R7854K9254p4199Q7775J93071J09464l05027r7967N0474
905b50152r307Q5637O2295j06774J47694k71330J79224J1814k40230P7561K10159
$$ y = [-404415, -235453, -59053, -182540, -338794, -298345, -244350, -350873, -52767, -344129, -58133, -213099, -350691, -209755, -306903, -292590, -162477, -163187, -58343, -225289, -172350, -423142, -127460, -142909, -131289, -286950, -197913, -141414, -273088, -213281, 3102, -340264, -65808, -31159, -261335, -85071, -373260, -283311, -140933, -64996, -92118, -279050, -104115, -94330, -122814, -45786, -35850, -28704, -112356, -290588, -251901, -46134, -93656, -110993, -302093, -296057, -231561, 2760, -125591, -222281, -77449, -290802, -162831, -108535, -286740, -62592, -230881, -340851, -242997, -213743, -287942, -200167, -7096, 102368, -202659, -300626, -250152, -259459, -173822, -111527, -218301, -70607, -341937, -162713, -150899, -391129, -313568, -103409]
894a03409r6050n0795J64952j42742n7665O0562k23093L93853k14970o8391M7154
883b90594L2949M5826J28124k09157K65486l06796Q8474n8268L00625M4013j76185
872a35503p9984J19044m0717r5310J94778j01543P545j26693J03246k52865P0379
861c37623N9103K55911l66970J14832L25664l46188J31530P4675O6924k34744
851b56886j42917m2072M8278K66791J2750k7476m79j82048P4274J18270j33037
$$ y = [-103409, -199459, -250254, -85302, -228044, -285709, -225147, -448240, -54387, -269357, -337748, -290594, -257645, -211819, -83695, -292852, -27366, -334162, -245688, -303956, -3331, 40682, -135503, -215487, -96443, -137160, -232470, -37692, -139235, -131690, -258383, -155137, -408002, -337623, -278520, -22609, -389579, -274747, 50917, -295271, -163741, -89066, -22142, -256886, -399803, -441875, -393597, -126806, -114056, -141532, -142011, -324059, -249785, -131515, -264552]
$$ [...]
##END NTUPLES=NMR SPECTRUM
##END=
