##TITLE=abcd
##JCAMPDX= 6.0         $$ Bruker NMR JCAMP-DX V2.0
##DATA TYPE= NMR SPECTRUM
##DATA CLASS= NTUPLES
##ORIGIN= UXNMR, Bruker Analytische Messtechnik GmbH
##OWNER= root
$$ XWIN-NMR		Version 3.5
$$ Sat Feb 22 14:18:00 2025 Russian Standard Time (UT+4h)  servis@DPX200
##.OBSERVE FREQUENCY= 200.131235884673
##.OBSERVE NUCLEUS= ^1H
##.ACQUISITION MODE= SIMULTANEOUS
##.ACQUISITION SCHEME= undefined
##.AVERAGES= 16
##.DIGITISER RES= 18
##SPECTROMETER/DATA SYSTEM= spect
##.PULSE SEQUENCE= zg
##.SOLVENT NAME= DMSO
##.SHIFT REFERENCE= (INTERNAL, DMSO, 0, 16.4885)
##AUDIT TRAIL= $$ (NUMBER, WHEN, WHO, WHERE, WHAT)
$$ ##TITLE= Audit trail, XWIN-NMR		Version 3.5
$$ ##JCAMPDX= 5.01
$$ ##ORIGIN= Bruker BioSpin GmbH
$$ ##OWNER= servis
$$ F:\spectra/data/av/nmr/H1/1/pdata/1/auditp.txt
$$ ##AUDIT TRAIL=  $$ (NUMBER, WHEN, WHO, WHERE, WHAT)
(   1,<2025-02-22 14:17:35.56 +0400>,<servis>,<DPX200>,
      <created by zg, POWCHK disabled, PULCHK disabled
       terminated by command 'halt'
       configuration hash MD5:
       00 E9 B6 7A A2 85 ED C7 34 08 36 98 17 FE 4E 26
       data hash MD5: 32K
       0E 33 A6 79 71 79 7A 07 53 77 0E 34 80 21 D1 E0>)
(   2,<2025-02-22 14:17:37.32 +0400>,<servis>,<DPX200>,
      <Start of raw data processing
       efp BC_mod = 2 LB = 0.05 FT_mod = 6 PKNL = 1 PHC0 = -264.1254 PHC1 = 1.301534 SI = 16K 
       data hash MD5: 16K
       E8 9F 93 3E B1 F1 97 20 5B 35 B2 0A 36 D3 72 4A>)
$$ ##END=
$$ 
$$ hash MD5
$$ 19 67 38 41 A3 E3 AA 0A 22 2E 26 9A 87 97 D2 85
##$RELAX= 
##$RELAX= 
##$RELAX= 
##$RELAX= 
##$RELAX= 
##$RELAX= 
##$RELAX= 
##$RELAX= 
$$ Bruker specific parameters
$$ --------------------------
##$DU= <F:\spectra>
##$EXPNO= 1
##$NAME= <H1>
##$PROCNO= 1
##$TYPE= <nmr>
##$USER= <av>
##$AMP= (0..31)
100 100 100 100 100 100 100 100 100 100 100 100 100 100 100 100 100 100 
100 100 100 100 100 100 100 100 100 100 100 100 100 100 
##$AQSEQ= 0
##$AQ_mod= 1
##$AUNM= <au_zg>
##$AUTOPOS= <>
##$BF1= 200.13
##$BF2= 200.13
##$BF3= 200.13
##$BF4= 200.13
##$BF5= 500.13
##$BF6= 500.13
##$BF7= 500.13
##$BF8= 500.13
##$BYTORDA= 1
##$CFDGTYP= 0
##$CFRGTYP= 5
##$CHEMSTR= <none>
##$CNST= (0..31)
1 1 145 1 1 1 1 1 1 1 1 1 1 1 1 1 1 1 1 1 1 1 1 1 1 1 1 1 1 1 1 1 
##$CPDPRG= <>
##$CPDPRG1= <>
##$CPDPRG2= <>
##$CPDPRG3= <>
##$CPDPRG4= <mlev>
##$CPDPRG5= <mlev>
##$CPDPRG6= <mlev>
##$CPDPRG7= <mlev>
##$CPDPRG8= <mlev>
##$CPDPRGB= <>
##$CPDPRGT= <>
##$D= (0..31)
0 2 0 0 0 0 0 0 0 0.06 0 0 0 0 0 0 0.0002 0 0 0 0 0 0 0 0 0 0 0 0 0 0 
0 
##$DATE= 1740219455
##$DBL= (0..7)
120 120 120 120 120 120 120 120 
##$DBP= (0..7)
150 150 150 150 150 150 150 150 
##$DBP07= 0
##$DBPNAM0= <>
##$DBPNAM1= <>
##$DBPNAM2= <>
##$DBPNAM3= <>
##$DBPNAM4= <>
##$DBPNAM5= <>
##$DBPNAM6= <>
##$DBPNAM7= <>
##$DBPOAL= (0..7)
0.5 0.5 0.5 0.5 0.5 0.5 0.5 0.5 
##$DBPOFFS= (0..7)
0 0 0 0 0 0 0 0 
##$DE= 6
##$DECBNUC= <off>
##$DECIM= 32
##$DECNUC= <off>
##$DECSTAT= 4
##$DIGMOD= 1
##$DIGTYP= 9
##$DL= (0..7)
0 120 120 120 120 120 120 120 
##$DP= (0..7)
$$ [...]
##$SUBNAM4= <"">
##$SUBNAM5= <"">
##$SUBNAM6= <"">
##$SUBNAM7= <"">
##$SUBNAM8= <"">
##$SUBNAM9= <"">
##$SW= 20.6817932712277
##$SWIBOX= (0..15)
0 0 3 0 0 0 0 0 0 0 0 0 0 0 0 0 
##$SW_h= 4139.07284768212
##$TD= 32768
##$TD0= 1
##$TE= 0
##$TE2= 300
##$TE3= 300
##$TEG= 300
##$TL= (0..7)
0 120 120 120 120 120 120 120 
##$TP= (0..7)
150 150 150 150 150 150 150 150 
##$TP07= 0
##$TPNAME0= <>
##$TPNAME1= <>
##$TPNAME2= <>
##$TPNAME3= <>
##$TPNAME4= <>
##$TPNAME5= <>
##$TPNAME6= <>
##$TPNAME7= <>
##$TPOAL= (0..7)
0.5 0.5 0.5 0.5 0.5 0.5 0.5 0.5 
##$TPOFFS= (0..7)
0 0 0 0 0 0 0 0 
##$TUNHIN= 0
##$TUNHOUT= 0
##$TUNXOUT= 0
##$USERA1= <user>
##$USERA2= <user>
##$USERA3= <user>
##$USERA4= <user>
##$USERA5= <user>
##$V9= 5
##$VALIST= <valist>
##$VCLIST= <CCCCCCCCCCCCCCC>
##$VD= 0
##$VDLIST= <DDDDDDDDDDDDDDD>
##$VPLIST= <PPPPPPPPPPPPPPP>
##$VTLIST= <TTTTTTTTTTTTTTT>
##$WBST= 1024
##$WBSW= 30
##$XGAIN= (0..3)
0 0 0 0 
##$XL= 0
##$YL= 0
##$YMAX_a= 470552
##$YMIN_a= -354471
##$ZGOPTNS= <>
##$ZL1= 120
##$ZL2= 120
##$ZL3= 120
##$ZL4= 120
##$ABSF1= 0
##$ABSF2= 0
##$ABSG= 0
##$ABSL= 0
##$ALPHA= 0
##$AQORDER= 0
##$ASSFAC= 0
##$ASSFACI= 0
##$ASSFACX= 0
##$ASSWID= 0
##$AUNMP= <proc_1d>
##$AZFE= 0.1
##$AZFW= 0.1
##$BCFW= 0
##$BC_mod= 2
##$BYTORDP= 0
##$COROFFS= 0
##$CY= 18.4799938201904
##$DATMOD= 1
##$DC= 0
##$DFILT= <>
##$DTYPP= 0
##$F1P= 9.9274215381318
##$F2P= -0.165520771350173
##$FCOR= 1
##$FTSIZE= 16384
##$FT_mod= 6
##$GAMMA= 0
##$GB= 0
##$INTBC= 1
##$INTSCL= 4.127829e-11
##$ISEN= 128
##$LB= 0.05
##$LEV0= 0
##$LPBIN= 0
##$MAXI= 10000
##$MC2= 0
##$MEAN= 0
##$ME_mod= 0
##$MI= 50
##$NCOEF= 0
##$NC_proc= -6
##$NLEV= 6
##$NOISF1= 3.799351
##$NOISF2= 2.8
##$NSP= 0
##$NTH_PI= 0
##$NZP= 0
##$OFFSET= 16.48848
##$PC= 4
##$PHC0= -264.1254
##$PHC1= 1.301534
##$PH_mod= 1
##$PKNL= yes
##$PPARMOD= 0
##$PSCAL= 4
##$PSIGN= 0
##$REVERSE= no
##$SF= 200.130005582386
##$SI= 16384
##$SIGF1= 3
##$SIGF2= 2
##$SINO= 400
##$SIOLD= 16384
##$SREGLST= <1H.CDCl3>
##$SSB= 0
##$STSI= 16384
##$STSR= 0
##$SW_p= 4139.07284768211
##$SYMM= 0
##$S_DEV= 0
##$TDeff= 32768
##$TDoff= 0
##$TI= <>
##$TILT= no
##$TM1= 0
##$TM2= 0
##$TOPLEV= 0
##$USERP1= <user>
##$USERP2= <user>
##$USERP3= <user>
##$USERP4= <user>
##$USERP5= <user>
##$WDW= 1
##$XDIM= 16384
##$YMAX_p= 342163308
##$YMIN_p= -966775
$$ End of Bruker specific parameters
$$ ---------------------------------
##NTUPLES= NMR SPECTRUM
##VAR_NAME=  FREQUENCY,     SPECTRUM/REAL,   SPECTRUM/IMAG
##SYMBOL=    X,             R,               I
##VAR_TYPE=  INDEPENDENT,   DEPENDENT,       DEPENDENT
##VAR_FORM=  AFFN,          ASDF,            ASDF
##VAR_DIM=   16384,         16384,           16384
##UNITS=     HZ,            ARBITRARY UNITS, ARBITRARY UNITS
##FACTOR=    0.252644378177508, 1,           1
##FIRST=     3299.83951724647, 0,            0
##LAST=      -839.233330435636, 0,           0
##MIN=       -839.233330435636, -966775,     0
##MAX=       3299.83951724647, 342163308,    0
$$ Real data points
##PAGE= N=1
##DATA TABLE= (X++(R..R)), XYDATA
$$ [...]
9046B64132r390L0553q5458O0298k8851j23283J18877n3209K8268q5069J68204
9035B85072M6119k11287L00227p9427j54286P1109P9205N7636q3820M786j2547
9024C02787l9468j2183J4206l6414J12229k0812q4638j2391J2858O6279q725k1350
9012B72378j68811K60795k4415J43580j8961J33213K5485M88M254N3476k7343
9001F54139k1795l5445m8871q8065K59800l97012Q0561j95691K9205J3715N6822
8990C07363J2001n0509l6091J9314J5261l032J2458r1724J89373j53564M1608
8979B62458l2879R8310j44703K14651k9931R2012m8240j40731K2106L7497M6584
8968C77134p2231j12208Q316J7468Q1690j59579p0047L9713k509N6068j551n3913
$$ plain form
9046 264132 254742 285295 199837 260135 231284 108001 226878 173669 201937 116868 285072
9035 285072 331191 119904 420131 340704 186418 257527 336732 394368 310548 315334 302787
9024 302787 263319 251136 265342 228928 341157 320345 235707 223316 236174 302453 293728 272378
9012 272378 103567 364362 339947 483527 464566 597779 623264 623752 628006 681482 654139
9001 654139 632344 596899 548028 459963 719763 322751 403312 207621 236826 250541 307363
8990 307363 319364 268855 232764 252078 267339 264307 276765 185041 374414 220850 262458
8979 262458 229579 327889 183186 397837 367906 459918 411678 270947 293053 330550 377134
8968 377134 304903 192695 201011 218479 300169 140590 70543 110256 107747 163815 162264 108351
8956A08351j84712J00836R8637n1107p2215k6441q982p0884q892L4518k044K5179
8944e7756P4461j37763J79104j96553Q2711k3270K26203l18115P6476m6767k8664
8933a69933R6180p0423J28586o0431m4079m8026K0061R4668K9284j6810n0314
8922i1237n4744n4099k3835J83967k22048J54439L8111o3069r6961Q7788M8230
8911i3458l5005n1682n0439K6731L3674r291o5838R1481m7627r1135R0744K4376
8899a77469k8250k5947n0388k1417p5249P8512K6472M3757K4270M3249k40748
8888d03208Q4071P1722N8062p5199N8720N9014j1794o4297k8980p4669N1006N4514
8876b21038O5145m2961l1280K0601j60677N3418j1141K01590j62574k3705R9922
$$ plain form
8956 108351 -76361 24475 123112 72005 -210 -26651 -35633 -106517 -115409 -80891 -82935 -57756
8944 -57756 16705 -121058 58046 -138507 -55796 -79066 147137 -170978 -94502 -141269 -169933
8933 -169933 -73753 -144176 -15590 -76021 -120100 -168126 -148065 -53397 -24113 -40923 -91237
8922 -91237 -145981 -200080 -223915 -39948 -261996 -107557 -69446 -132515 -229476 -141688 -93458
8911 -93458 -128463 -180145 -230584 -203853 -170179 -179470 -245308 -153827 -201454 -292589 -201845 -177469
8899 -177469 -205719 -231666 -282054 -303471 -378720 -300208 -273736 -229979 -205709 -162460 -403208
8888 -403208 -319137 -247415 -189353 -264552 -205832 -146818 -158612 -222909 -251889 -326558 -275552 -221038
8876 -221038 -155893 -198854 -230134 -209533 -370210 -316792 -327933 -126343 -288917 -312622 -212700
8865b12700o0832J21416r6602p0750L6506Q4291P500M366j47310O2085n927M0173
8853b37784q8999R1225K7641o6637J61222j14317J7198j53094K0238J3917k9209
8842c58599o4238J53338J43173r5482L8466o0648J185m1690P4378k0713n4568
8831b85398j39837Q7525J65343o2275n9845m3671J45841K5892j90591L6157P9500
8820b41359j0629l2967O3575L989J7650j65026k607J82583k02023J64694n0481
8809b72601M8343p576j21411R6840k7870J05176m8597j60887J09133J9267J1687
8798b48496q4223K434J21560p2931q1610L0823p5235P3341L3107l0980k8922N5373
8786c05759j53446K88525n5500j704M3684q7416l3837J40738m1995k5130j28663
$$ plain form
8865 -212700 -273532 -152116 -248718 -319468 -282962 -198671 -191171 -186805 -334115 -272030 -277957 -237784
8853 -237784 -326783 -235558 -207917 -274554 -113332 -227649 -210451 -363545 -343307 -329390 -358599
8842 -358599 -422837 -269499 -126326 -221808 -183342 -243990 -242805 -284495 -210117 -230830 -285398
8831 -285398 -425235 -337710 -172367 -234642 -294487 -338158 -192317 -166425 -357016 -320859 -241359
8820 -241359 -251988 -284955 -221380 -217391 -199741 -364767 -367374 -184791 -386814 -222120 -272601
8809 -272601 -224258 -231834 -353245 -256405 -284275 -179099 -227696 -388583 -279450 -260183 -248496
8798 -248496 -332719 -330285 -208725 -281656 -363266 -332443 -407678 -334337 -301230 -332210 -361132 -305759
8786 -305759 -459205 -170680 -226180 -227884 -184200 -271616 -305453 -164715 -206710 -231840 -360503
8775c60503L9899q3813N721M8178M7732P2352n8655q181O45J08539q0948j9974
8763b89008Q70J55328m4441j09186m0456j6340P5268p8808K14724l4668m4218
8752b10935k5343j13236k0305O0911k4032m456j9012L6718J19105P2027j71958
8741c00516R2635L7480j55996O9489Q6364k9535j55838m1907M4058J31676k22183
8730d44273K45823L0170k13690J54273K2761q3293R4411j12875O5922o3384m3578
8719c47733Q3239p416p0592o5238R5802N4442k4215N8350n4174j05346J8631n1945
8707d16195M8932L6687K2121K4918k24513J51423j6275K19795n2856k83653l367
8696d92983J85428p0976O9871N8176k6622L945j378j07302Q8223M052J09165M8335
$$ plain form
8775 -360503 -320604 -404417 -398696 -350518 -302786 -230434 -289089 -297270 -296625 -188086 -269034 -289008
8763 -289008 -288138 -132810 -177251 -286437 -326893 -343233 -267965 -346773 -132049 -166717 -210935
8752 -210935 -236278 -349514 -369819 -308908 -332940 -337396 -356408 -319690 -200585 -128558 -300516
8741 -300516 -207881 -170401 -326397 -256908 -170544 -200079 -355917 -397824 -353766 -222090 -444273
8730 -444273 -198450 -168280 -381970 -227697 -204936 -288229 -193818 -306693 -240771 -304155 -347733
8719 -347733 -264494 -271910 -342502 -407740 -311938 -257496 -281711 -223361 -277535 -382881 -364250 -416195
8707 -416195 -367263 -330576 -308455 -283537 -508050 -356627 -372902 -153107 -205963 -489616 -492983
8696 -492983 -307555 -378531 -308660 -250484 -277106 -273161 -274539 -381841 -293618 -289566 -180401 -132066
8684a32066k31317L1169R6758j78041J35790J4808k5732M0676j93619J39280o2656
8673c64950M1901N4063j5167P3988m63K9981j15819M8582p9771R8312n5693o5305
8661c50341Q5658R0478m5581j89268J05689j1634j4081k4450o3568J66249l9289
8650b90138j68219P7744J4991k1374J37848j01038N4568N3679j28650p641R2385
8639b85845j24493J93441p9358J816j85881j37305K83804R9810P070p1938k2659
8628c21538q3661R5584j13001O425J07167m6080J10098K0564k07788J92439p0776
8617c10567P4970m1858N5805o7767m5047o7382J00189N4701p5289J27324k26111
8606d21032J57892J4522j86627J32855J8119q7804k5833m0815J36532O6227l6454
$$ plain form
8684 -132066 -363383 -332214 -235456 -413497 -277707 -262899 -288631 -247955 -441574 -302294 -364950
8673 -364950 -323049 -268986 -284153 -210165 -210628 -180647 -296466 -247884 -327655 -229343 -285036 -350341
8661 -350341 -264683 -174205 -219786 -409054 -303365 -314999 -329080 -353530 -417098 -250849 -290138
8650 -290138 -458357 -380613 -365622 -386996 -249148 -350186 -295618 -241939 -370589 -378230 -285845
8639 -285845 -410338 -216897 -296255 -294439 -480320 -617625 -333821 -234011 -226941 -298879 -321538
8628 -321538 -405199 -309615 -422616 -416191 -309024 -355104 -245006 -224442 -432230 -239791 -310567
8617 -310567 -235597 -277455 -221650 -289417 -334464 -401846 -301657 -246956 -322245 -194921 -421032
8606 -421032 -263140 -248618 -435245 -302390 -284271 -372075 -397908 -438723 -302191 -235964 -272418
8595b72418j1215j45611O2958K620k3494J28641q9721K25398q1209j13216J31768
8584a85499k15983J40979l1361j02720K10377j13279P0404j47194O2636J44765
8574a66875m9246n8253M0451L4073m6430o4999K5738j00572P8863J71539j51735
8563b87446K1765J28138j00494L7179O8411l6654k6644K4966j11398N0080J7096
8552b15001q3196J6988j05047K018k4742p5706J54395J75452j13164K3576r3907
8541c38334k1010R0815O4287k4810j21982J07572J541o1438j0595l68598J28081
8530e54471P6424J13389j31552J38480K2662j1366q3080K08310j62140J08824
8520b74520l9129k6606r5665J12271J5971p2811J36368l5379p7711m0775k7334
$$ plain form
8595 -272418 -283633 -429244 -366286 -363666 -387160 -258519 -348240 -122842 -204051 -317267 -185499
8584 -185499 -401482 -260503 -291864 -394584 -184207 -297486 -227082 -374276 -311640 -166875
8574 -166875 -216121 -274374 -233923 -199850 -246280 -311279 -285541 -386113 -307250 -135711 -287446
8563 -287446 -265681 -137543 -238037 -200858 -132447 -169101 -195745 -170779 -282177 -232097 -215001
8552 -215001 -298197 -281209 -386256 -384238 -408980 -484686 -330291 -154839 -268003 -244427 -338334
8541 -338334 -359344 -268529 -204242 -229052 -351034 -243462 -241921 -303359 -313954 -682552 -554471
8530 -554471 -478047 -364658 -496210 -357730 -335068 -346434 -429514 -221204 -383344 -274520
8520 -274520 -313649 -340255 -435920 -323649 -307678 -380489 -244121 -279500 -357211 -397986 -425320
8509d25320Q6786K4916l2265R647p1986J17632J3260j34945N3118p7179J05172
8498c31164j9954L0141j55038J76286l8722q0524J42015n5354O5398j72766P5351
8487c64331m727L5421k8701P7789j10855M8137Q8585l2551k0449L0379j42967
8476d24270m3511J08382M5633m6449l5071O3970j4333l1143n5604P104N401K8539
8464c91352K0015J0038M3190J9090j3955M2359p2770M9877m4184k7439P4635j11659
8452d02155L5705k5866O3825R887j04822r158J37740j06440O9701j56022K07467
8441b80138p2259N6560j85023J2588J59791j42844J04900q4590K48766k64778
8431d47027Q8285m280n4278M0089r6097j1624j697J4068O4411j3933j8429M7866
$$ plain form
8509 -425320 -338534 -313618 -345883 -336236 -408222 -290590 -277330 -412275 -359157 -436336 -331164
8498 -331164 -351118 -320977 -476015 -299729 -338451 -418975 -276960 -332314 -266916 -439682 -364331
8487 -364331 -369058 -333637 -362338 -284549 -395404 -347267 -258682 -291233 -311682 -281303 -424270
8476 -424270 -467781 -359399 -313766 -360215 -395286 -331316 -345649 -376792 -432396 -425292 -419891 -391352
8464 -391352 -371337 -361299 -318109 -299019 -312974 -270615 -343385 -293508 -337692 -365131 -290496 -402155
8452 -402155 -366450 -392316 -328491 -318604 -423426 -432584 -294844 -401284 -331583 -487605 -280138
8441 -280138 -352397 -295837 -480860 -468272 -308481 -451325 -346425 -431015 -182249 -447027
8431 -447027 -358742 -363022 -417300 -377211 -473308 -484932 -486629 -472561 -408150 -422083 -440512 -392646
8419c92646k1632J14712k3257L9535j47315J46404l0610P544p5673j05252L9174
8408d49016M2688k6582J54725J1000q4812P9477p5244j07916Q2216J40831p8331
8397c10964j7381j15029L1997L5860J05603r7090r8081K13379o6646n2464N4352
8386c16464K1174r4974L1701K0497K3751m0724k4279J3809J11838j35485K9075
8375c60081O9182J117j65741J01626J21056j31927R1713j25505j0717P8724q7472
8364d18025J02871j69547K1390O4116O2662J04474j59695m146K00799k50383J4049
8353d31435Q5069j14821Q3806j33997J02992j42429J10334O6716P0361j34671
8343d38075R9283O6184q6797K4490K3224l3747J23143j34546l7468p721K51738
$$ plain form
8419 -392646 -414278 -299566 -322823 -283288 -430603 -284199 -314809 -307265 -382938 -488190 -449016
8408 -449016 -406328 -432910 -278185 -267185 -351997 -272520 -347764 -455680 -373464 -232633 -310964
8397 -310964 -328345 -443374 -411377 -375517 -269914 -367004 -465085 -251706 -318352 -370816 -316464
8386 -316464 -295290 -390264 -358563 -338066 -314315 -355039 -379318 -365509 -253671 -389156 -360081
8375 -360081 -290899 -289782 -455523 -353897 -232841 -364768 -273055 -398560 -409277 -330553 -418025
8364 -418025 -315154 -484701 -463311 -399195 -336533 -232059 -391754 -395900 -195101 -445484 -431435
8353 -431435 -346366 -461187 -377381 -511378 -408386 -550815 -440481 -373765 -303404 -438075
8343 -438075 -338792 -272608 -359405 -334915 -311691 -345438 -222295 -356841 -394309 -402030 -150292
8332a50292k34303J04853M8737j7131m9521o6177l3027k8518J27260p8233P8615
8321b97737k060J25664j19351j5556q1491o3347R7122P4736K6278k11410K36536
8310b30616j09223P7631l0304l7590J5426j988l9867k2354M9121N0758r5433P9008
8298b95431J2976J00786j07509J8237j39873J19588K4986j48730J11406L413r7930
8287c98081O3439j0958n7705N6567n5746J62502r6768P5830k1204O788o6946J81363
8275a60919j60148J8122p5366N2104p6145k3784M6229N7832J1183L0040j7427
8264b98279j36105J01046J1409q0563J72747n2916j83175J94844j86703N8338
8254c99357J080n431k040p4438J30084O3939R6471j42209L6823j12078O4476j29751
$$ plain form
8332 -150292 -384595 -279742 -231005 -248136 -297657 -363834 -396861 -425379 -298119 -376352 -297737
8321 -297737 -299797 -174133 -293484 -309040 -390531 -453878 -356756 -282020 -255742 -467152 -230616
8310 -230616 -339839 -262208 -292512 -330102 -314676 -316664 -356531 -378885 -329764 -279006 -374439 -295431
8298 -295431 -282455 -181669 -289178 -270941 -410814 -291226 -266240 -414970 -303564 -300151 -398081
8287 -398081 -334642 -345600 -403305 -346738 -402484 -239982 -336750 -260920 -282124 -275336 -342282 -160919
8275 -160919 -321067 -302945 -378311 -326207 -402352 -426136 -379907 -322075 -310892 -280852 -298279
8264 -298279 -434384 -333338 -321929 -402492 -229745 -282661 -465836 -270992 -457695 -399357
8254 -399357 -398277 -403708 -405748 -480186 -350102 -286163 -189692 -331901 -295078 -407156 -342680 -472431
8242d72431J23081N1363k0092O9035r1768P6665p6221P1585j14995K21397l8773
8231b01154j06163m3088q6821Q7308L7349n0695J10795j92794J30831M4793k6077
8220b95716j71625J37711J2619k5714q7192L7462p2028R6948P7224L6907q6509
8209c39913m0810j2247m8506J11137J15097j18464K960j04607N2167R0891O7214
8198b25081n3060N2920k09566Q7049j02471J11007J317606j573065M73118j65059
8188b86602m24292N55668l36973J27318J43458m3284k28573J07221J67595j87799
8178d06263J95800r0993K9390j10656O4549L2108n457l8505N3265j16470J04975
8167b88257p5598Q9514K2897K5541n7615m0521J25869k17193J81769k35604j2397
$$ plain form
8242 -472431 -349350 -297987 -318079 -249044 -340812 -264147 -340368 -268783 -383778 -162381 -201154
8231 -201154 -307317 -350405 -437226 -349918 -312569 -363264 -252469 -445263 -314432 -269639 -295716
8220 -295716 -467341 -329630 -317011 -342725 -429917 -392455 -464483 -367535 -290311 -253404 -339913
8209 -339913 -380723 -392970 -441476 -330339 -215242 -333706 -330746 -435353 -383186 -292295 -225081
8198 -225081 -278141 -225221 -434787 -347738 -450209 -339202 978404 -594661 -121543 -286602
8188 -286602 -710894 -155226 -492199 -364881 -221423 -264707 -493280 -386059 -218464 -406263
8178 -406263 -210463 -301456 -272066 -382722 -318173 -286065 -291522 -330027 -276762 -393232 -288257
8167 -288257 -363855 -274341 -251444 -225903 -283518 -324039 -198170 -415363 -233594 -469198 -481595
8156d81595J05537J23432r141p560r152O5733l9702q2560J39816j93225O8547
8145c19870k0618r7051P5842P4555n5891k13o3232n8321K21718o1741k3468O3219
8133b65071k2350p7673K10625k67864L6529Q3662n8279R8634l1628O0335p5585
8122c08665r3342m0936J73655o9650M9999l5913N387j42270K0331N8025J1317
8111c72062K0991J86773q6626j02614q4K2185R0312m0495p5172J58192j96379
8100c94979N565J47307j62727L6165k0307J91743j50897J54532j86179J38099
8090b41678q7949Q055R2538j09976M7728l2985P851o9799j9537J9026J70366j04458
8078c20818L6786O85j91644J26635N9410j17395K03455p8867j982k1728j12291
$$ plain form
8156 -481595 -376058 -252626 -261767 -269327 -278479 -212746 -252448 -335008 -195192 -388417 -319870
8145 -319870 -340488 -437539 -361697 -287142 -343033 -343246 -406478 -464799 -243081 -304822 -328290 -265071
8133 -265071 -287421 -365094 -154469 -422333 -385804 -302142 -360421 -261787 -293415 -233080 -308665
8122 -308665 -402007 -442943 -269288 -338938 -288939 -324852 -319465 -461735 -441404 -383379 -372062
8111 -372062 -351071 -164298 -250924 -353538 -353622 -331437 -241125 -281620 -356792 -198600 -394979
8100 -394979 -389414 -242107 -404834 -368669 -388976 -197233 -348130 -193598 -379777 -241678
8090 -241678 -329627 -321572 -229034 -339010 -291282 -324267 -316416 -386215 -405752 -386726 -216360 -320818
8078 -320818 -284032 -283347 -474991 -348356 -288946 -406341 -202886 -281753 -283735 -305463 -417754
8067d17754P4145k9405L9252k5488j3376Q0555L77j14466J5004k2597J16597P6515
8055b20641j56777n1545j684K19530J46361j34272j74667R6999j3083K3959k9650
8044b95470N4063j73161J65008r3704Q1590o3922m504J03858r7534k0042O9032
8033b74786j82349N8129N1927L801L3619P901p8553R1983k03204J64703m8104
8022c74933L9732L7419r0933O504J0167M3778k4458q2108J764J12043k8252O414
8010c42863k5683M1036K1204k0326m7111m4223R0664M1808m4341J72633l870l5825
7998a96897p2182q2783M9919Q2335o2025P4503j5784j1273n3005O9148M4097K2262
7986a51685k11405L7276L1427J55778j49495O1960p9621J31948j04615j2973M2613
$$ plain form
8067 -417754 -343609 -373014 -333762 -359250 -372626 -292071 -291694 -406160 -391156 -413753 -297156 -220641
8055 -220641 -377418 -428963 -430647 -211117 -64756 -199028 -373695 -276696 -289779 -265820 -295470
8044 -295470 -241407 -414568 -249560 -343264 -261674 -325596 -330100 -226242 -323776 -343818 -274786
8033 -274786 -457135 -399006 -347079 -343278 -309659 -301758 -380311 -288328 -491532 -326829 -374933
8022 -374933 -335201 -297782 -388715 -382211 -372044 -328266 -352724 -434832 -433068 -321025 -349277 -342863
8010 -342863 -368546 -327510 -306306 -326632 -373743 -417966 -327302 -285494 -329835 -157202 -161072 -196897
7998 -196897 -269079 -351862 -301943 -219608 -281633 -207130 -222914 -234187 -287192 -218044 -173947 -151685
7986 -151685 -363090 -325814 -294387 -138609 -288104 -226144 -305765 -173817 -278432 -291405 -248792
7975b48792j2885O9163j41971J50037k8029q26j2002k8443O4495j04268L2061
7964b61460J1733p9188l7069J03191J18131j36996K9255j9381M9964m7301q088
7953b77209L2593J03826k30255K43503l5312r117r191j53085K24420n4050J31238
7942c2639j03730J88878p4707p0870k5699K8833O4602Q8987m474J6856j5971p6385
7930a6319p4739K6883M4300o9950q9598m6973l7382K57258k1633j14960j58366
7919c01479m5129K15118p5646Q4230o3642O9935q2477L9531j09347R1695n5331
7908b32542l2999m1817K43601m3325j2166q4996P4345J04233j08591J29962p0276
7897g4571j02732K65028m4507j68724J34574J07742l168J4023K10949j09017L8092
$$ plain form
7975 -248792 -261677 -192514 -334485 -184448 -212477 -213303 -225305 -253748 -189253 -293521 -261460
7964 -261460 -249727 -328915 -365984 -262793 -144662 -281658 -252403 -271784 -221820 -269121 -277209
7953 -277209 -244616 -140790 -371045 -127542 -162854 -171971 -181162 -334247 -109827 -163877 -32639
7942 -32639 -136369 52509 -22198 -93068 -118767 -89934 -25332 63655 59181 76037 60066 -16319
7930 -16319 -91058 -64175 -19875 -89825 -179423 -226396 -263778 -6520 -28153 -143113 -301479
7919 -301479 -346608 -131490 -207136 -122906 -186548 -116613 -199090 -159559 -268906 -177211 -232542
7908 -232542 -265541 -307358 -63757 -107082 -119248 -204244 -129899 -25666 -134257 -4295 -74571
7897 -74571 -177303 87725 43218 -125506 9068 116810 113642 127665 338614 229597 267689
7886B67689K68510N93M34975M6337J76480p4350m050k17368l72872L0457k46211
7875C10190P9675k10157j69678K9496L6763j73064J55691j72936L6870l6510R5553
7864a8107j11418j59081J92418m2878L3372j84506J64102j62147J81539l9851
7854a46557R545j23586p06177N71641J21253L2224J453j3717J19720l1787j63326
7843c29314J51450k6282j22743J16225m1137j1029m7889k8359R3691o365l4843
7832b86595O6061j168o7778P623n8427r210J17983M7801k8921p9081N682P9579
7820b06451k30654R0169J19949K7726K6725M5842j34984r1476m1717J82555M2488
7809a69828j69717R4242j77431J63266m3635R9950n7339l61j40387J74598P2521
$$ plain form
7886 267689 536199 536792 971767 1018104 1194584 1120234 1116184 898816 525944 556401 310190
7875 310190 389865 179708 10030 39526 76289 -96775 58916 -114020 -77150 -113660 -18107
7864 -18107 -129525 -288606 -96188 -139066 -105694 -290200 -126098 -288245 -106706 -146557
7854 -146557 -137012 -260598 -966775 -395134 -273881 -241657 -240204 -253921 -134201 -165988 -329314
7843 -329314 -177864 -204146 -326889 -210664 -251801 -262830 -310719 -339078 -245387 -251752 -286595
7832 -286595 -220534 -221702 -289480 -281857 -340284 -349494 -231511 -183710 -212631 -291712 -286030 -206451
7820 -206451 -437105 -346936 -226987 -199261 -172536 -126694 -261678 -353154 -394871 -212316 -169828
7809 -169828 -339545 -245303 -422734 -259468 -303103 -203153 -260492 -260853 -401240 -226642 -154121
7798a54121j10595M9741n6456J6335j38495K05586j40833N2424n8819O0998O1698
7787b12537J13460j63454q3294P4063p4333J40646n8732q4391M4435r7117R0874
7776c10380p8058K18503L2257k87134J54555m9154J05126m3293n9917R1509j48500
7765c74486Q6333K8150j84162J23396M9443Q474n6523m4506j04013R9713j4549
7754c82730K1651O2859q2018k6764J90956j03291K8249k4619N6467j51596J83123
7743b27713o1886r6904P0135J04715m1341n9367p0830N6223L3455M6754J09876
7732a36883j67779k5069R7827n213m3945L3351P11j10941R7901k6294o3566m7968
7720c97868J11464p5164J43464r3023J35488j44366m497P8345o1661n1337J83280
$$ plain form
7798 -154121 -264716 -214975 -271431 -255096 -393591 -188005 -328838 -276414 -335233 -274235 -212537
7787 -212537 -99077 -262531 -345825 -271762 -346095 -205449 -264181 -348572 -304137 -401254 -310380
7776 -310380 -388438 -169935 -137678 -424812 -270257 -319411 -214285 -257578 -317495 -225986 -374486
7765 -374486 -288153 -260003 -444165 -320769 -271326 -262852 -319375 -363881 -467894 -368181 -382730
7754 -382730 -361079 -298220 -380238 -407002 -216046 -319337 -291088 -315707 -259240 -410836 -227713
7743 -227713 -289599 -386503 -316368 -211653 -252994 -312361 -383191 -326968 -293513 -246759 -136883
7732 -136883 -304662 -329731 -231904 -237117 -281062 -247711 -247000 -357941 -260040 -286334 -349900 -397868
7720 -397868 -286404 -361568 -218104 -311127 -175639 -320005 -324502 -246157 -307818 -359155 -175875
7709a75875m6982j247o8311J5834N799N1130m2093j22974O9532r7985L6007P0745
7697c06420J22498j25100J50085j08169N1176j2547j23919O2870J3566P6745q7796
7686b87011j9517J13415o8783Q5535j25055R8538q0944K6865L8780O490p3734
7675b85421p6531K00430j13044p8047L661J59199j8146j1619l8755J40213j55470
7664b73530k8973K8082J46608o1120r5824n378R8302q8469j17020J34623l3058
7653b95757J5522j31017J88928j26293j2942J27299k4114o7685P4866p5921O7763
7642b59351k9770M4233p0134J88694n3911j22929j9998r1597K2474K1078M1837
7631c29374j04400J04018J61679r6853j03999O1682J10798p0716L3522L8523k2431
$$ plain form
7709 -175875 -222857 -224104 -292415 -276581 -270782 -219652 -261745 -384719 -315187 -413172 -377165 -306420
7697 -306420 -183922 -309022 -158937 -267106 -215930 -228477 -352396 -289526 -275960 -199215 -287011
7686 -287011 -306528 -193113 -261896 -176361 -301416 -202878 -283822 -256957 -218177 -211687 -285421
7675 -285421 -361952 -161522 -274566 -352613 -348952 -189753 -207899 -219518 -258273 -118060 -273530
7664 -273530 -302503 -274421 -127813 -188933 -284757 -290135 -191833 -280302 -397322 -262699 -295757
7653 -295757 -280235 -411252 -222324 -348617 -361559 -234260 -258374 -326059 -251193 -327114 -259351
7642 -259351 -289121 -244888 -315022 -126328 -180239 -303168 -323166 -414763 -392289 -371211 -329374
7631 -329374 -433774 -329756 -168077 -264930 -368929 -307247 -196449 -267165 -233643 -195120 -217551
7620b17551o6330K9630M9418j5691p289j22016J18699m7327O4666j10602L3502
7609b90891l7361L0502J6344N9912P0629j38064M9055n4069k6511J74495n9937
7598b05896l44475K61877k0531J04195j24151J5999L9050J3536j17761J33247
7588b44910j00212J23466l6306P2366j0848j13779M8085J37619j51413n2061K8529
7577b99464P0330j6620N1393k0511J30726j01518K04633k90327N2687K8561p3353
7566b63463r1246J82596j00241m4270J09123K2252k9260P7369r6491J0681l0302
7555b53252j4810O0115j42419K6764L0281m6515J07637J5776j5301j6392k1283
7544b69399J58043m4849j03193m3238j1574k068O1388K7384q9364J08925j84720
$$ plain form
7620 -217551 -283881 -254251 -204833 -220524 -227813 -349829 -231130 -278457 -213791 -324393 -290891
7609 -290891 -328252 -297750 -281406 -221494 -150865 -288929 -239874 -293943 -320454 -145959 -205896
7598 -205896 -550371 -288494 -309025 -204830 -328981 -312982 -273932 -260396 -378157 -244910
7588 -244910 -345122 -221656 -257962 -185596 -196444 -310223 -262138 -124519 -275932 -327993 -299464
7577 -299464 -229134 -245754 -194361 -214872 -84146 -185664 18969 -271358 -218671 -190110 -263463
7566 -263463 -354709 -172113 -272354 -316624 -207501 -185249 -214509 -137140 -233631 -222950 -253252
7555 -253252 -268062 -207947 -350366 -323602 -293321 -339836 -232199 -216423 -231724 -248116 -269399
7544 -269399 -111356 -156205 -259398 -302636 -314210 -316278 -254890 -227506 -316870 -207945 -392665
7533c92665J61420L3167j09421K7467P910K36J48109K341q6193o1209N8852M4377
7521a65609n4402K50076j68729k2540n7289j0916N7749j30332J50084J32306m2089
7510f1691j28572l1537K06726r2097L0075j35405j2321n3160J24435J55569k55995
7499b53973K7992P8844p6087o2617J07637O1644o6495J67802j21351n9725P6014
7488a20315r6938l9698M8642K9672l9156j27229J27755l0682J20629j2290k1883
7477a61493j68274J23539m3027M3600n0585N1429J29469m2388q4026m5454N3577
7466a93633J12094l8787l6141j40Q2260j92614Q2820r4218K44995j43538r8131
7455b75033J38426j5528Q7361j14500J2872N2688j6019m9281Q8035q5065J1464
$$ plain form
7533 -392665 -231245 -198078 -307499 -280032 -272122 -271886 -123777 -121436 -207629 -268838 -209986 -165609
7521 -165609 -220011 30065 -138664 -161204 -218493 -229409 -171660 -301992 -151908 -19602 -61691
7510 -61691 -190263 -221800 -15074 -107171 -77096 -212501 -224822 -277982 -153547 2022 -253973
7499 -253973 -225981 -147137 -223224 -285841 -178204 -116560 -183055 -15253 -136604 -196329 -120315
7488 -120315 -217253 -256951 -208309 -178637 -217793 -345022 -217267 -247949 -127320 -139610 -161493
7477 -161493 -329767 -206228 -249255 -205655 -256240 -204811 -75342 -117730 -201756 -247210 -193633
7466 -193633 -81539 -120326 -156467 -156607 -74347 -266961 -184141 -278359 -33364 -176902 -275033
7455 -275033 -136607 -152135 -64774 -179274 -166402 -113714 -129733 -179014 -90979 -176044 -164580
7444a64580r4821J56407j37565J4070M9774K4054J45123j00277l9113p587o1218
7433b15733J01875k086m4052r6825J86960j36992J64391M0040j27547Q445J00977
7422b0547k43774J60868j43158J48013k29510J44619R9927l4058j74n6102J2792
7411a61104Q6144K8367j28000J12332l2232J3581p0117O4629q727N8796K8849
7400g482m9388j16943L89q7659K70770p7787j40986n382J87581j06300J08975
7389b4212r5779K102j8240J06879j54723K1070J09617R097r316n7924o3050K356
7377a72123J14839k7057Q0125l6431j3611j2602j8014R960K9065N2808j44296
7366a37337L9226p8145R030J68113j07582J55757r9063k1073R5099j8466k6607
$$ plain form
7444 -164580 -259401 -102994 -240559 -226489 -176715 -152661 -7538 -107815 -146928 -154515 -215733
7433 -215733 -113858 -115944 -159996 -256821 -69861 -206853 -42462 -2422 -129969 -121524 -20547
7422 -20547 -264321 -103453 -246611 -98598 -328108 -183489 -83562 -117620 -117794 -173896 -161104
7411 -161104 -74960 -46593 -174593 -62261 -94493 -80912 -151029 -86400 -95127 -36331 -7482
7400 -7482 -56870 -173813 -173424 -261083 9687 -68100 -209086 -214468 -26887 -133187 -24212
7389 -24212 -119991 -117889 -136129 -29250 -183973 -162903 -53286 -44189 -53505 -111429 -174479 -172123
7377 -172123 -57284 -84341 -4216 -40647 -54258 -66860 -84874 -74914 -45849 6959 -137337
7366 -137337 -98111 -176256 -167226 887 -106695 49062 -50001 -71074 24025 5559 -21048
7355b1048r5543K0403l3436N4090Q999p6435P441m7823Q0369L8045L8684L4470
7343H216k9352j83045q283K5251J06626o9040j1193R3568Q7447j44306Q5386j50614
7331a89339N4623J20676J0835j39068O7769l227J09387q0456L9542o3969q933
7320h2160k3851J20330J2309l7753p4740J2439n5807J68447o2473p4068J40501
7309D3174O6351j29257Q380M809j6314R8931j6828P1119r6182O6836r6928k527
7297A564o1972P3515J9490L7090n9737M9273j6179K5697k3975r201J26183j09206
7285E2542j0196l4645K4404k7390R4615M243J09183j49899J78149j32951P8362
7274A86417l210R001l5699J69921j75217J21446j9119K8091j49565J26331P881
$$ plain form
7355 -21048 -116591 -96188 -129624 -75534 -66535 -142970 -135529 -183352 -102983 -64938 -26254 8216
7343 8216 -21136 -204181 -212464 -187213 -80587 -149627 -160820 -67252 20195 -124111 -38725 -189339
7331 -189339 -134716 -14040 -3205 -142273 -74504 -77731 31656 -48800 -9258 -73227 -82160
7320 -82160 -106011 14319 26628 -11125 -85865 -73426 -129233 39214 -23259 -97327 43174
7309 43174 109525 -19732 -11352 -6543 -22857 76074 59246 130365 34183 101019 4091 1564
7297 1564 -60408 13107 32597 69687 9950 59223 43044 68741 44766 35565 161748 52542
7285 52542 42346 7701 32105 4715 99330 103573 212756 62857 241006 108055 186417
7274 186417 183207 192208 156509 326430 151213 272659 253540 281631 132066 258397 266278
7263B66278M1032K9767M2128k00593J04824o6043K7201J30741k8703N5511R78
7252D03121p4140J26418o0012j9859P4862O1506K138P2726j10315O0133L1035
7241E67613n7202K4442j10929K19223n4529k3580K55127j77958j6389l6520m5146
7230E44152O5885m1459q504J32752q4044L3423n6487P7483j6074R3710K144j72029
7218E70952N3643o0309J56482r8627j2802p24J1477l4777N1326p7929J7389o866
7206E69235l4025r3861p255O3701J47966j13549j34125J06058J895J06551j8723
7195E93868L054j66823Q3036M2172m0424j87262J23643l8903J0820J6179j5742
7184D23618O446M7241N5645j02325Q1140j40202K2571r7954J78018R546j34683
$$ plain form
7263 266278 307310 337077 379205 178612 283436 217393 244594 375335 346632 402143 403121
7252 403121 328981 455399 395387 375528 450390 511896 514034 586760 476445 536578 567613
7241 567613 510411 534853 423924 643147 588618 565038 820165 642207 625818 589298 544152
7230 544152 610037 568578 560074 692826 608782 642205 585718 663201 647127 740837 742981 570952
7218 570952 624595 564286 720768 622141 609339 608615 620092 585315 636641 558712 576101 569235
7206 569235 535210 441349 434094 497795 645761 532212 398087 504145 506040 612591 593868
7195 593868 596922 430099 513135 555307 514883 327621 451264 412361 423181 439360 423618
7184 423618 430064 477305 532950 430625 511765 371563 394134 296180 474198 483744 349061
7173C49061J12381j65323J26097P7903p4607Q6566m5828l5065j6551J31379n1385
7162D94628p7895O2358J2522R336J42443j92175R7993j30198o5749J39589p713
7151D85139J320k0003R6683J27004P587j2469P404j87057J40726J6248o188n8008
7139E98386R3200r4594J53748j45377P8437j42111O4071Q0674j27866J8145K92335
7128H69048p5714r1085k069M0217L0256j8182o8054k9027K41274j5797o514n013
7116H69340j30232K13302r0639J10150j08553N5622J68867p7209M6767j0368o787
7105A040260M6008j39380J72244k6046J06379j02567L4963k5807O8915J46406
7095A321375k6321o1749O5118J36651k84558K80555j50006J2700n5484N1791P5089
$$ plain form
7173 349061 461442 296119 422216 500119 425512 512078 466250 431185 414634 546013 494628
7162 494628 416733 479091 491613 500949 643392 451217 549210 419012 353263 492852 485139
7151 485139 486459 466456 563139 690143 697730 685261 692665 505608 646334 662582 656394 598386
7139 598386 691586 596992 750740 605363 683800 541689 605760 686434 558568 576713 869048
7128 869048 793334 702249 700180 740397 770653 752471 684417 655390 896664 880867 874353 869340
7116 869340 739108 952410 861771 971921 863368 918990 1087857 1010648 1057415 1047047 1040260
7105 1040260 1086268 946888 1119132 1093086 1199465 1096898 1131861 1106054 1174969 1321375
7095 1321375 1295054 1233305 1298423 1435074 1150516 1431071 1281065 1293765 1238281 1290072 1365161
7084A365161j1238P576J75867o5782N3303P8620j7454Q35J86593l209O7987K5517
7072A863776k36003K25741N9369q7269K22404j7009r737K0157J26657k9830J61788
7061B300044L3755n0184l2696N760Q9094J09180P0772P8935J37779J38170o3239
7050B817370N6647J22526J0787K3775J11855j1979K11265j07747K66452M233J45404
7039C650588J97128O0600J95300K1357J64087J64880J23711J76339J36910J53535
7029E044435K13010P5758K99751J38261L01421L07212J26318K39575M63224J38402
7019G347367M22696L41418K80782M05762M94450M84110N73747M89739M70340N89658
7009A1900069O76579O43723P07451Q30713P31049Q46017Q29122R80555J271184
$$ plain form
7084 1365161 1353923 1361499 1537366 1471584 1524887 1603507 1586053 1586888 1773481 1770272 1838259 1863776
7072 1863776 1627773 1853514 1912883 1825614 2048018 2031009 2021272 2041429 2168086 2138256 2300044
7061 2300044 2333799 2283615 2250919 2256679 2345773 2454953 2525725 2604660 2742439 2880609 2817370
7050 2817370 2874017 2996543 3007330 3031105 3142960 3130981 3342246 3234499 3500951 3505184 3650588
7039 3650588 3847716 3908316 4103616 4124973 4289060 4453940 4577651 4753990 4890900 5044435
7029 5044435 5257445 5333203 5632954 5771215 6072636 6379848 6506166 6745741 7208965 7347367
7019 7347367 7770063 8111481 8392263 8798025 9292475 9776585 10350332 10840071 11310411 11900069
7009 11900069 12576648 13220371 13927822 14758535 15489584 16335601 17164723 18145278 19416462
7000A9416462R30350J281985J218092J377210J323548J763586J399077J634792
6992C0345102J651712J814526J670845J716078J434946J405253J459814J218822
6984D2717098R58671J002974R20722Q76040Q75260R29161R59325J070673J301638
6975E1611562J253189J396959J470863J562483J404088J466543J227980Q79053
6967F2272720O05564L20977k66063m58653q77038j387577j590503j459709j600843
6958E5558875j587797j461500j410922j348226j131374r69282r33210q26444p65083
6949D5125037q09514p93638r83834j029997j170063j383062j485404j439492j846311
6940C4183722j604053j601113j958613j452114j680182j512811j234318j339473
$$ plain form
7000 19416462 20346812 21628797 22846889 24224099 25547647 27311233 28710310 30345102
6992 30345102 31996814 33811340 35482185 37198263 38633209 40038462 41498276 42717098
6984 42717098 43675769 44678743 45599465 46475505 47350765 48279926 49239251 50309924 51611562
6975 51611562 52864751 54261710 55732573 57295056 58699144 60165687 61393667 62272720
6967 62272720 62878284 63199261 62933198 62474545 61597507 60209930 58619427 57159718 55558875
6958 55558875 53971078 52509578 51098656 49750430 48619056 47649774 46716564 45890120 45125037
6949 45125037 44315523 43521885 42538051 41508054 40337991 38954929 37469525 36030033 34183722
6940 34183722 32579669 30978556 29019943 27567829 25887647 24374836 23140518 21801045
6932B1801045j185450j132764j173057q45189q85689r45850o63223n98161n32361
6923A3839301q23588n98527o26628m53483m60914m59784m42550l44542m31292
6914I197993k73531n30395j14710l03806l34039k49720k48801j68879j42255k06596
6904F625261k41145l00652j41534j32018o1969k82032r8703j25859j16727j70522
6894D954100k80451P5731k53395l3378q4235r6628k86090j25315J11150j31500
6884C849989j74543N2740n2424j43769j02911n1031j9402q1233j57989K2296r2221
6873C049502m8231m990p9671j4157j38694J29286j74815P733j1147J543J266j12312
6861B605313p3316N8640J1626j37164k3923O4926r4114o0626n6990q3957L6882
$$ plain form
6932 21801045 20615595 19482831 18309774 17464585 16578896 15633046 14969823 14371662 13839301
6923 13839301 13015713 12417186 11790558 11337075 10876161 10416377 9973827 9629285 9197993
6914 9197993 8924462 8394067 8279357 7975551 7641512 7391792 7142991 6974112 6831857 6625261
6904 6625261 6384116 6083464 5941930 5809912 5747943 5465911 5367208 5241349 5124622 4954100
6894 4954100 4673649 4749380 4495985 4462607 4378372 4281744 3995654 3870339 3981489 3849989
6884 3849989 3675446 3728186 3675762 3531993 3429082 3378051 3358649 3277416 3119427 3141723 3049502
6873 3049502 3001271 2996281 2916610 2902453 2763759 2893045 2718230 2725963 2714816 2716359 2717625 2605313
6861 2605313 2531997 2590637 2602263 2465099 2441176 2506102 2411988 2351362 2294372 2210415 2247297
6850B247297K2180m8576k18167J32679m0459k8135l5865R5580j33099m0479r1595
6839A861361J08108m9228o0811r0385Q2764j34020P0478j08372k4491Q1166j75775
6828A560795J45348r377j20653j89955L33215k68212J62329j23715Q8927M8778
6818A627480o8145j72387J93006q8435j15639L3246m7574J14585M044l1754l8223
6807A410204J4136m8189J46860J16904J1303j72207J97619r6764J68925j55754
6797A593037K3304Q2708k4071J5389k8023J98520k21299P6458k0875O8970l7803
6786A726315K6102o5726J79921o1782r4236K34676P7036j38667P5716K9134j03036
6775A885453M6282o4160J94610j08992q6181j83951K45475j48576K6103j33693
$$ plain form
6850 2247297 2269477 2220901 2002734 2135413 2094954 2066819 2030954 2126534 1993435 1952956 1861361
6839 1861361 1969469 1920241 1859430 1769045 1851809 1717789 1788267 1679895 1655404 1736570 1560795
6828 1560795 1706143 1696766 1576113 1386158 1719373 1451161 1613490 1489775 1578702 1627480
6818 1627480 1559335 1386948 1579954 1491519 1375880 1409126 1361552 1476137 1480181 1448427 1410204
6807 1410204 1424340 1376151 1523011 1639915 1651218 1479011 1676630 1579866 1748791 1593037
6797 1593037 1616341 1699049 1674978 1690367 1662344 1860864 1639565 1716023 1695148 1764118 1726315
6786 1726315 1752417 1686691 1866612 1804830 1710594 1945270 2022306 1883639 1959355 1988489 1885453
6775 1885453 1931735 1867575 2062185 1953193 1867012 1683061 1928536 1779960 1806063 1672370
6765A672370l3494J63874k26231J03002q9070j08783o1577l9858J15091l8672
6755A456652O7999j39755p1313K0011r4846k8777j67633J22154k06543J83588
6745A141537l5607j82924J29404k63j52893r0602K7183j7920k04902J71645l6741
6734G47917n5846P3833R8771n4945j85297K3517n2775O1841K3587j10539J27866
6723F97930J3098M2304k21777J28902M22n313P1650M0964j51714J30990j71812
6712E75644K42086n1795p9953j0016M844k0658o671Q902N7825o8036k8807M9611
6700F72976r5883R783Q4367l5484J03238O1951K3119j01136J9592P2763l555j68193
6688F43538J27155m2267P360P9725q6919j44186R4976j1985J4621n4090j27087
$$ plain form
6765 1672370 1638876 1802750 1576519 1679521 1590451 1481668 1420091 1380233 1495324 1456652
6755 1456652 1524651 1384896 1313583 1333594 1238748 1209971 1042338 1164492 957949 1141537
6745 1141537 1105930 923006 1052410 1052147 899254 808652 835835 817915 613013 784658 747917
6734 747917 692071 765904 864675 809730 624433 647950 595175 657016 680603 570064 697930
6723 697930 711028 753332 531555 660457 660879 655566 727216 768180 616466 747456 575644
6712 575644 817730 765935 685982 675966 680810 660152 653481 662383 720208 652172 623365 672976
6700 672976 577093 586876 671243 635759 738997 800948 824067 722931 742523 815286 811731 643538
6688 643538 770693 728426 735786 815511 728592 584406 679382 667397 682018 627928 500841
6677E00841J55985j31613P8547j17861P9106J5065L2573j35431j4059J66702p1044
6666E58811N1984J455m8746M9997j98605J40883K5718p3665O0463q1712j01202
6655C85381N3173P5711J3288j62006J60400l7660j26036J71997l2169n3868j1011
6644D37200J44287r207j46195J79573r2755J0593l2448M3224k1517J22282o3452
6633E71585J24555r4687j09918J46942j26004N0310R091R1873m6137n8491M2538
6622F01657J19307l5256K2058j36851J49261M8099n7611O7946l5314k5535R8362
6611H16123n7042p5703O1457K7508l8483J9918O4762N6671o3193q7124N3312O8027
6599H46233l1175p2602M3323p7415R2387n7415N7612l4776m0190J8635N8883J66346
$$ plain form
6677 500841 656826 525213 603760 485899 565005 580070 612643 477212 463153 629855 558811
6666 558811 610795 612250 563504 613501 414896 555779 581497 507832 568295 486583 385381
6655 385381 438554 514265 527553 365547 525947 488287 362251 534248 502079 448211 437200
6644 437200 581487 572280 426085 605658 512903 523496 491048 534272 512755 635037 571585
6633 571585 696140 601453 491535 638477 512473 562783 571874 663747 617610 559119 601657
6622 601657 720964 685708 707766 570915 720176 768275 710664 778610 743296 717761 816123
6611 816123 759081 683378 744835 772343 733860 753778 818540 875211 812018 724894 778206 846233
6599 846233 815058 742456 785779 708364 800751 743336 800948 766172 725982 744617 803500 969846
6587I69846j56226j92302J01010k4853R6010J45094j62902j51983O4788j7798
6577F70684P4399M0150p0584j26566J41023l4263O0242k9148m1186r2544J59088
6566G51295m6600m135j09026N0604M1397q7074J00196L7916j1222n7443Q5415
6555G51323j11116m7131L265K10285o2818j49430O4991j920Q636r7031J12835
6544F81889J51327j26373m6407R121J39985j3088o2390m0177J70204l0666m9567
6533G83858n7771j7630J16514M6191o5021j01823L0451J52468l8144j8743M7206
6522H77556J8592J42692k7436k1707j6077j6859R7376p2970P4592m9638J26189
6511A132310k19935R4173j1469J5045k600k3276k8510J39126j28448J26406m125
$$ plain form
6587 969846 813620 621318 722328 697475 793485 938579 775677 623694 688482 670684
6577 670684 745083 785233 714649 588083 729106 694843 755085 725937 684751 592207 751295
6566 751295 704695 700560 591534 642138 683535 596461 696657 734573 723351 665908 751323
6555 751323 640207 593076 596341 806626 743808 594378 659369 657449 666085 569054 681889
6544 681889 833216 706843 660436 669557 809542 796454 734064 693887 864091 833425 783858
6533 783858 726087 708457 824971 871162 806141 704318 734769 887237 849093 830350 877556
6522 877556 896148 1038840 1011404 989697 973620 956761 1054137 981167 1055759 1006121 1132310
6511 1132310 912375 1006548 995079 1010124 1007524 984248 955738 1094864 966416 1092822 1088697
6500A088697j5739R9196q3967j4512J88345k18251J39236M4606q8015k5375L7069
6489A151290o7494K73536l8140k14227m9888J22J27248J41565j00299j12914J87392
6478A298191m0850O3376m796k9360P339P1385n503J11891L9608J0650J0037J48439
6466A680407j57671M256J54934J5778l7928Q1766m0876M8530J00755K744j2349
6455A840346n1411J29596R7839M644j11200j7607K2082K13274q9031M1475o1640
6444B018367J92738l0457J01467r8382Q2728j02383J58491O2480p4996P2312M9805
6433B432170K04562j28664M7555Q1660o3369N6431M0829K5912M4616n2494M3371
6422B732579J67444m4242q671q08J12389r788p447J20807K1995O4763O4781J1113
$$ plain form
6500 1088697 1072958 1172154 1088187 1073675 1262020 1043769 1183005 1227611 1139596 1114221 1151290
6489 1151290 1083796 1357332 1319192 1104965 1055077 1055199 1182447 1324012 1223713 1110799 1298191
6478 1298191 1257341 1320717 1315921 1286561 1293900 1365285 1359782 1471673 1511281 1521931 1531968 1680407
6466 1680407 1522736 1526992 1681926 1697704 1659776 1741542 1700666 1749196 1849951 1852695 1840346
6455 1840346 1788935 1918531 2016370 2021014 1909814 1892207 1914289 2127563 2038532 2080007 2018367
6444 2018367 2211105 2180648 2282115 2183733 2266461 2164078 2322569 2385049 2310053 2382365 2432170
6433 2432170 2636732 2508068 2555623 2637283 2573914 2630345 2671174 2697086 2741702 2689208 2732579
6422 2732579 2900023 2855781 2847110 2846302 2958691 2948903 2941456 3062263 3084258 3149021 3213802 3224915
6410C224915J4683K4818P4025K09361q0075M8309K69482k5756J02024K3035k7664
6399C857157O6681J91817j9031J75893J21622k3397J31060J73085R8410J03688
6389D876985J83374K1684J18809K30232J21473L05194J82915J34446K44152J53699
6379F572963J30685L57298K16371M23902n5411L82793L70226L36053M05937L19279
6369I460096M56681M81652M67861M17157N95443M76403O30116P36955P16204O41610
6359A5080178R15187P88377R33713J044751Q81084J007673J208584J281561J379766
6350B4520874J333672J746805J615981J659548J938173J781584J841405K097035
6342C8535077J827083K028673J677867J629834J497431J159236J114645Q42867
$$ plain form
6410 3224915 3239598 3264416 3338441 3547802 3467727 3516036 3785518 3759762 3861786 3884821 3857157
6399 3857157 3923838 4115655 4096624 4272517 4394139 4370742 4501802 4674887 4773297 4876985
6389 4876985 5060359 5082043 5200852 5431084 5552557 5857751 6040666 6175112 6419264 6572963
6379 6572963 6703648 7060946 7277317 7701219 7645808 8028601 8398827 8734880 9140817 9460096
6369 9460096 9916777 10398429 10866290 11283447 11878890 12355293 12985409 13722364 14438568 15080178
6359 15080178 15995365 16783742 17717455 18762206 19643290 20650963 21859547 23141108 24520874
6350 24520874 25854546 27601351 29217332 30876880 32815053 34596637 36438042 38535077
6342 38535077 40362160 42390833 44068700 45698534 47195965 48355201 49469846 50312713
6334E0312713P32912Q47332O53789Q20741R40851J070150J256482J518139J349498
6325E9502607J778232J778834J740222J694780J203708J045756M27746j52081
6317F9019804o57390j103843j527323j884545k158172k006772k071453k071941
6309E5538365j900700j509474j464681j418648j094541j045774q61613j160734
6301D5082200p23028q82924j011724j204975j322029j193112j710004j724119
6293C5310285j829763j700210j670489j606111j627288j474156j319976j337872
6285B2744420j228668r93297q82175j036235r12946p24109p91323p00093o51641
6276A4823933l82054q11320l14336l75941m71049l24194l98375m34275k87564
$$ plain form
6334 50312713 51045625 51892957 52546746 53367487 54308338 55378488 56634970 58153109 59502607
6325 59502607 61280839 63059673 64799895 66494675 67698383 68744139 69171885 69019804
6317 69019804 68362414 67258571 65731248 63846703 61688531 59681759 57610306 55538365
6309 55538365 53637665 52128191 50663510 49244862 48150321 47104547 46242934 45082200
6301 45082200 44359172 43476248 42464524 41259549 39937520 38744408 37034404 35310285
6293 35310285 33480522 31780312 30109823 28503712 26876424 25402268 24082292 22744420
6285 22744420 21515752 20522455 19640280 18604045 17691099 16966990 16175667 15475574 14823933
6276 14823933 14441879 13630559 13316223 12940282 12469233 12145039 11746664 11312389 11024825
6267A1024825l33133k98688j35648k52631k26369j72571k33106m6499l73865O297
6257H958612j86806p2131j28818k40594L6815j76135r9322k147k44953O159l5590
6246G815090k9428j62315K24388j50274p0041J5250p540o8583n37j28196J36953
6235G574767k0835K2557J52360L5110q5984J42267K1608P8850L1882Q3204R5656
6224H131442O8419R1721J74145R5783J46529J88799L8534J59090K46224K23290
6214I563976J11754K04176K80761R9515M04953N0766K68593J92129M06144L20946
6204A1903713L64938L03528L74058L95077O66252K98250N91464O05185O31119
6195A6133584N54760O73536O48306Q22711Q03359P54575Q33937J030200R42022
$$ plain form
6267 11024825 10691692 10393004 10257356 10004725 9778356 9605785 9372679 9326180 8952315 8958612
6257 8958612 8771806 8699675 8570857 8330263 8367078 8190943 8091621 8089474 7844521 7850680 7815090
6246 7815090 7785662 7623347 7847735 7697461 7627420 7642670 7635130 7566547 7566010 7437814 7574767
6235 7574767 7553932 7576489 7728849 7763959 7677975 7820242 7841850 7920700 7952582 8035786 8131442
6224 8131442 8199861 8291582 8465727 8561510 8708039 8896838 8935372 9094462 9340686 9563976
6214 9563976 9675730 9879906 10160667 10260182 10665135 10715901 10984494 11176623 11582767 11903713
6204 11903713 12268651 12572179 12946237 13341314 14007566 14305816 14897280 15502465 16133584
6195 16133584 16688344 17361880 18010186 18832897 19636256 20390831 21224768 22254968 23196990
6186B3196990J053160J163815J163885J380377J409296J647794J590928J816012
6178C4422257J801082J857177J896807J665130J864776J684510J182649J332575
6170D7706963R08451J170220O66396P95721O92407Q06654R39362J034963J173317
6161E5894454J397420J538412J611925J833295J921205J946807J892776J743825
6153F9780119J465588J078443N58027K40576o59979j062822j260644j730328j886386
6144F6522594j998826j853628j830732j569119j521606j183564j225248q79703
6136E4460168o22426q15258o69101m01769p07641o86338r77685j114666j162738
6127D7302546j499921j518289j595863j920825j779146j747680j682112j573275
$$ plain form
6186 23196990 24250150 25413965 26577850 27958227 29367523 31015317 32606245 34422257
6178 34422257 36223339 38080516 39977323 41642453 43507229 45191739 46374388 47706963
6170 47706963 48615414 49785634 50452030 51247751 51940158 52746812 53686174 54721137 55894454
6161 55894454 57291874 58830286 60442211 62275506 64196711 66143518 68036294 69780119
6153 69780119 71245707 72324150 72882177 73122753 72462774 71399952 70139308 68408980 66522594
6144 66522594 64523768 62670140 60839408 59270289 57748683 56565119 55339871 54460168
6136 54460168 53837742 53022484 52353383 51951614 51243973 50557635 49579950 48465284 47302546
6127 47302546 45802625 44284336 42688473 40767648 38988502 37240822 35558710 33985435
6119C3985435j556448j390149j378820j224294p60687j176568q28734o36436q05072
6110B4228227n03456n79462n24624m30188l26369k28865j55365k87956k22757
6101B0969185m8799j71253J68681r8899J19743k1792J64048J573L64082J23293
6091B1569862M10282J09717M01186L80742L27082O11681L33641O46680M75742
6082B5266615N74564P43286O62885Q80853R01505J027746R43407J199985J059794
6073C3260640J267027J357417J697365J632501J770908K194434K154933K329331
6065D7664556K769131K899917L063245L620125L425549L946515M290007M652690
6057G6331735M954376N149721N740450N741262O249938O728208P082453P308845
$$ plain form
6119 33985435 32428987 31038838 29660018 28435724 27675037 26498469 25669735 25033299 24228227
6110 24228227 23724771 23145309 22620685 22190497 21864128 21635263 21479898 21191942 20969185
6101 20969185 20920386 20749133 20917814 20818915 20938658 20916866 21080914 21082487 21446569 21569862
6091 21569862 21980144 22089861 22491047 22871789 23198871 23810552 24144193 24790873 25266615
6082 25266615 25841179 26584465 27247350 28128203 29029708 30057454 31000861 32200846 33260640
6073 33260640 34527667 35885084 37582449 39214950 40985858 43180292 45335225 47664556
6065 47664556 50433687 53333604 56396849 60016974 63442523 67389038 71679045 76331735
6057 76331735 81286111 86435832 92176282 97917544 104167482 110895690 117978143 125286988
6049A25286988Q208869Q699509R370030J0336850J1404155J2276537J3663967
6042A99246905J4792148J6226251J7292704J8138987J8389519J7933536J5985746
6035C18005796J3089384Q279233K788895l442011r346918j4054891j7605250j9342094
6027B78372144k0417478k0079950j9106649j8073166j6400662j4836865j3491769
6020A55965605j2066260j0649759r759348q680709p894023o980677o298169o133847
6012H7502813n333266m924226m400188m189191l751268l520656l095778l269486
6004E5018754k566777k603436k389657k211137k096530k011817j771071j855176
5996C7513153j511303j417152j419275j368148j299394j093425j280187j004066
$$ plain form
6049 125286988 133495857 142195366 151565396 161902246 173306401 185582938 199246905
6042 199246905 214039053 230265304 247558008 265696995 284086514 302020050 318005796
6035 318005796 331095180 339374413 342163308 338721297 329374379 315319488 297714238 278372144
6027 278372144 257954666 237874716 218768067 200694901 184294239 169457374 155965605
6020 155965605 143899345 133249586 123490238 114809529 106915506 99934829 93636660 87502813
6012 87502813 82169547 77245321 72845133 68655942 64904674 61384018 58288240 55018754
6004 55018754 52451977 49848541 47458884 45247747 43151217 41139400 39368329 37513153
5996 37513153 36001850 34584698 33165423 31797275 30497881 29404456 28124269 27120203
5988B7120203q27907j052872q58702q71337p67660q44859o86910p83211n01606
5979A9925139o34875m88827p16176n19214o00964m41307n61532l60242m25002
5970A5177000l31443m98432l17377l00976m86611k87253k07065m92194n6888l29522
5960A1869239l23396k08190m49022j67734k61753j84592k22329k97225l3797k38216
5950I482985j92726j84577k76792q3176j22036k37401j42975j90579p6353k57961
5940G718409o3503k46582l36795M5735j2053l64377m3619k66876K2158o6064k16927
5929F169506p1791j29654n2265M303l50575R0257L3770j80629q8246k35318J10351
5918E299709k05030M849k2130j00343j34119j13077j64792Q7010j3332k27454
$$ plain form
5988 27120203 26292296 25239424 24380722 23509385 22741725 21896866 21209956 20426745 19925139
5979 19925139 19290264 18801437 18085261 17566047 16965083 16523776 15962244 15602002 15177000
5970 15177000 14845557 14347125 14029748 13728772 13242161 12954908 12747843 12255649 12198761 11869239
5960 11869239 11545843 11337653 10888631 10720897 10459144 10274552 10052223 9754998 9721201 9482985
5950 9482985 9290259 9105682 8828890 8745714 8623678 8386277 8243302 8052723 7976370 7718409
5940 7718409 7654906 7408324 7071529 7117264 7105211 6740834 6697215 6430339 6452497 6386433 6169506
5929 6169506 6097715 5968061 5915796 5920099 5569524 5659781 5693551 5512922 5424676 5189358 5299709
5918 5299709 5094679 5099528 5077398 4977055 4842936 4729859 4565067 4652077 4638745 4411291
5908D411291j6224p5683j513j57356J79588k37653k5144P0594j63741q0881o5250
5897C838028P4510j41595r0610j5277j32202K5243m838k5800n7230K3400q962
5886C484667j75108r6637k2207M2953l5578j15289J22448j1969j82382j15496
5876B895402J9584o9209n5164J38742j18977J13415j13148j09342J05558k7789
5866B779072K6026n2495j07676p6813k6460l8851N3682n6555R9130k44871J73034
5855B527223l9808j79473J605L4906l8180j08208J837R931j06834j3455R466P0311
5843B169321k5508j34775J7876M6430o8361j70473l542J41228j45884j13771R5429
5832A807970M2685j15958L9545j18647J98039j14456j4666j27627o0356Q0907
$$ plain form
5908 4411291 4395067 4319384 4317871 4160515 4340103 4102450 4077306 4147900 3984159 3903278 3838028
5897 3838028 3912538 3770943 3680333 3665056 3532854 3558097 3553259 3527459 3470229 3493629 3484667
5886 3484667 3309559 3212922 3190715 3233668 3198090 3082801 3205249 3193280 3010898 2895402
5876 2895402 2914986 2845777 2790613 2929355 2810378 2923793 2810645 2701303 2806861 2779072
5866 2779072 2805098 2752603 2644927 2568114 2541654 2502803 2556485 2499930 2599060 2354189 2527223
5855 2527223 2487415 2307942 2309547 2344453 2306273 2198065 2199902 2209833 2102999 2089544 2099010 2169321
5843 2169321 2143813 2009038 2026914 2073344 2004983 1834510 1830968 1972196 1826312 1712541 1807970
5832 1807970 1850655 1734697 1774242 1655595 1853634 1739178 1724512 1596885 1536529 1617436
5822A617436M6878J426m5386n6738J13650j04947o6243L2558N5490k14r864j63349
5810A420697N4481J31255j22672K5514K1291j53648L6601R4668L5400n6463j40759
5799A346365P4519J03071K1639j8739k08806K20205L7202j37161P6737j44329
5789A370703O2563N784J02901R0426k11072j4773K55472q1346l6854O8659j14103
5778A498360N8258o1586K107k16733J70420j85124J47740O6733j02039J67105
5768A545241l8974n3006j437m7093j0983J0776o4247O7281l9512o9713R4592M0496
5756A433421q9648L7087N3655k97307J58380O4479J6353k4929j1776j22920m9861
5745A166934O4285N8983n5183J00460j7265q2528Q3694N991j65620J93872m8802
$$ plain form
5822 1617436 1664314 1665740 1620354 1563616 1677266 1572319 1506076 1538634 1594124 1593910 1584046 1420697
5810 1420697 1475178 1606433 1483761 1509275 1530566 1376918 1413519 1508187 1543587 1487124 1346365
5799 1346365 1420884 1523955 1545594 1526855 1318049 1538254 1575456 1438295 1515032 1370703
5789 1370703 1433266 1439050 1541951 1632377 1421305 1406532 1662004 1580658 1543804 1612463 1498360
5778 1498360 1556618 1495032 1497139 1280406 1450826 1265702 1413442 1480175 1378136 1545241
5768 1545241 1506267 1453261 1451824 1404731 1393748 1404524 1340277 1407558 1368046 1298333 1392925 1433421
5756 1433421 1343773 1380860 1434515 1137208 1295588 1360067 1376420 1351491 1339715 1216795 1166934
5745 1166934 1231219 1290202 1235019 1335479 1318214 1235686 1319380 1325371 1159751 1353623 1304821
5734A304821o6421P8008M421k6272p7428R3984j3949k07675J32530L4967m7653
5723A209333m4756Q9898q6044Q6426K2570p2600J8527O072l294J55042j2253k85089
5711A083832K16149P9714j15248j7807n6112o8108J47051J46440j91018J6503
5701A241396N8745j10088M1594J58808n6852N3283q8090l6329J22655L6593o4666
5690A357049r4636J43505k30l6736o5382J4281J20085j01430J56164j48314K26265
5679A570621k29224J43283l971o023m7927R756j9127L0597n767M2330O4655o7736
5667A481467j9167j9532Q7022q1089M2656K4685Q9429j56123J11446K104N6593
5656A619491n2114m284O0810l7689k792l2852J02843j51098J63946r326q520k5399
$$ plain form
5734 1304821 1238400 1316408 1320829 1294557 1217129 1311113 1297164 1089489 1222019 1256986 1209333
5723 1209333 1164577 1254475 1168431 1254857 1277427 1204827 1223354 1229426 1226132 1381174 1368921 1083832
5711 1083832 1299981 1379695 1264447 1246640 1190528 1122420 1269471 1415911 1224893 1241396
5701 1241396 1300141 1190053 1231647 1390455 1333603 1386886 1298796 1262467 1385122 1421715 1357049
5690 1357049 1262413 1405918 1405688 1368952 1303570 1317851 1437936 1336506 1492670 1344356 1570621
5679 1570621 1341397 1484680 1480709 1474686 1426759 1436515 1417388 1447985 1442218 1484548 1549203 1481467
5667 1481467 1462300 1442768 1529790 1448701 1491357 1516042 1605471 1449348 1560794 1562898 1619491
5656 1619491 1567377 1563093 1623903 1586214 1583422 1550570 1653413 1502315 1666261 1656935 1648415 1623016
5644A623016Q8699o624m5180J28771l0298N1210o3558j764R6675M4678j55443
5633A730182N6421J95247q8126M403n7565Q6314P9816K2630j1900O5729n1989
5622B031162J90528J40487k9024L245J32626L943J48740n0664J43273P8701j2511
5611B780506M7159P5403J62159J44371o6688L76067J10798J31555J80874K61798
5601D204002L45287M13013L62834N12521J15904K64382O7326m04687m91471k51087
5591E138024k47887j99257l54889n0112k40851J6048J2467M9507n3759L0346p5214
5580D024423J15962P4851R3001m8824J81012J13253o901l139J77131p3039K03222
5569D850952P7829J52780Q639K64968m9155K21183j02517K04450K02371R0252
$$ plain form
5644 1623016 1711715 1705091 1659911 1788682 1758384 1809594 1746036 1744272 1840947 1885625 1730182
5633 1730182 1786603 1981850 1893724 1898127 1840562 1926876 2006692 2029322 2017422 2083151 2031162
5622 2031162 2221690 2362177 2333153 2336398 2469024 2472967 2621707 2571043 2714316 2793017 2780506
5611 2780506 2827665 2903068 3065227 3209598 3142910 3518977 3629775 3761330 3942204 4204002
5601 4204002 4549289 4962302 5325136 5837657 5953561 6217943 6285269 5880582 5389111 5138024
5591 5138024 4890137 4690880 4335991 4285879 4045028 4061076 4073543 4123050 4069291 4099637 4024423
5580 4024423 4140385 4215236 4308237 4259413 4440425 4553678 4546777 4543638 4720769 4647730 4850952
5569 4850952 4928781 5081561 5090200 5355168 5306013 5527196 5424679 5629129 5831500 5921752
5559E921752K31941J15134L04357J52004J88532K19178L16365R6003L12317J85097
5549H042680K88655L26663M11310K80597K34648M44228L78521M43666M39326M21632
5539A1711926M28617P45582L98002O81968M48733P03792P02253M67791R83117
5530A7271781M47932R14445P45809Q83666P08109Q31438Q39741R02895P74236
5521B4320052J109643J015758Q35531J098390P99178J071598R13136J021606Q93935
5512C3078827J121560Q66691J057207Q51710R90835R92302Q35178P99159R83851
5503D1577320P36640J048101N45402Q72424O51144N90948P53950L39996O63271
5494D7779196L67900K95792O06744J94169J93459K30258R9944J539K6921n955
$$ plain form
5559 5921752 6153693 6268827 6573184 6725188 6913720 7132898 7449263 7545266 7857583 8042680
5549 8042680 8331335 8657998 9069308 9349905 9584553 10028781 10407302 10850968 11290294 11711926
5539 11711926 12140543 12886125 13284127 13966095 14414828 15118620 15820873 16288664 17271781
5530 17271781 17719713 18634158 19379967 20263633 20971742 21803180 22642921 23545816 24320052
5521 24320052 25429695 26445453 27280984 28379374 29178552 30250150 31163286 32184892 33078827
5512 33078827 34200387 35067078 36124285 36975995 37966830 38959132 39794310 40593469 41577320
5503 41577320 42313960 43362061 43907463 44779887 45431031 46021979 46775929 47115925 47779196
5494 47779196 48147096 48442888 49049632 49243801 49437260 49667518 49767462 49769001 49795922 49789967
5484D9789967j59349r9524j77607m42113j80673l10336k99890m45238l40168l34280
5474D7000789m20606k90495o11960m32869p08385r57475j089757j217766j290202
5465C9981274j217345j223570j191290j097161j110201j007671j023434j006692
5457C1103910r88758r46025r75215r58349r25544p46497j003245r27817q07718
5448B2824742o76854q72228q71122o71685n31355q13665p11373n15147o13999
5439A6547314o83182m11409o62313o13815n93601m96291m65734n76776n00042
5430A1544151m90698j85604o17061k48718l51478k63081m47575k53805l97684
5421H288447j57828j72701j37790k40300k93288j73737k29028M1725l82972j09947
$$ plain form
5484 49789967 49630618 49531094 49353487 48911374 48730701 48420365 48120475 47675237 47335069 47000789
5474 47000789 46580183 46289688 45677728 45244859 44536474 43578999 42489242 41271476 39981274
5465 39981274 38763929 37540359 36349069 35251908 34141707 33134036 32110602 31103910
5457 31103910 30115152 29169127 28193912 27235563 26310019 25563522 24560277 23632460 22824742
5448 22824742 22147888 21275660 20404538 19732853 19201498 18387833 17676460 17161313 16547314
5439 16547314 15864132 15452723 14790410 14176595 13582994 13086703 12620969 12044193 11544151
5430 11544151 11053453 10867849 10250788 10002070 9650592 9387511 8939936 8686131 8288447
5421 8288447 8130619 7957918 7820128 7579828 7286540 7112803 6883775 6925500 6542528 6432581
5411F432581k0789k93820j33565O859k24358j61290j36111l3895j91787M6311
5401E290136m4476k68510j9721m5912K7660j95490j47798K3904l9814m5275N1565
5390D586269q4796j21163R2674j72878n2980j0885j9860N7107m2258N308k7461
5379D209077J0529n4738K0104R6963n1207L4123j5681M3728r6648K62764j27625
5368D331389O5946M9544J31123j50928L67523r5704p9698J88004J81397J88289
5358E176885J86541R7483J77189J95216J43396L34711L32411J00697L83374M06571
5348G534474L16614L28822L26917L71327M42123M64113M35632M51882P20853P34685
5338A2127442J106321O74105J258404J322451J777664K171852K683918L055573
$$ plain form
5411 6432581 6411792 6117972 5984407 5991266 5766908 5605618 5469507 5435612 5243825 5290136
5401 5290136 5245660 4977150 4957429 4911517 4939177 4743687 4595889 4619793 4579979 4534704 4586269
5390 4586269 4501473 4380310 4472984 4300106 4247126 4236241 4216381 4273488 4231230 4236538 4209077
5379 4209077 4219606 4164868 4184972 4281935 4230728 4264851 4249170 4292898 4196250 4459014 4331389
5368 4331389 4397335 4446879 4578002 4427074 4794597 4698893 4619195 4807199 4988596 5176885
5358 5176885 5363426 5460909 5638098 5833314 5976710 6311421 6643832 6744529 7127903 7534474
5348 7534474 7851088 8179910 8506827 8878154 9320277 9784390 10220022 10671904 11392757 12127442
5338 12127442 13233763 13907868 15166272 16488723 18266387 20438239 23122157 26177730
5330B6177730L163777L130824K503003K21404j532163k442608j640908q95492
5322B8685567q37783O3156K9756M65080J334321J320181J921191K122598K469601
5313C7573668K803821K609953K708013K362213K423318K720480L097132L225389
5305E9523987K822285K456458J762947R69351J092729J478979J442381J382409
5297G2931526O08849p44090j939067k605619k267131j898058j759265k114196
5289F0212949k625095l443696l759626l677803l177662l069770k573504k861370
5281C5024423k809601l078203k929585k402651k487910j799990j822091j311726
5273A6382666j302356j257873q10706q30705r46190n51336n19863o11202m36268
$$ plain form
5330 26177730 29341507 32472331 34975334 35196738 33664575 31221967 29581059 28685567
5322 28685567 27847784 27910940 27940696 28405776 29740097 31060278 32981469 35104067 37573668
5313 37573668 40377489 42987442 45695455 48057668 50480986 53201466 56298598 59523987
5305 59523987 62346272 64802730 66565677 67535028 68627757 70106736 71549117 72931526
5297 72931526 73540375 72796285 70857218 68251599 65984468 64086410 62327145 60212949
5289 60212949 57587854 54144158 50384532 46706729 43529067 40459297 37885793 35024423
5281 35024423 32214822 29136619 26207034 23804383 21316473 19516483 17694392 16382666
5273 16382666 15080310 13822437 13011731 12181026 11234836 10683500 10163637 9552435 9116167
5264I116167l72827m86891l81511l38532l20095k92665k96203k11810l22621j59489
5254E933523k26530j66124j2131j91024l34715j90555l2806j44634j32204j06724
5244D396076j81189N010n3081p0297j94755n9043n2718n384j38650L5462j94909
5233C486522m6075k9202J65295k12660j48694J9129N5342p0967l0641P1537r0876
5222C168710j86215K3904J46387J0534j31289r227M5484j19510J48474p5273L8239
5211C060218p8606R2717p1121r5216M421L9976J09440j59374n821l0332j852J66725
5199C031175j54518r871O4208P8000k3714r4037Q9563j52521k615J03131k40716
5188B688085m9049J7295k4110j07945J03026m280k7119m7393M8065O0408k34555
$$ plain form
5264 9116167 8743340 8256449 7874938 7536406 7216311 6923646 6627443 6415633 6093012 5933523
5254 5933523 5706993 5540869 5528738 5337714 5002999 4812444 4779638 4635004 4502800 4396076
5244 4396076 4214887 4219897 4166816 4096519 3901764 3842721 3790003 3784619 3645969 3681431 3486522
5233 3486522 3440447 3411245 3576540 3363880 3215186 3234315 3289657 3218690 3188049 3259586 3168710
5222 3168710 2982495 3006399 3152786 3163320 3032031 3022804 3068288 2948778 3097252 3021979 3060218
5211 3060218 2981612 3074329 3003208 2907992 2912413 2952389 3061829 2902455 2896634 2866302 2864450 3031175
5199 3031175 2876657 2866786 2930994 3008994 2985280 2891243 2980806 2828285 2825670 2928801 2688085
5188 2688085 2639036 2656331 2632221 2524276 2627302 2623022 2595903 2548510 2596575 2656983 2422428
5177B422428k10664P3753J1364o3371J15647k03376R1391K6386j31455j34737
5167A997366J09292K8794k00857Q0003j4581j76166R4226J0428o8573k386n3053
5156A804493L9755m0719p6569J1191N1875j61704J03314J13761j96786n5949J52383
5145A745045j30745Q1757q5803K12584q3523j02657k5989J74789L9276j80499
5135A644235p5654J16939o7299j10937K66691o3189J15605j28202O161N5146J8149
5124A777645N2082k64068J40555O7666P0272m1185l3105M3883N6644m9622n7253
5113A763514l2575L3477J93691l2943q8637J55779j78424J30134o741j5210p1997
5102A850068J71753m0196O9202j9402k34682L04233j11010j07152J97540L3971
$$ plain form
5177 2422428 2211764 2285517 2296881 2233510 2349157 2145781 2237172 2263558 2132103 1997366
5167 1997366 2106658 2135452 1934595 2014598 2000017 1823851 1918077 1928505 1859932 1857546 1804493
5156 1804493 1844248 1803529 1726960 1738151 1790026 1628322 1731636 1845397 1648611 1592662 1745045
5145 1745045 1614300 1696057 1610254 1822838 1739315 1636658 1610669 1785458 1824734 1644235
5135 1644235 1568581 1685520 1618221 1507284 1773975 1710786 1826391 1698189 1704350 1759496 1777645
5124 1777645 1829727 1565659 1706214 1773880 1844152 1802967 1769862 1813745 1870389 1820767 1763514
5113 1763514 1730939 1764416 1958107 1925164 1836527 1992306 1813882 1944016 1937275 1922065 1850068
5102 1850068 2021821 1981625 2050827 2031425 1796743 2100976 1989966 1882814 2080354 2114325
5092B114325M8034j26776Q359R4357J19598K467j37896R5105n695J32504k23248
5081B121134J62408J04855M8669j25227J32006L6275l4289m2824K7902M9144M2135
5070B522188N7154q1004K48847o9508P9282O2028n260J08934J5927p2119o1203
5059B805266J58778j4044J07043M6124n3911K56084L9567o1444K4695R1407O7533
5048C467098p5621j5700J26422Q4217k9319J22467j4041J57498K18124l0541P9922
5037D090526p290K17738P29O5025L9777J48329J49914q8135K91274j95707J19205
5026D831385J78386q7973J62481J442l7380M397J74216n9117J54950J75025J35240
5015E633052R8855m0120J05975K12382p604Q4055L36391p2984L02416J42254O4837
$$ plain form
5092 2114325 2162359 2035583 2043942 2138299 2257897 2260364 2122468 2217573 2211878 2344382 2121134
5081 2121134 2283542 2388397 2437066 2311839 2443845 2480120 2445831 2403007 2430909 2480053 2522188
5070 2522188 2579342 2498338 2747185 2677677 2756959 2818987 2813727 2922661 2938588 2866469 2805266
5059 2805266 2964044 2950000 3057043 3103167 3049256 3305340 3344907 3283463 3308158 3399565 3467098
5048 3467098 3391477 3375777 3502199 3586416 3557097 3679564 3665523 3823021 4041145 4010604 4090526
5037 4090526 4083236 4300974 4301703 4366728 4406505 4554834 4704748 4616613 4907887 4712180 4831385
5026 4831385 5009771 4921798 5084279 5085721 5048341 5052738 5226954 5167837 5322787 5497812 5633052
5015 5633052 5731907 5691787 5797762 6010144 6002540 6086595 6422986 6350002 6652418 6794672 6859509
5004F859509J90225L26354L25508p2892M10383K4178L87721L34711K25737M86499
4994I497933K02364M78090M63815N28553M02714O83931N44890O06548N55581P73035
4984A4737454P23166Q95745R20785J031084J092954J052003J060758J247635J319886
4975B4081470J483903J499281J678297J992239J738662K198158K292306K760755
4967C9725071L266872L381674M514869M562121N201153M967041N391304K381558
4959G3391663L08995j543991m52349O44530Q48605J227933J370717J865497K280366
4950G9941966K541099K429276K605699K565314K353760K661887K026399K183730
4942I9309130J934047J778263J707370J391101J174570J033076P66399L88820
$$ plain form
5004 6859509 7049734 7376088 7701596 7628704 8039087 8063265 8450986 8785697 9011434 9497933
4994 9497933 9700297 10178387 10642202 11170755 11573469 12257400 12802290 13408838 13964419 14737454
4984 14737454 15460620 16356365 17277150 18308234 19401188 20453191 21513949 22761584 24081470
4975 24081470 25565373 27064654 28742951 30735190 32473852 34672010 36964316 39725071
4967 39725071 42991943 46373617 50888486 55450607 60651760 65618801 71010105 73391663
4959 73391663 73700658 72156667 71704318 72348848 73197453 74425386 75796103 77661600 79941966
4950 79941966 82483065 84912341 87518040 90083354 92437114 95099001 97125400 99309130
4942 99309130 101243177 103021440 104728810 106119911 107294481 108327557 109093956 109482776
4934A09482776K81201j82353k88352q47151p89388j343343j307207j702715j918412
4925A01385056j943196k417044k596860k473808k913124k694327k926063l027189
4917H0393445l168461k911725l231852k862811l113474l069279k876226k724505
4909E6435112k911807k672215k533856k480975k289582k377574k131485k140532
4901C6897086j861621j911648j665806j819191j493494j388010j276484j323298
4893B4157534j273665j022928r83187j038669p02031r34134n84834p90110o34631
4884A6193345o70593n02382n95525m80245k96676n15154l72969k86881l65502
4875A2107418l79790k00567k42596k06499j78488k37522l35572j08031k60273
$$ plain form
4934 109482776 109763977 109581624 109293272 108446121 107656733 106313390 105006183 103303468 101385056
4925 101385056 99441860 97024816 94427956 91954148 89041024 86346697 83420634 80393445
4917 80393445 77224984 74313259 71081407 68218596 65105122 62035843 59159617 56435112
4909 56435112 53523305 50851090 48317234 45836259 43546677 41169103 39037618 36897086
4901 36897086 35035465 33123817 31458011 29638820 28145326 26757316 25480832 24157534
4893 24157534 22883869 21860941 20877754 19839085 19137054 18202920 17618086 16827976 16193345
4884 16193345 15522752 15020370 14424845 13944600 13647924 13132770 12759801 12472920 12107418
4875 12107418 11727628 11527061 11284465 11077966 10899478 10661956 10326384 10218353 9958080
4866I958080M2349j14601l22736k9037j19082K7211r6482j00418L1056L5768J25963
4855I438071p6450l2542K7932k4547K39283K51719O7338p250O644K42109K26002
4844A0358309J67959P9895K53836L02317K6805M95286N88612L28487O02946P64285
4834A3968737R34498J147460J518926J710839J474513J554523O09144n86095j555176
4825B0777369j902364j476489j166256j097325p03035o25611o26661k94329k34276
4816A2651023j66745m26829j96831j73307j2904Q535p446l23845j08942j84195
4806A1058514n1782j59093O4994k49767l2072j30744M8636j60120J44058l2438
4796A0500186l7729M1347P1387Q1228j10313L5275J69129n4286J02245k7633J86894
$$ plain form
4866 9958080 10000429 9885828 9563092 9534055 9414973 9442184 9345702 9245284 9276340 9312108 9438071
4855 9438071 9361621 9329079 9357011 9332464 9571747 9823466 9890804 9883554 9890198 10132307 10358309
4844 10358309 10526268 10606163 10859999 11162316 11189121 11684407 12273019 12601506 13204452 13968737
4834 13968737 14903235 16050695 17569621 19280460 20754973 22309496 22918640 22332545 20777369
4825 20777369 18875005 17398516 16232260 15134935 14431900 13806289 13179628 12885299 12651023
4816 12651023 12484278 12057449 11860618 11687311 11674407 11682942 11675496 11351651 11242709 11058514
4806 11058514 11006732 10847639 10912633 10662866 10630794 10500050 10548686 10388566 10532624 10500186
4796 10500186 10462457 10503804 10575191 10656419 10546106 10581381 10750510 10696224 10798469 10770836 10957730
4785A0957730k3306J98945J15153o0324K04916K9385R4291L24245J53221P595
4775A2001851J84464K13591J98195J14669L15596L01461M6377K24508K81071K73240
4765A4155023K59761K53075L56909L17359M31513K23618M35003M25704M19277
4756A7277242M34812M05571N17778N83845M56519O06282N79781P71560O19468
4747B2252858O90993O88473R49862P49869J041450R61963Q67567J182119J047571
4738C0432725J142662J326282J204861J895154J489097J535935J934453J899051
4730D2860220K133690K197466K551383K539370K808634K942131L305005L479213
4722F4817112L601101M029354M217416M453801M792351N155471N536995N782462
$$ plain form
4785 10957730 10934424 11133369 11248522 11188198 11393114 11422499 11516790 11841035 11994256 12001851
4775 12001851 12186315 12399906 12598101 12712770 13028366 13329827 13376204 13600712 13881783 14155023
4765 14155023 14414784 14667859 15024768 15342127 15773640 15997258 16432261 16857965 17277242
4756 17277242 17712054 18117625 18635403 19219248 19675767 20282049 20861830 21633390 22252858
4747 22252858 22943851 23632324 24582186 25332055 26373505 27335468 28203035 29385154 30432725
4738 30432725 31575387 32901669 34106530 36001684 37490781 39026716 40961169 42860220
4730 42860220 44993910 47191376 49742759 52282129 55090763 58032894 61337899 64817112
4722 64817112 68418213 72447567 76664983 81118784 85911135 91066606 96603601 102386063
4714A02386063O302776O704423P222128P781617P982913Q624769R086254R318110
4706A65409053R737072R914599R830979R723796Q993130Q526569P483004O535442
4698B36153644N288051M050597K640057J632399M78393p44167j566225k305629
4690B45627120l444199m390787n409185o397908p483994q319928q827114r607910
4682A91746095r864146j0024910r896706r719994r424883q710002q247052p690399
4674A18168003p282010o419213o090986n405588n249759m619201m178791l849569
4666G5072886l430721l282496k950094k803801k337342k297017k133917j807655
4658E4029843j572427j697668j329181j313453j280740j077022q98088p06656
$$ plain form
4714 102386063 108688839 115393262 122615390 130397007 138379920 147004689 156090943 165409053
4706 165409053 175146125 185060724 194891703 204615499 213608629 222135198 229618202 236153644
4698 236153644 241441695 245492292 248132349 249764748 250243141 249498974 247932749 245627120
4690 245627120 242182921 237792134 232382949 225985041 218501047 210181119 201354005 191746095
4682 191746095 181881949 171857039 161960333 152240339 142815456 134105454 125858402 118168003
4674 118168003 110885993 104466780 98375794 92970206 87720447 83101246 78922455 75072886
4666 75072886 71642165 68359669 65409575 62605774 60268432 57971415 55837498 54029843
4658 54029843 52457416 50759748 49430567 48117114 46836374 45759352 44861264 44154608
4650D4154608r09747o16379l51338n91312k80911l49166j29673j05943q0688J30036
4640D0869487R8712J12518L61438L59551L78854M56778M57326M81723M59478M08645
4630D4444510M54949N24004N08446L51009K87775M43514J58752M56233K17280
4621D7846472R9624J61538n653L027k92012l7647q0630j25761k14608j56938n5289
4610D7142123N1386j52723R631K75370K34351K28541O39598K14608P98943O89338
4600E0131166J097931J221068J448921J648187J691063J901387K247820K312342
4592F3699885K537240K933711K882731L166412L245471L463292L424529L606209
4584H8959480L479595L719207L565096L306159L319672L059629L239605K836420
$$ plain form
4650 44154608 43244861 42628482 42277144 41685832 41404921 41055755 40926082 40820139 40739451 40869487
4640 40869487 40968199 41080717 41442155 41801706 42180560 42637338 43094664 43576387 44035865 44444510
4630 44444510 44899459 45423463 45931909 46282918 46570693 47014207 47172959 47629192 47846472
4621 47846472 47946096 48107634 48101981 48105008 47812996 47775349 47694719 47568958 47354350 47197412 47142123
4610 47142123 47193509 47040786 47050417 47325787 47560138 47788679 48428277 48642885 49441828 50131166
4600 50131166 51229097 52450165 53899086 55547273 57238336 59139723 61387543 63699885
4592 63699885 66237125 69170836 72053567 75219979 78465450 81928742 85353271 88959480
4584 88959480 92439075 96158282 99723378 103029537 106349209 109408838 112648443 115484863
4576A15484863K546109K581965K156604J858008J842881J233681J123667R32329
4568A29760107O44184K30058Q0213J06644J2409m0759j82896j21717k38331k12769
4558A30037143k35384k33192l40801k38267k42386l82581l01828m46312k50424
4549A27365968l21066l28702m99479n64397q64760p25753j273152j259173j380330
4540A20149156k012620k120451k202991k462115k832854k837797l057253l052546
4532I9570529l240641l300736l383556l433743l298971l303256l459270l192322
4524G2958034l348951l082054k986612k780405k542486k425009k219820j826029
4516E1746668j685285j571352j314231j078053j051522p31296o43492n31074m69269
$$ plain form
4576 115484863 118030972 120612937 122769541 124627549 126470430 127704111 128827778 129760107
4568 129760107 130404291 130634349 130714562 130821206 130833615 130792856 130609960 130488243 130249912 130037143
4558 130037143 129801759 129568567 129227766 128989499 128747113 128364532 128062704 127616392 127365968
4549 127365968 127044902 126716200 126216721 125652324 124787564 124061811 122788659 121529486 120149156
4540 120149156 118136536 116016085 113813094 111350979 108518125 105680328 102623075 99570529
4532 99570529 96329888 93029152 89645596 86211853 82912882 79609626 76150356 72958034
4524 72958034 69609083 66527029 63540417 60760012 58217526 55792517 53572697 51746668
4516 51746668 50061383 48490031 47175800 46097747 45046225 44314929 43671437 43140363 42671094
4507D2671094l80151k13334k20279l65265k3871j95394j7847k97684j23882l11723
4497D0521664j10250l83820l42294l43439n69079n12834n03829q16300p05004
4488C6234815r13037r90712r60374r43599j031564q87828j026050r58014j140250
4479B7383387r47359j240478p86135j084992j130247q57275q06220r97693q47829
4470A8685159o00206p65486p31887o03201p01112m48128m99641n17900l78101
4461A3439497m58721l66144l06326l84287k14560l81570k08828j86863l62071
4452A0570127r8051m12829j72332j73267j92545r3952k69978l9017j85980j17014
4442H815162j42506r9333l52742j98442q3740m8794k47795m5975k00912r7476
$$ plain form
4507 42671094 42290943 42077609 41857330 41492065 41468194 41272800 41254953 40957269 40833387 40521664
4497 40521664 40411414 40027594 39685300 39341861 38772782 38259948 37756119 36939819 36234815
4488 36234815 35321778 34331066 33370692 32427093 31395529 30507701 29481651 28523637 27383387
4479 27383387 26436028 25195550 24409415 23324423 22194176 21336901 20530681 19532988 18685159
4470 18685159 18084953 17319467 16587580 15984379 15283267 14835139 14335498 13817598 13439497
4461 13439497 12980776 12614632 12308306 11924019 11709459 11327889 11119061 10932198 10570127
4452 10570127 10472076 10059247 9886915 9713648 9521103 9427151 9157173 9118156 8932176 8815162
4442 8815162 8672656 8573323 8220581 8022139 7938399 7889605 7641810 7595835 7394923 7297447
4432G297447m4038j51878k76561J6216r8761j82243l6050l21633j05777j63675
4422E933047k18674K7821j69861n3956j94175j25040q9533j30119m7522j19707
4412D812281k00010j07363o6986m7886k01364n0740k5572r7575k3962j15163P1201
4401C946861j71800q8204l0849p7549L2888j27998O556r4633j35559J8106P2325
4390C350144j97849J34806o1779j0561j73058k6826R7092j35353m6802p1805j9562
4379B838447J3479M6272j31895Q2873j34603m9693j7700j2008r250k022n5936
4368B567964l5525q0152J5212j1958p2740m3995N1702J6051j80770N4875Q4139
4357B364803j91862J14700n2825M4232r3876k9705l8627j9265j872L3712r3878
$$ plain form
4432 7297447 7253409 7101531 6824970 6841186 6742425 6560182 6524132 6202499 6096722 5933047
4422 5933047 5714373 5742194 5572333 5518377 5324202 5199162 5109629 4979510 4931988 4812281
4412 4812281 4612271 4504908 4437922 4390036 4188672 4137932 4112360 4014785 3990823 3875660 3946861
4401 3946861 3775061 3686857 3656008 3578459 3611347 3483349 3489905 3395272 3259713 3277819 3350144
4390 3350144 3152295 3287101 3225322 3214761 3041703 3014877 3111969 2976616 2929814 2858009 2838447
4379 2838447 2851926 2898198 2766303 2849176 2714573 2664880 2647180 2635172 2625922 2623900 2567964
4368 2567964 2532439 2452287 2467499 2455541 2382801 2338806 2390508 2406559 2225789 2280664 2364803
4357 2364803 2172941 2287641 2234816 2279048 2185172 2155467 2116840 2097575 2095703 2129415 2035537
4346B035537l503L3350j72841j5449K96349k19817m2452N9292p5852l399J4928
4335A906143Q2474O041n3161m152R8410n3858k2527r8410J10894l3960J24035
4324B061929l0317O3203k5115o1457l8295J59077r2732Q803R4893j78047K7735
4313A989677L5771j5854j2179j1109q0644J28539j26236j39598J56645n5769k406
4302A866837J57580j89627L1761p3224K20700k90185J69387j01081L6377o5652
4292A762873j22340Q4319n3044N0566n0901n6670M5682J27106j89031P0590j39349
4281A529801J52589k00722J64526O915R380j32054R9718n2578j03607K61342j37567
4270A597743m921L6449k6389j94508J42883Q7000Q269q1282n1295M1002K4320
$$ plain form
4346 2035537 2032034 2065384 1892543 1877094 2173443 1953626 1911174 1970466 1894614 1891215 1906143
4335 1906143 1988617 1994658 1941497 1937345 2035755 1981897 1959370 1860960 1971854 1937894 2061929
4324 2061929 2031612 2094815 2069700 2008243 1969948 2129025 2036293 2045096 2139989 1961942 1989677
4313 1989677 2025448 2009594 1997415 1986306 1905662 2034201 1907965 1768367 1925012 1869243 1866837
4302 1866837 2024417 1834790 1866551 1793327 2014027 1723842 1893229 1792148 1828525 1762873
4292 1762873 1640533 1724852 1671808 1722374 1671473 1614803 1660485 1787591 1598560 1669150 1529801
4281 1529801 1682390 1481668 1646194 1653109 1662489 1530435 1630153 1577575 1473968 1735310 1597743
4270 1597743 1592822 1629271 1602882 1408374 1551257 1638257 1646526 1565244 1513949 1554951 1579271
4259A579271J26172k970O7310j47480N3559Q0907l5882J6775k9048n6015p9552
4248A573047J02774p2585L9807q66j98052p5826O9357n987j6708q8679O855p8771
4236A254366l2245Q204j30859J96384n3897K3732j88718K246J49053j39893M0076
4225A128449J00503k27348P6703J7118Q8160N3620O883l8693n0456N970L41038
4214A501947j28140m2347M8528M9788j54079L1335k98385k6115j06105O7080j14730
4203H28777m7136J21416r6270q5390q2201J1899l3360J4894q672N9469O1885j76365
4191E68946l0243M2528K7524j44521k9100J15405l3424L358L389m2784j0412J04836
4179E75502p6490p201j23197J45577l7652J21542k46518Q1116O298M6411j28207
$$ plain form
4259 1579271 1705443 1702473 1769783 1622303 1675862 1756769 1720887 1737662 1708614 1652599 1573047
4248 1573047 1675821 1603236 1643043 1642177 1444125 1368299 1437656 1431669 1414961 1326282 1333137 1254366
4236 1254366 1222121 1230325 1099466 1295850 1241953 1265685 1076967 1079213 1228266 1088373 1128449
4225 1128449 1228952 1001604 1078307 1095425 1183585 1237205 1244088 1205395 1154939 1160909 1501947
4214 1501947 1373807 1331460 1379988 1429776 1275697 1307032 1008647 982532 876427 943507 828777
4203 828777 781641 903057 806787 721397 639196 651095 617735 632629 623957 683426 745311 568946
4191 568946 538703 581231 608755 464234 435134 550539 517115 520473 523862 481078 470666 575502
4179 575502 499012 491811 368614 514191 476539 598081 351563 432679 438977 485388 357181
4168C57181P7340l1o4327j7752L8722P586m4238q7478J02080m0961r8281J32504
4156C62345K2769j08001K635M0524J6094N3889K1465p100j29581n0880P2624J13331
4144D10114j1711r6074O2770Q5355r8507k3050J1585l049L4773j88287M1903Q7590
4132C13412K7755k5875r1356j2938n579n8116L4549K7370Q7464j79046L5159Q6319
4120B39118N1529L3709k2490m0855r0713Q2039j31858Q6307j50923L4901o1925
4109B8839J05572j28495Q0721N7881q5487P9838m7867J87405j65811j03351j085
4098H160Q9945r1363M1480l9707J70232j87034Q9545o9820L1737J25015j06312
4087F1878o0709J50079o3901p003L2174j04290N9413l8321J52169j50969o9349
$$ plain form
4168 357181 434521 434490 370163 352411 391133 398719 354481 267003 369083 328122 229841 362345
4156 362345 385114 277113 279748 320272 336366 390255 411720 404620 275039 224159 296783 410114
4144 410114 398403 302329 365099 450454 351947 328897 340482 337433 372206 183919 225822 313412
4132 313412 341167 315292 223936 210998 205419 147303 181852 209222 296686 117640 152799 239118
4120 239118 290647 324356 301866 261011 170298 252337 120479 206786 55863 90764 28839
4109 28839 134411 5916 86637 144518 59031 138869 91002 278407 112596 9245 8160
4098 8160 98105 6742 48222 8515 178747 -8287 81258 11438 43175 168190 61878
4087 61878 1169 151248 87347 80344 112518 8228 67641 29320 181489 30520 -38829
4076c8829L3813j565j3641K2564R6232M0234j27825R773N23O9088k06326J92309
4064G6350M7079j59750J34689m9308N7237m7013k08063K40081j7416j57340P1897
4053a1557P1243j26470R0040j90999J63069P722L830J09185j33542J82799j40485
4042B4835n180J76796j73563l04P726R1024R0076n6858M3452J2075o3948J8932
4030A65063j1392J14412m375J11207Q2711o380K6791r3831J83672j30924n6421
4019C80533j19856M7005p605j13465J63857O223p8868j7797J3211k3862k9440
4008B19936R6683p6460J1230Q0101O7333Q4306O1617j2298p4644n7715J42183
3997E42272j79967o1601N6107j16146M1399k3157N4437K3752k0156j08355O0060
$$ plain form
4076 -38829 -5016 -6581 -20222 2342 98574 138808 10983 20756 21279 90367 -115959 76350
4064 76350 123429 -36321 98368 49060 106297 59284 -148779 91302 73886 -83454 -11557
4053 -11557 59686 -66784 23256 -167743 -4674 3048 6878 116063 -17479 165320 24835
4042 24835 19655 196451 22888 22584 30310 121334 211410 154552 198004 210079 146131 165063
4030 165063 153671 268083 263708 374915 457626 451246 478037 384206 567878 436954 380533
4019 380533 260677 307682 300077 186612 350469 356692 277824 260027 273238 249376 219936
4008 219936 316619 240159 251389 331490 398823 483129 544746 532448 457804 400089 542272
3997 542272 362305 300704 356811 240665 282064 258907 313344 337096 316940 208585 268645
3986B68645N2738n6465m0429q4259J87025j16408k8085K9594K7843M3202q9934
3975A93467k8403R1642Q9889j11112o7790J40776L8633j02372L3478L8298j0160
3964C06346q7036j02406R1418P689L9098m9673N7025o250j48956P5772J49071
3953C32098q0881j0267m8344L5167j97795J81237o3079m4260n2920J63563M2790
3942B57309q0737J00549m9924r9593j43689J88249j31219J2991m469r639N2143
3931I1971P4497j68666j11997K33967j86725J4824l8458j8534M3919K9004L3784
3920b414k11721K73334j85270P0222J74545j43650J0019j52925J5685R8862n8388
3909a11701j69481J86728M4523j75350N4085j26968J07778J14321r7706K19489
$$ plain form
3986 268645 321383 264918 224489 140230 327255 210847 182762 212356 240199 283401 193467
3975 193467 165064 256706 346595 235483 167693 308469 347102 244730 278208 316506 306346
3964 306346 219310 116904 208322 216011 255109 205436 262461 256211 107255 183027 332098
3953 332098 251217 240950 192606 227773 29978 211215 148136 103876 50956 214519 257309
3942 257309 176572 277121 227197 127604 -16085 172164 40945 53936 49467 39828 91971
3931 91971 166468 -2198 -114195 119772 -66953 -52129 -90587 -109121 -65202 -36198 -2414
3920 -2414 -214135 59199 -126071 -55849 118696 -24954 -14935 -167860 -152175 -53313 -111701
3909 -111701 -281182 -94454 -49931 -225281 -171196 -298164 -190386 -76065 -173771 45718
3899D5718k58796K8679n1330L0516K2004q291j5863l2511J53294q9874M114j03930
3887b76270O6106J08814j52906p0197R4221L1252n1578l1721J06133j42459K74254
3876d4351j33631j25279k4166K4678K6553J34832j80062O0243M0353q8072j5762
3865c24664J88222j80618J31844J2300n3949p459P015l9975J6742P3693j82504
3854c59353r5519J44016O0122j65015K16667j6601l5201K5816l9721j3375p4692
3843c52856K19517q5986K6167q4792J29361j15177j04011J78619j35890N9321
3833b65727o2099Q1457N121j23321J39496j83577J10621L4357j34355J11072o265
3822b93220j1387p4539J46780j9128M0300o8296j6654m4821J07265j19043l2650
$$ plain form
3899 45718 -213078 -184399 -235729 -205213 -183209 -191500 -207363 -239874 -86580 -176454 -172340 -276270
3887 -276270 -210164 -101350 -254256 -324453 -230232 -198980 -250558 -282279 -176146 -318605 -44351
3876 -44351 -177982 -303261 -327427 -302749 -276196 -141364 -321426 -261183 -220830 -308902 -324664
3865 -324664 -136442 -317060 -185216 -172916 -226865 -234324 -227309 -267284 -250542 -176849 -359353
3854 -359353 -454872 -310856 -250734 -415749 -199082 -215683 -250884 -225068 -264789 -278164 -352856
3843 -352856 -133339 -219325 -193158 -277950 -148589 -263766 -367777 -189158 -325048 -265727
3833 -265727 -327826 -246369 -241248 -364569 -225073 -408650 -298029 -263672 -398027 -286955 -293220
3822 -293220 -304607 -379146 -232366 -251494 -211194 -279490 -296144 -340965 -233700 -352743 -385393
3811c85393Q9177m0551j27988L9729J46472l4970j0537o4557Q8711q036Q681q1579
3799c80841J54951N4137k38859Q3341P6564K6633o5486O1466j73893M6191J26134
3788b29662m9714N9966p1048m5815J27676j43432l8978J70584k0700j20122K12502
3777a48743r168j64373l8810Q2604m005j1711N5008m7499P552q6546L6705p311
3765c36297j34578J83403n4343K33596j38154k0604r087J2841j62813J25926m6297
3754c46407J98000q0268j33197L0985K4945J48552j52911J22809j64496J44435
3744b07553j47360L5648L657P0921Q5644j27936M4745r4213j607J4223j02649
3733d26480J22583j51775J77635q1561k7845L1285J17541q5140J00801r4465r5849
$$ plain form
3811 -385393 -296216 -336767 -464755 -425026 -278554 -313524 -324061 -388618 -299907 -307943 -299262 -380841
3799 -380841 -225890 -171753 -410612 -327271 -250707 -224074 -289560 -228094 -401987 -355796 -229662
3788 -229662 -279376 -219410 -290458 -336273 -208597 -352029 -391007 -220423 -241123 -361245 -148743
3777 -148743 -157911 -322284 -361094 -278490 -282495 -294206 -239198 -286697 -279145 -365691 -328986 -336297
3765 -336297 -470875 -287472 -341815 -108219 -246373 -266977 -276064 -263223 -426036 -300110 -346407
3754 -346407 -148407 -228675 -361872 -330887 -305942 -157390 -310301 -187492 -351988 -207553
3744 -207553 -354913 -319265 -315608 -244687 -159043 -286979 -242234 -336447 -338054 -323831 -426480
3733 -426480 -303897 -455672 -278037 -359598 -387443 -356158 -238617 -323757 -222956 -317421 -413270
3722d13270J84742n2512n0031Q3214j43692n3575J19230l0477K3602l1607L6980
3711c27396j22875R7460O0461k9948j29999L5038Q4091N4190j25268J09036m5929
3700c41139r1528J24045o7329l1267k5420Q0747m4550j21014J44470K5287k355
3689c50053P5881L4288n903k46772J95317m3768n7000n4236J35893j4881J28213
3678b03021j57000M9951n4759l827j07697J10092m1201N9849k614J8475L3077
3667b98675j51332Q9047k0900R2462k30399K20341j25861j3380K1637M6088O1352
3656c09620j3301j13462J43807o1619Q4180j2379m6515Q0829j67538J77741j16786
3645c54663P2295q0031P3897j48527Q2881K9766o1709J9006N3734p6052J9966
$$ plain form
3722 -413270 -228528 -281040 -331071 -247857 -391549 -445124 -325894 -356371 -332769 -364376 -327396
3711 -327396 -450271 -352811 -292350 -322298 -452297 -417259 -333168 -278978 -404246 -295210 -341139
3700 -341139 -432667 -308622 -375951 -407218 -432638 -351891 -396441 -517455 -372985 -347698 -350053
3689 -350053 -274172 -239884 -245787 -492559 -297242 -341010 -398010 -452246 -316353 -331234 -203021
3678 -203021 -360021 -310070 -364829 -368656 -476353 -366261 -407462 -347613 -350227 -331752 -298675
3667 -298675 -450007 -360960 -381860 -289398 -519797 -299456 -425317 -438697 -417060 -370972 -309620
3656 -309620 -322921 -436383 -292576 -354195 -270015 -282394 -328909 -248080 -415618 -237877 -354663
3645 -354663 -282368 -362399 -288502 -437029 -354148 -324382 -386091 -367085 -313351 -389403 -369437
3634c69437P8458j94158J88772q317n0132n414k4185M0908M9048r8608O9057N7138
3622b66870k5371J92174n6955j27217j22063N2442Q497L2958l1556k586K6354
3611c20193J06096r8547j352q0563j5689O2948Q031n3432L2712J1297N1960r5751
3599c92483J37513j63125R7999K373P466l0501p0634J52454j95068P4192K3823
3588c55991K3905r7369K7214q1158J37420O1035p9613P8667r6591l7330J15491
3577c04320j81864J22044J3113q719K33315k09702K0074K891r4491N173K0901
3566c81585p4686J42031o51n9625N972k7290l0035J31643R051m2635j5571n636
3554c49017J9966o6121N7228j4911P1802q5018Q0348R7170j44971j8928k4685
$$ plain form
3634 -369437 -290979 -485137 -296365 -304682 -354814 -360228 -384413 -343505 -294457 -393065 -324008 -266870
3622 -266870 -292241 -100067 -157022 -284239 -406302 -353860 -345363 -312405 -343961 -346547 -320193
3611 -320193 -214097 -312644 -313996 -394559 -410248 -347300 -339269 -392701 -359989 -348692 -296732 -392483
3599 -392483 -254970 -418095 -320096 -317723 -310257 -340758 -411392 -258938 -454006 -379814 -355991
3588 -355991 -332086 -429455 -402241 -483399 -345979 -284944 -364557 -285890 -382481 -419811 -304320
3577 -304320 -486184 -364140 -351027 -359746 -126431 -336133 -316059 -313168 -407659 -402486 -381585
3566 -381585 -456271 -314240 -314891 -374516 -368544 -395834 -425869 -294226 -285175 -327810 -343381 -349017
3554 -349017 -329051 -395172 -337944 -352855 -281053 -366071 -285723 -188553 -333524 -352452 -377137
3543c77137K04456l0473j33207k2819J50703j19279K3363l4707L9741R411n949
3532b95897Q4019j16629P9481N2446q3031o292r7216R7977r5868J13686J4546
3521b52778K5708j48985P0453J13534q9032m3672N5967j3766o5755M2173j37530
3510d43683J07478j19191J95078L689o8747k8363q6457J85587j43819O1081o0947
3499c98294J46075j85414J15838L9148J4864J1021J2970r3315L2227J034j19480
3488d23326J58308j48042L800J52321j67197N8235O5849j35770J09360o6830J48604
3477b44688j75555O8474m328K1177r520L0246P0532j92841M784J15052j32703
3466d49370K28390j76624P327J6543j9163J38810K8005k7228p2256n5473J29567
$$ plain form
3543 -377137 -172681 -203154 -336361 -359180 -208477 -327756 -304393 -339100 -299359 -289948 -295897
3532 -295897 -211878 -328507 -249026 -196580 -279611 -285903 -383119 -285142 -381010 -267324 -252778
3521 -252778 -227070 -376055 -305602 -192068 -281100 -324772 -268805 -282571 -348326 -306153 -443683
3510 -443683 -336205 -455396 -260318 -256629 -325376 -353739 -440196 -254609 -398428 -337347 -398294
3499 -398294 -252219 -437633 -321795 -282647 -267783 -256762 -243792 -337107 -304880 -303846 -423326
3488 -423326 -265018 -413060 -409260 -256939 -424136 -365901 -300052 -435822 -326462 -393292 -244688
3477 -244688 -420243 -351769 -356097 -334920 -344440 -314194 -243662 -436503 -431719 -316667 -449370
3466 -449370 -220980 -397604 -390277 -373734 -392897 -254087 -226082 -253310 -325566 -381039 -251472
3455b51472r9147J14922L5987j31830l6283R5039J00168j21765J3708J1771m7608
3444c16510r682j12614J85903q632j89157J71439j31928J88147o9808K4253j49317
3433d17906K12761j74961J7560J40545j13401p7586K08834p5407n5630l4168l4919
3422d04278R5558Q7779k00555J00933p628K8513K701R7238q5280j8090K00365
3411a02744j22630j01750k8151R3810p8770n3373J15685M0194m7578J06465j30393
3400c09235J59014j51847O4805j08583j0061O1176J38402k19678J18550q9824
3390c47281J24555Q681J35796j57328j7105J72769m7915j6061j04638J27129j45994
3379b67392Q4184j0422J6309q1844J03914j71587N1474J35844j50579J64587n6634
$$ plain form
3455 -251472 -350619 -235697 -199710 -331540 -367823 -272784 -172616 -294381 -280673 -268902 -316510
3444 -316510 -326192 -438806 -252903 -261535 -450692 -279253 -411181 -223034 -292842 -268589 -417906
3433 -417906 -205145 -380106 -362546 -222001 -335402 -412988 -204154 -279561 -335191 -369359 -404278
3422 -404278 -308720 -220941 -421496 -320563 -328191 -299678 -296977 -199739 -285019 -303109 -102744
3411 -102744 -225374 -327124 -355275 -261465 -340235 -393608 -277923 -237729 -285307 -178842 -309235
3400 -309235 -150221 -302068 -237263 -345846 -355907 -294731 -156329 -376007 -257457 -347281
3390 -347281 -222726 -214045 -78249 -235577 -252682 -79913 -127828 -143889 -248527 -121398 -267392
3379 -267392 -183208 -193630 -177321 -259165 -155251 -326838 -275364 -139520 -290099 -125512 -182146
3368a82146q16o6825J43440L0707P5641p4443k7985P2757l4544O4015q5712K0576
3356f5335j20958K25378k2258j28879K1984P1253J0599j7989J196j5367N4455
3345A4079J92757k44196J98406N9919O2341m8288J5440K4866j27944K47735n905
3334C89210J02063J02968J5916J64561p0751J59898K0352K45639J08055k3929
3324A213982K35884L06084J30146K50516K27097J76909J59800K77104K59377L10168
3314C547067K21865L43871K91186L01633M52069N69966Q42424P57219J349167
3305H676467J449099J998776J678389J826197J525936n71834j835877k812279
3297A1934874k125448j284067j157386j284133j151760o52112n29530l12112k03406
$$ plain form
3368 -182146 -182962 -249787 -106347 -75640 1 -74442 -102427 -29670 -64214 -199 -85911 -65335
3356 -65335 -186293 39085 16827 -112052 -90068 -18815 -8216 -26205 -25009 -40376 14079
3345 14079 206836 -37360 161046 220965 283306 235018 250458 275324 147380 395115 389210
3334 389210 491273 594241 610157 774718 703967 863865 884217 1129856 1237911 1213982
3324 1213982 1449866 1755950 1886096 2136612 2363709 2540618 2700418 2977522 3236899 3547067
3314 3547067 3768932 4112803 4403989 4705622 5157691 5727657 6570081 7327300 8676467
3305 8676467 10125566 12124342 13802731 15628928 17154864 16583030 14747153 11934874
3297 11934874 9809426 8525359 7367973 6083840 4932080 4279968 3750438 3438326 3234920
3288C234920k72903m02502k19016k70280j23487k37220j72604j57167j84830j9491
3278A175420r6262j47991j70733Q0545j11589O8322k98527J09959j49810N3617
3268E12951r8859j89891J02303J00860j99690j763L2390l1139j35435o7123K73758
3257B98362k65329m0227O9884p0646j540K8529K4745j30073M0557K8897j43655
3246a60496Q6389K4838k51749K65161k22860J52510n8314m4427J06977r6454O9838
3235a28587M9275j7764j10282o6574J04763M9800j5883J7605o6570K7588j15802
3224b72431r139J05363k1165M7045j20435R0072j0530p5881M1587M9554l3797
3213b09757L4262J42523j35963O918p053Q075M6148j62995J72727k07669J54915
$$ plain form
3288 3234920 2962017 2559515 2340499 2070219 1946732 1709512 1536908 1379741 1194911 1175420
3278 1175420 1079158 931167 760434 840979 729390 797712 499185 609144 459334 512951
3268 512951 414092 224201 326504 427364 227674 225911 258301 227162 91727 24604 298362
3257 298362 33033 -7194 62690 -7956 -9496 19033 43778 -86295 -45738 -16841 -160496
3246 -160496 -74107 -49269 -301018 -35857 -258717 -106207 -164521 -208948 -101971 -198425 -128587
3235 -128587 -79312 -97076 -207358 -273932 -169169 -119369 -135252 -117647 -184217 -156629 -272431
3224 -272431 -281570 -176207 -197372 -150327 -270762 -180690 -191220 -267101 -225514 -175960 -209757
3213 -209757 -175495 -32972 -168935 -162017 -169070 -160995 -114847 -277842 -105115 -312784 -157869
3202a57869p9348o4619R7766k36608J34337o227J63725j99291J45553p5162n4782
3191c32525R6850j26905J39197N5747j35013M3353L5200o7978M9437j35561J69563
3180b08635L839k01139k3105P8677l0705k6499P2611m5043L6459j14318R3010
3169c64848j07548L3191N6263M3443N3816n6858O0673J5896l5830j35112K5050
3158d11864l2436j3258R0295L37j0213n0665R5288p7847j4314O7574P6066p6260
3146c57297K4658q4623P4748k4047J6221n7050j2415P0544j7734K0217k2802j08916
$$ plain form
3202 -157869 -237217 -301836 -204070 -440678 -306341 -312568 -148843 -348134 -202581 -277743 -332525
3191 -332525 -235675 -362580 -223383 -167636 -302649 -259296 -224096 -292074 -242637 -378198 -208635
3180 -208635 -204796 -405935 -429040 -350363 -381068 -407567 -334956 -379999 -343540 -457858 -364848
3169 -364848 -472396 -439205 -382942 -339499 -285683 -342541 -281868 -265972 -301802 -436914 -411864
3158 -411864 -444300 -457558 -367263 -366926 -377139 -427804 -332516 -410363 -424677 -357103 -281037 -357297
3146 -357297 -332639 -417262 -342514 -366561 -350340 -407390 -419805 -349261 -366995 -346778 -369580 -478496
$$ [...]
##END NTUPLES=NMR SPECTRUM
##END=
