##TITLE=abcd
##JCAMPDX= 6.0         $$ Bruker NMR JCAMP-DX V2.0
##DATA TYPE= NMR SPECTRUM
##DATA CLASS= NTUPLES
##ORIGIN= UXNMR, Bruker Analytische Messtechnik GmbH
##OWNER= root
$$ XWIN-NMR		Version 3.5
$$ Sat Feb 22 11:30:37 2025 Russian Standard Time (UT+4h)  servis@DPX200
##.OBSERVE FREQUENCY= 200.131235884673
##.OBSERVE NUCLEUS= ^1H
##.ACQUISITION MODE= SIMULTANEOUS
##.ACQUISITION SCHEME= undefined
##.AVERAGES= 8
##.DIGITISER RES= 18
##SPECTROMETER/DATA SYSTEM= spect
##.PULSE SEQUENCE= zg
##.SOLVENT NAME= DMSO
##.SHIFT REFERENCE= (INTERNAL, DMSO, 0, 16.4885)
##AUDIT TRAIL= $$ (NUMBER, WHEN, WHO, WHERE, WHAT)
$$ ##TITLE= Audit trail, XWIN-NMR		Version 3.5
$$ ##JCAMPDX= 5.01
$$ ##ORIGIN= Bruker BioSpin GmbH
$$ ##OWNER= servis
$$ F:\spectra/data/av/nmr/H1/1/pdata/1/auditp.txt
$$ ##AUDIT TRAIL=  $$ (NUMBER, WHEN, WHO, WHERE, WHAT)
(   1,<2025-02-22 11:30:08.59 +0400>,<servis>,<DPX200>,
      <created by zg, POWCHK disabled, PULCHK disabled
       terminated by command 'halt'
       configuration hash MD5:
       00 E9 B6 7A A2 85 ED C7 34 08 36 98 17 FE 4E 26
       data hash MD5: 32K
       50 D9 A7 6F 1A B0 FE B6 B2 E4 4A 42 3F 9A 09 75>)
(   2,<2025-02-22 11:30:10.37 +0400>,<servis>,<DPX200>,
      <Start of raw data processing
       efp BC_mod = 2 LB = 0.05 FT_mod = 6 PKNL = 1 PHC0 = -264.1254 PHC1 = 1.301534 SI = 16K 
       data hash MD5: 16K
       D0 72 6D 3E 92 FE 64 FC 73 48 62 59 D4 5F E1 2D>)
$$ ##END=
$$ 
$$ hash MD5
$$ 84 DD ED A6 DF 55 3B 28 5B 1A 47 91 9C 3C D1 EF
##$RELAX= 
##$RELAX= 
##$RELAX= 
##$RELAX= 
##$RELAX= 
##$RELAX= 
##$RELAX= 
##$RELAX= 
$$ Bruker specific parameters
$$ --------------------------
##$DU= <F:\spectra>
##$EXPNO= 1
##$NAME= <H1>
##$PROCNO= 1
##$TYPE= <nmr>
##$USER= <av>
##$AMP= (0..31)
100 100 100 100 100 100 100 100 100 100 100 100 100 100 100 100 100 100 
100 100 100 100 100 100 100 100 100 100 100 100 100 100 
##$AQSEQ= 0
##$AQ_mod= 1
##$AUNM= <au_zg>
##$AUTOPOS= <>
##$BF1= 200.13
##$BF2= 200.13
##$BF3= 200.13
##$BF4= 200.13
##$BF5= 500.13
##$BF6= 500.13
##$BF7= 500.13
##$BF8= 500.13
##$BYTORDA= 1
##$CFDGTYP= 0
##$CFRGTYP= 5
##$CHEMSTR= <none>
##$CNST= (0..31)
1 1 145 1 1 1 1 1 1 1 1 1 1 1 1 1 1 1 1 1 1 1 1 1 1 1 1 1 1 1 1 1 
##$CPDPRG= <>
##$CPDPRG1= <>
##$CPDPRG2= <>
##$CPDPRG3= <>
##$CPDPRG4= <mlev>
##$CPDPRG5= <mlev>
##$CPDPRG6= <mlev>
##$CPDPRG7= <mlev>
##$CPDPRG8= <mlev>
##$CPDPRGB= <>
##$CPDPRGT= <>
##$D= (0..31)
0 2 0 0 0 0 0 0 0 0.06 0 0 0 0 0 0 0.0002 0 0 0 0 0 0 0 0 0 0 0 0 0 0 
0 
##$DATE= 1740209408
##$DBL= (0..7)
120 120 120 120 120 120 120 120 
##$DBP= (0..7)
150 150 150 150 150 150 150 150 
##$DBP07= 0
##$DBPNAM0= <>
##$DBPNAM1= <>
##$DBPNAM2= <>
##$DBPNAM3= <>
##$DBPNAM4= <>
##$DBPNAM5= <>
##$DBPNAM6= <>
##$DBPNAM7= <>
##$DBPOAL= (0..7)
0.5 0.5 0.5 0.5 0.5 0.5 0.5 0.5 
##$DBPOFFS= (0..7)
0 0 0 0 0 0 0 0 
##$DE= 6
##$DECBNUC= <off>
##$DECIM= 32
##$DECNUC= <off>
##$DECSTAT= 4
##$DIGMOD= 1
##$DIGTYP= 9
##$DL= (0..7)
0 120 120 120 120 120 120 120 
##$DP= (0..7)
$$ [...]
##$SUBNAM4= <"">
##$SUBNAM5= <"">
##$SUBNAM6= <"">
##$SUBNAM7= <"">
##$SUBNAM8= <"">
##$SUBNAM9= <"">
##$SW= 20.6817932712277
##$SWIBOX= (0..15)
0 0 3 0 0 0 0 0 0 0 0 0 0 0 0 0 
##$SW_h= 4139.07284768212
##$TD= 32768
##$TD0= 1
##$TE= 0
##$TE2= 300
##$TE3= 300
##$TEG= 300
##$TL= (0..7)
0 120 120 120 120 120 120 120 
##$TP= (0..7)
150 150 150 150 150 150 150 150 
##$TP07= 0
##$TPNAME0= <>
##$TPNAME1= <>
##$TPNAME2= <>
##$TPNAME3= <>
##$TPNAME4= <>
##$TPNAME5= <>
##$TPNAME6= <>
##$TPNAME7= <>
##$TPOAL= (0..7)
0.5 0.5 0.5 0.5 0.5 0.5 0.5 0.5 
##$TPOFFS= (0..7)
0 0 0 0 0 0 0 0 
##$TUNHIN= 0
##$TUNHOUT= 0
##$TUNXOUT= 0
##$USERA1= <user>
##$USERA2= <user>
##$USERA3= <user>
##$USERA4= <user>
##$USERA5= <user>
##$V9= 5
##$VALIST= <valist>
##$VCLIST= <CCCCCCCCCCCCCCC>
##$VD= 0
##$VDLIST= <DDDDDDDDDDDDDDD>
##$VPLIST= <PPPPPPPPPPPPPPP>
##$VTLIST= <TTTTTTTTTTTTTTT>
##$WBST= 1024
##$WBSW= 30
##$XGAIN= (0..3)
0 0 0 0 
##$XL= 0
##$YL= 0
##$YMAX_a= 417343
##$YMIN_a= -271125
##$ZGOPTNS= <>
##$ZL1= 120
##$ZL2= 120
##$ZL3= 120
##$ZL4= 120
##$ABSF1= 0
##$ABSF2= 0
##$ABSG= 0
##$ABSL= 0
##$ALPHA= 0
##$AQORDER= 0
##$ASSFAC= 0
##$ASSFACI= 0
##$ASSFACX= 0
##$ASSWID= 0
##$AUNMP= <proc_1d>
##$AZFE= 0.1
##$AZFW= 0.1
##$BCFW= 0
##$BC_mod= 2
##$BYTORDP= 0
##$COROFFS= 0
##$CY= 18.4799938201904
##$DATMOD= 1
##$DC= 0
##$DFILT= <>
##$DTYPP= 0
##$F1P= 9.9274215381318
##$F2P= -0.165520771350173
##$FCOR= 1
##$FTSIZE= 16384
##$FT_mod= 6
##$GAMMA= 0
##$GB= 0
##$INTBC= 1
##$INTSCL= 4.127829e-11
##$ISEN= 128
##$LB= 0.05
##$LEV0= 0
##$LPBIN= 0
##$MAXI= 10000
##$MC2= 0
##$MEAN= 0
##$ME_mod= 0
##$MI= 50
##$NCOEF= 0
##$NC_proc= -8
##$NLEV= 6
##$NOISF1= 3.799351
##$NOISF2= 2.8
##$NSP= 0
##$NTH_PI= 0
##$NZP= 0
##$OFFSET= 16.48848
##$PC= 4
##$PHC0= -264.1254
##$PHC1= 1.301534
##$PH_mod= 1
##$PKNL= yes
##$PPARMOD= 0
##$PSCAL= 4
##$PSIGN= 0
##$REVERSE= no
##$SF= 200.130005582386
##$SI= 16384
##$SIGF1= 3
##$SIGF2= 2
##$SINO= 400
##$SIOLD= 16384
##$SREGLST= <1H.CDCl3>
##$SSB= 0
##$STSI= 16384
##$STSR= 0
##$SW_p= 4139.07284768211
##$SYMM= 0
##$S_DEV= 0
##$TDeff= 32768
##$TDoff= 0
##$TI= <>
##$TILT= no
##$TM1= 0
##$TM2= 0
##$TOPLEV= 0
##$USERP1= <user>
##$USERP2= <user>
##$USERP3= <user>
##$USERP4= <user>
##$USERP5= <user>
##$WDW= 1
##$XDIM= 16384
##$YMAX_p= 395757714
##$YMIN_p= -2758708
$$ End of Bruker specific parameters
$$ ---------------------------------
##NTUPLES= NMR SPECTRUM
##VAR_NAME=  FREQUENCY,     SPECTRUM/REAL,   SPECTRUM/IMAG
##SYMBOL=    X,             R,               I
##VAR_TYPE=  INDEPENDENT,   DEPENDENT,       DEPENDENT
##VAR_FORM=  AFFN,          ASDF,            ASDF
##VAR_DIM=   16384,         16384,           16384
##UNITS=     HZ,            ARBITRARY UNITS, ARBITRARY UNITS
##FACTOR=    0.252644378177508, 1,           1
##FIRST=     3299.83951724647, 0,            0
##LAST=      -839.233330435636, 0,           0
##MIN=       -839.233330435636, -2758708,    0
##MAX=       3299.83951724647, 395757714,    0
$$ Real data points
##PAGE= N=1
##DATA TABLE= (X++(R..R)), XYDATA
$$ [...]
7340G24973j03616J95362J96337m05929K25146Q7008J54960m46515J99040J18258
$$ 724973 621357 816719 1013056 607127 832273 919281 1074241 627726 826766 945024
7330I45024J27226k16777j9077p1490k6474j7987M48308k66704J11481j28471
$$ 945024 1072250 855473 836396 764906 738432 720445 1168753 902049 1013530 885059
7320H85059J45714k1180k14990K06009L1039P3730j33827R5479K33478k1417J29747
$$ 885059 1030773 1009593 794603 1000612 1031651 1105381 971554 1067033 1300511 1279094 1408841
7309A408841l55305J02851J58806Q7646l73388K30844k90601m0418J95665K69034
$$ 1408841 1053536 1156387 1315193 1402839 1029451 1260295 969694 929276 1124941 1393975
7299A393975j99816J45093J90851l19646j02445L87092l58853J82328L45640j93089
$$ 1393975 1194159 1339252 1530103 1210457 1108012 1495104 1136251 1318579 1664219 1471130
7289A471130j45284J27865M064J07457j7565r7825J39032J56821R2618P5381j06495
$$ 1471130 1325846 1453711 1457775 1565232 1547667 1449842 1588874 1745695 1838313 1913694 1807199
7278A807199m60353J53030k01848P82944q3261l97125M05596m02698L04619L5651
$$ 1807199 1346846 1499876 1298028 2080972 1997711 1600586 2006182 1603484 1908103 1943754
7268A943754J08353m7164Q8851j20064o2252R0441J21521l22769J03969L95272
$$ 1943754 2052107 2004943 2093794 1973730 1911478 2001919 2123440 1800671 1904640 2299912
7258B299912j34443J53533k98244L66699J20830n35167K56690j32279K40184K8519
$$ 2299912 2165469 2319002 2020758 2387457 2508287 1973120 2229810 2097531 2337715 2366234
7248B366234k41110j0933L63230k10844M85806l41620K99409J16778k56582Q4573
$$ 2366234 2125124 2114191 2477421 2266577 2752383 2410763 2710172 2826950 2570368 2654941
7238B654941m54559L93960K81966K5382L291o0828k81486L25219J98217k24398
$$ 2654941 2200382 2594342 2876308 2901690 2904981 2844153 2562667 2887886 3086103 2861705
7228B861705m4121k05027L16369l02664K37665r7526J58355l85810K19438M24585
$$ 2861705 2817584 2612557 2928926 2626262 2863927 2766401 2924756 2538946 2758384 3182969
7218C182969m44288M27520k31937r0593n1844K35347J77264j18590J96141J92996
$$ 3182969 2738681 3166201 2934264 2843671 2791827 3027174 3204438 3085848 3281989 3474985
7208C474985j72299J76694m6265k95664K30639Q9824m36928M47746j39119M5693
$$ 3474985 3302686 3479380 3433115 3137451 3368090 3457914 3020986 3468732 3329613 3375306
7198C375306j3520j39006L32743K85760k23747K74568K1901n19432M7402K37543
$$ 3375306 3361786 3222780 3555523 3841283 3617536 3892104 3914005 3394573 3441975 3679518
7188C679518k19974j76926M51037j94775J21821K57456k88962J71082K02167m73978
$$ 3679518 3459544 3282618 3733655 3538880 3660701 3918157 3629195 3800277 4002444 3528466
7178C528466O55752k37064j79204q6797K92454Q4507K0003n6751J8372J10698
$$ 3528466 4184218 3947154 3767950 3681153 3973607 4058114 4078117 4021366 4039738 4150436
7168D150436k02862K71459j55652J282K33862p7996P6160n0533N15391l27808
$$ 4150436 3947574 4219033 4063381 4064663 4298525 4220529 4296689 4246156 4761547 4433739
7158D433739L58835k24665K09515k15589J50614K70621k41412K4097J52244K72206
$$ 4433739 4792574 4567909 4777424 4561835 4712449 4983070 4741658 4765755 4917999 5190205
7148E190205j96229K8961N3891J95983j48313J75738k56730N11312O2862l29767
$$ 5190205 4993976 5022937 5076828 5272811 5124498 5300236 5043506 5554818 5617680 5287913
7138E287913J60355k46957J93211P6634M01498j40282K87987P1757j38241L02174
$$ 5287913 5448268 5201311 5394522 5471156 5872654 5732372 6020359 6092116 5953875 6256049
7128F256049j00111K35180J03341l12143J32411j22562M11030j14290K28224K53618
$$ 6256049 6155938 6391118 6494459 6182316 6314727 6192165 6603195 6488905 6717129 6970747
7118F970747k16553L89418L63184l77121M18219l78584O76847q7632j0060p0528
$$ 6970747 6754194 7143612 7506796 7129675 7547894 7169310 7846157 7758525 7748465 7677937
7108G677937K63164j98695M18541k2242K78236M32355k26372o7296m7631O31242
$$ 7677937 7941101 7742406 8160947 8138705 8416941 8849296 8622924 8555628 8507997 9139239
7098I139239n59651L52592N90212k97816J67084N30551K5027J77461k51477L16883
$$ 9139239 8579588 8932180 9522392 9224576 9391660 9922211 9947238 10124699 9873222 10190105
7088A0190105N14789k1488J42545J38399J97159l48088P10375K32855o6327K34624
$$ 10190105 10704894 10683406 10825951 10964350 11161509 10813421 11523796 11756651 11690324 11924948
7078A1924948L28473J85274K48299N7362Q37264l95324K30723K40928O13462p3177
$$ 11924948 12253421 12438695 12686994 12744356 13581620 13186296 13417019 13657947 14271409 14198232
7068A4198232N5733N41021L54381Q4528J30324L64698N39489J67948K95256o8380
$$ 14198232 14253965 14794986 15149367 15233895 15364219 15728917 16268406 16436354 16731610 16663230
7058A6663230N10736L64010L48248R2985O23647M50563K43747R80986L13572J15118
$$ 16663230 17173966 17537976 17886224 17979209 18602856 19053419 19297166 20278152 20591724 20706842
7048B0706842M66632N09626J95618P29356L26263M95451P33409L71931O99794
$$ 20706842 21173474 21683100 21878718 22608074 22934337 23429788 24163197 24535128 25234922
7039B5234922l1272R97348N00067Q64372M14705M69334P70915O65653Q44811P83209
$$ 25234922 25203650 26200998 26701065 27565437 27980142 28449476 29220391 29886044 30730855 31514064
7029C1514064N79585R90364N32995O12723J192071P35093J021654J101611J043140
$$ 31514064 32093649 33084013 33617008 34229731 35421802 36156895 37178549 38280160 39323300
7020C9323300J019255P06277N44608J282866J200566J293956J017615J580360
$$ 39323300 40342555 41048832 41593440 42876306 44076872 45370828 46388443 47968803
7012D7968803J166153J107304J385123J366969R72222J454070J561146J544684
$$ 47968803 49134956 50242260 51627383 52994352 53966574 55420644 56981790 58526474
7004E8526474J480183J374647J782527R40465J806667J453632J940139J586345
$$ 58526474 60006657 61381304 63163831 64104296 65910963 67364595 69304734 70891079
6996G0891079J984986J040351K077305J997653J391896J516612J471536J579889
$$ 70891079 72876065 73916416 75993721 77991374 79383270 80899882 82371418 83951307
6988H3951307K016355K144515J408711J780571J165533J518609J797949J223212
$$ 83951307 85967662 88112177 89520888 91301459 92466992 93985601 95783550 97006762
6980I7006762J023807J966971J333487J492273J028182O92006J892098P47846
$$ 97006762 98030569 99997540 101331027 102823300 103851482 104543488 106435586 107183432
6972A07183432J164384R69338M89367J015374O67207M68885O16226N11352M3629
$$ 107183432 108347816 109317154 109806521 110821895 111489102 111957987 112574213 113085565 113129194
6963A13129194M48065k07255M88133j63223m4852n92490p4612m57456n41395k50179
$$ 113129194 113577259 113370004 113858137 113694914 113650062 113057572 112982960 112525504 111984109 111733930
6953A11733930p71485n09724j249307r76686p55557j149042m05516j681335j356612
$$ 111733930 110962445 110452721 109203414 108226728 107471171 106322129 105916613 104235278 102878666
6944A02878666j105427j319478j345095j227741j769751j312157j431469j648446
$$ 102878666 101773239 100453761 99108666 97880925 96111174 94799017 93367548 91719102
6936I1719102j322404j697398j708321j465267j851224j575052j328187j298708
$$ 91719102 90396698 88699300 86990979 85525712 83674488 82099436 80771249 79472541
6928G9472541j922171j568174j470661j831855j332919j453950j650718j297259
$$ 79472541 77550370 75982196 74511535 72679680 71346761 69892811 68242093 66944834
6920F6944834j340504j901816j475414j266073j149773j375652j029031j071039
$$ 66944834 65604330 63702514 62227100 60961027 59811254 58435602 57406571 56335532
6912E6335532j322371j289478r08855j845690j056353j056969p47526j140565
$$ 56335532 55013161 53723683 52814828 50969138 49912785 48855816 48108290 46967725
6904D6967725r92141j326577n87101l78487j587264o57628j208554o72141n32611
$$ 46967725 45975584 44649007 44061906 43683419 42096155 41438527 40229973 39557832 39025221
6895C9025221k25062j302907n19684j049378o69946m02876q38377m50973o43236
$$ 39025221 38800159 37497252 36977568 35928190 35258244 34855368 34016991 33566018 32922782
6886C2922782p29414n14074j4892r48455p47183k63349o62211n77046m25679n14024
$$ 32922782 32193368 31679294 31664402 30715947 29968764 29705415 29043204 28466158 28040479 27526455
6876B7526455m57651j62740o61739r84679j83825L9163n17452p0467o80649j59314
$$ 27526455 27068804 26906064 26244325 25259646 25075821 25114984 24597532 24527065 23846416 23687102
6866B3687102o74310l75332J72163k44137k48128p81304J59945l55545l76701
$$ 23687102 23012792 22637460 22809623 22565486 22317358 21536054 21695999 21340454 20963753
6857B0963753o86123m3101k79460k88732k01098j90227P8108n74798k77705j40525
$$ 20963753 20277630 20234529 19955069 19666337 19465239 19275012 19353120 18778322 18500617 18360092
6847A8360092l29498j16819l60685j66422j3738l78289J50322k53293j91331l30250
$$ 18360092 18030594 17913775 17553090 17386668 17372930 16994641 17144963 16891670 16700339 16370089
6837A6370089o5527k8301l31350O9801r62419N3254K36007n70668J63379k31702
$$ 16370089 16304562 16276261 15944911 16014712 15052293 15105547 15341554 14770886 14934265 14702563
6827A4702563n79796j87521K33907J99315m60981P4585m79900l46566O8724m48673
$$ 14702563 14122767 13935246 14169153 14368468 13907487 13982072 13502172 13155606 13224330 12775657
6817A2775657N23041m37844M73022r19433M08757k41148k90976J2453j95870Q1662
$$ 12775657 13298698 12860854 13333876 12414443 12823200 12582052 12291076 12303529 12107659 12189321
6807A2189321J9236l90710M26390k94040k96610J27105k20623k8044k5060j81035
$$ 12189321 12208557 11817847 12244237 11950197 11653587 11780692 11560069 11532025 11506965 11325930
6797A1325930K37478m23218j38093L92436j46395j83167j97840K99611k81322
$$ 11325930 11563408 11140190 11002097 11394533 11248138 11064971 10867131 11166742 10885420
6788A0885420k93334N26867n67989L5351P7720k83642j35758k79072K33784J21210
$$ 10885420 10592086 11118953 10550964 10586315 10664035 10380393 10244635 9965563 10199347 10320557
6778A0320557O3358l87707R4511J49562n08686K87717M9403o4561n00166M72588
$$ 10320557 10383915 9996208 10090719 10240281 9731595 10019312 10068715 10004154 9503988 9976576
6768I976576L97751p46918J1767L4077l12090K41667l9333k66285j08643j87685
$$ 9976576 10374327 9627409 9639176 9673253 9361163 9602830 9563497 9297212 9188569 9000884
6758I000884k02147J95363j74253n2650K43039k36226J73129r9273l34056J55411
$$ 9000884 8798737 8994100 8819847 8767197 9010236 8774010 8947139 8847866 8513810 8669221
6748H669221K04509m57280k9327n7658l47100K98651L9655k8007m64366K78824
$$ 8669221 8873730 8416450 8387123 8329465 7982365 8281016 8320671 8292664 7828298 8107122
6738H107122j06726k82882L8379R7597l61744j87082N49233j28990J84013o39391
$$ 8107122 8000396 7717514 7755893 7853490 7491746 7304664 7853897 7724907 7908920 7269529
6728G269529J06784o80604M55310j82313L20462m20627J7365j66906N57887j52125
$$ 7269529 7376313 6695709 7151019 6968706 7289168 6868541 6885906 6719000 7276887 7124762
6718G124762r3352L1805j63696o7703j31990M46079l33520j66133J94815K23555
$$ 7124762 7031410 7063215 6899519 6831816 6699826 7145905 6812385 6646252 6841067 7064622
6708G064622l40833o6239J2419j31441P7918l09627K96706j431k67326L77351
$$ 7064622 6723789 6657550 6669969 6538528 6616446 6306819 6603525 6602094 6334768 6712119
6698F712119o33605N05412j96985j20321J57800J8912k33047J0525J96318j65304
$$ 6712119 6078514 6583926 6386941 6266620 6424420 6443332 6210285 6220810 6417128 6251824
6688F251824L63655k73414j68246R8559j54870J6487q5774J47413J14256N2854
$$ 6251824 6615479 6342065 6173819 6272378 6117508 6133995 6048221 6195634 6309890 6362744
6678F362744l60799Q6276J86895k52464j28359J94334q5007j2413p8567M32577
$$ 6362744 6001945 6088221 6275116 6022652 5894293 6088627 6003620 5991207 5912640 6345217
6668F345217J6556m30329K43493m9670K54458j36245k35455J8043M18771p6611
$$ 6345217 6361773 5931444 6174937 6125267 6379725 6243480 6008025 6026068 6444839 6368228
6658F368228n13568J40107J80376m99353N36642o5192j56431O7801M07534l84330
$$ 6368228 5854660 5994767 6175143 5675790 6212432 6147240 5990809 6058610 6466144 6081814
6648F081814n4889j84542L61407l54089J04357N34414j91710l42703J02896J85733
$$ 6081814 6026925 5842383 6203790 5849701 5954058 6488472 6296762 5954059 6056955 6242688
6638F242688j75364J43528k23844L14663p2957j5202J0416M30966n02271J98168
$$ 6242688 6067324 6210852 5987008 6301671 6228714 6213512 6223928 6654894 6152623 6350791
6628F350791k23046j99187L91837J24038k38737L15639j48371J60522p04073K83931
$$ 6350791 6127745 5928558 6320395 6444433 6205696 6521335 6372964 6533486 5829413 6113344
6618F113344n7905O13678k88186j0632q3377j53312K39101P8063j05439J3952
$$ 6113344 6055439 6669117 6380931 6370299 6286922 6133610 6372711 6450774 6345335 6359287
6608F359287q7304L32699j46468N6219o5444J3074j1202J17539J54811m9227j78852
$$ 6359287 6271983 6604682 6458214 6514433 6448989 6462063 6450861 6568400 6723211 6673984 6495132
6597F495132j19648J0457J71354K27612o43848Q12868l09023k98478r0361J45973
$$ 6495132 6375484 6385941 6557295 6784907 6141059 6953927 6644904 6346426 6256065 6402038
6587F402038P01750n66529N05756n31448K46025k81242K05476K99590l32378P8359
$$ 6402038 7103788 6537259 7043015 6511567 6757592 6476350 6681826 6981416 6649038 6727397
6577F727397K01821k6754N715j16809Q1311k7035K79383k84075M02906J63781
$$ 6727397 6929218 6902464 6908179 6791370 6872681 6845646 7125029 6840954 7243860 7407641
6567G407641m51525P51910j71023j54608r344J00704O0509j37471L7767N9539
$$ 7407641 6956116 7708026 7537003 7382395 7373051 7473755 7534264 7396793 7434560 7494099
6557G494099L13272n91293O17695k02024k65142M39854l50920M62430k96539L37447
$$ 7494099 7807371 7216078 7833773 7631749 7366607 7806461 7455541 7917971 7621432 7958879
6547G958879j40626J56481J9625O6898J42252L05333n42682L02661M69157p81928
$$ 7958879 7818253 7974734 7994359 8061257 8203509 8508842 7966160 8268821 8737978 7956050
6537G956050P06812k43611R7617j48607m35171O83124J72493k41753O4484O53884
$$ 7956050 8662862 8419251 8516868 8368261 7933090 8616214 8788707 8546954 8611438 9265322
6527I265322j66437K14444R5350j9102m411N8081L7831k04445M52757j938L68681
$$ 9265322 9098885 9313329 9408679 9389577 9385166 9443247 9481078 9276633 9729390 9727452 10096133
6516A0096133j50854L51533m20636J13399j06440M47587m4623J24710r3544m4995
$$ 10096133 9945279 10296812 9876176 9989575 9883135 10330722 10286099 10410809 10317265 10272270
6506A0272270P08689J44451k35263K17544l47169J30844Q9149N1410L97054j10159
$$ 10272270 10980959 11125410 10890147 11107691 10760522 10891366 10980515 11031925 11428979 11318820
6496A1318820L92192J37092M5323k8452L63946J59081j77030J09751L09396L67101
$$ 11318820 11711012 11848104 11893427 11864975 12228921 12388002 12210972 12320723 12630119 12997220
6486A2997220k45654L15121p4694R7018K21793J05676J29927M03703j60717M18971
$$ 12997220 12751566 13066687 12991993 13089011 13310804 13416480 13546407 13950110 13789393 14208364
6476A4208364J7265J79119j54168j3929P12191j39674m22958O99474M53868M77198
$$ 14208364 14225629 14404748 14250580 14236651 14948842 14809168 14386210 15085684 15539552 16016750
6466A6016750o4481j13674P4733K47602L63727j53674M76318k89107O68896l87284
$$ 16016750 15952269 15838595 15913328 16160930 16524657 16370983 16847301 16558194 17227090 16839806
6456A6839806M76468o3945O97948J28980j00108K04525M66704L28380L68945J83236
$$ 16839806 17316274 17252329 17950277 18079257 17979149 18183674 18650378 18978758 19347703 19530939
6446A9530939K66996L03838k3114L70829K61516M20090J09702K77083L71161Q2524
$$ 19530939 19797935 20101773 20078659 20449488 20711004 21131094 21240796 21517879 21889040 21971564
6436B1971564J019996K1012L3791N29246N62238k6484M06883M41810N55574L75685
$$ 21971564 22991560 23012572 23046363 23575609 24137847 24111363 24518246 24960056 25515630 25891315
6426B5891315M01207L41050M60870J84086J040781N5888Q53232j77438Q64875
$$ 25891315 26292522 26633572 27094442 27278528 28319309 28375197 29228429 29050991 29915866
6417B9915866N08256L91533O74967P21884K41512R45767O17415O52236M57767
$$ 29915866 30424122 30815655 31490622 32212506 32454018 33399785 34017200 34669436 35127203
6408C5127203R71000P85362R23902O09323R56152K53528J433579P81330L92981
$$ 35127203 36098203 36883565 37807467 38416790 39372942 39626470 41060049 41841379 42234360
6399D2234360J110139O00341R24797J357825J221696J246197P16772R43019J398424
$$ 42234360 43344499 43944840 44869637 46227462 47449158 48695355 49412127 50355146 51753570
6390E1753570J111472J189096J517486R42363J200281J076745J945225J582015
$$ 51753570 52865042 54054138 55571624 56513987 57714268 58791013 60736238 62318253
6382F2318253J620044J330085J546711J731819J093098J712145J927745J320609
$$ 62318253 63938297 65268382 66815093 68546912 69640010 71352155 73279900 74600509
6374G4600509K099944J463297J811716J844366J538310K130472J564010K177638
$$ 74600509 76700453 78163750 79975466 81819832 83358142 85488614 87052624 89230262
6366H9230262J811307J200749K048342K089459K021097J649438J594477J908335
$$ 89230262 91041569 92242318 94290660 96380119 98401216 100050654 101645131 103553466
6358A03553466J447806J620530J823238J324949J723132J731940J080848J565493
$$ 103553466 105001272 106621802 108445040 109769989 111493121 113225061 114305909 115871402
6350A15871402J070540J579473J182699J079320R81049J024038N78716J585820
$$ 115871402 116941942 118521415 119704114 120783434 121764483 122788521 123367237 124953057
6342A24953057N40827R10801K00769K44473L62715L61401M95554J82548j12731
$$ 124953057 125493884 126404685 126605454 126849927 127212642 127574043 128069597 128252145 128139414
6333A28139414q9882n33522J43486n99589j92648o50990p32171r37829m66625
$$ 128139414 128049532 127516010 127659496 127059907 126867259 126216269 125484098 124546269 124079644
6324A24079644j065784o28311j075154q85896j145507j137716j291851j255349
$$ 124079644 123013860 122385549 121310395 120424499 119278992 118141276 116849425 115594076
6316A15594076q80176j572696j406670j249646j417740j147853j572584j236398
$$ 115594076 114713900 113141204 111734534 110484888 109067148 107919295 106346711 105110313
6308A05110313j717817j228966j302035j813432j297782j266709j200074j417282
$$ 105110313 103392496 102163530 100861495 99048063 97750281 96483572 95283498 93866216
6300I3866216j294050j272999j846328r34535j149995j178296j046499j148069
$$ 93866216 92572166 91299167 89452839 88518304 87368309 86190013 85143514 83995445
6292H3995445j087757j292348j101163q67401j246604n81028j171349m37538o84549
$$ 83995445 82907688 81615340 80514177 79646776 78400172 77819144 76647795 76210257 75525708
6283G5525708j294276n16071p10730l38412m41572p99455m36861o04957o05103
$$ 75525708 74231432 73715361 73004631 72666219 72224647 71425192 70988331 70383374 69778271
6274F9778271n28570J44007o06676R9979p54277K37415p38413J80461K3354r7251
$$ 69778271 69249701 69393708 68787032 68887011 68132734 68370149 67631736 67812197 67835551 67738300
6264F7738300Q8178k12009q4845J46678N80598l10173L89293M04650K79699M12707
$$ 67738300 67826478 67614469 67529624 67676302 68256900 67946727 68336020 68740670 69020369 69433076
6254F9433076L36697Q7264Q62628L76750M84739N60267M61415J330386M46880
$$ 69433076 69769773 69857037 70719665 71096415 71581154 72141421 72602836 73933222 74380102
6245G4380102O16700N56029J275327R96931P02199R83014J034793O47936J597594
$$ 74380102 74996802 75552831 76828158 77825089 78527288 79510302 80545095 81193031 82790625
6236H2790625J041886J068243J631270R89290J070547J554293J253428J465022
$$ 82790625 83832511 84900754 86532024 87521314 88591861 90146154 91399582 92864604
6228I2864604J667436J289305J324594J673203J998098J251273J766396J398611
$$ 92864604 94532040 95821345 97145939 98819142 100817240 102068513 103834909 105233520
6220A05233520J811864J367745J946038J420214J693492J791964J842460J741733
$$ 105233520 107045384 108413129 110359167 111779381 113472873 115264837 117107297 118849030
6212A18849030J613493J502230J560477J542465J715122J326940J590780J339763
$$ 118849030 120462523 121964753 123525230 125067695 126782817 128109757 129700537 131040300
6204A31040300J755413J102166J293265J449495J019755R60270J520008Q54833
$$ 131040300 132795713 133897879 135191144 136640639 137660394 138620664 140140672 140995505
6196A40995505Q65301J174888M21602O90479N80594K64225J023236K48091M67950
$$ 140995505 141860806 143035694 143457296 144147775 144728369 144992594 146015830 146263921 146731871
6187A46731871l247M3956K63782m08780J24850j91428k00097q27251m718r48889
$$ 146731871 146728624 146772580 147036362 146627582 146752432 146561004 146360907 145533656 145528938 144580049
6177A44580049o8079o41312m58225q66083r67503r61197p16311r56983q39464
$$ 144580049 144511970 143870658 143412433 142546350 141578847 140617650 139901339 138944356 138104892
6168A38104892r52052j296619j120315j452423q96450m90323j478231r57833j117255
$$ 138104892 137152840 135856221 134735906 133283483 132387033 131896710 130418479 129460646 128343391
6159A28343391o54463j247747r50474j496176o34246j248417q86269j235648p10490
$$ 128343391 127688928 126441181 125490707 123994531 123360285 122111868 121225599 119989951 119279461
6150A19279461p74228q62582n96257j375320n67247j82691p78149p74768k32131
$$ 119279461 118505233 117642651 117046394 115671074 115103827 114921136 114142987 113368219 113136088
6141A13136088l98843m8049r09799J29317j17492O8413N1592K31845j22445p5811
$$ 113136088 112737245 112689196 111779397 111908714 111791222 111859635 111911227 112143072 112020627 111944816
6131A11944816P28473K13159N28929M00574M74794O90964J058315P82369Q54655
$$ 111944816 112673289 112886448 113415377 113815951 114290745 114981709 116040024 116822393 117677048
6122A17677048J398364O10966J145293J316923J717588J425123J565293J438640
$$ 117677048 119075412 119686378 120831671 122148594 123866182 125291305 126856598 128295238
6114A28295238J695182K205794J801806J798821J871019K883523K326001K103847
$$ 128295238 129990420 132196214 133998020 135796841 137667860 140551383 142877384 144981231
6106A44981231K523014K599293K340087L319206L084436K940412L253111K845735
$$ 144981231 147504245 150103538 152443625 155762831 158847267 161787679 165040790 167886525
6098A67886525L314678L404231L003179L541345L465342L462143L609079L771820
$$ 167886525 171201203 174605434 177608613 181149958 184615300 188077443 191686522 195458342
6090A95458342K989494L453811L340453L133176L548135L194118K558833K883066
$$ 195458342 198447836 201901647 205242100 208375276 211923411 215117529 217676362 220559428
6082B20559428L115496K551745K496124J913958J995460J405708J083745J371154
$$ 220559428 223674924 226226669 228722793 230636751 232632211 234037919 235121664 236492818
6074B36492818O39495J025491m0442m56008n16900l20056j140282r56460k216423
$$ 236492818 237132313 238157804 238117362 237661354 237144454 236824398 235684116 234727656 232511233
6065B32511233j807240j811287k442466k501014k610240l443602k742781l607346
$$ 232511233 230703993 228892706 226450240 223949226 221338986 217895384 215152603 211545257
6057B11545257l576939l553608l506505l657100m098525l840448l844643l709578
$$ 211545257 207968318 204414710 200908205 197251105 193152580 189312132 185467489 181757911
6049A81757911m185356l459388m047926l468751l992827l967254l431192l646627
$$ 181757911 177572555 174113167 170065241 166596490 162603663 158636409 155205217 151558590
6041A51558590k996555l589677l556378l350876l299219k947646l149433l103242
$$ 151558590 148562035 144972358 141415980 138065104 134765885 131818239 128668806 125565564
6033A25565564k953572k943427k559036k939622k334117k863912k509674k439359
$$ 125565564 122611992 119668565 117109529 114169907 111835790 108971878 106462204 104022845
6025A04022845k453075k056368k632725j690724k160421j853971k180868j869093
$$ 104022845 101569770 99513402 96880677 95189953 93029532 91175561 88994693 87125600
6017H7125600k035369j785719j289791k154195j904781j197523j625194j619174
$$ 87125600 85090231 83304512 82014721 79860526 77955745 76758222 75133028 73513854
6009G3513854j124712j283045j674291j533147j171952j204183j388038j097007
$$ 73513854 72389142 71106097 69431806 67898659 66726707 65522524 64134486 63037479
6001F3037479j074989j371996r56170r12896j366075o48978r28063q04725j203994
$$ 63037479 61962490 60590494 59634324 58721428 57355353 56706375 55778312 54973587 53769593
5992E3769593m75606j197438p23126r85538n03554q73314q94652o57702p99265
$$ 53769593 53293987 52096549 51373423 50387885 49884331 49011017 48116365 47458663 46659398
5983D6659398m78295n54272m75106p99408r56611j63414n22200o37069p22544
$$ 46659398 46181103 45626831 45151725 44352317 43395706 43232292 42710092 42073023 41350479
5974D1350479o79271k69234m85170k23713r32683k11249m22030q76299j16726
$$ 41350479 40671208 40401974 39916804 39693091 38760408 38549159 38127129 37250830 37134104
5965C7134104m80051k44740k30691m20446m79485k24324k60096o33843K17989
$$ 37134104 36654053 36409313 36178622 35758176 35278691 35054367 34794271 34160428 34378417
5956C4378417q98768M3705k69816j66336n61429j83925k53660m64416J65413n15593
$$ 34378417 33479649 33523354 33253538 33087202 32525773 32341848 32088188 31623772 31789185 31273592
5946C1273592J43783l61085o35756k5557m04046k13159l93018J95645p01190K78769
$$ 31273592 31417375 31056290 30420534 30394977 29990931 29777772 29384754 29580399 28879209 29157978
5936B9157978m03778m48957k67102l14322o22986L7009k41383o8468j52815m39193
$$ 29157978 28754200 28305243 28038141 27723819 27100833 27137842 26896459 26827991 26675176 26235983
5926B6235983j64937k75296P3054k31416n00521o31199j54769k96619L96284n16858
$$ 26235983 26071046 25795750 25868804 25637388 25136867 24505668 24350899 24054280 24450564 23933706
5916B3933706m61163J21190k92536m51712l68234J04563J13o61046k88906k49845
$$ 23933706 23472543 23593733 23301197 22849485 22481251 22585814 22585927 21924881 21635975 21386130
5906B1386130L493k30727m43828k8197k33925j96149k41548k57970j56426m2844
$$ 21386130 21389623 21158896 20715068 20686871 20452946 20256797 20015249 19757279 19600853 19558009
5896A9558009o3620n01037l71286O9042l29375n6158P6340l05229l79051p7389
$$ 19558009 19494389 18993352 18622066 18691108 18361733 18305575 18381915 18076686 17697635 17620246
5886A7620246k24059K7221l24513R7075m16375J51105o09891L09944m84419k03021
$$ 17620246 17396187 17423408 17098895 17195970 16779595 16930700 16320809 16630753 16146334 15943313
5876A5943313P5560l35911o5171N4975m30315K10895k25885k00420l92060K25889
$$ 15943313 16018873 15682962 15617791 15672766 15242451 15453346 15227461 15027041 14634981 14860870
5866A4860870o6664q2615l66693l99038M83581l26911J2367l31750K62199m38861
$$ 14860870 14794206 14711591 14344898 13945860 14429441 14102530 14114897 13783147 14045346 13606485
5856A3606485j93115L2989q9323l73188K7724K8578j52937J30919r9612j83200
$$ 13606485 13413370 13446359 13357036 12983848 13011572 13040150 12887213 13018132 12918520 12735320
5846A2735320J9487o28828M40490j53187j01696k30540j17546M1361l73252R2117
$$ 12735320 12754807 12125979 12566469 12413282 12311586 12081046 11963500 12004861 11631609 11723726
5836A1723726K2494J37374N4214P8985l40358j15843J20962j36727m40583L14212
$$ 11723726 11746220 11883594 11937808 12016793 11676435 11560592 11681554 11544827 11104244 11418456
5826A1418456l0293J50078m23878J34152l61517K87045k84254J47609l92315N85125
$$ 11418456 11388163 11538241 11114363 11248515 10886998 11174043 10889789 11037398 10645083 11230208
5816A1230208m8968j69919l79791M45260j64464k7918m71337L93519k6946l16376
$$ 11230208 11181240 11011321 10631530 11076790 10912326 10884408 10413071 10806590 10779644 10463268
5806A0463268J2552R7238K19600q5291j64029j36190K26236k11193P1254j14757
$$ 10463268 10475820 10573058 10792658 10707367 10543338 10407148 10633384 10422191 10493445 10378688
5796A0378688Q2k86806J4425M31885m94429n9130L89500k15735j06403K71756
$$ 10378688 10378770 10091964 10106389 10538274 10043845 9984715 10374215 10158480 10052077 10323833
5786A0323833o65789K18502J42039m09128M45253l26304O47491l25500m7902Q1499
$$ 10323833 9658044 9876546 10018585 9609457 10054710 9728406 10375897 10050397 10002495 10083994
5776A0083994l30454K08430L05682m95456K43368k63704J73398J12396l36403
$$ 10083994 9753540 9961970 10267652 9772196 10015564 9751860 9925258 10037654 9701251
5767I701251N21K1307J90483J38454m88722N03404l15325J42143m30531K19401
$$ 9701251 9701772 9723079 9913562 10052016 9563294 10066698 9751373 9893516 9462985 9682386
5757I682386K23931l75069j9046M36759P5384m65499k33823K23091N4695K36578
$$ 9682386 9906317 9531248 9512202 9948961 10024345 9558846 9325023 9548114 9602809 9839387
5747I839387o1470N32950k39951j23079j93901L51969m22996K63367M9688J03256
$$ 9839387 9777917 10310867 10070916 9947837 9753936 10105905 9682909 9946276 9995964 10099220
5737A0099220j30775k08238L4976J98913k97329L29977k3988K02645m32764K37289
$$ 10099220 9968445 9760207 9795183 9994096 9696767 10026744 10002756 10205401 9772637 10009926
5727A0009926j13619R738o8028O0020K56775K54463Q6963k57203m81487L64543
$$ 10009926 9896307 9906045 9838017 9898037 10154812 10409275 10496238 10239035 9757548 10122091
5717A0122091L6641n7355M6449J63512K17017k53640K35088K237J24701R987O6258
$$ 10122091 10158732 10101377 10147826 10311338 10528355 10274715 10509803 10512040 10636741 10646728 10712986
5706A0712986K44567n87715j38140K33558J90802l31015L30005L43994l36421
$$ 10712986 10957553 10369838 10231698 10465256 10656058 10325043 10655048 10999042 10662621
5697A0662621m57946Q50169j28938J37895n20805M17676M36072n52409R1993L75186
$$ 10662621 10204675 11054844 10925906 11063801 10542996 10960672 11396744 10844335 10936328 11311514
5687A1311514k00441j63739J40181J01650j01788K76680k40812L63978k31812
$$ 11311514 11111073 10947334 11087515 11189165 11087377 11364057 11123245 11487223 11255411
5678A1255411N15083l46771k95422J09325N90518l69482L95257J36679l33201
$$ 11255411 11770494 11423723 11128301 11237626 11828144 11458662 11853919 11990598 11657397
5669A1657397K40514k21982M44744J8129j74470J55103K56487j9014K01215k18536
$$ 11657397 11897911 11675929 12120673 12138802 11964332 12119435 12375922 12356908 12558123 12339587
5659A2339587J64202k4196J61024R295l1471r9772N57692J477j02923K07663k43104
$$ 12339587 12503789 12479593 12640617 12649912 12618441 12518669 13076361 13077838 12974915 13182578 12939474
5648A2939474M33675J13201j39803j52666K2763K70613r8558O45133J64187K36685
$$ 12939474 13373149 13486350 13346547 13193881 13216644 13487257 13388699 14033832 14198019 14434704
5638A4434704J1263j30582J25623l41195O40011q6426J85010J13300K89125K56988
$$ 14434704 14445967 14315385 14441008 14099813 14739824 14653398 14838408 14951708 15240833 15497821
5628A5497821k87051P70112m4668k32486L95303K13962M31321m1681k68201L53023
$$ 15497821 15210770 15980882 15936214 15703728 16099031 16312993 16744314 16702633 16434432 16787455
5618A6787455K86401J62165j03751R80697k51932K86721M12745K37014K73934
$$ 16787455 17073856 17236021 17132270 18112967 17861035 18147756 18560501 18797515 19071449
5609A9071449p7357K42545R0707J17785R43474p1248M66590M2451P32167R291
$$ 19071449 18994092 19236637 19327344 19445129 20388603 20317355 20783945 20826396 21558563 21567854
5599B1567854K63354L38688M50699k05876M35248L82531K76913O59092M0364L19041
$$ 21567854 21831208 22169896 22620595 22414719 22849967 23232498 23509411 24168503 24208867 24527908
5589B4527908M53523K42996N38457N9021N29980R01135j3044O60199L97287K71282
$$ 24527908 24981431 25224427 25762884 25821905 26351885 27253020 27239976 27900175 28297462 28568744
5579B8568744K74408P78213N20142L8036Q34008P13926N29963k30J147608M08058
$$ 28568744 28843152 29621365 30141507 30179543 31013551 31727477 32257440 32257210 33404818 33812876
5569C3812876L80550P55411O59155M57286N77025Q95210M29837R37831O04563
$$ 33812876 34193426 34948837 35607992 36065278 36642303 37537513 37967350 38905181 39509744
5560C9509744O09651P85067J126773K45944J393409P96374O49230O91495J079517
$$ 39509744 40119395 40904462 42031235 42277179 43670588 44466962 45116192 45807687 46887204
5551D6887204R04854Q35729J161687Q31611J344416R38036J266449Q56728J269400
$$ 46887204 47792058 48627787 49789474 50621085 51965501 52903537 54169986 55026714 56296114
5542E6296114P26557J238701J056448J128289J303508J038362Q18665J201016
$$ 56296114 57022671 58261372 59317820 60446109 61749617 62787979 63606644 64807660
5534F4807660J662102J014425J536111J002620J454074J053541J332582J443066
$$ 64807660 66469762 67484187 69020298 70022918 71476992 72530533 73863115 75306181
5526G5306181J089662J202275R08365J227022J686445N87227J179142J492517
$$ 75306181 76395843 77598118 78506483 79733505 81419950 82007177 83186319 84678836
5518H4678836J419292J200051P94797J138792J125312P97526R91645J404004O77882
$$ 84678836 86098128 87298179 88092976 89231768 90357080 91154606 92146251 93550255 94228137
5509I4228137J127323P46237R44878O54879J002876N93284L99669J307583M03439
$$ 94228137 95355460 96101697 97046575 97701454 98704330 99297614 99697283 101004866 101408305
5500A01408305M45992P04858L26708K87752L25948N31280L19624J35642N1409
$$ 101408305 101854297 102559155 102885863 103173615 103499563 104030843 104350467 104486109 104537518
5491A04537518M54064J44104k72595k37339M56205k49929n3616k19751m07201
$$ 104537518 104991582 105135686 104863091 104625752 105081957 104832028 104778412 104558661 104151460
5482A04151460l33662l79321k68048n72788l09731l57732j011733l6507j273405
$$ 104151460 103817798 103438477 103170429 102597641 102287910 101930178 100918445 100881938 99608533
5473I9608533n32047o45212q80082r96009o18830j041840q28132r79734j067158
$$ 99608533 99076486 98431274 97551192 96555183 95936353 94894513 94066381 93086647 92019489
5464I2019489q76770r53105j000302j500502p76664j100476j090879j312062j145812
$$ 92019489 91142719 90189614 89189312 87688810 86912146 85811670 84720791 83408729 82262917
5455H2262917j219669p74968j207812j274863j076835j382787r63943j204488
$$ 82262917 81043248 80268280 79060468 77785605 76708770 75325983 74362040 73157552
5447G3157552j195633j443974r70009r77033j218395j034843r34391j281838j201812
$$ 73157552 71961919 70517945 69547936 68570903 67352508 66317665 65383274 64101436 62899624
5438F2899624j210384m75502j742297p19387j055116p35017j161749r66331n89809
$$ 62899624 61689240 61213738 59471441 58752054 57696938 56961921 55800172 54833841 54244032
5429E4244032j224432q32781n70299j088656r25367o72337n90661j341462n22613
$$ 54244032 53019600 52186819 51616520 50527864 49602497 48930160 48339499 46998037 46475424
5420D6475424j99238j020148r51856l98653o93609n28008o52842r51046k77961
$$ 46475424 46276186 45256038 44304182 43905529 43211920 42683912 42031070 41080024 40802063
5411D0802063l49481m61007j121215m83894j93516n12264j44174q86922J32252
$$ 40802063 40452582 39991575 38870360 38386466 38192950 37680686 37536512 36649590 36781842
5402C6781842r45646j81451k5827m83491l91872l69581k00229j17981m19402o72495
$$ 36781842 35836196 35654745 35628918 35145427 34753555 34383974 34183745 34065764 33646362 32973867
5392C2973867K02568n37375K30429k85171n48032k67296N61080o89020j6893k00058
$$ 32973867 33176435 32639060 32869489 32584318 32036286 31768990 32330070 31641050 31624157 31424099
5382C1424099K17728j12100N9237j00023p02873K96941r1616K22383k40765K80541
$$ 31424099 31641827 31529727 31588964 31488941 30786068 31083009 30991393 31213776 30973011 31253552
5372C1253552Q4618o185k42687M56324m7166l0114J40339L25602k8596L25467
$$ 31253552 31338170 31331985 31089298 31545622 31498456 31468342 31608681 31934283 31905687 32231154
5362C2231154K14228K18226M61010K1820O266P03164L0382K95215L84454N21397
$$ 32231154 32445382 32663608 33124618 33146438 33152704 33855868 33886250 34181465 34565919 35087316
5352C5087316J28315O74146L63141J56906N46364P47055O70476L96509M35606
$$ 35087316 35215631 35889777 36252918 36409824 36956188 37703243 38373719 38770228 39205834
5343C9205834L67108P11256P95480N44810P65327Q42163N71091O39973N87714
$$ 39205834 39572942 40284198 41079678 41624488 42389815 43231978 43803069 44443042 45030756
5334D5030756J122371M84106Q25924M36070Q08129Q79805J028825Q89240N72642
$$ 45030756 46153127 46637233 47463157 47899227 48707356 49587161 50615986 51505226 52077868
5325E2077868J352867N28684Q67677J114365Q17761R05211M54941J073062O51671
$$ 52077868 53430735 53959419 54827096 55941461 56759222 57664433 58119374 59192436 59844107
5316E9844107R70198P12804P05718J096912O96197R01714M09789P99071Q74482
$$ 59844107 60814305 61527109 62232827 63329739 64025936 64927650 65337439 66136510 67010992
5307F7010992N05492P17711M72704M35008L30542M32406Q58650j09189K77124
$$ 67010992 67516484 68234195 68706899 69141907 69472449 69904855 70763505 70654316 70931440
5298G0931440O5679k9972K49157q24613R0967L15478n06289k32137n71349p01617
$$ 70931440 70997119 70967147 71216304 70391691 70482658 70798136 70291847 70059710 69488361 68786744
5288F8786744l81430r76442k33094o98915m60950j475886n51811j330229o40655
$$ 68786744 68405314 67428872 67195778 66496863 66035913 64560027 64008216 62677987 62037332
5279F2037332o33055j083944j180796p89066j135976j031370j412160r67790r89464
$$ 62037332 61404277 60320333 59139537 58350471 57214495 56183125 54770965 53803175 52813711
5270E2813711r98563j009845j225870j187770o46089n49535j660947o20913j101888
$$ 52813711 51815148 50805303 49579433 48391663 47745574 47196039 45535092 44914179 43812291
5261D3812291n28234j385112p89698p13110m98781j111752j193188k23469o88621
$$ 43812291 43284057 41898945 41109247 40396137 39897356 38785604 37592416 37368947 36680326
5252C6680326k76279j375917l87975q94787l99234p34949l11210r48396O9502
$$ 36680326 36404047 35028130 34640155 33745368 33346134 32611185 32299975 31351579 31421081
5243C1421081o39526l86479R519q52130n31834k92895l42161m57141j95287q11646
$$ 31421081 30781555 30395076 30404595 29552465 29020631 28727736 28385575 27928434 27733147 26921501
5233B6921501k18286K9558m03648m10074M6198q07198m483l85536l41288k37488
$$ 26921501 26703215 26732773 26329125 25919051 25965249 25158051 25153568 24768032 24426744 24189256
5223B4189256J2931k60718k86341k24170j7778l15618k47680j23085k44379L01230
$$ 24189256 24202187 23941469 23655128 23430958 23413180 23097562 22849882 22726797 22482418 22783648
5213B2783648l18838j80256k73966R4568l35870k07967K64650k86798k41704L12314
$$ 22783648 22464810 22284554 22010588 22105156 21769286 21561319 21825969 21539171 21297467 21609781
5203B1609781l82973j13388l7862J07459k4006j10200n58021j01585j18997J15862
$$ 21609781 21226808 21113420 21075558 21183017 21159011 21048811 20490790 20389205 20270208 20386070
5193B0386070l38961j98715K58933j4761R767k01456j82932j02666j92821K11399
$$ 20386070 20047109 19848394 20107327 20092566 20102333 19900877 19717945 19615279 19422458 19633857
5183A9633857m0303K15347l65620k79322K1309J07019m98276j19002K98461j96714
$$ 19633857 19593554 19808901 19443281 19163959 19185268 19292287 18794011 18675009 18973470 18776756
5173A8776756m333K29356o25199L28874j768R4632k81125N9855j00274j35402
$$ 18776756 18772423 19001779 18376580 18705454 18703686 18798318 18517193 18577048 18476774 18341372
5163A8341372J55153m36676L44739k6525o3362l65283J46061M41250l23630r3171
$$ 18341372 18496525 18059849 18404588 18378063 18314701 17949418 18095479 18536729 18213099 18119928
5153A8119928j99544o232j21793N71559N3734p51071m5433M42596L3934q0402
$$ 18119928 17920384 17914152 17792359 18363918 18417652 17666581 17621148 18063744 18097678 18017276
5143A8017276j2367L14702m30343M25090j47431P448J33771j56923K59863k95995
$$ 18017276 18004909 18319611 17889268 18314358 18166927 18174375 18308146 18151223 18411086 18115091
5133A8115091J15814o7151N07535j69100K6211Q6869j76734K23215o8071K52501
$$ 18115091 18230905 18163754 18671289 18502189 18528400 18615269 18438535 18661750 18593679 18846180
5123A8846180m01804j16344M60312M69207j80799j12220K86654j22458k29312
$$ 18846180 18444376 18328032 18788344 19257551 19076752 18964532 19251186 19128728 18899416
5114A8899416O6118M21978M7474N03799m20259J82267K74420m9183K14528J59695
$$ 18899416 18965534 19387512 19434986 19938785 19518526 19700793 19975213 19926030 20140558 20300253
5104B0300253J98122n5337J22114j61221K83022J06322l1697K95832j22220J39985
$$ 20300253 20498375 20443038 20565152 20403931 20686953 20793275 20761578 21057410 20935190 21075175
5094B1075175J90409K03135K67374p5461N33063j91038J38076L06928K19318M42994
$$ 21075175 21265584 21468719 21736093 21660632 22193695 22002657 22140733 22447661 22666979 23109973
5084B3109973k44266K41790k00339L67533Q94927k69245K14596K45514O80290
$$ 23109973 22865707 23107497 22907158 23274691 24169618 23900373 24114969 24360483 25040773
5075B5040773k82386L50331K49338m51952J084077P7888J61352L18367J9200K22840
$$ 25040773 24758387 25108718 25358056 24906104 25990181 26068069 26229421 26547788 26566988 26789828
5065B6789828N23931l39440J081589k02547N92511l9622L60902M48641L94315
$$ 26789828 27313759 26974319 28055908 27853361 28445872 28406250 28767152 29215793 29610108
5056B9610108j15337M65433N66032L84365m8005P89813K73749J61862J019737
$$ 29610108 29494771 29960204 30526236 30910601 30862596 31652409 31926158 32088020 33107757
5047C3107757p6921N21042K21426P15610K46228O66555N42310K95721M96427N39012
$$ 33107757 33030836 33551878 33773304 34488914 34735142 35401697 35944007 36239728 36736155 37275167
5037C7275167O08933N68214L14641N85815O10412N26402P14089P55515J18497
$$ 37275167 37884100 38452314 38766955 39352770 39963182 40489584 41203673 41959188 42077685
5028D2077685Q68277J127091N83096M35139M67735Q80732J081607P72190P19814
$$ 42077685 42945962 44073053 44656149 45091288 45559023 46439755 47521362 48293552 49013366
5019D9013366Q60531N99253J018071J213891P45354R09406Q38879J624640P49227
$$ 49013366 49873897 50473150 51491221 52705112 53450466 54359872 55198751 56823391 57572618
5010E7572618J036580J392403J228300R37072J141039J236607J179061J687802
$$ 57572618 58609198 60001601 61229901 62166973 63308012 64544619 65723680 67411482
5002F7411482J399341J223249J601123J555709J386098J963563J387504J874185
$$ 67411482 68810823 70034072 71635195 73190904 74577002 76540565 77928069 79802254
4994G9802254J830555J840583J844976K144451J960674J987737K277051K269408
$$ 79802254 81632809 83473392 85318368 87462819 89423493 91411230 93688281 95957689
4986I5957689K113626K460293J866293K832314K801785K363053K831951K807577
$$ 95957689 98071315 100531608 102397901 105230215 108032000 110395053 113227004 116034581
4978A16034581K639245K654713L176675K903476K862570K988753L383418K880273
$$ 116034581 118673826 121328539 124505214 127408690 130271260 133260013 136643431 139523704
4970A39523704L747133K605895L135375L584135K972286L435672K848220L751532
$$ 139523704 143270837 145876732 149012107 152596242 155568528 159004200 161852420 165603952
4962A65603952K859145K776811L249095K847780K864090L024657K567984K913924
$$ 165603952 168463097 171239908 174489003 177336783 180200873 183225530 185793514 188707438
4954A88707438K243188K612567K707722K263545K524817K407288K074145K139298
$$ 188707438 190950626 193563193 196270915 198534460 201059277 203466565 205540710 207680008
4946B07680008J561616K518808J482842J727844J608250J638258J577097J952686
$$ 207680008 209241624 211760432 213243274 214971118 216579368 218217626 219794723 221747409
4938B21747409M58489J264965R76796J346626O78126R46583P80320O16251J50030
$$ 221747409 222205898 223470863 224447659 225794285 226472411 227418994 228199314 228815565 228965595
4929B28965595O10759J63364R9359n83945p3224n98965q8887n66247j163494j028520
$$ 228965595 229576354 229739718 229839077 229255132 229181908 228582943 228494056 227927809 226764315 225735795
4919B25735795q56640j613643j142064j807381j170945j599550k108023j640999
$$ 225735795 224879155 223265512 222123448 220316067 219145122 217545572 215437549 213796550
4911B13796550k665419j585070k560150j531337l080616k397005k587018k578004
$$ 213796550 211131131 209546061 206985911 205454574 202373958 199976953 197389935 194811931
4903A94811931k096086l241359k468239k810672k722023k508366k540831l179200
$$ 194811931 192715845 189474486 187006247 184195575 181473552 178965186 176424355 173245155
4895A73245155k654282k635759k542297l132915k215798k860470k641207k188270
$$ 173245155 170590873 167955114 165412817 162279902 160064104 157203634 154562427 152374157
4887A52374157k280911l154176k282898k267095k140881k273882j976914k628579
$$ 152374157 150093246 146939070 144656172 142389077 140248196 137974314 135997400 133368821
4879A33368821k081378j768883j923638j800529j525286k273839j660842j619641
$$ 133368821 131287443 129518560 127594922 125794393 124269107 121995268 120334426 118714785
4871A18714785j391559j408157j379875j710490q96851j186205j465135j206537
$$ 118714785 117323226 115915069 114535194 112824704 111927853 110741648 109276513 108069976
4863A08069976j086495j045005r22059j140490q82064q16457o27171j006383p77688
$$ 108069976 106983481 105938476 105016417 103875927 102993863 102177406 101550235 100543852 99766164
4854I9766164m09017l5829r68494p80438l07173m19000j31066o09079k74209r69902
$$ 99766164 99357147 99321318 98352824 97572386 97265213 96846213 96715147 96106068 95831859 94861957
4844I4861957K48385K23298q65695K54833l28527j87900J08616p8393l31464R7812
$$ 94861957 95110342 95333640 94467945 94722778 94394251 94206351 94314967 94236574 93905110 94002922
4834I4002922P6302L8849M27293l62778L70370M37336m28801O42003M8158k87416
$$ 94002922 94079224 94118073 94545366 94182588 94552958 94990294 94561493 95203496 95251654 94964238
4824I4964238M44621K57845O76777l8140n615N48814M46578O14364O39248K91525
$$ 94964238 95408859 95666704 96343481 96305341 96299726 96848540 97295118 97909482 98548730 98840255
4814I8840255L87017O43063L85298P45624L53929J153716O68276N12425J068270
$$ 98840255 99227272 99870335 100255633 101001257 101355186 102508902 103177178 103689603 104757873
4805A04757873J131467P80388O89094J338772J029572J009664J407235O11697
$$ 104757873 105889340 106669728 107358822 108697594 109727166 110736830 112144065 112755762
4797A12755762J574616J483993J009642J579610J493841J126533K238685J303538
$$ 112755762 114330378 115814371 116824013 118403623 119897464 121023997 123262682 124566220
4789A24566220K033988R76512K891367K164992J625950K159118J943405K033837
$$ 124566220 126600208 127576720 130468087 132633079 134259029 136418147 138361552 140395389
4781A40395389K634474K263847K747577K583874K692962K936081K399974K901854
$$ 140395389 143029863 145293710 148041287 150625161 153318123 156254204 158654178 161556032
4773A61556032L228339L151993L699381K907107L712422L716393L908808L728207
$$ 161556032 164784371 167936364 171635745 174542852 178255274 181971667 185880475 189608682
4765A89608682M069934L981572M039367M803590L977821M561788N078186M725011
$$ 189608682 193678616 197660188 201699555 206503145 210480966 215042754 220120940 224845951
4757B24845951M950821N341687N341234N109655M984895O106084N618693N441005
$$ 224845951 229796772 235138459 240479693 245589348 250574243 256680327 262299020 267740025
4749B67740025N627676N842536N695100O340108O051101N827569N941958N626087
$$ 267740025 273367701 279210237 284905337 291245445 297296546 303124115 309066073 314692160
4741C14692160O193148O167012N350316N459727N617294N442574N415355M982985
$$ 314692160 320885308 327052320 332402636 337862363 343479657 348922231 354337586 359320571
4733C59320571M033521N261900L430279M110277L928818L121002L342127K262979
$$ 359320571 363354092 368615992 372046271 376156548 380085366 383206368 386548495 388811474
4725C88811474J968032J542904J502990O41804J127370J63140n25092q68428r74455
$$ 388811474 390779506 392322410 393825400 394467204 395594574 395757714 395232622 394364194 393389739
4716C93389739j313589j871514k328918k800787k837340k945305l994338l729903
$$ 393389739 392076150 390204636 387875718 385074931 382237591 379292286 375297948 371568045
4708C71568045l904154l847134n196884m267965n285862n128849m841061m784941
$$ 371568045 367663891 363816757 358619873 354351908 349066046 343937197 339096136 334311195
4700C34311195n586089n706520n083724n474032n652497n368056m948973n802440
$$ 334311195 328725106 323018586 317934862 312460830 306808333 301440277 296491304 290688864
4692B90688864n069589m899806n380809m966283m869106m612150m882217m746799
$$ 290688864 285619275 280719469 275338660 270372377 265503271 260891121 256008904 251262105
4684B51262105m306953m799559m279659l909413m224949l915840l649566l714230
$$ 251262105 246955152 242155593 237875934 233966521 229741572 225825732 222176166 218461936
4676B18461936l984107l288986l454551k967361k900564l150749l232231k663689
$$ 218461936 214477829 211188843 207734292 204766931 201866367 198715618 195483387 192819698
4668A92819698k563304k083311k918111k390554k210618k435408j729398k391086
$$ 192819698 190256394 188173083 185254972 182864418 180653800 178218392 176488994 174097908
4660A74097908j342745j459158j668312j404307j798485j456332j103048j374218
$$ 174097908 172755163 171296005 169627693 168223386 166424901 164968569 163865521 162491303
4652A62491303p84931m83084j485613r08158j68201j198633m07271l76718r15344
$$ 162491303 161706372 161223288 159737675 158829517 158661316 157462683 157055412 156678694 155763350
4643A55763350r2048l72484j14287j5637j37108J67136o3599R01687k82385L11322
$$ 155763350 155671302 155298818 155184531 155168894 155031786 155198922 155135323 156037010 155754625 156065947
4633A56065947P1853N29006N27565O86835J88127J533720j15278P43078J059649
$$ 156065947 156137800 156666806 157194371 157881206 158069333 159603053 159487775 160230853 161290502
4624A61290502R60128P31718J157452Q62204Q44637J459065R87787J099483J481444
$$ 161290502 162250630 162982348 164139800 165002004 165846641 167305706 168293493 169392976 170874420
4615A70874420J325899J616429P93482J226162J574743J840123J346753J823398
$$ 170874420 172200319 173816748 174610230 175836392 177411135 179251258 180598011 182421409
4607A82421409J137954K086592J532200J628630K150713J821540K000802K313865
$$ 182421409 183559363 185645955 187178155 188806785 190957498 192779038 194779840 197093705
4599A97093705J540316K706350J663207K460205K534874K367787L003650K267489
$$ 197093705 198634021 201340371 203003578 205463783 207998657 210366444 213370094 215637583
4591B15637583K604683K747456K971395K488924L076676L263475K932311L037407
$$ 215637583 218242266 220989722 223961117 226450041 229526717 232790192 235722503 238759910
4583B38759910K553377L629082L068611L086247L534216L363007L253404K835591
$$ 238759910 241313287 244942369 248010980 251097227 254631443 257994450 261247854 264083445
4575B64083445L652845L015993K922273L010156L150214K859245K798671K727358
$$ 264083445 267736290 270752283 273674556 276684712 279834926 282694171 285492842 288220200
4567B88220200L151073K661602K623910K008819K712111K017583J881085J944901
$$ 288220200 291371273 294032875 296656785 298665604 301377715 303395298 305276383 307221284
4559C07221284J772764J219585J807065J325664J078233Q24609P56349N76992
$$ 307221284 308994048 310213633 312020698 313346362 314424595 315249204 316005553 316582545
4551C16582545N63770K5522K96260m1162l69176r30877j50880j157057p28657
$$ 316582545 317146315 317171837 317468097 317426935 317057759 316126882 315976002 314818945 314090288
4542C14090288j338754j020122j755166j481102j355099k306843k243616k190500
$$ 314090288 312751534 311731412 309976246 308495144 307140045 304833202 302589586 300399086
4534C00399086k453714k346691k680991k496576k821934l167328k980382k958663
$$ 300399086 297945372 295598681 292917690 290421114 287599180 284431852 281451470 278492807
4526B78492807l117506l071934l188531l735210l328827l516158l861923l496912
$$ 278492807 275375301 272303367 269114836 265379626 262050799 258534641 254672718 251175806
4518B51175806k820400l990735l653184l433527l138699l919332l515641l377388
$$ 251175806 248355406 244364671 240711487 237277960 234139261 230219929 226704288 223326900
4510B23326900l345232l431188l054893l842979k814390l167271k973309l354490
$$ 223326900 219981668 216550480 213495587 209652608 206838218 203670947 200697638 197343148
4502A97343148k655476l529084l039496k507061k846443l018821k600882k164995
$$ 197343148 194687672 191158588 188119092 185612031 182765588 179746767 177145885 174980890
4494A74980890l033208k410541l084489k322133k310865k736436k384282k459458
$$ 174980890 171947682 169537141 166452652 164130519 161819654 159083218 156698936 154239478
4486A54239478k589918k430659j647463k912360k222308j993140k735731j703389
$$ 154239478 151649560 149218901 147571438 144659078 142436770 140443630 137707899 136004510
4478A36004510k674985j713530k550411j950883k150174k245304k139908j650370
$$ 136004510 133329525 131615995 129065584 127114701 124964527 122719223 120579315 118928945
4470A18928945k090682j976185k106258k055020j699412j635003k131663j750728
$$ 118928945 116838263 114862078 112755820 110700800 109001388 107366385 105234722 103483994
4462A03483994j839434j744507j832629j755610j389318j940653j157205j975732
$$ 103483994 101644560 99900053 98067424 96311814 94922496 92981843 91824638 89848906
4454H9848906j439755j548892r91337j839505j427619j249402j489159j345875
$$ 89848906 88409151 86860259 85868922 84029417 82601798 81352396 79863237 78517362
4446G8517362j512169j316526o92926j802958p87430j480166j176988q96886r90391
$$ 78517362 77005193 75688667 74995741 73192783 72405353 70925187 69748199 68851313 67860922
4437F7860922r57004j147640r74528j241934n04382j127141j172712p84645r04489
$$ 67860922 66903918 65756278 64781750 63539816 63035434 61908293 60735581 59950936 59046447
4428E9046447o60125r70057r67279o63678r96869k38991j592876k48875n21313
$$ 59046447 58386322 57416265 56448986 55785308 54788439 54549448 52956572 52707697 52186384
4419E2186384m88108j036592k82782j068568n11655q12203j145693l17097j31679
$$ 52186384 51698276 50661684 50378902 49310334 48798679 47986476 46840783 46523686 46392007
4410D6392007p49680r97557o68266n62341p5240p94942m94911n79067o34728j63848
$$ 46392007 45642327 44644770 43976504 43414163 43338923 42543981 42049070 41470003 40835275 40671427
4400D0671427o08469n86929n52450k78177m95435n09408m36761J4876r86769l48338
$$ 40671427 40062958 39476029 38923579 38645402 38149967 37640559 37203798 37218674 36231905 35883567
4390C5883567j24519o01053o5320k09154p68158k34550k35626n01206l81273m15667
$$ 35883567 35759048 35157995 35092675 34883521 34115363 33880813 33645187 33143981 32762708 32347041
4380C2347041l54644k42896j57929l18289j47678p46743J5860o53309R4034m06844
$$ 32347041 31992397 31749501 31591572 31273283 31125605 30378862 30394722 29741413 29835447 29428603
4370B9428603k72918k31905q50000N23552q11425l39721j36009L0090l89935l23089
$$ 29428603 29155685 28923780 28073780 28597332 27785907 27446186 27310177 27340267 26950332 26627243
4360B6627243J39273n32186l75468j35841m24966M4756N301k82213j76144n22400
$$ 26627243 26766516 26234330 25858862 25723021 25298055 25342811 25348112 25065899 24889755 24367355
4350B4367355q4333M0764J1570q3352o19677m5652k67406K7134j51229l81581
$$ 24367355 24283022 24323786 24335356 24252004 23632327 23586675 23319269 23346403 23195174 22813593
4340B2813593L0227j48027m63163o36045M51922l33787P3959R3638o51966L0838
$$ 22813593 22843820 22695793 22232630 21596585 22048507 21714720 21788679 21882317 21230351 21261189
4330B1261189K55045l29674k32211j65156K33529r85490O44863m72774r0641k93185
$$ 21261189 21516234 21186560 20954349 20789193 21022722 20037232 20682095 20209321 20118680 19825495
4320A9825495k029k33333j39185k50586j73400o539j46885K18328m60279M37875
$$ 19825495 19823466 19590133 19450948 19200362 19026962 19020423 18873538 19091866 18631587 19069462
4310A9069462l81614M9159m04796Q8729m23098j84986J37183K3909j2011k30997
$$ 19069462 18687848 18737007 18332211 18420940 17997842 17812856 17950039 17973948 17961937 17730940
4300A7730940j91483M76456m48282p9171j1702j99696m39231k24886j6270k5904
$$ 17730940 17539457 18015913 17567631 17488460 17476758 17277062 16837831 16612945 16596675 16570771
4290A6570771j73540K55471n8729K5280k75867j53126j14973j62280l9121J92368
$$ 16570771 16397231 16652702 16593973 16619253 16343386 16190260 16075287 15913007 15873886 16066254
4280A6066254m97588k37679N2632J55661j3130l02047J75618m84959J74403q0629
$$ 16066254 15568666 15330987 15383619 15539280 15526150 15224103 15399721 14914762 15089165 15008536
4270A5008536j77374N0988j71141p1078N9720k56689K22257k41579m20484J06690
$$ 15008536 14831162 14882150 14711009 14639931 14699651 14442962 14665219 14423640 14003156 14109846
4260A4109846p5147P6157j39911j79177J99736k67247q8217M0095n337m40686
$$ 14109846 14034699 14110856 13970945 13791768 13991504 13724257 13636040 13676135 13670798 13230112
4250A3230112n6550O6781m99707N75538k99500k72811N53301n95961J3963l29558
$$ 13230112 13173562 13240343 12740636 13316174 13016674 12743863 13297164 12701203 12715166 12385608
4240A2385608N32676q18688J34615J2140N55675o96717j86461J40621j87568j37080
$$ 12385608 12918284 12099596 12234211 12246351 12802026 12105309 11918848 12059469 11871901 11734821
4230A1734821K22472O1507m584m55549L66759j17904m13522Q0978j11618M07530
$$ 11734821 11957293 12018800 12014216 11558667 11925426 11807522 11394000 11474978 11363360 11770890
4220A1770890m72163q2344J11321j38714k26483L45711l26567m44644K44076R0350
$$ 11770890 11298727 11216383 11327704 11188990 10962507 11308218 10981651 10537007 10781083 10871433
4210A0871433k61248k59605L87336l09383J32256n4975l84018k17967N9480l10882
$$ 10871433 10610185 10350580 10737916 10428533 10560789 10505814 10121796 9903829 9963309 9652427
4200I652427K31574J54311j72009l02496k05809J31068n31813J07069J00650P7823
$$ 9652427 9884001 10038312 9866303 9563807 9357998 9489066 8957253 9064322 9164972 9242795
4190I242795L27566q44237J65964L7977J52671l24200k71987L19142j329k41201
$$ 9242795 9570361 8726124 8892088 8930065 9082736 8758536 8486549 8805691 8804362 8563161
4180H563161p463l51820L2777J07226j0367m69101M2459P0197K23102o19397L40184
$$ 8563161 8555698 8203878 8236655 8343881 8333514 7864413 7906872 7977069 8200171 7580774 7920958
4169G920958l58172J29517j0405j23483K01805l71460l24757O16174J13352m02994
$$ 7920958 7562786 7692303 7681898 7558415 7760220 7388760 7064003 7680177 7793529 7390535
4159G390535K92944k49265l62954L40813j47557O5927l25939k48225M90821l11639
$$ 7390535 7683479 7434214 7071260 7412073 7264516 7330443 7004504 6756279 7247100 6935461
4149F935461M3025j10534L3869P1978k54642j05923N6966L1383j56972R573j4449
$$ 6935461 6978486 6867952 6901821 6973799 6719157 6613234 6670200 6701583 6544611 6554184 6539735
4138F539735j89048K31986n29130J13262M54188j32453j99921K86284l29628j55769
$$ 6539735 6350687 6582673 6053543 6166805 6620993 6488540 6288619 6574903 6245275 6089506
4128F089506K96K30815j31551o4546R3880p3084j00677j27278L0702k26735M8536
$$ 6089506 6089802 6320617 6189066 6124520 6218400 6145316 6044639 5917361 5948063 5721328 5769864
4117E769864j21795K88882m86172r198K65319l69426M35936j78032J73811j23649
$$ 5769864 5648069 5936951 5450779 5441581 5706900 5337474 5773410 5595378 5769189 5645540
4107E645540L77475l9964l28443k27101K36775q7511l0019j57858J52433j16840
$$ 5645540 6023015 5983051 5654608 5427507 5664282 5576771 5546752 5388894 5541327 5424487
4097E424487l4217j17331q8128q9143J88457k7341R1934j90577J18389o1403K2719
$$ 5424487 5390270 5272939 5184811 5095668 5284125 5256784 5348718 5158141 5276530 5215127 5237846
4086E237846m02760P64096m33777Q5673K04889j76941r1507K54480r8590m61324
$$ 5237846 4835086 5599182 5165405 5251078 5455967 5279026 5187519 5441999 5343409 4882085
4076D882085M3373J93707l0455L81529m2816j14091k10165J21447j201k50624
$$ 4882085 4925458 5119165 5088710 5470239 5427423 5313332 5103167 5224614 5223413 4972789
4066D972789o2864M11083k41836l66207L49458J442j44648J24618J15025j13016
$$ 4972789 4909925 5321008 5079172 4712965 5062423 5063865 4919217 5043835 5158860 5045844
4056E045844J63002L7518n08362M05283J70723k24675j54508P7858k24514J59057
$$ 5045844 5208846 5246364 4738002 5143285 5314008 5089333 4934825 5012683 4788169 4947226
4046D947226r068r6110n8337J64471J6499K97905k50440k91110K77338r4007L8515
$$ 4947226 4938158 4842048 4783711 4948182 4964681 5262586 5012146 4721036 4998374 4904367 4942882
4035D942882k24770O6488m3007m92959N00698j7723J44830k84036J67989l81394
$$ 4942882 4718112 4784600 4741593 4248634 4749332 4731609 4876439 4592403 4760392 4378998
4025D378998M91920k74048k29793l1320K86893K48972n65404m0055l56066J66113
$$ 4378998 4870918 4596870 4367077 4335757 4622650 4871622 4306218 4266163 3910097 4076210
4015D076210L11375n12734J11189R9693j1393M40531k37126L07604n1575l59231
$$ 4076210 4387585 3874851 3986040 4085733 4074340 4514871 4277745 4585349 4533774 4174543
4005D174543k3766k53083J21169n4555J02979k73074K48137k04984p279K27125
$$ 4174543 4150777 3897694 4018863 3964308 4067287 3794213 4042350 3837366 3830087 4057212
3995D057212k06522j04690N07953o26038j75655L61752o62198L58342P19582n68517
$$ 4057212 3850690 3746000 4253953 3627915 3452260 3814012 3151814 3510156 4229738 3661221
3985C661221O54764r34845M23740l55826K69844l13562K85856j26692J8980j92821
$$ 3661221 4315985 3381140 3804880 3449054 3718898 3405336 3691192 3564500 3583480 3390659
3975C390659M3354J79000k11054k10426K64994J48359m76397N57043n78787J04672
$$ 3390659 3434013 3613013 3401959 3191533 3456527 3604886 3128489 3685532 3106745 3211417
3965C211417J04134L43775m89531L86255l94990M38916l79111o6382K8446L6517
$$ 3211417 3315551 3659326 3169795 3556050 3161060 3599976 3220865 3154483 3182929 3219446
3955C219446k073L86201l39001j34865j21809q6856J32018r92L6415k03658J22696
$$ 3219446 3217373 3603574 3264573 3129708 3007899 2921043 3053061 3052069 3088484 2884826 3007522
3944C007522m79458N15357p4981M9601J50311k73987M03258n77500j24667N02918
$$ 3007522 2528064 3043421 2968440 3018041 3168352 2894365 3297623 2720123 2595456 3098374
3934C098374l25190J34762l04777l0744K3474p4330J76663k94579R9514K70669
$$ 3098374 2773184 2907946 2603169 2572425 2595899 2521569 2698232 2403653 2503167 2773836
3924B773836l35657K33547j48768l72406O42522l91079n66466O33953j5340Q801
$$ 2773836 2438179 2671726 2522958 2150552 2793074 2401995 1835529 2469482 2454142 2462943
3914B462943l44183N53680p63840L01444M46182l98183K31006m2783n67204Q08794
$$ 2462943 2118760 2672440 1908600 2210044 2656226 2258043 2489049 2446266 1879062 2687856
3904B687856l08056j57775o214L34760n87753L0901j77572L39523R6343m16020
$$ 2687856 2379800 2222025 2215811 2550571 1962818 1993719 1816147 2155670 2252013 1835993
3894A835993K91003j67762K78262l74962k38020j3058O07402j54201j62525J8260
$$ 1835993 2126996 1959234 2237496 1862534 1624514 1611456 2218858 2064657 1902132 1920392
3884A920392o5311J40747L5083k57325r7746M16699m79310M2780J01761M0079
$$ 1920392 1855081 1995828 2030911 1773586 1675840 2092539 1613229 1656009 1757770 1797849
3874A797849J02872l85475M52547q5799J10816l47659J36172l00074J96923L40295
$$ 1797849 1900721 1515246 1967793 1881994 1992810 1645151 1781323 1481249 1678172 2018467
3864B018467k54741k87756K86665J25687N8102o10436M9904M52865l4131k89217
$$ 2018467 1763726 1475970 1762635 1888322 1946424 1335988 1385892 1838757 1804626 1515409
3854A515409L10425o16043M96495k81792J67186r4701P5821N4054j39899j01868
$$ 1515409 1825834 1209791 1706286 1424494 1591680 1496979 1572800 1626854 1486955 1385087
3844A385087p9576L00089j71687J1466J13417m33007K25541o4632j85133J93848
$$ 1385087 1305511 1605600 1433913 1445379 1558796 1125789 1351330 1286698 1101565 1295413
3834A295413K48708k14028J70449p5979k31392l32090N28177j35922L31323k64039
$$ 1295413 1544121 1330093 1500542 1424563 1193171 861081 1389258 1253336 1584659 1320620
3824A320620J70357r623j86339j47451J68998J59847k23291R7726n3026K57724
$$ 1320620 1490977 1481354 1295015 1147564 1316562 1476409 1253118 1350844 1297818 1555542
3814A555542m17342K14991R7867n05626R1649o1962K51427j1616k12625J45277
$$ 1555542 1138200 1353191 1451058 945432 1037081 975119 1226546 1214930 1002305 1147582
3804A147582j5357O2692n9711K62447l06625j06028Q6818j53090K29733k60603
$$ 1147582 1132225 1194917 1135206 1397653 1091028 985000 1071818 918728 1148461 887858
3794H87858M54667l7525n25333k0215J47282R013k5113k96751L21059q2799K5506
$$ 887858 1342525 1305000 779667 759452 906734 915747 890634 593883 914942 832143 857649
3783H57649J11872N72438m58090j54366J17759J56751o13264K91684n1348j10280
$$ 857649 969521 1541959 1083869 929503 1047262 1204013 590749 882433 831085 720805
3773G20805N38343l19737K61927o0144n90332M90515k78695K57344n61746N26521
$$ 720805 1259148 939411 1201338 1141194 550862 1041377 762682 1020026 458280 984801
3763I84801q4481L36783l3942k01932m04069M9564M24464j92611j17474K85441
$$ 984801 900320 1237103 1203161 1001229 597160 646724 1071188 878577 761103 1046544
3753A046544o14236k1914J95951Q3213q4223o9152L19314L24333n10672L12167
$$ 1046544 432308 410394 606345 689558 605335 536183 855497 1179830 669158 981325
3743I81325r0813l34750N1775k49895L89016k67553J265K75918P14304n17764
$$ 981325 890512 555762 607537 357642 746658 479105 480370 756288 1470592 952828
3733I52828j20590O3320J36186l33739j9053J62032k90176J40177J20717j50963
$$ 952828 832238 895558 1031744 698005 678952 840984 550808 690985 811702 660739
3723F60739R4294j33773m86851M91642j28464M2715r985k3133K25658j5755k51020
$$ 660739 755033 621260 134409 626051 497587 540302 530317 507184 732842 717087 466067
3712D66067R5763L74399m00618K43554k04372N8813j07644l9942N42298O727l83489
$$ 466067 561830 936229 535611 779165 574793 633606 525962 486020 1028318 1035045 651556
3701F51556j24101J19513J91307l82280K17657M64632m41283k23119m4054L82485
$$ 651556 527455 646968 838275 455995 673652 1138284 697001 473882 429828 812313
3691H12313j29950r5522p9594l610N7263l48j63514L01212j72136k29817J16929
$$ 812313 682363 586841 507247 503637 560900 560552 397038 698250 526114 296297 413226
3680D13226J22398J63208k58843K60122l65932p0697L96210l27948K42124J91614
$$ 413226 535624 698832 439989 700111 334179 263482 659692 331744 573868 765482
3670G65482j78912K21042l93949N02782p56001K15204J28786k52321j22820K3678
$$ 765482 586570 807612 413663 916445 160444 375648 504434 252113 129293 152971
3660A52971j43334J28994m3984K30058j09895L72508Q9228r3401J27902k01597
$$ 152971 9637 138631 94647 324705 214810 587318 676546 583145 711047 509450
3650E09450k03861K32136p0147m0231K88447j57256j44518j72437N4307N4520
$$ 509450 305589 537725 467578 427347 715794 558538 414020 241583 295890 350410
3640C50410k2989N24189p257n02064K62126l70941L33519k21476Q1577J59074
$$ 350410 327421 851610 844353 342289 604415 233474 566993 345517 427094 586168
3630E86168k32114J70876l10817M02524k33821j3839n3646K12055k55002J20153
$$ 586168 354054 524930 214113 616637 382816 368977 315331 527386 272384 392537
3620C92537m75927M85529j17721J7712p2568j36565O3331J85813k0135k57308
$$ 392537 -83390 402139 284418 302130 229562 92997 156328 342141 322006 64698
3610F4698k9919j1968P9956N99240m66424K64575k0467k31422J32128J709k14393
$$ 64698 34779 22811 102767 702007 235583 500158 479691 248269 380397 382106 167713
3599A67713N95800m37297l5315q228k20388K42384j78074K21186k73596L00965
$$ 167713 763513 326216 290901 282673 62285 304669 126595 347781 74185 375150
3589C75150j37011j48665L80227J9035j03103k70802M4906k04841K75566m47183
$$ 375150 238139 89474 469701 488736 385633 114831 159737 -45104 230462 -216721
3579b16721L98768J61353p1174R5885Q8583j83367L21120o18538L6729J65206
$$ -216721 182047 343400 272226 368111 456694 273327 594447 -24091 12638 177844
3569A77844K7847J00846o23044N66453j92314K22641J44438J18485j96583J14371
$$ 177844 205691 306537 -316507 249946 57632 280273 424711 543196 346613 460984
3559D60984l76091M7987j77270M48384k59085N16176n28889j5708K31241j67731
$$ 460984 84893 132880 -44390 403994 144909 661085 132196 116488 347729 179998
3549A79998J02241J33364k27566k9584O9184k96776J66787K43103k13970k5243
$$ 179998 282239 415603 188037 158453 227637 -69139 97648 340751 126781 101538
3539A01538L29784m00407J90766j71345J98673l6470k63532k8593K51986m87646
$$ 101538 431322 30915 221681 50336 249009 212539 -50993 -79586 172400 -315246
3529c15246M29100L90166n7922l40191K43079k25931J94649j5412l67932M79647
$$ -315246 113854 504020 446098 105907 348986 123055 317704 302292 -65640 414007
3519D14007q8204m45606N26876q3886r2750j45063K10708m28327J56961Q6482
$$ 414007 325803 -119803 407073 323187 230437 85374 296082 -132245 24716 111198
3509A11198j93125N27448q07365M14443L72006j65149J18275l58695o5667J3487
$$ 111198 -81927 445521 -361844 52599 424605 259456 377731 19036 -46631 -33144
3499c3144L95900k41347L92608m88648m0079L72018l52518M4547N01625k33531
$$ -33144 362756 121409 514017 25369 -14710 357308 4790 49337 550962 317431
3489C17431J6717k67358L73076j61939J46138n59148O43743j87423j22439J33268
$$ 317431 334148 66790 439866 277927 424065 -135083 508660 321237 198798 332066
3479C32066l69518K32171n77970M38758M49985k66039k10562L6768r8086K69289
$$ 332066 -37452 194719 -383251 55507 505492 239453 28891 65659 -32427 236862
3469B36862J18701k70760p4801J15421L2568j52467O82163k29078k93073p0033
$$ 236862 355563 84803 10002 125423 157991 5524 687687 458609 165536 95503
3459I5503K69995j11922q5097k14690K78643M28216m61254P4657l36473M69513
$$ 95503 365498 253576 168479 -46211 232432 660648 199394 274051 -62422 407091
3449D07091q9911l32956K35951j7370J66679l09041K64633j65565J38932k07299
$$ 407091 317180 -15776 220175 202805 369484 60443 325076 159511 298443 91144
3439I1144K53087O2219n9372j98623Q4576k33215L28802k45660K36574l13646
$$ 91144 344231 406450 347078 148455 233031 -184 328618 82958 319532 5886
3429E886O3493K16478k41048J78788J13651k2283j0227m33827O18811m20360L26406
$$ 5886 69379 285857 44809 223597 337248 314965 304738 -129089 489722 69362 395768
3418C95768K14088m00324m2176M56594n34398O81060j34403L3796k96109N5118
$$ 395768 609856 209532 167356 623950 89552 770612 636209 670005 373896 429014
3408D29014k40186K99185k680k45330J16278J37189j22736J07195Q2252m9179
$$ 429014 188828 488013 485333 240003 356281 493470 370734 477929 560181 511002
3398E11002p12668O13269K61199k37416L86302j99680j67867J65278l24553O02624
$$ 511002 -201666 411603 672802 435386 821688 622008 454141 619419 294866 897490
3388H97490k95135O6691l6605J75395P9366l6490J19496M5024l34767R7350L07151
$$ 897490 602355 669046 632441 807836 887202 850712 970208 1015232 680465 777815 1084966
3377A084966J05471J4674r2438n4956J29492j02123K04908k34269l3719j01208
$$ 1084966 1190437 1205111 1112673 1057717 1187209 1085086 1289994 1055725 1022006 920798
3367I20798O05396k17773M9745K32780k2559r594L71130m65186L40963L6869k71562
$$ 920798 1526194 1308421 1358166 1590946 1568387 1558793 1929923 1464737 1805700 1842569 1571007
3356A571007L93036k70060K44254K73731o0951M0679k45822O78130m85488M54610
$$ 1571007 1964043 1693983 1938237 2211968 2151017 2191696 1945874 2624004 2138516 2593126
3346B593126o4390L0948K28456k72065M78443k68676O63184l50156K9998J46325
$$ 2593126 2528736 2559684 2788140 2516075 2994518 2725842 3389026 3038870 3068868 3215193
3336C215193J69978L79886J27565j26016L09791k4434M55593p1563K57869K74270
$$ 3215193 3385171 3765057 3892622 3766606 4076397 4051963 4507556 4435993 4693862 4968132
3326D968132j94345L01936K40583m58665O47140J52456O7679J57487L70260Q1336
$$ 4968132 4773787 5075723 5316306 4857641 5504781 5657237 5724916 5882403 6252663 6333999
3316F333999j5570M14852L54692n47438K84193M9032J11509P4973j1021J33781
$$ 6333999 6318429 6733281 7087973 6540535 6824728 6873760 6985269 7060242 7049221 7183002
3306G183002L47960l06301P704K83165J58923m07606R7265n20633L64308q5556
$$ 7183002 7530962 7224661 7232365 7515530 7674453 7266847 7364112 6843479 7207787 7122231
3296G122231Q962j13359n04295J21027r1386j22179j32579j57402j76367k48653
$$ 7122231 7131193 7017834 6513539 6634566 6543180 6421001 6288422 6131020 5954653 5706000
3286E706000l57288m617J33426n02591M63520o14836K3456j97402K85477o02901
$$ 5706000 5348712 5344095 5477521 4974930 5438450 4823614 4847070 4649668 4935145 4332244
3276D332244k90345K7001k02183K08189m50987r2662k7661k85315k42563Q509
$$ 4332244 4041899 4068900 3866717 4074906 3623919 3531257 3503596 3218281 2975718 2984227
3266B984227K98365m00965n29680K61536N8485k56589m43715P43517o02766K03107
$$ 2984227 3282592 2881627 2351947 2613483 2671968 2415379 1971664 2715181 2112415 2315522
3256B315522j13365n25335l2778N39439l97505o9863J07725j77011j40544L35015
$$ 2315522 2202157 1676822 1644044 2183483 1785978 1716115 1823840 1646829 1506285 1841300
3246A841300m52928J24908k39481K06825k81126k02876K44194q546j61210Q385
$$ 1841300 1388372 1513280 1273799 1480624 1199498 996622 1240816 1232270 1071060 1079445
3236A079445L25147p99814L31027k1793l8272J82546k17609K09825j08284m10637
$$ 1079445 1404592 604778 935805 914012 875740 1058286 840677 1050502 942218 531581
3226E31581J08668J08904k73815K71748j43268K4130n1617K8684l03537L03642
$$ 531581 640249 749153 475338 747086 603818 627948 576331 605015 301478 605120
3216F05120J87095j64903K31263m47659M64457k77619j90051k51511L14993n9723
$$ 605120 792215 627312 858575 410916 875373 597754 407703 156192 471185 411462
3206D11462k69189M35863k65684q0569p8471o3174K52975j64748m4399J24156
$$ 411462 142273 578136 312452 231883 153412 90238 343213 178465 134066 258222
3196B58222m65364M50305m62750K54537J86894J58449l07980j15595K43196O457
$$ 258222 -207142 243163 -219587 34950 221844 380293 72313 -43282 199914 206371
3186B06371k39528L46943l20935L92626p40668J22173K46704K46974o10220N25042
$$ 206371 -33157 313786 -7149 385477 -355191 -233018 13686 260660 -349560 175482
3176A75482o72396K32940L83135m22689L21896l30416M2283N50757n36533L35051
$$ 175482 -496914 -263974 119161 -303528 18368 -312048 -269765 280992 -255541 79510
3166G9510q7168K73409k37994j74844k20384J31664l73383M85379j2043L21742
$$ 79510 -7658 265751 27757 -147087 -367471 -235807 -609190 -123811 -135854 185888
3156A85888l16063O2515l14052K13415J87901r6247j0319o33616N13142J92497
$$ 185888 -130175 -67660 -381712 -168297 19604 -76643 -86962 -720578 -207436 -14939
3146a4939m81312J28107P7167J49673k14234M45489k38435n3841L37646m34956
$$ -14939 -496251 -368144 -290977 -141304 -355538 89951 -148484 -202325 135321 -299635
3136b99635m0438R7792r8478M65674m21608J98515L442j16806k71850K48131l7267
$$ -299635 -340073 -242281 -340759 124915 -296693 -98178 -94736 -211542 -483392 -235261 -272528
3125b72528k18094j0833p0131K82405L87050o79217K33040n63914M49842K13167
$$ -272528 -490622 -501455 -571586 -289181 97869 -581348 -348308 -912222 -462380 -249213
3115b49213o35737R09879m18749J06642k47764K68612k49049L2559q176J58042
$$ -249213 -884950 24929 -393820 -287178 -534942 -266330 -515379 -482820 -490996 -332954
3105c32954K7586R6151K01300m26463L98434q3847j71398l28421J81569L10010
$$ -332954 -305368 -209217 -7917 -434380 -35946 -119793 -291191 -619612 -438043 -128033
3095a28033L6312j28398l06135M4554K10479n05044L71827l65819N09958k2850
$$ -128033 -91721 -220119 -526254 -481700 -271221 -776265 -404438 -770257 -260299 -283149
3085b83149k01732j72556L13503l2681L22592k88823K319l34378L17517j74075
$$ -283149 -484881 -657437 -343934 -376615 -54023 -342846 -340527 -674905 -357388 -531463
3075e31463l1666k02154K05901l9296j25182K62373j1953J13562L5356k3530J9187
$$ -531463 -563129 -765283 -559382 -598678 -723860 -461487 -473440 -359878 -324522 -348052 -328865
3064c28865j88217Q5543J34139j58541Q7383p0192m43940M79924o3333L3051k2904
$$ -328865 -517082 -431539 -297400 -455941 -368558 -438750 -882690 -402766 -466099 -433048 -455952
3053d55952m3659K7689k28261M70917q5241k71077j6137m5904L6976J98704L2709
$$ -455952 -499611 -471922 -700183 -229266 -314507 -585584 -601721 -647625 -610649 -411945 -379236
3042c79236l60301M78763M85837o30016J76734j77666n9522l20337K49116o9155
$$ -379236 -739537 -260774 225063 -404953 -228219 -405885 -465407 -785744 -536628 -605783
3032f05783j91892N2326L935k46794K29422K36108j821L0144k04874K59846l03329
$$ -605783 -797675 -745349 -741414 -988208 -758786 -522678 -524499 -494355 -699229 -439383 -742712
3021g42712K52293K09511M0690n75033J29057M92989m42639j65411L91321k92793
$$ -742712 -490419 -280908 -240218 -815251 -686194 -193205 -635844 -801255 -409934 -702727
3011g02727K83596l71715Q7292L93026l29378M14087l17257j16799n5209k71191
$$ -702727 -419131 -790846 -703554 -310528 -639906 -225819 -543076 -659875 -715084 -986275
3001i86275K81222N84016k07493j16633k25545J34638j93382L18155m69714P91627
$$ -986275 -705053 -121037 -328530 -445163 -670708 -536070 -729452 -411297 -881011 -89384
2991h9384m39348k9772m30128K77668q453J77522J65815n0437m49940p1536M20014
$$ -89384 -528732 -558504 -988632 -710964 -719417 -541895 -376080 -426517 -876457 -947993 -527979
2980e27979j55427J27782k46352N4236O02764n53004j32047J53411J44809l62824
$$ -527979 -683406 -555624 -801976 -747740 -144976 -697980 -830027 -676616 -531807 -894631
2970h94631J63282k8685L86185K6947l98493m0255Q3306L26269n10041J34692
$$ -894631 -731349 -760034 -373849 -346902 -745395 -785650 -702344 -376075 -886116 -751424
2960g51424N9254J01792l4841j85190J61638L9047k08764J03226j64272J28299
$$ -751424 -692170 -590378 -625219 -810409 -648771 -609724 -818488 -715262 -879534 -751235
2950g51235L40309p0815l1413n50484N97736m3546j35322K33566k58553j57475
$$ -751235 -410926 -481741 -513154 -1063638 -465902 -509448 -644770 -411204 -669757 -827232
2940h27232L03932q5778K5696n00356K60668l8224K68490l57906J10941q7165
$$ -827232 -523300 -609078 -583382 -1083738 -823070 -861294 -592804 -950710 -839769 -926934
2930i26934L94342k94266K9254J36273L758k22499L81614j00013O5424j21580
$$ -926934 -532592 -826858 -797604 -661331 -657573 -880072 -498458 -598471 -533047 -654627
2920f54627n51745L97887J24044J51070k86377n885K75370R8319k12491l28945
$$ -654627 -1206372 -808485 -684441 -533371 -819748 -825633 -550263 -451944 -664435 -993380
2910i93380N64010m21793l66927M91571J71682P4486l54102K79708O8272r9621
$$ -993380 -429370 -851163 -1218090 -726519 -554837 -480351 -834453 -554745 -486473 -586094
2900e86094k26284o785L20376l77663O71544n92974j10741K91107P8470j02156
$$ -586094 -812378 -819163 -498787 -876450 -204906 -797880 -908621 -617514 -539044 -641200
2890f41200j88469N8453K28336l8600l52158M34988k02932k09283M44675j96351
$$ -641200 -829669 -771216 -542880 -581480 -933638 -498650 -701582 -910865 -466190 -662541
2880f62541J88101P1814l65366M6586K2616K59824o89287M79076j89433K75805
$$ -662541 -474440 -402626 -767992 -721406 -698790 -438966 -1128253 -649177 -838610 -562805
2870e62805n25096M07076L53576k40804k62440M90130m86806o9719J3970m8735
$$ -562805 -1087901 -680825 -327249 -568053 -830493 -340363 -827169 -896888 -882918 -931653
2860i31653M30354N1778j73543q2268l4267m04003K87577N10384l37583K63499
$$ -931653 -501299 -449521 -623064 -705332 -739599 -1143602 -856025 -345641 -683224 -419725
2850d19725m39293r6511M4437K61178J44187l02431N52872n49031L37636m7159
$$ -419725 -859018 -955529 -911092 -649914 -505727 -808158 -255286 -804317 -466681 -513840
2840e13840m57606M48275k25499k43874K45183m6285j1105k73752L72369k64219
$$ -513840 -971446 -523171 -748670 -992544 -747361 -793646 -804751 -1078503 -706134 -970353
2830i70353p2770M03871k54544J20089j36355K4365M14235l42773p0527O6369
$$ -970353 -1043123 -639252 -893796 -773707 -910062 -885697 -471462 -814235 -884762 -818393
2820h18393k87969M84096N5802q8255j49552O7204k21160K36632q4704J2492j11892
$$ -818393 -1106362 -622266 -566464 -654719 -804271 -737067 -958227 -721595 -806299 -793807 -905699
2809i05699k88933L14844j23992J3096O35626n47044L7339K40253K24551m55236
$$ -905699 -1194632 -879788 -1003780 -990684 -355058 -902102 -864763 -624510 -399959 -855195
2799h55195L7291k0041l7931j37672J01724L50912l13958K19561P4928k79420
$$ -855195 -817904 -837945 -875876 -1013548 -911824 -560912 -874870 -655309 -580381 -859801
2789h59801j58172L73148k23270N80088o71273L5321K33645n9664m8186k30536
$$ -859801 -1017973 -644825 -868095 -288007 -959280 -923959 -690314 -749978 -798164 -1028700
2779a028700K56329l7976J34607l31971J2734J29740k43016J38405K99651m7322
$$ -1028700 -772371 -810347 -675740 -1007711 -994977 -865237 -1108253 -969848 -670197 -717519
2769g17519k87880M07616k94685j03223M83462m28271K9742q843K24235P3074
$$ -717519 -1005399 -597783 -892468 -995691 -512229 -940500 -910758 -919601 -695366 -622292
2759f22292q3951J06102n5313l57057n430K23519J46455l08087N3776J37869J36035
$$ -622292 -706243 -600141 -655454 -1012511 -1017941 -794422 -647967 -956054 -902278 -764409 -628374
2748f28374l60074N7227J54625R6122m74985M72903k99791N1011N49410l10589
$$ -628374 -988448 -931221 -776596 -680474 -1155459 -682556 -982347 -931336 -381926 -692515
2738f92515m20854J13812R6468k51416O8089J85664L9416M1394J18898k79942
$$ -692515 -1113369 -999557 -903089 -1154505 -1086416 -900752 -861336 -819942 -701044 -980986
2728i80986O48987m97812j69824J34294J36730k25139o792L36872j32151k95679
$$ -980986 -331999 -829811 -999635 -865341 -728611 -953750 -960542 -623670 -755821 -1051500
2718a051500N9435J65281j1554K50495r7688l53063N9616Q2110k21245M55286
$$ -1051500 -992065 -826784 -838338 -587843 -685531 -1038594 -978978 -896868 -1118113 -662827
2708f62827l37737l40940K83631N05348j14007j72883J57018k95898J4358q8561
$$ -662827 -1000564 -1341504 -1057873 -552525 -666532 -839415 -682397 -978295 -963937 -1052498
2698a052498m1626K11774m8189K33515j25760j50356k90216L94369j78724J00595
$$ -1052498 -1094124 -882350 -930539 -697024 -822784 -973140 -1263356 -868987 -1047711 -947116
2688i47116J59264j13585Q3724n9322M27729l44054J13879l18820J69896K44660
$$ -947116 -787852 -901437 -817713 -877035 -449306 -793360 -679481 -998301 -828405 -583745
2678e83745k80602J28179m65301L30340K16964M6246j80914r2027J10584k51207
$$ -583745 -864347 -736168 -1201469 -871129 -654165 -607919 -788833 -880860 -770276 -1021483
2668a021483J97935p1837m2696K43710j21785L9687K7964J58484k50469k67952
$$ -1021483 -823548 -895385 -938081 -694371 -816156 -776469 -748505 -590021 -840490 -1108442
2658a108442j4835o2918r3678K86770K56580k09527J16891j10036j60997K21640
$$ -1108442 -1123277 -1186195 -1279873 -993103 -736523 -946050 -829159 -939195 -1100192 -878552
2648h78552j73816L24659l39843n3040K82310J39372l05929P4740K25826k12863
$$ -878552 -1052368 -727709 -1067552 -1120592 -838282 -698910 -1004839 -930099 -704273 -917136
2638i17136L45673k42082J40356l97400K12565k71161K05954L289j80644L64017
$$ -917136 -571463 -813545 -673189 -1070589 -858024 -1129185 -923231 -919942 -1100586 -736569
2628g36569l48788J04592J57395r7510j75585N08498m15279N68025m35478J66681
$$ -736569 -1085357 -980765 -823370 -920880 -1096465 -587967 -1003246 -435221 -870699 -704018
2618g04018m0263l13452K16805j98623K15708k47147P0464j41592K59760J2949
$$ -704018 -744281 -1057733 -840928 -1039551 -823843 -1070990 -1000526 -1142118 -882358 -869409
2608h69409j28208L21090j16528j8298L23180q34617L22398j10549J89766J36895
$$ -869409 -997617 -676527 -793055 -811353 -488173 -1322790 -1000392 -1110941 -921175 -784280
2598g84280l46550K91415K4031J51282j65334P2667l05839K778J09119k30476
$$ -784280 -1130830 -839415 -815384 -664102 -829436 -756769 -1062608 -1059830 -950711 -1181187
2588a181187M15316r9614j98684L10969j88410L45759m36850p2249L66128m33696
$$ -1181187 -765871 -865485 -1064169 -753200 -941610 -595851 -1032701 -1104950 -738822 -1172518
2578a172518M03427K7439j92880L62888j77376q3384m67405K06018k6772J27136
$$ -1172518 -769091 -741652 -934532 -571644 -749020 -832404 -1299809 -1093791 -1120563 -993427
2568i93427J30318k81858J83476K70720l97708K741n0859M96038J33736j97869
$$ -993427 -863109 -1144967 -961491 -690771 -1088479 -1085738 -1136597 -640559 -506823 -704692
2558g04692p9575k07836Q5333k50631L84043l42186L82782o44752J006592n65396
$$ -704692 -784267 -992103 -906770 -1157401 -773358 -1115544 -732762 -1377514 -370922 -936318
2548i36318j44926L99440k60433M1286J57324J29438m46018P2331L66171j54611
$$ -936318 -1081244 -681804 -942237 -900951 -743627 -614189 -1060207 -987876 -621705 -776316
2538g76316k02872p5390J64481j8221K97055n00051K47016l29680N05530J94000
$$ -776316 -979188 -1054578 -890097 -908318 -611263 -1111314 -864298 -1193978 -688448 -494448
2528d94448k87252k04277J75671l77488M27457L08630l83163J70749k93862J10268
$$ -494448 -781700 -985977 -810306 -1187794 -760337 -451707 -834870 -664121 -957983 -847715
2518h47715k82000J00457r7564J00978J78970Q1363l80087L60505l19946M60814
$$ -847715 -1129715 -1029258 -1126822 -1025844 -846874 -765511 -1145598 -785093 -1105039 -644225
2508f44225l61481R5355m50036K22687k9388K73139K6269k01413N266L22237q0397
$$ -644225 -1005706 -910351 -1360387 -1137700 -1167088 -893949 -867680 -1069093 -1063827 -741590 -821987
2497h21987m98638J99393R5908q2598p4979N23892o52738L92913k45771K76925
$$ -821987 -1320625 -1121232 -1025324 -1107922 -1182901 -659009 -1311747 -918834 -1164605 -887680
2487h87680n0248J54225k11422p2695J27674J18557l98549J60227J8109M9133
$$ -887680 -937928 -783703 -995125 -1067820 -940146 -821589 -1220138 -1059911 -1041802 -992669
2477i92669j73466K12151j02343l919J3853m3358J72895J35748l84102N8718L59146
$$ -992669 -1166135 -953984 -1056327 -1060246 -1046393 -1089751 -916856 -781108 -1165210 -1106492 -747346
2466g47346l50237L64756K34943k13767m65830K1930M11687m57754M82082l65664
$$ -747346 -1097583 -732827 -497884 -711651 -1177481 -1155551 -743864 -1201618 -719536 -1085200
2456a085200J33131P2469J82323n99935N29095l73418Q8533M75102n0641l28423
$$ -1085200 -952069 -879600 -697277 -1297212 -768117 -1141535 -1053002 -577900 -628541 -956964
2446i56964o1970j68885K48622O9490j91377M01745n27702O0675J61167j30072
$$ -956964 -1018934 -1187819 -939197 -869707 -1061084 -659339 -1187041 -1126366 -965199 -1095271
2436a095271J44882J41299K331l2165k52158K26391R70N4759l38427P0413q1595
$$ -1095271 -950389 -809090 -806759 -838924 -1091082 -864691 -863721 -808962 -1147389 -1076976 -1158571
2425a158571j22733J32504K87581m82009L11623J11248Q928K40463k55549j14862
$$ -1158571 -1281304 -1148800 -861219 -1343228 -1031605 -920357 -911429 -670966 -926515 -1041377
2415a041377l6089J62106k8799J28200j74413M6183j20138J9754K03017l02615
$$ -1041377 -1077466 -915360 -944159 -815959 -990372 -944189 -1064327 -1044573 -841556 -1144171
2405a144171m1657L59956K5012l96480M60070j93646j5755m82L7260j09941l060
$$ -1144171 -1185828 -825872 -800860 -1197340 -737270 -930916 -946671 -947153 -909893 -1019834 -1022894
2394a022894p9486k9715K17294j61690J76768J59649j43006k30928M39384k41328
$$ -1022894 -1102380 -1132095 -914801 -1076491 -899723 -740074 -883080 -1114008 -674624 -915952
2384i15952l16510N1138J20372L68467j98206P5377n76799O36617l18113O7936
$$ -915952 -1232462 -1181324 -1060952 -692485 -890691 -815314 -1392113 -755496 -1073609 -1005673
2374a005673j59571n2868O5101L06425n62024N90476m75621M57453L5047O1204
$$ -1005673 -1165244 -1218112 -1153011 -846586 -1408610 -818134 -1293755 -836302 -801255 -740051
2364g40051m18051K42400R9784j56244j02561P427J10683M38954j65815k95424
$$ -740051 -1158102 -915702 -815918 -972162 -1074723 -1067296 -956613 -517659 -683474 -978898
2354i78898R1277k35301N09176m68741L72203l87249P29K96342k63104K11085
$$ -978898 -887621 -1122922 -613746 -1082487 -710284 -1097533 -1096804 -800462 -1063566 -852481
2344h52481J45895k75297J36048J76115m84721J53446M42816m29255J29935l03371
$$ -852481 -706586 -981883 -845835 -669720 -1154441 -1000995 -558179 -987434 -857499 -1160870
2334a160870K85604m0018k08922J74426j19136K78733m36163o7507P6986j26585
$$ -1160870 -875266 -915284 -1124206 -949780 -1068916 -790183 -1226346 -1293853 -1216867 -1343452
2324a343452J63917M41114k95666L13773j41346l14234K52650j409O7115r4203
$$ -1343452 -1179535 -738421 -1034087 -720314 -861660 -1175894 -923244 -924653 -857538 -951741
2314i51741l7355l142N1926J02728j10175J27012l36077J71476k42581J27835
$$ -951741 -989096 -992238 -940312 -837584 -947759 -820747 -1156824 -985348 -1227929 -1100094
2304a100094N12321q0160m56611J8427K79179m7345j49186l2600o17J73958l22604
$$ -1100094 -587773 -667933 -1124544 -1106117 -826938 -874283 -1023469 -1056069 -1056686 -882728 -1205332
2293a205332L69011J30247j61134J42251J9829j86747j61032k56651M45453J5086
$$ -1205332 -836321 -706074 -867208 -724957 -705128 -891875 -1052907 -1309558 -864105 -849019
2283h49019j35604k80799K39106J65758n47697M74359l03543J76313P7188k03072
$$ -849019 -984623 -1265422 -1026316 -860558 -1408255 -933896 -1237439 -1061126 -983938 -1187010
2273a187010K72488J40861l31523q9823L80124m49083M02084j59004l8640K61937
$$ -1187010 -914522 -773661 -1105184 -1195007 -814883 -1263966 -861882 -1020886 -1059526 -797589
2263g97589j05282o1596j55868K4819m5207K41368p6707j85199J51535K46477
$$ -797589 -902871 -964467 -1120335 -1095516 -1140723 -899355 -976062 -1161261 -1009726 -763249
2253g63249p32753K30070K53409j40994K44981k39779k92952M83979K04182n96282
$$ -763249 -1496002 -1265932 -1012523 -1153517 -908536 -1148315 -1441267 -957288 -753106 -1349388
2243a349388O53820m52251N7116m1269K60518l52950K21412j21285j1569m8470
$$ -1349388 -695568 -1147819 -1090703 -1131972 -871454 -1224404 -1002992 -1124277 -1135846 -1184316
2233a184316n1309K84597n9668M3236L35716m25726L13130j66892k77603M11093
$$ -1184316 -1235625 -951028 -1010696 -967460 -631744 -1057470 -744340 -911232 -1188835 -777742
2223g77742l36098O6416K94138k52244j13054o3709K19616n301p795k04003J83289
$$ -777742 -1113840 -1047424 -753286 -1005530 -1118584 -1182293 -962677 -967978 -975773 -1179776 -996487
2212i96487k79096K64122J4831l67921K86216P9583j60988J56035j23526m0518
$$ -996487 -1275583 -1011461 -996630 -1364551 -1078335 -998752 -1159740 -1003705 -1127231 -1167749
2202a167749j00033L63181o8015K15709l37521J96439O8318k42195K15280m31718
$$ -1167749 -1267782 -904601 -972616 -756907 -1094428 -897989 -829671 -1071866 -856586 -1288304
2192a288304J59406K14702k13175k91237N7330O33423m07974j3090o2718J89487
$$ -1288304 -1128898 -914196 -1127371 -1418608 -1361278 -727855 -1135829 -1148919 -1211637 -1022150
2182a022150M6907l12531J40523j83546J58328P4022J36949J12274j84050k52412
$$ -1022150 -975243 -1287774 -1147251 -1330797 -1172469 -1098447 -961498 -849224 -1033274 -1285686
2172a285686L38504j60245K84108k6428o67859O51041l31702K80485k67926j16803
$$ -1285686 -947182 -1107427 -823319 -849747 -1517606 -866565 -1198267 -917782 -1185708 -1302511
2162a302511L49857o7370J7480K50953K3489l9631r5538l78068M14283j3727n51562
$$ -1302511 -952654 -1020024 -1002544 -751591 -728102 -767733 -863271 -1241339 -827056 -840783 -1392345
2151a392345L07872j98937K92540K1422K2038k11560J68083o4431J3563J62850
$$ -1392345 -1084473 -1283410 -990870 -969448 -947410 -1158970 -990887 -1055318 -1041755 -878905
2141h78905j09770m06295L35527j85808N61391k36572J67572k95978l13867L26885
$$ -878905 -988675 -1394970 -1059443 -1245251 -683860 -920432 -752860 -1048838 -1362705 -1035820
2131a035820K7441N0734J77022m46392M12581q3166r5262r8389j68055P4200q0203
$$ -1035820 -1008379 -957645 -780623 -1227015 -814434 -897600 -992862 -1091251 -1259306 -1185106 -1265309
2120a265309K13808J5402n10474P96328m2046m4449j14982j17764p7981R9022
$$ -1265309 -1051501 -1036099 -1546573 -750245 -792291 -836740 -951722 -1069486 -1147467 -1048445
2110a048445K0560j54239j56074L24763Q6701j97807J40800m8581j35469K52803
$$ -1048445 -1027885 -1182124 -1338198 -1013435 -926734 -1124541 -983741 -1032322 -1167791 -914988
2100i14988K06403k1196j13492j63748j03232q3247M43124m8964l85233K97905
$$ -914988 -708585 -729781 -843273 -1007021 -1110253 -1193500 -750376 -799340 -1184573 -886668
2090h86668m60324K15832n916N2163J46916o14177N43252r0159O7330k35212L88240
$$ -886668 -1346992 -1131160 -1137076 -1084913 -937997 -1552174 -1008922 -1099081 -1031751 -1266963 -878723
2079h78723j68948l04225O33453m69456N2806P0365J1564k60505N13401k70752
$$ -878723 -1047671 -1351896 -718443 -1187899 -1135093 -1064728 -1053164 -1313669 -800268 -1071020
2069a071020j08699j45451N31153n58049m0395L70568k54781j14487M38984j21661
$$ -1071020 -1179719 -1325170 -794017 -1352066 -1392461 -1021893 -1276674 -1391161 -952177 -1073838
2059a073838N1892k37267M93043m44121J65584p9136Q4428Q5979k57041O44123
$$ -1073838 -1021946 -1259213 -766170 -1210291 -1044707 -1123843 -1039415 -953436 -1210477 -566354
2049e66354k63319k68161k868k03568J72332L00434j67689k4592L58020m85949
$$ -566354 -829673 -1097834 -1100702 -1304270 -1131938 -831504 -999193 -1023785 -665765 -1151714
2039a151714K36011J27255k69851k09491K33105l63123K82267r6584N23629l30740
$$ -1151714 -915703 -788448 -1058299 -1267790 -1034685 -1397808 -1115541 -1212125 -688496 -1019236
2029a019236K5382n4801k43693N11217o02595K75566m87594M51220L6440n6206
$$ -1019236 -993854 -1048655 -1292348 -781131 -1383726 -1108160 -1595754 -1144534 -1108094 -1164300
2019a164300L6526J02829j29147L16319J4436l06169l56330N52983M8239o3362
$$ -1164300 -1127774 -1024945 -1154092 -837773 -823337 -1129506 -1485836 -932853 -884614 -947976
2009i47976l60151K70741j72825K30804k47670P2245k82241K92499M1742J60870
$$ -947976 -1308127 -1037386 -1210211 -979407 -1227077 -1154832 -1437073 -1144574 -1102832 -941962
1999i41962k23291Q0689J36880q3384m4654J31453R2757k41873J0046O8934m2302
$$ -941962 -1165253 -1084564 -947684 -1031068 -1075722 -944269 -851512 -1093385 -1083339 -1014405 -1056707
1988a056707K82486j22113J63733l76386l2560Q2135O5107R3993l31062M85844
$$ -1056707 -774221 -896334 -732601 -1108987 -1141547 -1059412 -994305 -900312 -1231374 -745530
1978g45530m33443K27409k81154R3394J88994l18755M73419j10561l00453m8654
$$ -745530 -1178973 -951564 -1232718 -1139324 -950330 -1269085 -795666 -906227 -1206680 -1255334
1968a255334P77366k83190l20143j52873J70967k45131K88185j33316m50285J29492
$$ -1255334 -477968 -761158 -1081301 -1234174 -1063207 -1308338 -1020153 -1153469 -1603754 -1474262
1958a474262J78647n7464O3829K44452n65424L95628j66806K31066J8469J02875
$$ -1474262 -1295615 -1353079 -1289250 -1044798 -1610222 -1214594 -1381400 -1150334 -1131865 -1028990
1948a028990L6270r7827k3610J46965j56038J93272l98559O94840m63785K11693
$$ -1028990 -992720 -1090547 -1114157 -967192 -1123230 -929958 -1328517 -633677 -1097462 -885769
1938h85769k28398K50578l21377L9511L4179j29379j14184M08823k79362j70786
$$ -885769 -1114167 -863589 -1184966 -1145455 -1111276 -1240655 -1354839 -946016 -1225378 -1396164
1928a396164J80703K56016l53781J18889J41389j77196N17896l34192j60483l06527
$$ -1396164 -1215461 -959445 -1313226 -1194337 -1052948 -1230144 -712248 -1046440 -1206923 -1513450
1918a513450J19506P2586R0381q2233K30308l22505K3743J81167J39692J60461
$$ -1513450 -1393944 -1321358 -1230977 -1313210 -1082902 -1405407 -1381664 -1200497 -1060805 -900344
1908i00344k78191J62654J84496m70462M39260p8013l59337k10444R52237j95172
$$ -900344 -1178535 -1015881 -831385 -1301847 -862587 -940600 -1299937 -1510381 -558144 -753316
$$ [...]
##END NTUPLES=NMR SPECTRUM
##END=
