##TITLE=abcd
##JCAMPDX= 6.0         $$ Bruker NMR JCAMP-DX V2.0
##DATA TYPE= NMR SPECTRUM
##DATA CLASS= NTUPLES
##ORIGIN= UXNMR, Bruker Analytische Messtechnik GmbH
##OWNER= root
$$ XWIN-NMR		Version 3.5
$$ Sat Feb 15 09:02:29 2025 Russian Standard Time (UT+4h)  servis@DPX200
##.OBSERVE FREQUENCY= 200.131235884673
##.OBSERVE NUCLEUS= ^1H
##.ACQUISITION MODE= SIMULTANEOUS
##.ACQUISITION SCHEME= undefined
##.AVERAGES= 25
##.DIGITISER RES= 18
##SPECTROMETER/DATA SYSTEM= spect
##.PULSE SEQUENCE= zg
##.SOLVENT NAME= DMSO
##.SHIFT REFERENCE= (INTERNAL, DMSO, 0, 16.4885)
##AUDIT TRAIL= $$ (NUMBER, WHEN, WHO, WHERE, WHAT)
$$ ##TITLE= Audit trail, XWIN-NMR		Version 3.5
$$ ##JCAMPDX= 5.01
$$ ##ORIGIN= Bruker BioSpin GmbH
$$ ##OWNER= servis
$$ F:\spectra/data/av/nmr/H1/1/pdata/1/auditp.txt
$$ ##AUDIT TRAIL=  $$ (NUMBER, WHEN, WHO, WHERE, WHAT)
(   1,<2025-02-15 09:01:14.00 +0400>,<servis>,<DPX200>,
      <created by zg, POWCHK disabled, PULCHK disabled
       terminated by command 'halt'
       configuration hash MD5:
       00 E9 B6 7A A2 85 ED C7 34 08 36 98 17 FE 4E 26
       data hash MD5: 32K
       DC CF 5D F1 6B F1 B0 C8 2D B4 13 42 C3 8F 3C F1>)
(   2,<2025-02-15 09:01:44.79 +0400>,<servis>,<DPX200>,
      <Start of raw data processing
       efp BC_mod = 2 LB = 0.05 FT_mod = 6 PKNL = 1 PHC0 = -261.9254 PHC1 = 1.301534 SI = 16K 
       data hash MD5: 16K
       D1 31 DB 09 98 3E A1 4E EB DD 30 64 B4 85 85 A2>)
$$ ##END=
$$ 
$$ hash MD5
$$ 94 9A 10 6F B7 03 92 C8 33 2A 6B 1C 34 C3 97 F9
##$RELAX= 
##$RELAX= 
##$RELAX= 
##$RELAX= 
##$RELAX= 
##$RELAX= 
##$RELAX= 
##$RELAX= 
$$ Bruker specific parameters
$$ --------------------------
##$DU= <F:\spectra>
##$EXPNO= 1
##$NAME= <H1>
##$PROCNO= 1
##$TYPE= <nmr>
##$USER= <av>
##$AMP= (0..31)
100 100 100 100 100 100 100 100 100 100 100 100 100 100 100 100 100 100 
100 100 100 100 100 100 100 100 100 100 100 100 100 100 
##$AQSEQ= 0
##$AQ_mod= 1
##$AUNM= <au_zg>
##$AUTOPOS= <>
##$BF1= 200.13
##$BF2= 200.13
##$BF3= 200.13
##$BF4= 200.13
##$BF5= 500.13
##$BF6= 500.13
##$BF7= 500.13
##$BF8= 500.13
##$BYTORDA= 1
##$CFDGTYP= 0
##$CFRGTYP= 5
##$CHEMSTR= <none>
##$CNST= (0..31)
1 1 145 1 1 1 1 1 1 1 1 1 1 1 1 1 1 1 1 1 1 1 1 1 1 1 1 1 1 1 1 1 
##$CPDPRG= <>
##$CPDPRG1= <>
##$CPDPRG2= <>
##$CPDPRG3= <>
##$CPDPRG4= <mlev>
##$CPDPRG5= <mlev>
##$CPDPRG6= <mlev>
##$CPDPRG7= <mlev>
##$CPDPRG8= <mlev>
##$CPDPRGB= <>
##$CPDPRGT= <>
##$D= (0..31)
0 2 0 0 0 0 0 0 0 0.06 0 0 0 0 0 0 0.0002 0 0 0 0 0 0 0 0 0 0 0 0 0 0 
0 
##$DATE= 1739595673
##$DBL= (0..7)
120 120 120 120 120 120 120 120 
##$DBP= (0..7)
150 150 150 150 150 150 150 150 
##$DBP07= 0
##$DBPNAM0= <>
##$DBPNAM1= <>
##$DBPNAM2= <>
##$DBPNAM3= <>
##$DBPNAM4= <>
##$DBPNAM5= <>
##$DBPNAM6= <>
##$DBPNAM7= <>
##$DBPOAL= (0..7)
0.5 0.5 0.5 0.5 0.5 0.5 0.5 0.5 
##$DBPOFFS= (0..7)
0 0 0 0 0 0 0 0 
##$DE= 6
##$DECBNUC= <off>
##$DECIM= 32
##$DECNUC= <off>
##$DECSTAT= 4
##$DIGMOD= 1
##$DIGTYP= 9
##$DL= (0..7)
0 120 120 120 120 120 120 120 
##$DP= (0..7)
$$ [...]
##$SUBNAM4= <"">
##$SUBNAM5= <"">
##$SUBNAM6= <"">
##$SUBNAM7= <"">
##$SUBNAM8= <"">
##$SUBNAM9= <"">
##$SW= 20.6817932712277
##$SWIBOX= (0..15)
0 0 3 0 0 0 0 0 0 0 0 0 0 0 0 0 
##$SW_h= 4139.07284768212
##$TD= 32768
##$TD0= 1
##$TE= 0
##$TE2= 300
##$TE3= 300
##$TEG= 300
##$TL= (0..7)
0 120 120 120 120 120 120 120 
##$TP= (0..7)
150 150 150 150 150 150 150 150 
##$TP07= 0
##$TPNAME0= <>
##$TPNAME1= <>
##$TPNAME2= <>
##$TPNAME3= <>
##$TPNAME4= <>
##$TPNAME5= <>
##$TPNAME6= <>
##$TPNAME7= <>
##$TPOAL= (0..7)
0.5 0.5 0.5 0.5 0.5 0.5 0.5 0.5 
##$TPOFFS= (0..7)
0 0 0 0 0 0 0 0 
##$TUNHIN= 0
##$TUNHOUT= 0
##$TUNXOUT= 0
##$USERA1= <user>
##$USERA2= <user>
##$USERA3= <user>
##$USERA4= <user>
##$USERA5= <user>
##$V9= 5
##$VALIST= <valist>
##$VCLIST= <CCCCCCCCCCCCCCC>
##$VD= 0
##$VDLIST= <DDDDDDDDDDDDDDD>
##$VPLIST= <PPPPPPPPPPPPPPP>
##$VTLIST= <TTTTTTTTTTTTTTT>
##$WBST= 1024
##$WBSW= 30
##$XGAIN= (0..3)
0 0 0 0 
##$XL= 0
##$YL= 0
##$YMAX_a= 1192625
##$YMIN_a= -1309521
##$ZGOPTNS= <>
##$ZL1= 120
##$ZL2= 120
##$ZL3= 120
##$ZL4= 120
##$ABSF1= 0
##$ABSF2= 0
##$ABSG= 0
##$ABSL= 0
##$ALPHA= 0
##$AQORDER= 0
##$ASSFAC= 0
##$ASSFACI= 0
##$ASSFACX= 0
##$ASSWID= 0
##$AUNMP= <proc_1d>
##$AZFE= 0.1
##$AZFW= 0.1
##$BCFW= 0
##$BC_mod= 2
##$BYTORDP= 0
##$COROFFS= 0
##$CY= 18.4799938201904
##$DATMOD= 1
##$DC= 0
##$DFILT= <>
##$DTYPP= 0
##$F1P= 9.9274215381318
##$F2P= -0.165520771350173
##$FCOR= 1
##$FTSIZE= 16384
##$FT_mod= 6
##$GAMMA= 0
##$GB= 0
##$INTBC= 1
##$INTSCL= 4.127829e-11
##$ISEN= 128
##$LB= 0.05
##$LEV0= 0
##$LPBIN= 0
##$MAXI= 10000
##$MC2= 0
##$MEAN= 0
##$ME_mod= 0
##$MI= 50
##$NCOEF= 0
##$NC_proc= -5
##$NLEV= 6
##$NOISF1= 3.799351
##$NOISF2= 2.8
##$NSP= 0
##$NTH_PI= 0
##$NZP= 0
##$OFFSET= 16.48848
##$PC= 4
##$PHC0= -261.9254
##$PHC1= 1.301534
##$PH_mod= 1
##$PKNL= yes
##$PPARMOD= 0
##$PSCAL= 4
##$PSIGN= 0
##$REVERSE= no
##$SF= 200.130005582386
##$SI= 16384
##$SIGF1= 3
##$SIGF2= 2
##$SINO= 400
##$SIOLD= 16384
##$SREGLST= <1H.CDCl3>
##$SSB= 0
##$STSI= 16384
##$STSR= 0
##$SW_p= 4139.07284768211
##$SYMM= 0
##$S_DEV= 0
##$TDeff= 32768
##$TDoff= 0
##$TI= <>
##$TILT= no
##$TM1= 0
##$TM2= 0
##$TOPLEV= 0
##$USERP1= <user>
##$USERP2= <user>
##$USERP3= <user>
##$USERP4= <user>
##$USERP5= <user>
##$WDW= 1
##$XDIM= 16384
##$YMAX_p= 450452136
##$YMIN_p= -1319561
$$ End of Bruker specific parameters
$$ ---------------------------------
##NTUPLES= NMR SPECTRUM
##VAR_NAME=  FREQUENCY,     SPECTRUM/REAL,   SPECTRUM/IMAG
##SYMBOL=    X,             R,               I
##VAR_TYPE=  INDEPENDENT,   DEPENDENT,       DEPENDENT
##VAR_FORM=  AFFN,          ASDF,            ASDF
##VAR_DIM=   16384,         16384,           16384
##UNITS=     HZ,            ARBITRARY UNITS, ARBITRARY UNITS
##FACTOR=    0.252644378177508, 1,           1
##FIRST=     3299.83951724647, 0,            0
##LAST=      -839.233330435636, 0,           0
##MIN=       -839.233330435636, -1319561,    0
##MAX=       3299.83951724647, 450452136,    0
$$ Real data points
##PAGE= N=1
##DATA TABLE= (X++(R..R)), XYDATA
$$ [...]
6688F385767j15840k45667j77954j27232p2424k29017r5677j00537n2489j90215
6678D978715j75359j10509j37583o7764j11496j56040l4392r3881j46437m4202
6668C901052r9682j32572o5455j28323m3361j08209j6512j45622K8456r6544j49896
6657B943332j38029k8904M2677j38161n7228j9820n7447r9281j9588q4921o5438
6646B277192j29572L7370L9072j02391j54541P075k1732m9685p3023P8416j56846
6635A751335k6802l3911K5571n7511q3765K317J6743j71610J13093j08847K5527
6624A452140m2577m4360p7477M0993j0676m7149k2024j06001N082J05699k4641
6613A229009j29797P455J6774m0446o5121l8387o1565L0368R893l7497k03j9026
$$ plain form
6688 6385767 6269927 6024260 5846306 5719074 5646650 5417633 5321956 5221419 5168930 4978715
6678 4978715 4803356 4692847 4555264 4487500 4376004 4219964 4185572 4091691 3945254 3901052
6668 3901052 3801370 3668798 3603343 3475020 3431659 3323450 3306938 3161316 3189772 3093228 2943332
6657 2943332 2805303 2776399 2819076 2680915 2623687 2603867 2546420 2447139 2427551 2342630 2277192
6646 2277192 2147620 2184990 2224062 2121671 1967130 1974205 1952473 1902788 1829765 1908181 1751335
6635 1751335 1724533 1690622 1716193 1658682 1574917 1577234 1593977 1422367 1535460 1426613 1452140
6624 1452140 1409563 1365203 1287726 1328719 1318043 1270894 1248870 1142869 1147951 1253650 1229009
6613 1229009 1099212 1106667 1123441 1082995 1017874 979487 917922 948290 958183 920686 920483 901457
6601I01457l3483n7376J1825j1370k94j07542J43495q3515l5067o3071N6018j25467
6589E95610k4431o4023k5347J18590l9906n4898J55587j13047l1211Q123m1269
6578D83778o9404N1234l8588K5503n9104Q3985p2212l9026N4452k6910M1941r0766
6566C44883M3351n8644j10522M3431R7535j85265Q6448k4893J6604o3759Q0700
6555B69869m0628P6437n1681k5893R555j14285J47917q7679k1582N6868o0953
6544A57945o890N2025o466k7116Q8319n431p3138o1757R7482m4753m9516J15763
6532B36467o1013J2974l227Q982r324l699J5013r3311J07002k1068J9315J4262
6520B22373j652P417l1666j1023L9020o7017M2346J138J983o2316K5782K2535
$$ plain form
6601 901457 867974 810598 822423 811053 810759 703217 846712 763197 728130 665059 721077 595610
6589 595610 571179 507156 481809 600399 560493 505595 661182 548135 516924 525047 483778
6578 483778 414374 465608 427020 452523 393419 477404 405192 366166 420618 393708 435649 344883
6566 344883 388234 329590 219068 262499 360034 174769 261217 236324 252928 189169 269869
6555 269869 229241 305678 253997 228104 237659 123374 271291 183612 162030 218898 157945
6544 157945 151055 203080 196614 169498 257817 252386 179248 117491 214973 170220 120704 236467
6532 236467 175454 188428 185201 194183 184859 181160 196173 102862 209864 188796 208111 222373
6520 222373 220721 228138 196472 185449 224469 157452 199798 200936 202919 140603 166385 188920
6508A88920O9770m8359k7474O7718j12566l4633P0439J9213n0569L3363L4391
6497B10213r9948r3259L2896L3779N8816n0811j7127N2661j7849Q2896j17982
6486G4285L3131o2664k4840M8767j0340R059k5056J3683m2031N5406n4857M4782
6474E9325q8531L5302L5563l75m2030r8596J4620L7362m368L5884L6654j06925
6462h6115l7315p7949J13526L814M7216j06097N1897N568m3918M1993q3273J59521
6450a1132p6839o6505M4666J7998k3611o3554P7349n0963N6294o4613N2410p7790
6438a86290P3526k4538j1574J09571j61741L6467Q9294k4724N8590l6109p3685
6427a51213M1136q1769J2917L264Q0660p3810M7916l3581k2649N6635k9321N7247
$$ plain form
6508 188920 258690 210331 182857 250575 138009 103376 173815 193028 142459 175822 210213
6497 210213 110265 17006 49902 83681 142497 91686 74559 127220 109371 192267 74285
6486 74285 107416 44752 19912 68679 58339 67398 42342 56025 13994 69400 14543 59325
6474 59325 -29206 6096 41659 41284 -746 -99342 -84722 -47360 -51728 -15844 20810 -86115
6462 -86115 -123430 -201379 -87853 -84039 -36823 -142920 -91023 -85455 -129373 -87380 -170653 -11132
6450 -11132 -87971 -154476 -109810 -91812 -115423 -178977 -101628 -152591 -96297 -160910 -108500 -186290
6438 -186290 -112764 -137302 -148876 -39305 -201046 -164579 -75285 -100009 -41419 -77528 -151213
6427 -151213 -110077 -191846 -178929 -175665 -95005 -168815 -120899 -154480 -177129 -120494 -149815 -92568
6415i2568J0587l6269O113l7563M2196j1343n6459l1628P900L1765l1260j03719
6403c02248K8972L2730k9831J02513o1704l6532P0785p1505j3256Q8210q4154
6392b76020J60458j86354O6707K2296K1153j66082O6645N2515l7752L5066j46314
6381c87682J08315p8159R3370n7538k7339Q11N3820p1606q7934L6422O5889r0151
6369d41782R4157p2118K959O5294n2497l6747N6388j04057R2966j0361l697M0084
6357c69411M364m9548J2978k6920j9000j641K5764o0364J20861p7610j3823O3402
6345c90948n9551Q0524k446m9084o6572J24291l4191k7690M3767J2453j7421K9590
6333c57278l2636j7667O1825j4439m9580L5382M9887K7297L5430j19181Q0921
$$ plain form
6415 -92568 -81981 -118250 -112137 -149700 -107504 -118847 -175306 -206934 -199034 -167269 -198529 -302248
6403 -302248 -273276 -240546 -270377 -167864 -229568 -266100 -195315 -266820 -280076 -191866 -276020
6392 -276020 -115562 -301916 -235209 -212913 -191760 -357842 -291197 -238682 -276434 -241368 -387682
6381 -387682 -279367 -357526 -264156 -321694 -349033 -348222 -294402 -366008 -453942 -417520 -351631 -441782
6369 -441782 -347625 -419743 -416784 -351490 -403987 -440734 -384346 -488403 -395437 -405798 -409495 -369411
6357 -369411 -365047 -414595 -401617 -428537 -447537 -449178 -423414 -483778 -362917 -440527 -454350 -390948
6345 -390948 -450499 -369975 -372421 -421505 -488077 -363786 -397977 -425667 -381900 -369447 -386868 -357278
6333 -357278 -389914 -407581 -345756 -360195 -409775 -374393 -324506 -297209 -261779 -380960 -300039
6322c00039p1133O7526N6977q9581L5542l2840J9713l1563M0737J16963j26846
6311c14544J05834p1962L5908p67p630J35670j11013K1570Q8618K261q3018J2537
6299a86536L8378R361P6963R1936m2293L2644J9121J74380l490J32222L9092L057
6287C84835L4310J06246J06938O1841P3239L0303M1286o6510n1507j13351j21548
6276D86082m6334p4143j20508L3006o4589o5776k0806o2180n337J221k6686J6437
6264E0387K3968o5043q4793O1896m1987l4074M4457q456q8122M8783N5413k511
6252d0082N2814o9016k2735J8912n9464Q8168m0409J00175p1040N7183p9888l413
6240f8795R6609K7493n6328J21932n2035r447j8869K3922L2745J11615J9807k2445
$$ plain form
6322 -300039 -371172 -303646 -246669 -336250 -300708 -333548 -313835 -345398 -304661 -187698 -314544
6311 -314544 -208710 -280672 -244764 -245531 -253161 -117491 -228504 -206934 -118316 -116055 -199073 -186536
6299 -186536 -148158 -138797 -61834 30102 -12191 20453 39574 213954 210464 342686 381778 384835
6287 384835 419145 525391 632329 694170 767409 797712 838998 772488 720981 607630 486082
6276 486082 439748 365605 245097 278103 213514 147738 126932 64752 59415 60636 33950 50387
6264 50387 74355 9312 -75481 -13585 -55572 -89646 -45189 -53645 -141767 -92984 -37571 -40082
6252 -40082 12732 -56284 -79019 -60107 -119571 -31403 -71812 28363 -42677 14506 -65382 -68795
6240 -68795 27814 55307 -1021 120911 68876 59429 40560 64482 97227 208842 228649 206204
6228B06204J00178K1420K7883J31985P3933J33568J23458J49853j43j0820J4843
6217I72362j48582J8187J6838n0479P143j19491j07649o1480j503J33544q5876
6206E73014J5380L2462J21052l0328Q7145n4980n8501J47404p6403o111J8116
6195G68250q6531L76o0830j75886P4655p1007m1070m2352r4903k442K843l4189
6183B36914K4342r5688k9408J40362n9424q3609n2795R9975N9756j5532o0041
6172A64852O2269L004j302l8129O7407n177J7793j17157P6978K4654J3869q2990
6160A86071O0643l98Q790Q3352N8755j16463N3601L7500O5055l107J4703p093
6148D41409J8655J8592M5986k9506Q375R4874L4015Q3760j17284O8121J40394
$$ plain form
6228 206204 306382 327802 355685 487670 561603 695171 818629 968482 968339 957519 972362
6217 972362 823780 841967 858805 808326 815469 695978 588329 526849 525346 658890 573014
6206 573014 588394 620856 741908 711580 798725 743745 685244 832648 756245 750134 768250
6195 768250 681719 682095 621265 445379 520034 449027 407957 365605 270702 268260 271103 236914
6183 236914 261256 165568 136160 276522 217098 133489 80694 180669 240425 224893 164852
6172 164852 227121 230125 228823 190694 258101 252924 270717 153560 230538 255192 269061 186071
6160 186071 246714 246316 255106 338458 397213 280750 334351 371851 436906 433799 448502 441409
6148 441409 460064 478656 524642 495136 503511 598385 632400 716160 598876 666997 807391
6137H07391M2460K793o9434J09078o759J16825n9246J02241N4279O0599j7307
6126A142920J86174o434M4994J44183j4919J06300L5032O1718k6985J45172N8192
6115A876347N1327J30328P2724R5442K8671Q7180J06299K0801J22930K06297P0200
6104B868546J39472N0073J07585J50670J35302Q2900K87350R6917J43565K88049
6094D350429J54833K56577J84277K91722K92546L05477L15471L11842L18269M52176
6084G233619M42612M41888M99284N24311N55042P39943N82238Q51603P84870R26463
6074A3581873R90948J111770J160782J169517J399315J594150J608494J933555
6066B4550404K094293K289697K635779K803675L046449L259449L733519M042548
$$ plain form
6137 807391 849851 852644 783210 892288 885529 1002354 943108 1045349 1099628 1160227 1142920
6126 1142920 1329094 1322660 1367654 1511837 1496918 1603218 1638250 1699968 1672983 1818155 1876347
6115 1876347 1927674 2058002 2130726 2226168 2254839 2342019 2448318 2469119 2592049 2798346 2868546
6104 2868546 3008018 3058091 3165676 3316346 3451648 3534548 3821898 3918815 4062380 4350429
6094 4350429 4505262 4761839 4946116 5237838 5530384 5835861 6151332 6463174 6781443 7233619
6084 7233619 7676231 8118119 8617403 9141714 9696756 10436699 11018937 11870540 12655410 13581873
6074 13581873 14572821 15684591 16845373 18014890 19414205 21008355 22616849 24550404
6066 24550404 26644697 28934394 31570173 34373848 37420297 40679746 44413265 48455813
6058D8455813M357035M763434N518767O027465P004591Q019295R136772J0060732
6050A03343904J0654228J0291326Q562881N108929Q56831l803646p786593j0505108
6042A16722752j1144149j0812389r995765q895506p910201o907884n951358n137706
6034D9967794m330822l908620l309678k952209k708479k317882k139914j916952
6026B6383238j680093j604711j332154j318533j098120j159958r87620q60565
6018A6341484q61091p96364o85502n65209o90904o30876m72414o79385l76860
6009A0582879m71357m41589l72999l89503l25635n34112k31869l32765k97536
6000G185514j58950l42092k39330j95689k47070j25625k28035j67264k17554j55503
$$ plain form
6058 48455813 52812848 57576282 63095049 69122514 76127105 84146400 93283172 103343904
6050 103343904 113998132 124289458 132852339 137961268 138818099 135014453 127227860 116722752
6042 116722752 105578603 94766214 84770449 75874943 67964742 61056858 55105500 49967794
6034 49967794 45636972 41728352 38418674 35466465 32757986 30440104 28300190 26383238
6026 26383238 24703145 23098434 21766280 20447747 19349627 18189669 17202049 16341484
6018 16341484 15480393 14684029 13998527 13433318 12742414 12111538 11639124 10959739 10582879
6009 10582879 10111522 9669933 9296934 8907431 8581796 8047684 7815815 7483050 7185514
6000 7185514 7026564 6684472 6445142 6249453 6002383 5876758 5648723 5481459 5263905 5108402
5990E108402j08918j53475j34619k57332n9609q8744j00675k28571n2956n3497
5980C870006j41904n7230k44957j3723p1493j68628j61967k8225p0188o3639n6823
5969B791229k2241l6699j09304o9886j17241R118n7361K1326r1999p8773k499
5958B235670n0989L247j60596P1423p9925n5400k0527r3925J8042j56411L3465
5947A744074K8665p6395m5217j46099n857n203m1076j32679J22996k891j54578
5936A285740l5560o9341J6639k6354J21768k06946K6028n0453l5219O37L2454
5925A059393j60197j5186O758K3990L4209j07309m9582n9106N4677m2768r719
5914G35160R372o7114Q1239j19721j0065n4644J4552O0373p2195K7783j33375
$$ plain form
5990 5108402 4999484 4846009 4711390 4454058 4394449 4305705 4205030 3976459 3923503 3870006
5980 3870006 3728102 3670872 3425915 3412192 3340699 3172071 3010104 2981879 2911691 2848052 2791229
5969 2791229 2768988 2732289 2622985 2553099 2435858 2444976 2387615 2408941 2316942 2238169 2235670
5958 2235670 2184681 2187928 2027332 2098755 2018830 1963430 1942903 1848978 1867020 1710609 1744074
5947 1744074 1772739 1696344 1651127 1505028 1499171 1493968 1452892 1320213 1443209 1440318 1285740
5936 1285740 1250180 1180839 1197478 1171124 1292892 1085946 1111974 1061521 1026302 1026939 1059393
5925 1059393 899196 884010 890768 914758 948967 841658 792076 732970 787647 744879 735160
5914 735160 744532 677418 758657 638936 628871 574227 588779 649152 576957 604740 471365
5903D71365K3858k5123K2529M1019m9860J2440n4138l4314O9825r2414j1913J50576
5891E23850j50414J5930L8002M936q0812L6915L0211n9117j9393L1222J3983n6922
5879C28391J1763q271m292r115M1596j5628j22436Q2537J8015l0944J1308n1180
5867B51744M8355j7722M7394j48219R0995M7062L8110m0565j1074n5301O2773
5856C13552j26996J0695R6870r3006J2249K2301J8862p5507q3868O8571q3653
5845H0070J3655J05601l9773r787l5372r951J3185Q8222r2290J00134j27236R3471
5833A79929r9349P1942j961o953m2263M1872k1771J5181r3776l3916L7653L7855
5821H4443r237l4289P7023p2520p9731P9462l5467P6618J07899l9922q0774o5881
$$ plain form
5903 471365 495223 470100 492629 533648 483788 496228 442090 407776 477601 385187 373274 523850
5891 523850 373436 389366 427368 432304 351492 388407 418618 359501 340108 371330 385313 328391
5879 328391 340154 331883 327591 318476 360072 344444 222008 304545 322560 291616 302924 251744
5867 251744 300099 282377 329771 181552 272547 319609 357719 317154 306080 250779 313552
5856 313552 186556 197251 294121 201115 213364 235665 254527 179020 95152 163723 80070
5845 80070 93725 199326 159553 149766 114394 104443 117628 205850 113560 213694 86458 179929
5833 179929 80580 152522 150561 143608 101345 143217 121446 136627 42851 8935 46588 84443
5821 84443 75206 40917 117940 45420 -34311 45151 9684 86302 194201 154279 73505 7624
5809G624j486J26566q4485k9055Q2264o6907K1669N7246K7160j01489L7071K1002
5797I7180L0897L119j3071N4629l1757n5730Q7255k5051m4585m3762O525J37063
5785B02712n312j20011l167l6730L2638N4514p0919K8965J14553q9598k1690L5122
5773A21077K1674m2115K3722n3214M4297o1699M0202J3060O3627m5600L4733p3948
5761H5816K234J5574Q4464k5707J3059l4893N9927q8529R4135j541J9180m5644
5749A78075k8849N5940J5301k386m5005p694P0238o2437K0625J3830M2727N7312
5737C07677n2789k1893J16205m7896K740N9391R820O374q2814J3496Q2440L6604
5725D29355J4117j8275k9478n191R4138j56133Q3994M1732L5058m7162J6203O6748
$$ plain form
5809 7624 6138 132704 48219 19164 101428 34521 56190 113436 140596 39107 76178 97180
5797 97180 128077 131196 118125 172754 140997 85267 172522 147471 102886 59124 65649 202712
5785 202712 197400 77389 74222 37492 70130 124644 53725 82690 197243 107645 85955 121077
5773 121077 142751 100636 124358 71144 115441 53742 93944 107004 170631 125031 159764 85816
5761 85816 88050 103624 188088 162381 175440 140547 200474 111945 206080 204539 223719 178075
5749 178075 149226 205166 220467 218081 173076 165382 235620 173183 193808 207638 250365 307677
5737 307677 254888 232995 349200 301304 304044 363435 373255 379629 296815 310311 392751 429355
5725 429355 443472 425197 395719 390528 484666 328533 412527 454259 489317 442155 458358 525106
5713E25106l5483P1435j06491n2418Q1120K6173k9740O4979k1626J8562j7529
5702E24088m5231J67976j6241o6048L380k2475J02058l6968M9466l7143j0637
5691F12225K6203J091m700o7863O2881N3774q1709N171k4375M0539p1616R5349
5679F46970o3183K0127n6230O2778m5456Q0203m8314k1696J31292j25673L1636
5668F12454Q7170n9408j06764J51085q435N3451j44152L4916K3581m829j565q845
5656F28659M4349l2981K5821Q934J1798Q3675m0299p1384R0823K1382K9167o685
5644G93259K9574L5437k230l3052J04043j08853J13690p8256K10112r0232N3005
5633A026497n0163K9454n0851J27033k6879K5164L3240r0728P1415K4561M5448
$$ plain form
5713 525106 489623 561058 454567 402149 483269 509442 479702 544681 523055 541617 524088
5702 524088 478857 646833 630592 564544 567924 545449 647507 610539 660005 622862 612225
5691 612225 638428 639519 634819 566956 629837 683611 601902 607073 582698 623237 551621 646970
5679 646970 583787 603914 547684 610462 565006 645209 596895 575199 706491 580818 612454
5668 612454 699624 640216 533452 684537 676102 729553 585401 620317 643898 639069 637504 628659
5656 628659 673008 640027 665848 674782 686580 770255 729956 658572 749395 770777 799944 793259
5644 793259 822833 858270 856040 822988 927031 818178 931868 853612 1063724 973492 1026497
5633 1026497 976334 1005788 954937 1081970 1055091 1080255 1113495 1022767 1094182 1118743 1164191
5622A164191k1133n3778j1662N639j4380O0696o2635M7518O049K7092o2006m7819
5610A037772o0340p846R8912o2140L788M1727n8259K2905M927j01063R9618J3549
5598A033550L5894r2508j4548R8840r9412K8043P3777R783o139j5266K1280R4820
5586A168114J87L5668l3485L6461N843K3031k0143R9310q104J07711N1278J2045
5574A477916L828L9688K7443P5924J0278J2130P8647n3308P9270L0283j4941Q9327
5562A856485N6640j09385J09886P2403K0125m1186O2232K0496r9333J25527m6979
5551B026911J17654J5063M8945P8163L6954P488P2790P3294n3142J45253j2682
5540B556691P6155J05198P7697M7836J17438j4079L3153J34128J21947Q7129J35749
$$ plain form
5622 1164191 1143058 1089280 1077618 1083257 1068877 1129573 1066938 1114456 1120505 1147597 1085591 1037772
5610 1037772 977432 969586 1068498 1006358 1010146 1051873 993614 1016519 1021446 920383 1020001 1033550
5598 1033550 1069444 976936 962388 1061228 961816 989859 1063636 1073419 1067280 1052014 1073294 1168114
5586 1168114 1168301 1203969 1170484 1206945 1212788 1235819 1215676 1314986 1306882 1414593 1465871 1477916
5574 1477916 1481744 1521432 1548875 1624799 1635077 1647207 1725854 1672546 1751816 1782099 1767158 1856485
5562 1856485 1913125 1803740 1913626 1986029 2006154 1964968 2027200 2047696 1948363 2073890 2026911
5551 2026911 2144565 2159628 2208573 2286736 2323690 2331178 2403968 2477262 2424120 2569373 2556691
5540 2556691 2632846 2738044 2815741 2863577 2981015 2966936 3000089 3134217 3256164 3343293 3479042
5529C479042Q2939M1662J68796N7577J44924J34205N8837Q5547J45030J73972
5519D572531J58906J16827J37175J76598K07491J94659J27873K03923J42414L01955
5509F340352J74801L13409R8099L81103K56224K81356L68320J96816M35486L35216
5499I181182M42175L16322L55880N44616L69598N08367M75447N79550L36525N49485
5489A3659147O57688M64981N27255N65177O29052O81888O49299O55251N87339
5480A9077077N66374P73732N82405N91022O59873O81709O95250O78277O11905
5471B4917624P09954P11618O98325P19984P45221P71578P19563P47192P14656
5462C1455715P55893P60575Q43975O52110R25605P15152O99195R20460P84960
$$ plain form
5529 3479042 3561981 3603643 3772439 3830016 3974940 4109145 4167982 4253529 4398559 4572531
5519 4572531 4731437 4848264 4985439 5162037 5369528 5564187 5692060 5895983 6038397 6340352
5509 6340352 6515153 6828562 6926661 7307764 7563988 7845344 8213664 8410480 8845966 9181182
5499 9181182 9623357 9939679 10295559 10840175 11209773 11718140 12193587 12773137 13109662 13659147
5489 13659147 14316835 14781816 15309071 15874248 16503300 17185188 17834487 18489738 19077077
5480 19077077 19643451 20417183 20999588 21590610 22250483 22932192 23627442 24305719 24917624
5471 24917624 25627578 26339196 27037521 27757505 28502726 29274304 29993867 30741059 31455715
5462 31455715 32211608 32972183 33816158 34468268 35393873 36109025 36808220 37728680 38513640
5453C8513640P41657P53664P63374Q22821P32411Q05894N58554Q05039P49913
5444D5246967N70281O31333N03114N66921M78976M27449M05112M06066L30449
5435D9566668M42572J40091L37413J34245K16076K26528J17305J62058J41868
5426E1484824J15339K5563M7269P5746R3492j09440P3629k20445J4114j31988
5416E1468103k8573r2714j80644k02647j53079l27611k93372k05404l85946m93269
5406D9104844m46310n30907n52302n43684o15035o94343o71717p12290o14061
5397D3724195o23576q10430p26510o95170q10248p13119o86363o96726q14319
5388C7147734o80156o81771o70575p57482p92141n41371p26671p19435o21868
$$ plain form
5453 38513640 39255297 40008961 40772335 41595156 42327567 43133461 43692015 44497054 45246967
5444 45246967 45817248 46448581 46951695 47518616 47997592 48425041 48830153 49236219 49566668
5435 49566668 50009240 50149331 50486744 50620989 50837065 51063593 51180898 51342956 51484824
5426 51484824 51600163 51625726 51672995 51748741 51842233 51732793 51806422 51585977 51600091 51468103
5416 51468103 51439530 51346816 51166172 50963525 50810446 50482835 50189463 49984059 49598113 49104844
5406 49104844 48658534 48127627 47575325 47031641 46416606 45722263 45050546 44338256 43724195
5397 43724195 43100619 42290189 41563679 40868509 40058261 39345142 38658779 37962053 37147734
5388 37147734 36467578 35785807 35115232 34357750 33565609 33024238 32297567 31578132 30956264
5379C0956264o57804o47703p63571n59092o72320o85357o01796o06728o20023
5370B5141870o25097n65587n98588p23343n20900o15379o03981o10975m89519
5361A9788501o19986n23461m69744n28957m51932m64167m86754m75733l67460
5352A5400307k75099l39528k49697k57018m08047j51880k55164j39833j92867
5343A3131174j24021k02419R22j04313J02625o2780Q2550J52089N0037J68556
5333A3194420K02574J70965L63014M08040L63153N04260N29423O36591P81316
5324A7153756P73389R57692J028693J247242J237317J470877J708741J906724
5316B7484431K320529K359450K590773K739727K880994K714795K853048K731071
$$ plain form
5379 30956264 30298460 29650757 28887186 28328094 27655774 26970417 26368621 25761893 25141870
5370 25141870 24516773 23951186 23352598 22629255 22108355 21492976 20888995 20278020 19788501
5361 19788501 19168515 18645054 18175310 17646353 17194421 16730254 16243500 15767767 15400307
5352 15400307 15125208 14785680 14535983 14278965 13870918 13719038 13463874 13324041 13131174
5343 13131174 13007153 12804734 12805656 12701343 12803968 12741188 12823738 12975827 13025864 13194420
5333 13194420 13396994 13567959 13930973 14339013 14702166 15206426 15735849 16372440 17153756
5324 17153756 17927145 18884837 19913530 21160772 22398089 23868966 25577707 27484431
5316 27484431 29804960 32164410 34755183 37494910 40375904 43090699 45943747 48674818
5308D8674818K943758L005656L105061K863954K605736K165643J823597J554386
5300F8742609J489820J536909J285054M75488r4878q98755j561889j741534j664009
5291F7568815j680620j920335k322577k574467l076732k865532k801229k477917
5283D7849406k516048k550018k646958k660326k895441k728234k613914k411732
5275B6826735k033832k049652j765079j435518j270745j218067r49662r35815
5267A5168365q02268q29137o12175n66915n60598n75332l91655m79291l96950
5258I954044l70339l67775l87106k63450k78973l28275k69237k33614j89532k00371
5248G065372k37165j01937l04142J825j84477j56844j89186j52800j36744l6046
$$ plain form
5308 48674818 51618576 54624232 57729293 60593247 63198983 65364626 67188223 68742609
5300 68742609 70232429 71769338 73054392 73529880 73435002 72536247 70974358 69232824 67568815
5291 67568815 65888195 63967860 61645283 59070816 55994084 53128552 50327323 47849406
5283 47849406 45333358 42783340 40136382 37476056 34580615 31852381 29238467 26826735
5275 26826735 24792903 22743251 20978172 19542654 18271909 17053842 16104180 15168365
5267 15168365 14366097 13536960 12924785 12357870 11797272 11221940 10830285 10350994 9954044
5258 9954044 9583705 9215930 8828824 8565374 8286401 7958126 7688889 7455275 7265743 7065372
5248 7065372 6828207 6726270 6422128 6423953 6239476 6082632 5893446 5740646 5603902 5567856
5238E567856j79311j01191j68184o3562j04649j01363k5075q7135p2744q5630
5228D579012L1549n6944o8648m5299k1261p9908l072p6108R1620J19628j09803
5217D360766J42218K707J34501J3828L8030N7279K11393N7167J78750L08676J87275
5206E692590J31579L432J48440j71275j07801k87007k78627k07043l82838j36485
5196D404965k13434j80044j79677r2671j84636j6310j10449l5324m3414j18487
5186C230519o9158m8480M4371p6595o3733j7227j6244r4042J53187j53436L4k2983
5174B866213j05040n5031M5129j4611n9910m2911J6234n6809k8528J8305q8215
5163B494826J17109n1047j44784O4433n3548j51924K7900R1202o0428k7446p8149
$$ plain form
5238 5567856 5388545 5287354 5119170 5055608 4950959 4849596 4824521 4737386 4664642 4579012
5228 4579012 4610561 4553617 4484969 4439670 4418409 4338501 4335429 4259321 4350941 4470569 4360766
5217 4360766 4502984 4505691 4640192 4654020 4692050 4749329 4960722 5017889 5196639 5505315 5692590
5206 5692590 5824169 5827601 5976041 5804766 5696965 5409958 5131331 4924288 4541450 4404965
5196 4404965 4191531 4011487 3831810 3739139 3554503 3538193 3427744 3392420 3349006 3230519
5186 3230519 3161361 3112881 3157252 3080657 3016924 2999697 2983453 2889411 3042598 2889162 2889196 2866213
5174 2866213 2761173 2706142 2751271 2736660 2676750 2633839 2650073 2593264 2564736 2583041 2494826
5163 2494826 2611935 2560888 2416104 2480537 2426989 2275065 2302965 2394167 2333739 2306293 2228144
5152B228144M5465J0298j7068k4677M3958o0077o6039P7778n7965K0969p4111
5141B126675N5323j2541J2312J4238J3396K5512q2652J7656Q7332j28956P8822
5130B207117k0091l6467P7057j38691O8328J0138j8486q5342K6013O8940Q9j1646
5118B146959K6400o6028l365Q1815n0108R9082k1712m230j06090N6986L3058L706
5106B196473P0759n0696M7341q287P7727n7166O4821l8940M262J32129n9833R785
5094B388375Q0073J01897k9213o903R5791J12200l25Q8025j2563O6811N3569K6723
5082B964460P5163k8867J20951J5597o367J13516L7270l716L4508N3834J23521
5071C499870J734p6379J17012K345j07062J6465L0437k6058j93824M3103P4920
$$ plain form
5152 2228144 2273609 2283907 2266839 2242162 2286120 2226043 2160004 2237782 2179817 2200786 2126675
5141 2126675 2181998 2169457 2181769 2196007 2209403 2234915 2152263 2169919 2257251 2128295 2207117
5130 2207117 2187026 2150559 2227616 2088925 2157253 2167391 2148905 2063563 2089576 2158516 2158605 2146959
5118 2146959 2173359 2107331 2103966 2185781 2135673 2234755 2213043 2208813 2102723 2159709 2192767 2196473
5106 2196473 2267232 2216536 2263877 2255590 2333317 2276151 2340972 2302032 2306294 2438423 2378590 2388375
5094 2388375 2468448 2570345 2541132 2534229 2630020 2742220 2741895 2829920 2817357 2884168 2937737 2964460
5082 2964460 3039623 3010756 3131707 3147304 3140937 3254453 3291723 3288007 3322515 3376349 3499870
5071 3499870 3501604 3425225 3542237 3544582 3437520 3453985 3484422 3458364 3264540 3307643 3382563
5060C382563r7305R3251o4914J05722j8577K0588Q7824K7353Q160R5839j0277
5049C630227J62370J8837M5182L527R0632r279J49261K2780P1774M7735N3880
5038D286926Q9919M0776J69945Q2169J04982O8173N7688J22445J13503J66401
5028E302927J52409J15226J70375J11188K20067J36429K01252J95827J99689K59480
5018G064869K08404K74335J89729L63878K12826M06067L26752M94428L51889N55911
5008A0449088M99670M49590O58382O88042O08279P71950O54587R03256J049165
4999A6732009J098118J256913J373780J486728J644897J448957J150136J034151
4991B7225689O71305N41554M80426M76947Q06098Q93919J031259J070863J217326
$$ plain form
5060 3382563 3285258 3378509 3313595 3419317 3400740 3421328 3509152 3536505 3544665 3640504 3630227
5049 3630227 3792597 3811434 3856616 3860143 3950775 3941496 4090757 4113537 4185311 4233046 4286926
5038 4286926 4376845 4417621 4587566 4669735 4774717 4842890 4900578 5023023 5136526 5302927
5028 5302927 5455336 5570562 5740937 5852125 6072192 6208621 6409873 6605700 6805389 7064869
5018 7064869 7273273 7547608 7737337 8101215 8314041 8720108 9046860 9541288 9893177 10449088
5008 10449088 10948758 11398348 12056730 12744772 13353051 14125001 14779588 15682844 16732009
4999 16732009 17830127 19087040 20460820 21947548 23592445 25041402 26191538 27225689
4991 27225689 27896994 28438548 28918974 29395921 30202019 31095938 32127197 33198060 34415386
4982C4415386J251602J349540J545451J461424J579410J669087J661351J766576
4974D6699827J746769J661402J959812J990864K196829K304422K648542K736895
4966F3945362K372276J393853N58782m42862j390684j731612j549634j451660
4958F1703821j446163j347201j261281j288514j214942j154629j239496j241631
4950E1509964j051304j220659j022533j265321j239370r66565j146351r44819
4942D2653042j104094j035123p56663r81402p01742o38314n33490l40555k51308
4933C6310351M2377J34655J27314J34185j79886m89853n73113j063833j252870
4924C3189327j465150j763843j967681j966688j829785j654623j428976j240607
$$ plain form
4982 34415386 35666988 37016528 38561979 40023403 41602813 43271900 44933251 46699827
4974 46699827 48446596 50107998 52067810 54058674 56255503 58559925 61208467 63945362
4966 63945362 66317638 67711491 68270273 67827411 66436727 64705115 63155481 61703821
4958 61703821 60257658 58910457 57649176 56360662 55145720 53991091 52751595 51509964
4950 51509964 50458660 49238001 48215468 46950147 45710777 44744212 43597861 42653042
4942 42653042 41548948 40513825 39757162 38775760 38074018 37435704 36902214 36561659 36310351
4933 36310351 36352728 36487383 36614697 36748882 36568996 36079143 35506030 34442197 33189327
4924 33189327 31724177 29960334 27992653 26025965 24196180 22541557 21112581 19871974
4916A9871974j143877r66467q31440o93693p22560n82835p35388n06266m61799
4907A3227649m70958m50272k92242m33772k72105l39600l23373k31163k35348
4898A0178816k80152k64542j62056k56621j66615j43354j58433j75732j91198
4889H380113r3086j42609o5860k19808j14494K1802j79470n4313j47622j20181
4879G264472P7333k22740k6969o4209j61611k8140J8480n5977j02673L3947n8284
4868F673629j7350j5437Q5269j68582J16959J5750M855j1234j02698L8306P7631
4857F697098j14495Q2976K5381j2274J11996K629r2159O6776m4139K8053J2919
4846F764761J23346N707L6750O7340O7762r305J41917J28149M9252J52373K8089
$$ plain form
4916 19871974 18728097 17761630 16930190 16236497 15513937 14931102 14195714 13689448 13227649
4907 13227649 12756691 12306419 12014177 11580405 11308300 10968700 10645327 10414164 10178816
4898 10178816 9898664 9634122 9472066 9215445 9048830 8905476 8747043 8571311 8380113
4889 8380113 8287027 8144418 8078558 7858750 7744256 7766058 7586588 7532275 7384653 7264472
4879 7264472 7341805 7119065 7092096 7027887 6866276 6838136 6856616 6800639 6697966 6731913 6673629
4868 6673629 6656279 6640842 6726111 6557529 6674488 6690238 6695093 6683859 6581161 6619467 6697098
4857 6697098 6582603 6665579 6690960 6678686 6790682 6793311 6701152 6767928 6723789 6751842 6764761
4846 6764761 6888107 6893814 6930564 6997904 7065666 7056361 7198278 7326427 7375679 7528052 7556141
4835G556141J68998N3297J04703J18217K9104J49684l1532J62280J74165P4077
4825H559134P3414Q1541K6780K33266J10916L07041J37890J58825J78837K13532
4815A0081176K76830J54160K21942K66521K95088L15261L41620K31829K72745
4806A2457172L16149M09049K60278M13133M48366K25502M22127M83681K63269
4797A5698726M71830M19300L84017M96306L63669L95674M50708M22744M34991
4788A9537965M78011M97671N39087N39042M42778O18784N02038O17271P68382
4779B4541029P09931O83984Q39962P45560Q46504J013373R39921R31374R82829
4770C2234467J085831J046924J204681J388728J516684J636848J802097J986330
$$ plain form
4835 7556141 7725139 7778436 7883139 8001356 8030460 8180144 8148612 8310892 8485057 8559134
4825 8559134 8632548 8714089 8740869 8974135 9085051 9392092 9529982 9688807 9867644 10081176
4815 10081176 10358006 10512166 10734108 11000629 11295717 11610978 11952598 12184427 12457172
4806 12457172 12773321 13182370 13442648 13855781 14304147 14529649 14951776 15435457 15698726
4797 15698726 16170556 16589856 16973873 17470179 17833848 18229522 18680230 19102974 19537965
4788 19537965 20015976 20513647 21052734 21591776 22034554 22653338 23155376 23772647 24541029
4779 24541029 25250960 25934944 26774906 27520466 28366970 29380343 30320264 31251638 32234467
4770 32234467 33320298 34367222 35571903 36960631 38477315 40114163 41916260 43902590
4762D3902590J966413J911021J806949J459843J156486R40875R04418N31810K29302
4753E4809707J19618j34233N6097L0261K94363L65014M76638M71016M94924O51787
4743E7635192O47857O48743N79270P08059P40703O54791Q41073Q00318J026695
4734F4282701Q47426J031153J068319J186664J241005J200329J231965J363136
4726G3452698J263940J366072J317219J353000J131418J064764J144589R98588
4718H3092288J003818P30288R23951P32486O38756O66261O96631O24884O70499
4709H9779862N16350O58092N35251O83671O18173P10315N65697P07559O88893
4700I5463863Q86503P24586R10967P91843Q71094P61227J012497R02910Q75854
$$ plain form
4762 43902590 45869003 47780024 49586973 51046816 52203302 53144177 54048595 54580405 54809707
4753 54809707 54929325 54795092 54851189 54881450 55175813 55540827 56017465 56488481 56983405 57635192
4743 57635192 58283049 58931792 59511062 60219121 60959824 61614615 62455688 63256006 64282701
4734 64282701 65130127 66161280 67229599 68416263 69657268 70857597 72089562 73452698
4726 73452698 74716638 76082710 77399929 78752929 79884347 80949111 82093700 83092288
4718 83092288 84096106 84826394 85750345 86482831 87121587 87787848 88484479 89109363 89779862
4709 89779862 90296212 90954304 91489555 92173226 92791399 93501714 94067411 94774970 95463863
4700 95463863 96350366 97074952 97985919 98777762 99648856 100410083 101422580 102325490 103201344
4691A03201344R23129P07604R43686O89644P13090O51457N00767M38896N05253
4682A09274870M91898M13981L64520M99436N14079M75089O27285O55061Q22923
4673A14139142J019120J011114J201347J391506J558436J635677J867685J967967
4665A25791994K088078K290806K344865K585917K565074K652248K744054K752770
4657A45815806K730033K812669K639148K615222K461034K184946K020353J791098
4649A65070309J335588J083964P00878M60076m2746j87577n32122r01869j265920
4640A65720581j379709j766091j919006k401103k602043k908702l220850l318704
4632A46204373l602000l712033l773969l975544l903237l987814l995882l698012
$$ plain form
4691 103201344 104124473 104832077 105775763 106465407 107178497 107829954 108330721 108769617 109274870
4682 109274870 109766768 110180749 110545269 111044705 111558784 112033873 112661158 113316219 114139142
4673 114139142 115158262 116169376 117370723 118762229 120320665 121956342 123824027 125791994
4665 125791994 127880072 130170878 132515743 135101660 137666734 140318982 143063036 145815806
4657 145815806 148545839 151358508 153997656 156612878 159073912 161258858 163279211 165070309
4649 165070309 166405897 167489861 168190739 168650815 168608069 168420492 167888370 166986501 165720581
4640 165720581 164340872 162574781 160655775 158254672 155652629 152743927 149523077 146204373
4632 146204373 142602373 138890340 135116371 131140827 127237590 123249776 119253894 115555882
4624A15555882l651744l573302l447061l373006l246158l167966k900885l028392
4616H9167368k761683k643128k458012k461022k335327k253327k015914k062136
4608G0176819j919435j776456j648214j716311j630692j519631j415803j399254
4600E7151023j526171j256106j317152j326132j363553j228283j216692j090538
4592D6826396j164288j054899r57335j071765r15289r98962q75486p37534p58674
4583C8292164p45271o89965n73967o12054n43966m10234n05700l43848l27155
4574C3540004k85027k73522l38780j25072k02290j05686q1194q0916L7720j6352
4564C2068885J06468J43457J02374J69734L09013K95214L11415L34916M12624
$$ plain form
4624 115555882 111904138 108330836 104883775 101510769 98264611 95096645 92195760 89167368
4616 89167368 86405685 83762557 81304545 78843523 76508196 74254869 72238955 70176819
4608 70176819 68257384 66480928 64832714 63116403 61485711 59966080 58550277 57151023
4600 57151023 55624852 54368746 53051594 51725462 50361909 49133626 47916934 46826396
4592 46826396 45662108 44607209 43649874 42578109 41662820 40663858 39788372 39050838 38292164
4583 38292164 37546893 36856928 36282961 35670907 35126941 34716707 34211007 33867159 33540004
4574 33540004 33254977 32981455 32642675 32517603 32315313 32209627 32128433 32047517 32085237 32068885
4564 32068885 32175353 32318810 32421184 32590918 32899931 33195145 33506560 33841476 34254100
4555C4254100N02170N83406N34352N72854P21676P01237Q29463Q69729Q64880
4546D0433867R18465R67324Q74230R28826Q52656Q12702P08837O91743N26635
4537D7715285M01476N73143L22344M27683M57601M38212N00619P55079P12548
4528E2303990Q10761J056176J120545J238412J373292J566588J800222J913711
4520F3183697K019689K334500K480591K665005K935849L217982L344619L715432
4512H5897364L847059M251745M359487M833009M956273N349308N599670N844154
4504A24938069O204717O461340O526971O657284O747698O732631O499880O446264
4496A77214854N950570N428905M836815L978778L123984K425448J567079N74751
$$ plain form
4555 34254100 34756270 35339676 35874028 36446882 37168558 37869795 38699258 39568987 40433867
4546 40433867 41352332 42319656 43193886 44122712 44975368 45788070 46496907 47188650 47715285
4537 47715285 48116761 48689904 49012248 49439931 49897532 50335744 50836363 51591442 52303990
4528 52303990 53114751 54170927 55291472 56529884 57903176 59469764 61269986 63183697
4520 63183697 65203386 67537886 70018477 72683482 75619331 78837313 82181932 85897364
4512 85897364 89744423 93996168 98355655 103188664 108144937 113494245 119093915 124938069
4504 124938069 131142786 137604126 144131097 150788381 157536079 164268710 170768590 177214854
4496 177214854 183165424 188594329 193431144 197409922 200533906 202959354 204526433 205101184
4488B05101184m79030j209872k036743k845665l710850m196691m663839n266285
4480A80692209n721629n863963o144903o122292o221974n984755n969152n743055
4472A32920486n635830n250264n026082m697835m587931m089307l984356l673557
4464I5975324l471922l333520l091734k871693k676517k563569k256828k150251
4456G3559290k092769j788382j746528j436081j397235j271500j098213r18610
4448F1809972p41845p10239o70895m80766l95663m68198l08957m22457m01245
4439E7209707m61940m35415m96079o62798p87815p91450p47110r64837o88863
4430E1173400q95248q19096o86398o78879n71602m24157m56884l77388k58114
$$ plain form
4488 205101184 204622154 203412282 201375539 198529874 194819024 190622333 185958494 180692209
4480 180692209 174970580 169106617 162961714 156839422 150617448 144632693 138663541 132920486
4472 132920486 127284656 122034392 117008310 112310475 107722544 103633237 99648881 95975324
4464 95975324 92503402 89169882 86078148 83206455 80529938 77966369 75709541 73559290
4456 73559290 71466521 69678139 67931611 66495530 65098295 63826795 62728582 61809972
4448 61809972 61068127 60357888 59686993 59206227 58810564 58342366 58033409 57610952 57209707
4439 57209707 56747767 56312352 55816273 55153475 54365660 53574210 52827100 51862263 51173400
4430 51173400 50278152 49459056 48772658 48093779 47522177 47098020 46641136 46263748 46005634
4421D6005634r3520j34734j15108L5715Q8828R6383K09847J37938K11755L15035
4411D6757773K31306K98506L03158L55592L21584L19954L21047M24600M23569
4402D9757089L55473N52556N44296N74794N48725P07973O75806P66307P90225
4393E5273244P71849Q87874Q23010Q15241Q04580P98270Q08326Q77637P28011
4384F2588042P38026P98585O21277O79137N96303O25083N80061N21748M15015
4375F8163277M07098M31955M55223L28867L91167M01072L44624K69553L66499
4366G1559335M24352L99315L27590L35119L17694K82020L59730M08498L73642
4357G4787295K72044L37382L11815L44437K98867L08227K33734J78634O1047J77337
$$ plain form
4421 46005634 45912114 45777380 45662272 45697987 45786815 45883198 46093045 46230983 46442738 46757773
4411 46757773 46989079 47287585 47590743 47946335 48267919 48587873 48908920 49333520 49757089
4402 49757089 50112562 50665118 51209414 51784208 52332933 53040906 53716712 54483019 55273244
4393 55273244 56045093 56932967 57755977 58571218 59375798 60174068 60982394 61860031 62588042
4384 62588042 63326068 64124653 64745930 65425067 66021370 66646453 67226514 67748262 68163277
4375 68163277 68570375 69002330 69457553 69786420 70177587 70578659 70923283 71192836 71559335
4366 71559335 71983687 72383002 72710592 73045711 73363405 73645425 74005155 74413653 74787295
4357 74787295 75059339 75396721 75708536 76052973 76351840 76660067 76893801 77072435 77133482 77310819
4347G7310819P0689m4415m7409j16305l2987k19533r1239j40422r8371j93093
4337G6397734j66708q1644K6953o6131j5265P5626N2905J58240J03719P7187K27543
4326G6790159K97010L08235K95067L03564M46690M06520N94620N38996N65541
4317H0546402N73392O32753O73016P52765Q73316Q47355J044965J262561J321885
4308H8528410J384660J698295J979756K066067K388281K647512K926034L060108
4300A06679123L482496L641774M073492M223771M696807M859106N168005N473503
4292A42298077N735941N990808O020777O205896O298012O064437N969196N845240
4284A90428384N398984M962747M310658L889954L134590K393894J802630J090801
$$ plain form
4347 77310819 77381508 77337093 77289684 77173379 77140392 76920859 76829620 76689198 76590827 76397734
4337 76397734 76231026 76149382 76176335 76110204 76094939 76170565 76223470 76381710 76485429 76562616 76790159
4326 76790159 77087169 77395404 77690471 77994035 78440725 78847245 79441865 79980861 80546402
4317 80546402 81119794 81752547 82425563 83178328 84051644 84898999 85943964 87206525 88528410
4308 88528410 89913070 91611365 93591121 95657188 98045469 100692981 103619015 106679123
4300 106679123 110161619 113803393 117876885 122100656 126797463 131656569 136824574 142298077
4292 142298077 148034018 154024826 160045603 166251499 172549511 178613948 184583144 190428384
4284 190428384 195827368 200790115 205100773 208990727 212125317 214519211 216321841 217412642
4276B17412642M04511k02064p68362j533242k104679k629496l222112l872752
4268B03484446m193397m688475n056207n581871n938895o399558o539716o662500
4260A58423827o818458o647442o334880o175584n962805n456026n359227m906820
4252A10762585m683359m307660m029263l794566l603231l256376k952436k946484
4244H1189210k667403k397239k282454k195390j866631j728330j650130j475170
4236F4926463j252619j346482j074991r56116q68655o72136p68524l69274k69094
4227E7348572j13057J70403K40516N10040K45977k70771r71911j463368j996754
4218E3699647k294476k010032j820907j486847j473056j357925j102198r79008
$$ plain form
4276 217412642 217817153 217615089 216846727 215313485 213208806 210579310 207357198 203484446
4268 203484446 199291049 194602574 189546367 183964496 178025601 171626043 165086327 158423827
4260 158423827 151605369 144957927 138623047 132447463 126484658 121028632 115669405 110762585
4252 110762585 106079226 101771566 97742303 93947737 90344506 87088130 84135694 81189210
4244 81189210 78521807 76124568 73842114 71646724 69780093 68051763 66401633 64926463
4236 64926463 63673844 62327362 61252371 60296255 59427600 58755464 57986940 57617666 57348572
4227 57348572 57235515 57405918 57646434 58156474 58402451 58131680 57159769 55696401 53699647
4218 53699647 51405171 49395139 47574232 46087385 44614329 43256404 42154206 41175198
4210D1175198q97312q04024n93950o03414m87274m82489l02464l24960k69542
4201C6409769j20799k03416J6347n021k2968k0112J02891P1092k4240K6146K8208
4190C6257897K4820l9458J08560l9283K6458q5208O8704J86283K0802L39419L57039
4179C7226033K40224L34261M68079M18303O37530N83297P81737P24043P83750
4170D2197257R75877J160600J147953J422550J338348J656506J720447J828699
4162E3448237K116464K002308K439137K262053K722045K858156K871648L019487
4154G3739535L081317L386299L241197L435129L413626L562785L357262L355768
4146A00572918L161968K917521K609353K176252J836357J390588Q98661L09137
$$ plain form
4210 41175198 40277886 39473862 38879912 38276498 37789224 37306735 37004271 36679311 36409769
4201 36409769 36288970 36085554 36101901 36096880 36073912 36053800 36156691 36227783 36203543 36229689 36257897
4190 36257897 36282717 36243259 36351819 36312536 36338994 36253786 36322490 36508773 36529575 36868994 37226033
4179 37226033 37466257 37800518 38268597 38686900 39324430 39907727 40689464 41413507 42197257
4170 42197257 43173134 44333734 45481687 46904237 48242585 49899091 51619538 53448237
4162 53448237 55564701 57567009 60006146 62268199 64990244 67848400 70720048 73739535
4154 73739535 76820852 80207151 83448348 86883477 90297103 93859888 97217150 100572918
4146 100572918 103734886 106652407 109261760 111438012 113274369 114664957 115563618 115872755
4138A15872755k92822o51957j373412j708618k325975k680115k995969l324620
4130A00519267l538263l653873l742227l716301l694439l683093l397381l380116
4122G1713574l199354l054060k877903k755443k515724k361606k210470j953399
4114E0785615k004849j775540j819380j503753j548501j341127j340045j158966
4106C8293454j119512j083478j029739q98122q51012p89917p16083o56009o04365
4097C0545217o30179m06047m91619m26254m07785l69943l24211l74088k98624
4088B6816467l27274l07653l48476l63676l80316m17295m16813m96077n19465
4079B3239422m07710n75441m01530m30747l98955m45433l60059k98038k80367
$$ plain form
4138 115872755 115579933 114927976 113554564 111845946 109519971 106839856 103843887 100519267
4130 100519267 96981004 93327131 89584904 85868603 82174164 78491071 75093690 71713574
4122 71713574 68514220 65460160 62582257 59826814 57311090 54949484 52739014 50785615
4114 50785615 48780766 47005226 45185846 43682093 42133592 40792465 39452420 38293454
4106 38293454 37173942 36090464 35060725 34162603 33311591 32521674 31805591 31149582 30545217
4097 30545217 29915038 29508991 29017372 28591118 28183333 27813390 27489179 27115091 26816467
4088 26816467 26489193 26181540 25833064 25469388 25089072 24671777 24254964 23758887 23239422
4079 23239422 22831712 22256271 21854741 21423994 21025039 20579606 20219547 19921509 19641142
4070A9641142l04635l57826l09398l04560k79606k50617k84986k53989j33003
4061A7162522j26286k03681j50890j86931j44894j49268j03988j19940n9038j21614
4051A5795992Q334j3385r4815L23n5492O5800j33311n8619m6642J1029n3572J3730
4039A5439372K640L7779J37356j2064N7286L7916J08026P4887r7051J67517J92557
4028A6146221K8329K02439J5184K26213M0471J95856J92208J30239J80254K06504
4018A7563918J79577J65186K86383J62882J08542L01886K36329K60014J56982
4009A9421699J34969L76522L24601L47313K95377L55647L44278K94584L82914
4000B2277904M44344L82588M72182M64382M93836O43616M13912P13109N35313
$$ plain form
4070 19641142 19336507 18978681 18669283 18364723 18085117 17834500 17549514 17295525 17162522
4061 17162522 17036236 16832555 16681665 16494734 16349840 16200572 16096584 15976644 15917606 15795992
4051 15795992 15804326 15790941 15696126 15696449 15640957 15706757 15573446 15514827 15468185 15479214 15425642 15439372
4039 15439372 15442012 15479791 15617147 15605083 15662369 15700285 15808311 15883198 15786147 15953664 16146221
4028 16146221 16174550 16376989 16392173 16618386 16658857 16854713 17046921 17177160 17357414 17563918
4018 17563918 17743495 17908681 18195064 18357946 18466488 18768374 19004703 19264717 19421699
4009 19421699 19556668 19933190 20257791 20605104 20900481 21256128 21600406 21894990 22277904
4000 22277904 22722248 23104836 23577018 24041400 24535236 25178852 25592764 26305873 26841186
3991B6841186P17156P13242P14921R26500P89773R49024Q81524J056956J048815
3982C4639097J230671J284691J258501J412881J495937J655254J603752J728344
3974D6309128J884271J967000K086066K294785K418843K695737K817865L029879
3966F5503574L391189L628698L908587M292179M662096N074098N413177N861251
3958A01734849O297780O874405P412522P988754Q747425R336558J0137355J0780912
3950A69310560J1468076J1989604J2810671J3275723J3556216J4545105J5242354
3943B62198309J6243802J7237409J8635579J9924042K0678139K1269533K0768061
3936C96954874J9431223J6313428J1829170N923441r64682p894069j3861622j8579513
$$ plain form
3991 26841186 27558342 28271584 28986505 29913005 30702778 31651802 32533326 33590282 34639097
3982 34639097 35869768 37154459 38412960 39825841 41321778 42977032 44580784 46309128
3974 46309128 48193399 50160399 52246465 54541250 56960093 59655830 62473695 65503574
3966 65503574 68894763 72523461 76432048 80724227 85386323 90460421 95873598 101734849
3958 101734849 108032629 114907034 122319556 130308310 139055735 148392293 158529648 169310560
3950 169310560 180778636 192768240 205578911 218854634 232410850 246955955 262198309
3943 262198309 278442111 295679520 314315099 334239141 354917280 376186813 396954874
3936 396954874 416386097 432699525 444528695 450452136 449487454 441593385 427731763 409152250
3928D09152250k1563339k2992458k3227254k2603972k1622839k0017264j8435678
3921B58689446j6966506j5278247j3899027j2486300j1450928j0394856r380578
3914A68833004q803282q180192p614297o989787o837758o407653o034404n757455
3906A12208176n412605n077144m687837m413770m245222l941274l635126l461098
3898G7334100l186692l144907k897941k648331k600172k407056k277765k213506
3890E5957730k091535j943848j876739j689046j657864j592576j409191j460472
3882D2236459j300176j320898j260567j168158j157327q89054j131170r29432
3874C3079677r44653r07404p68027q51157q96881o61912o42167p05687o78105
$$ plain form
3928 409152250 387588911 364596453 341369199 318765227 297142388 277125124 258689446
3921 258689446 241722940 226444693 212545666 200059366 188608438 178213582 168833004
3914 168833004 160029722 151849530 144235233 137245446 130407688 124000035 117965631 112208176
3906 112208176 106795571 101718427 97030590 92616820 88371598 84430324 80795198 77334100
3898 77334100 74147408 71002501 68104560 65456229 62856057 60449001 58171236 55957730
3890 55957730 53866195 51922347 50045608 48356562 46698698 45106122 43696931 42236459
3882 42236459 40936283 39615385 38354818 37186660 36029333 35140279 34009109 33079677
3874 33079677 32135024 31227620 30459593 29608436 28711555 28049643 27407476 26701789 26023684
3865B6023684p55824n38976o17513n45504n62169m75480n97059m30996n27659
3856B0972504l34770m03735l93093m97912l08608l44287m11437k82118l47107
3847A7649437l76637k97142k34491l26012k95970k30115l39340k28794l16522
3838A5004414k55981k75939k07743k96915k08371j60953k39030k49017k83493
3829A2826972j27680j51973k53427j99680q2955j87391k46144j37735j56245j69310
3819A1114432j47741k55892k04150P203k07168j63613j08122k55876l6263j40821
3809I601989j81557p4483j42598p6426j16664k19137r3438o5467j34104o8310
3799H429805j17135o7993j56172r0997j3772j60272l3176j49101p5128j65936
$$ plain form
3865 26023684 25267860 24728884 24111371 23565867 23003698 22528218 21931159 21500163 20972504
3856 20972504 20637734 20233999 19840906 19342994 19034386 18690099 18278662 17996544 17649437
3847 17649437 17272800 16975658 16741167 16415155 16119185 15889070 15549730 15320936 15004414
3838 15004414 14748433 14472494 14264751 13967836 13759465 13598512 13359482 13110465 12826972
3829 12826972 12699292 12547319 12293892 12094212 12011257 11823866 11577722 11439987 11283742 11114432
3819 11114432 10966691 10710799 10506649 10513852 10306684 10143071 10034949 9779073 9742810 9601989
3809 9601989 9420432 9345949 9203351 9126925 9010261 8791124 8697686 8632219 8498115 8429805
3799 8429805 8312670 8244677 8088505 7997508 7983736 7823464 7790288 7641187 7566059 7400123
3789G400123k2283k9783j23180N3748j96382j09622m9930k39653Q7341j019p2050
3778F697310p8794l9506j25572q5297j710r2823p6330J8488j41249j2012r5434
3767E967071r4005P6859o0918k02967R3652p8321L1962j14563q9127l3338o0222
3756E436083N3441r8202r5825n4243L6675p0584o0880o8329n5546K0976j60594
3745D882972Q6512j07458M2692j05792k014J3650n4553j9113j04931k3110l0253
3734D578602j11858q003k4804J2789j02665P514L648l9499j714J9345p9370K7815
3722D281800p3105m071j8958K7734n9359K0091o793N0032k0575L3960p184J9582
3710D243154j24502N6539j366K6394j7164N0526J01420M7698m1640N0572K2186
$$ plain form
3789 7400123 7377840 7348057 7224877 7278625 7082243 6972621 6922691 6683038 6770379 6769360 6697310
3778 6697310 6618516 6579010 6453438 6368141 6366431 6273608 6197278 6215766 6074517 6062505 5967071
3767 5967071 5873066 5949925 5889007 5686040 5779692 5701371 5733333 5618770 5529643 5496305 5436083
3756 5436083 5489524 5391322 5295497 5241254 5277929 5207345 5146465 5078136 5022590 5043566 4882972
3745 4882972 4969484 4862026 4904718 4798926 4796912 4810562 4756009 4736896 4631965 4608855 4578602
3734 4578602 4466744 4458741 4433937 4446726 4344061 4351575 4355223 4315724 4314010 4333355 4253985 4281800
3722 4281800 4208695 4204624 4185666 4213400 4154041 4174132 4167339 4217371 4196796 4230756 4223572 4243154
3710 4243154 4118652 4175191 4173825 4200219 4183055 4233581 4335001 4382699 4341059 4391631 4413817
3699D413817J03761p603M7853M9565J49650r7270K2446J39159J6285K11536m2496
3688E006703R2958k2166J24222r0034q3076N3724r8079p9506j06572j31168j69226
3677D497780q0176l0125j05280o8765k18991o809r6699r527j31536o7087j18466
3666C564319r1490n81j08024p327j20009k4610l079r5809j4697j3337p2337R27
3654C013946J4356r2257j3096L1193j33721r3755P0043j26404J4896m7814j8670
3643B618717Q7759j14324k58l303J6654m4336j07902J08395r5445Q17R9l6873
3631B430000M4329l9801j34562M6131o8983J8808O9569j53227R3118j07009m2716
3620B155657Q2374l6644l9124J9317l3836J8472r384o7581M2374j1432k7224o773
$$ plain form
3699 4413817 4517578 4509975 4557828 4607393 4757043 4659773 4682219 4821378 4837663 5049199 5006703
3688 5006703 5099661 5077495 5201717 5111683 5028607 5082331 4984252 4904746 4798174 4667006 4497780
3677 4497780 4417604 4387479 4282199 4213434 3994443 3987634 3890935 3881408 3749872 3682785 3564319
3666 3564319 3472829 3472248 3364224 3356897 3236888 3212278 3209199 3113390 3098693 3085356 3013019 3013946
3654 3013946 3028302 2936045 2922949 2954142 2820421 2726666 2796709 2670305 2685201 2637387 2618717
3643 2618717 2706476 2592152 2591894 2588591 2605245 2560909 2453007 2561402 2465957 2466774 2466873 2430000
3631 2430000 2474329 2434528 2299966 2346097 2277114 2295922 2365491 2212264 2305382 2198373 2155657
3620 2155657 2238031 2201387 2162263 2181580 2147744 2166216 2156832 2089251 2131625 2120193 2092969 2086196
3608B086196k6133O1349q5149M3633m3621j9666r967q953j08905N1826l5449O4485
3596A969646L7376p0544K0923j6918o3216M5998n7156j6028Q5770o8771N8539
3585A925619m8293l1300K9729l3968p1286M8512n6276O5757j7851m5475j3244
3574A751924N0800k9979K5379q6606L8841p0120l4869R084j7793o3353L0670O4312
3562A668290l1430L7919J5963n1007k6630L3646n7173j5916J22184r7762k2463
3551A575621K7385l1762J8739Q3590j37705K5552N6591o8456L9580r7234J9847
3540A511748K8955l4601j8759l8057P1901J1361J982j02747L8424O671j29625
3529A347253N1603p852l3203l4958M5566P8821j28827j4151R2721P62q5762m050
$$ plain form
3608 2086196 2060063 2121412 2036263 2079896 2036275 2016609 2006642 1997689 1888784 1940610 1905161 1969646
3596 1969646 2007022 1936478 1957401 1940483 1877267 1923265 1866109 1850081 1935851 1867080 1925619
3585 1925619 1877326 1846026 1875755 1841787 1770501 1819013 1762737 1828494 1810643 1765168 1751924
3574 1751924 1802724 1772745 1798124 1711518 1750359 1680239 1645370 1654454 1636661 1573308 1603978 1668290
3562 1668290 1636860 1674779 1690742 1639735 1613105 1646751 1589578 1573662 1695846 1598084 1575621
3551 1575621 1603006 1571244 1589983 1673573 1535868 1561420 1618011 1549555 1589135 1491901 1511748
3540 1511748 1540703 1506102 1487343 1449286 1521187 1532548 1534530 1431783 1470207 1476878 1347253
3529 1347253 1398856 1391004 1357801 1322843 1368409 1447230 1318403 1304252 1396973 1397735 1311973 1307923
3517A307923O3255K036K267n5567q1859M7122J3488l8498L0841O0961l1243j1898
3505A308828j04464J2989L0063J7222n8343Q7446o0452l0793k903K1027M467n5914
3493A169173M6023k3583J4277n8319J61j9689m8078P5077q4243Q7643m1543L1349
3481A148248j7799R070Q552j04726P5882l3987k5964N0987R6205q0433R703j59136
3469I76602J51631l0507Q96l5083L5064j7803o4407M6848M0598o5307K95j1217
3457A027610J4052L7761j32658N5923l9076K9083l076O019M7695n6439j043N3034
3445A038885q645j19021R8461R8779j15594k2123N7991j3550o7364N1656n171
3434I94304l4322J03557j50160O1275r2393J36331o3144O4807r4274N3350l539
$$ plain form
3517 1307923 1371178 1373214 1375481 1319914 1238055 1285177 1298665 1260167 1291008 1351969 1320726 1308828
3505 1308828 1204364 1217353 1247416 1264638 1206295 1293741 1233289 1202496 1199593 1220620 1225087 1169173
3493 1169173 1215196 1191613 1205890 1147571 1147732 1128043 1079965 1155042 1070799 1158442 1116899 1148248
3481 1148248 1130449 1139519 1148071 1043345 1119227 1085240 1059276 1110263 1206468 1126035 1135738 976602
3469 976602 1128233 1097726 1098622 1063539 1098603 1080800 1016393 1063241 1103839 1038532 1038827 1027610
3457 1027610 1041662 1079423 946765 1002688 963612 992695 989619 995638 1043333 986894 985851 1038885
3445 1038885 1030240 911219 1009680 1108459 992865 970742 1028733 1015183 947819 999475 994304
3434 994304 959982 1063539 913379 974654 882261 1018592 955448 1020255 925981 979331 975792
3423I75792k7271q2793O4831n2811P3545k7519k4563J66438j87165n3999O7859
3412H92344j4311k1670J7799Q1711q1884m7591R7825q4373n573K1757J16598p5526
3400H97106q9146R7707j4097n918j1148L4375j9048R6727o1381k985K9416j0663
3388I40945j06456O7090J3698J3225o7730P3542n5176R510M6852k2930p6491P4882
3376I10961q84P315k7889Q1500r6306l7927N4761L2092L6021p310K7998m7689
3364I32643l6053O7192N486o8853n70k5918J47716n2869K1254r1203P718Q9421
3352I95964p4900J31874j34043Q2216j3360N1651J8050n1375O0428K8844J6041
3341A111390j5513Q2442L9928j0661M9796o055P0157N4447k0776J21001j0074
$$ plain form
3423 975792 948521 865728 930559 877748 951293 923774 899211 1065649 878484 824485 892344
3412 892344 878033 856363 874162 955873 873989 826398 924223 839850 834277 856034 972632 897106
3400 897106 807960 905667 891570 885652 874504 908879 889831 986558 925177 922192 951608 940945
3388 940945 834489 901579 915277 928502 860772 934314 879138 888648 935500 912570 836079 910961
3376 910961 910077 917392 889503 971003 874697 836770 891531 923623 959644 952334 980332 932643
3364 932643 896590 963782 969268 900415 899845 873927 1021643 968774 990028 898825 906543 995964
3352 995964 921064 1052938 918895 1001111 987751 1039402 1057452 1006077 1066505 1095349 1111390
3341 1111390 1095877 1178319 1218247 1207586 1257382 1251327 1321484 1375931 1355155 1476156 1466082
3330A466082J85526j8356J12295J99442j7852J11040J94069R3390J60537J79969
3320B666142K20242J72339M52929J62902K58960L52401L09459L72635K92432M57314
3310E717755L79508P68553Q52711R39050J186053J742734J757683J155943M26804
3301A4926794j19191j334642k018413j607540j316299j051352r51458p05618n71845
3292E250436m99404l09158k81179l90832k14390k63247k43756k07298k20237l1921
3282B589014j87534j30855j29739j08969j65163K9067j48990M1290n7967j67890
3272A562264n4151j0172r7547n6416m2506o6044N1814p6348l2780r1445O3439
3261A150108j8005m5412p1111k0276L1425n8615K3939m8361l4485J6248J0414
$$ plain form
3330 1466082 1651608 1633252 1745547 1944989 1927137 2038177 2232246 2325636 2486173 2666142
3320 2666142 2886384 3058723 3511652 3674554 3933514 4285915 4595374 4968009 5260441 5717755
3310 5717755 6097263 6865816 7718527 8657577 9843630 11586364 13344047 14499990 14926794
3301 14926794 14807603 13472961 11454548 9847008 8530709 7479357 6527899 5822281 5250436
3292 5250436 4751032 4441874 4160695 3769863 3555473 3292226 3048470 2841172 2620935 2589014
3282 2589014 2401480 2270625 2140886 2031917 1866754 1895821 1746831 1788121 1730154 1562264
3272 1562264 1508113 1497941 1400394 1343978 1301472 1235428 1287242 1210894 1178114 1086669 1150108
3261 1150108 1132103 1086691 1015580 995304 1026729 968114 992053 943692 909207 925455 935869
3250I35869j11478N4579j8693l7273k0484M7164j0595j00444Q2420n8310M13n1283
3238G11885M737R1793r8892N8387o4430Q2689j10920J8727m9606j631P072K5918
3226F75729N6033m2277J4663P585m2236k6878M991l2835p809J9325p0748M8427
3214F03970j9974J9101k8660N842L6305p3825J7429J3388J3103m0801P0790j13746
3202E02922M1720o3147K1322M3069J211k7912j6739o0227J48361q7772m0157J1589
3190D74240J4659J9969K1850K4155q8363L5076q0210k6602J56249j4042q4364
3179D52617j9680m079J07394o3337K5993r4185O6235K1935j12110R219M9607q1030
3167C58579O6935M6756o2164K9420K8229k5425k4081l661k62Q3870q0969R821
$$ plain form
3250 935869 824391 878970 860277 823004 802520 849684 839089 738645 821065 762755 763168 711885
3238 711885 716622 808415 709523 767910 703480 786169 675249 693976 644370 642739 649811 675729
3226 675729 731762 689485 704148 711733 669497 642619 647610 614775 606966 626291 555543 603970
3214 603970 583996 603097 574437 580279 616584 542759 560188 573576 586679 545878 616668 502922
3202 502922 544642 481495 502817 545886 547097 519185 502446 442219 590580 502808 462651 474240
3190 474240 488899 508868 530718 554873 466510 501586 421376 394774 551023 536981 452617
3179 452617 432937 428858 536252 472915 498908 404723 470958 492893 380783 390002 439609 358579
3167 358579 425514 472270 410106 439526 467755 442330 418249 414588 414326 498196 417227 427048
3155D27048k742k6158K6824L7202k3180J2287j8143K388k8626M1756o5632J4365
3143C97389M6826o3974K4450j01021J52512r7045M9484n193j6522n1491J5747
3132C51162j7757L5522m707q5945J32076m3174r5098J50697r1202Q7352r1977
3121C26949J12774p5581j3818K7125j8300l9215O2374K8495o0940J15611j47311
3110C18163Q7775m8326p5810q423k249N9133j8321j0079O1573l0740L6624q6050
3098B83270L4347K358J2508o6591P0897n4474J9890m2843J21062p1059N2687q4069
3086B77983P8310r0186Q6434n3763m7012N5488q742K5366J1281m3795M7051o2163
3074B76252L4868Q714k0163P1075o0318r082P5215k1330r292n543l6752N6264
$$ plain form
3155 427048 424306 398148 424972 462174 438994 451281 433138 435526 406900 448656 383024 397389
3143 397389 444215 380241 404691 303670 456182 359137 408621 403428 386906 335415 351162
3132 351162 333405 368927 364220 278275 410351 367177 272079 422776 331574 418926 326949
3121 326949 439723 364142 350324 377449 359149 319934 382308 410803 349863 465474 318163
3110 318163 405938 357612 281802 273379 271130 330263 311942 301863 363436 332696 369320 283270
3098 283270 317617 319975 332483 265892 336789 282315 302205 259362 380424 309365 362052 277983
3086 277983 356293 266107 352541 298778 251766 307254 298512 323878 335159 291364 338415 276252
3074 276252 311120 319834 299671 370746 310428 301346 376561 355231 345939 340396 303644 359908
3062C59908j18589r03R9864l0060o6206j5467L5277N8119n3874J25538j10600
3051B83007j06416k5347N6821k5631N8330Q1660j37135Q2201j21449P1244J8392
3040B35677L9988n7864j057R080M0528L7731j41045o8312J78863r4302L0218N2671
3028B62176p9113K6144N4737k6408Q3044j35255J3127K7263M1157m3896m668M9255
3016B67563l8660p3934J05513m6364J7885l27O733J955M8883j10473O4934n2548
3004A91160L2410k5191n128R990k0894P6722q1426L2504k0517j5175j9500N8627
2992B13582l5904m5702m4964N5202n2683J13316k2799L1359n65m0044M7271L7504
2980B55573j34413K4912k3689K6368R2304k9450k8183p5823L9959j3560O2438
$$ plain form
3062 359908 241319 240416 340280 310220 244014 228547 263824 321943 268069 393607 283007
3051 283007 176591 151244 208065 182434 240764 322424 185289 267490 146041 217285 235677
3040 235677 275665 217801 216744 225824 266352 304083 163038 94726 273589 179287 209505 262176
3028 262176 183063 209207 263944 237536 320580 185325 198452 225715 266872 222976 218308 267563
3016 267563 228903 154969 260482 214118 232003 231676 238409 240364 289247 178774 243708 191160
3004 191160 223570 198379 193251 203241 182347 259069 177643 210147 189630 174455 154955 213582
2992 213582 177678 131976 87012 142214 89531 202847 180048 211407 210842 170798 218069 255573
2980 255573 121160 146072 122383 148751 241055 211605 183422 107599 147558 133998 196436
2969A96436m6586o1922N2591Q1097l6351o9072R9731n2929j4728k7251L0537M272
2957A55825J6326K6128j29505J85488j33028p6998P8079Q9147o423m0884O024
2946A70179j73637P8074L0166R9702m6132o9013p7743K01739n4372n3116P4868
2935A80715j5675L3552j1572l548o6586J1797l6780K9580m8866N1388N3873J3772
2923A91650l3579m5152P160o853M9531q092r606K2920k623P654k4935L1224p6462
2910A02837R9965o9781J44443r8291m5758K0175k3060j7004j0978J8006R6267
2899B16821j07602N167o604k4776J13598r9935N7731r7381P3266q1996M594J15910
2887A68793r4241J2398n5503Q3758j0926r5289K01366r7198l6672O6531k9953
$$ plain form
2969 196436 149850 87928 140519 221616 185265 116193 215924 162995 148267 121016 151553 155825
2957 155825 172151 198279 68774 254262 121234 44236 122315 211462 205039 164155 170179
2946 170179 -3458 74616 104782 204484 158352 89339 11596 213335 158963 105847 180715
2935 180715 165040 198592 187020 183472 116886 128683 91903 121483 72617 124005 177878 191650
2923 191650 158071 112919 120079 113226 162757 154665 145059 167979 165356 173010 148075 179299 102837
2910 102837 202802 133021 277464 179173 133415 153590 130530 113526 102548 120554 216821
2899 216821 109219 114386 107782 83006 196604 96669 154400 57019 130285 48289 52883 168793
2887 168793 74552 86950 31447 115205 104279 8990 210356 113158 76486 143017 113064
2876A13064K1272r9258M4038K4267r498N3272j7706J1421N2806j24843O1005k4038
2864A05802r9550J4600M2755O2305J4880j25058L3758Q0730l9655l3036O4527
2853A22058m2416Q8j6688P5143q9043j9087k83L8477k599N7047p1364J5599N6933
2840A23865o2382P899k5623O5395j18101Q5848J1332m2715r765O4308p7143o6532
2828d3614J04284l5658R8733j05382K2940O8744q632N4316o3912q074j7488q6316
2816b0059O6958o082P3721r1234m8446J38040j02835N6439m5100Q2735n6953N0659
2804I7843j6969Q2572j09309J4224k1698P3362R342j05606O4189p0639J0820j9158
2792H973k0098L6103L7740q7436J30581p4452p709q2814L7248J14432r4557R2996
$$ plain form
2876 113064 134336 35078 79116 103383 93885 147157 129451 140872 193678 68835 129840 105802
2864 105802 6252 20852 63607 125912 140792 15734 49492 130222 90567 57531 122058
2853 122058 79642 79730 63042 138185 49142 30055 29772 68249 65650 122697 51333 66932 123865
2840 123865 61483 69382 43759 109154 -8947 76901 88233 45518 35753 100061 22918 -43614
2828 -43614 60670 25012 123745 18363 41303 110047 101415 155731 91819 83745 66257 -20059
2816 -20059 46899 40817 114538 23304 -25142 112898 10063 66502 21402 104137 47184 97843
2804 97843 80874 163446 54137 68361 46663 120025 129367 23761 87950 17311 28131 8973
2792 8973 -11125 24978 62718 -24718 105863 31411 23702 -59112 -21864 92568 -1989 91007
2780I1007j11624O0140q0253M3719N6663M822m251l7116q64M5329l0078Pj2799
2767B4702k4666P2574R3444j25141l6997K6113n9748K3322N2066j25439J32525
2756E2755m7465J07216j27125O0793o690m0210O6802k8151J689J1689m5029P2119
2744G8393j19797J00515p4097N884M0698L7175l3139p0199N8160l716j0015j8596
2732h734n4471O280L9710Q803R162J6127p0093J06798r2697k3248Q6372J0131
2720C4140o4052K8312l3680O161J10592l577r42q8809R3988o1253p017k3835Q4024
2707G4052m1398l0752M2162n5559l6882K4540k3266M5684m6646M27R2266r4747
2695e0119m82j6110R9570o0643L4434k5132P0668n1871j1384p7409J0055Q8493
$$ plain form
2780 91007 -20617 39523 -40730 2989 59652 64474 60223 23107 22243 67572 37494 37501 24702
2767 24702 36 72610 166054 40913 3916 30029 -29719 -6397 45669 -79770 52755
2756 52755 5290 112506 -14619 46174 39484 -726 66076 37925 39614 51303 6274 78393
2744 78393 -41404 59111 -14986 -9102 31596 68771 35632 -34567 23593 19877 9862 -8734
2732 -8734 -63205 -56925 -17215 -8412 750 16877 -53216 53582 -39115 -62363 24009 34140
2720 34140 -29912 -1600 -35280 -29119 81473 77896 76954 -11855 82133 20880 13863 -9972 74052
2707 74052 32654 1902 44064 -11495 -48377 -23837 -47103 -1419 -48065 -47638 44628 -50119
2695 -50119 -50601 -66711 32859 -27784 6650 -18482 52186 315 -11069 -88478 -78423 10070
2683A0070l8926L0695L338p091p388J8534p2729N6018l6354j8791j291k5993K7740
2670f2168M7342M1064l0312r230m6178J5996L2802j4215r114J8628L413l5662
2658d7634Q0654q8154K8943m594K6538l0737l2858P8466q1848N6094l1351P5235
2646B8754l79j0486j19221J01172p5702N5517l3818P6667P572l9381j4615n5984
2634g9904P8447O274n579q7125k315n398J55106o1719K0328l0000P583q0363L3846
2621e0819o33J2260p2387Q3937R6914r0473L4776p3816J19039j44051J2367M2360
2609c0526O4283j05310M2970M6589p7028K8640M971j5923J7911j5941p7157M3866
2597g2655J11914r3108J3880J0282r9003J5985N9554k6424M3238m8146K9293r5144
$$ plain form
2683 10070 -28856 1839 5177 -1914 -9302 9232 -63497 -7479 -43833 -62624 -63915 -89908 -62168
2670 -62168 -14826 26238 -4074 -13304 -59482 -43486 -10684 -24899 -34013 -15385 -11972 -47634
2658 -47634 33020 -55134 -26191 -30785 -4247 -34984 -67842 10624 -71224 -15130 -46481 28754
2646 28754 28375 17889 -101332 -160 -75862 -20345 -54163 22504 30076 -9305 -23920 -79904
2634 -79904 -1457 4817 -762 -87887 -90202 -95600 59506 -2213 18115 -11885 -4302 -84665 -50819
2621 -50819 -51452 -39192 -111579 -27642 69272 -21201 13575 -60241 58798 -85253 -72886 -30526
2609 -30526 33757 -71553 -28583 18006 -59022 -30382 -25411 -41334 -23423 -39364 -116521 -72655
2597 -72655 39259 -53849 -39969 -29687 -128690 -112705 -53151 -79575 -36337 -84483 -55190 -150334
2585a50334O6716R7394l6557L3104q7174J9761K4662n9611k1689N6736J9492L1832
2573e668q7008K2900Q668M7478l1854o4276J58167j22400j1940N1038q9884P4136
2561e0643k200l3583j6411o686k6131N7832l923L1186m1759K8735k4399M2874
2549d5108K5349j15919L1248O0364l8036L482J5020j24605J38857O5578n8371
2538d2141q2874K773J18576j6493o4275j00572N1149L5297l5623M8141P6154n5979
2526f5867P4127q7522j8250L8028k5781n746J5595m2865N4158J4299j22749R7574
2514g4999p5496J37979j00714N3653j1504n9861K2943l87L4546j03690J23790
2503e3740J7045j1276q083j02462P682Q922J07433m6398r8455Q4956k9102N2362
$$ plain form
2585 -150334 -83618 13776 -22781 10323 -76851 -57090 -32428 -92039 -113728 -56992 -37500 -5668
2573 -5668 -92676 -69776 -61108 -13630 -45484 -109760 48407 -73993 -85933 -34895 -124779 -50643
2561 -50643 -52843 -86426 -102837 -109523 -135654 -77822 -81745 -50559 -92318 -63583 -87982 -45108
2549 -45108 -19759 -135678 -104430 -44066 -82102 -78620 -63600 -188205 -49348 16230 -42141
2538 -42141 -125015 -122242 -3666 -20159 -84434 -185006 -133857 -98560 -134183 -86042 -9888 -65867
2526 -65867 8260 -79262 -97512 -59484 -85265 -91011 -75416 -118281 -64123 -49824 -172573 -74999
2514 -74999 -150495 -12516 -113230 -59577 -71081 -130942 -107999 -108386 -73840 -177530 -53740
2503 -53740 -36695 -47971 -56054 -158516 -150834 -141912 -34479 -80877 -179332 -94376 -123478 -71116
2491g1116j37145J48844m7798O8992j36230Q7645o3726J6389L0573M7754q9593
2480a45411O6537o1421O1533m1202l1391l3071J95299j47298P756P1324m6577
2469a03922l2804l6716O4067k252m242N8323k5067o068q2788J59310o7763J7814
2457f2108L9262j73597J11967J7846r1811m7206J29393r6445Q8196j1296l4574
2446a30373K553J0986K8487j24832J69333p2459k1930K3700M9598p1559k8928
2435a65424N6560J9139R635R610q0638j9241O3064j1698o030J8473K8024m0551
2423a19077k6509m1843O9331L3499p2050R195m1397J147R3869K3258m6448m9850
2411a66875p688R5868n4929M3813l7638q1502J03631l8824l6115N1674J751j6323
$$ plain form
2491 -71116 -208261 -59417 -107215 -38223 -174453 -86808 -150534 -134145 -103572 -55818 -145411
2480 -145411 -78874 -140295 -78762 -119964 -151355 -184426 10873 -136425 -128669 -57345 -103922
2469 -103922 -136726 -173442 -109375 -111627 -115869 -57546 -82613 -88681 -171469 -12159 -79922 -62108
2457 -62108 -22846 -196443 -84476 -66630 -158441 -205647 -76254 -172699 -84503 -95799 -130373
2446 -130373 -127820 -116834 -88347 -213179 -43846 -116305 -138235 -114535 -64937 -136496 -165424
2435 -165424 -108864 -89725 -80090 -70480 -151118 -170359 -107295 -118993 -125023 -106550 -78526 -119077
2423 -119077 -145586 -187429 -118098 -84599 -156649 -147454 -188851 -187704 -93835 -70577 -117025 -166875
2411 -166875 -174563 -78695 -133624 -89811 -127449 -208951 -105320 -144144 -180259 -128585 -126834 -143157
2399a43157N2466o1850N937l946j7542N1864l6326L9389n277l0462j4706P8396
2387h5214m8902J8543m6743J344k9952J97127q5474n0497j4460K3084j0219p3361
2375b04724J41259j39374J06945Q226N859K2222m3716m7753L4260n4004l8038
2364b08838M640R5668q7210P1386q0180j7591k366M2576M6171l5627J7237J4964
2352a39170P8769o4876n5386J720k5792l9309Q9148K3433J4282k5473M4147o1848
2340a60355K5045k1676O5333k9595p2777j2085L0492q939N918M2949k4715M3366
2328a17039k6281K9441n6481M5211l3853L7268r117m1085l6045P6361k1644L2192
2316a21072L4906r9738l1783O9037N0019q903j05699P7895q742J0470l4904l1457
$$ plain form
2399 -143157 -90691 -152541 -146604 -150550 -168092 -116228 -152554 -113165 -118442 -148904 -163610 -85214
2387 -85214 -134116 -115573 -162316 -160972 -190924 6203 -79271 -129768 -144228 -121144 -131363 -204724
2375 -204724 -63465 -202839 -95894 -87668 -81809 -59587 -103303 -151056 -116796 -170800 -208838
2364 -208838 -204198 -108530 -195740 -124354 -204534 -222125 -224491 -181915 -135744 -171371 -154134 -139170
2352 -139170 -60401 -125277 -180663 -178943 -204735 -244044 -154896 -131463 -117181 -142654 -98507 -160355
2340 -160355 -135310 -156986 -91653 -121248 -194025 -206110 -175618 -184557 -178639 -135690 -160405 -117039
2328 -117039 -143320 -113879 -170360 -125149 -159002 -121734 -130851 -171936 -207981 -131620 -153264 -121072
2316 -121072 -86166 -185904 -217687 -148650 -98631 -107534 -213233 -135338 -144080 -133610 -168514 -199971
2304a99971Q7789m5197k074J405l5325n2913J10848p0821N7636k5552R8195j09345
2292a85325L0080j9907k6141L8059R730k0274k286N5352p8299R8963j443m7275
2280a48766K4258l9097M2924n8881p507R0673q0086O9730M5099j60049P1307M0722
2268a09673o5701L7952m0971L3392K7409j19654R2539N009q521L4561J8878o1145
2256a55925o487k7246J05453q2079m6761p831O0075M6654m7972J7310o6557m20
2244b11786J1874K677J47p3466K0652L8401L5048K2357o6318P9359o9515o8229
2232b78799J28806k4508P3494p660o6786P097K8654r2514M8288k812j656l5831
2220b24227Q5M6394j7230j1661N0925m9316N7272L4728k4701j12978J25022k8611
$$ plain form
2304 -199971 -112182 -157379 -159453 -158048 -193373 -246286 -135438 -206259 -148623 -174175 -75980 -185325
2292 -185325 -155245 -175152 -201293 -163234 -153504 -173778 -176064 -120712 -199011 -100048 -101491 -148766
2280 -148766 -124508 -163605 -120681 -179562 -187069 -96396 -176482 -106752 -61653 -221702 -150395 -109673
2268 -109673 -175374 -137422 -178393 -145001 -117592 -237246 -144707 -139698 -148219 -113658 -94780 -155925
2256 -155925 -162412 -189658 -84205 -166284 -213045 -220876 -160801 -114147 -162119 -144809 -211366 -211786
2244 -211786 -199912 -197235 -197088 -270554 -249902 -211501 -176453 -154096 -220414 -141055 -210570 -278799
2232 -278799 -149993 -174501 -101007 -108667 -175453 -168356 -139702 -232216 -183928 -186740 -188396 -224227
2220 -224227 -224142 -177748 -194978 -206639 -155714 -205030 -147758 -113030 -137731 -250709 -125687 -154298
2208a54298r3780k5266R4011N1426j33540Q4206p5735M6219O3297O4923q5688
2197a64225k4919n9162n0443R8121K6978n9783J7382Q2878j01301O4247j15702
2186b85929J36586r2165O5747k8017N5344l6403J6681l1836m4521j7572O0342
2175b01743m867K9375j0826J1106L481N8748o2950o9348Q2799k1265l8657J35352
2163h8795k3067o5442K5945r085l5534O9229l4215k4025J9371K7405k4926j1184
2151a74323n813O7984O295j30400M8262l6533N6310p2828L7063j1273p686L6477
2139a86465n0187L3487n7563J02410j02855N8497q0186Q0663k1400o4903J49974
2128a38528o1894J6325K4457q6194j527r074Q6549q106Q156n494l5419m266K1483
$$ plain form
2208 -154298 -248078 -273344 -179333 -127907 -261447 -177241 -252976 -206757 -143460 -78537 -164225
2197 -164225 -189144 -248306 -298749 -200628 -173650 -233433 -216051 -133173 -234474 -170227 -285929
2186 -285929 -149343 -241508 -175761 -203778 -148434 -184837 -168156 -199992 -244513 -262085 -201743
2175 -201743 -206610 -177235 -188061 -176955 -173474 -114726 -177676 -247024 -164225 -185490 -224147 -88795
2163 -88795 -111862 -177304 -151359 -160444 -195978 -126749 -160964 -184989 -165618 -138213 -163139 -174323
2151 -174323 -180136 -112152 -105857 -236257 -187995 -224528 -168218 -241046 -203983 -215256 -222942 -186465
2139 -186465 -236652 -203165 -260728 -158318 -261173 -202676 -282862 -202199 -223599 -288502 -138528
2128 -138528 -200422 -184097 -159640 -245834 -247361 -256435 -169886 -177992 -169836 -175330 -210749 -215015 -193532
2115a93532l8282k46O8379k5373K5031m3800M3735r5357R3725o7593n351Q93J16286
2102a21485r7599J1874N2938n9129L1922o0502o2509J16407o971m5897m6719q787
2090b96457O7409j993O142M7361r38q643j2487j993m6635R9565o836p0557M1249
2077a84813o5204n9178R9615k9802K9435j3623L1237j6648j6974m8043M6973M1026
2065a85999j30484J10875M305m7486L5583M5463n810j45599J16899r595k5402
2054b37250J6002M8169p2534J1326q8520J71711j21820O8362o420o7180p080L3095
2042b52139Q3735J4521o5852K6075m9653L0683l0055O35M610N3544k5879j312
2030b11087q8430J22917m0126J958n6516K0614j4918P1101m4833l0924N0141j5039
$$ plain form
2115 -193532 -231814 -232060 -163681 -189054 -164023 -207823 -164088 -259445 -165720 -233313 -238664 -237771 -121485
2102 -121485 -219084 -207210 -154272 -213401 -181479 -241981 -304490 -188083 -195054 -240951 -287670 -296457
2090 -296457 -229048 -231041 -224899 -177538 -178476 -187119 -199606 -201599 -248234 -148669 -155505 -226062 -184813
2077 -184813 -250017 -309195 -209580 -239382 -209947 -223570 -192333 -208981 -225955 -273998 -227025 -185999
2065 -185999 -316483 -205608 -201303 -248789 -213206 -167743 -173553 -319152 -202253 -211848 -237250
2054 -237250 -221248 -173079 -245613 -234287 -322807 -151096 -272916 -204554 -210974 -278154 -285234 -252139
2042 -252139 -168404 -153883 -219735 -193660 -243313 -212630 -242685 -242050 -237440 -183896 -209775 -211087
2030 -211087 -299517 -176600 -216726 -214768 -271284 -250670 -265588 -194487 -239320 -270244 -220103 -235142
2018b35142M4905M4843p3503J0724o954M410r0876Q7791l5142O7515m734J3736
2006a72427n2800J6577p2327j919Q2716J21470o3947p3923l8917N0560m2098J0354
1994b36681k5073Q6795k587o2179P2914o7478K211l971q7700J52266n7004J82619
1982d5868k00157K6188l2973K2571p9242J22141o2356p08m7450K8261J5191k031
1970b56433K4498p4371J3738J04626O506p6865O5717m9842R822k9350M1706k3030
1958b43278o1277M0151L8559o8534m3097o892L96J00599r162M9377R983m1828
1946b35003m784J8749l4724P3286o0105l7604J10170l9819m8888l0449K3214o0569
1934c26526Q4861N0126R631o9137M5229l2323n1708P7117o5238m2853J03406l2029
$$ plain form
2018 -235142 -190237 -145394 -218897 -208173 -215127 -210717 -301593 -213802 -248944 -181429 -186163 -172427
2006 -172427 -225227 -208650 -280977 -282896 -200180 -78710 -142657 -216580 -255497 -204937 -247035 -236681
1994 -236681 -261754 -174959 -177546 -239725 -166811 -234289 -232078 -236049 -323749 -171483 -228487 -45868
1982 -45868 -246025 -219837 -252810 -230239 -309481 -187340 -249696 -250404 -297854 -269593 -254402 -256433
1970 -256433 -231935 -306306 -292568 -187942 -181436 -258301 -192584 -242426 -232604 -261954 -220248 -243278
1958 -243278 -304555 -264404 -225845 -294379 -337476 -344368 -343972 -243373 -252535 -203158 -193175 -235003
1946 -235003 -239787 -221038 -255762 -182476 -242581 -280185 -170015 -209834 -258722 -289171 -265957 -326526
1934 -326526 -241665 -191539 -181908 -251045 -205816 -238139 -289847 -212730 -277968 -320821 -217415 -249444
1922b49444n854O7247p7765J1928m1895J12638j19390j1058J19964j30132N5601
1911b68160N0603J7186j9851M7561l2197j33592J06008o3242J6137N0912j8434
1900b47069J749N7113k2519n5549Q2067j39102J39345K8049j31886j319J3464
1889b75657P567L3934m3230M888j0158O7724K4264n8493j2179N1843o7204K1750
1877b54951q5928O7089n7083J32174j7742q584L6373j19797J19598p9163o415
1866b74429r594J3070O8570j8187j25919R7069n3291J23888p2182K9049n8416
1855b80372O8604L6312p6788M7676k98K2019k5936l2945l3065l1190o245K7154
1843b85074k9283L8456l046J09421k2602j15160N8585P627m2172L4940j2608n7372
$$ plain form
1922 -249444 -255298 -188051 -265816 -253888 -295783 -183145 -302535 -313593 -193629 -323761 -268160
1911 -268160 -217557 -200371 -220222 -172661 -204858 -338450 -232442 -295684 -279547 -228635 -247069
1900 -247069 -245320 -188207 -210726 -266275 -184208 -323310 -183965 -155916 -287802 -289121 -275657
1889 -275657 -268090 -234156 -277386 -272498 -282656 -214932 -190668 -249161 -261340 -209497 -276701 -254951
1877 -254951 -340879 -273790 -330873 -198699 -216441 -225025 -188652 -308449 -188851 -268014 -274429
1866 -274429 -284023 -270953 -202383 -220570 -346489 -249420 -302711 -178823 -251005 -221956 -280372
1855 -280372 -211768 -175456 -252244 -204568 -204866 -182847 -208783 -241728 -274793 -305983 -312228 -285074
1843 -285074 -314357 -275901 -278947 -169526 -192128 -307288 -248703 -241076 -283248 -248308 -260916 -318288
1831c18288Q9482L1840n2338O5970r7723m9518J03046j7728K6928m6574L5310
1820b29593k6538L2303J3192r0251j8455m9090J63425j1072m9056O7367o7311
1809b65079l0895l9970R3071m2967N3774n713j03544L6121N0841j37689L1440
1798c60610K5660K8537N2676n9345R0146j07023Q2046l7562Q8541J4796o8195
1787b50333K450p2429m88J07191L4q4481K5690m6467J09813q8496O2657n9869
1775b94728J4532L6147m3752O7926l3618k0759M4067J2778p5118N6249p3685M4706
1763b65255O3989j2465l9932L347j0154J3521j08990J14713q4720Q44k1395O9245
1751b77252Q7350l1485j04580P5825j17148Q5877O0066j58381J43056J2174K1327
$$ plain form
1831 -318288 -228806 -196966 -249304 -183334 -281057 -330575 -227529 -245257 -218329 -264903 -229593
1820 -229593 -256131 -223828 -210636 -300887 -319342 -368432 -205007 -216079 -265135 -197768 -265079
1809 -265079 -295974 -335944 -242873 -285840 -232066 -237779 -341323 -305202 -254361 -392050 -360610
1798 -360610 -334950 -306413 -253737 -313082 -222936 -329959 -247913 -285475 -196934 -182138 -250333
1787 -250333 -247883 -320312 -320800 -213609 -213575 -298056 -272366 -318833 -209020 -297516 -234859 -294728
1775 -294728 -280196 -244049 -287801 -219875 -253493 -274252 -230185 -217407 -292525 -236276 -309961 -265255
1763 -265255 -201266 -213731 -253663 -250316 -260470 -246949 -355939 -241226 -325946 -325102 -346497 -277252
1751 -277252 -189902 -221387 -325967 -250142 -367290 -281413 -221347 -379728 -236672 -224498 -203171
1740b03171l5028j11297R7370k2652q7387R5447r6581M4633j7626O7534n1856
1729c20614M2506n0555R1674p1507M1697O2843m0296l801p6500k6229J42939o7213
1717b75056j2107o7054J08187n8264P9360o2190m2236Q1381k7801n1044L814R6257
1705b26753p3166N633m153j0579O1787j53455J09238J49424p8772j25354J36097
1694b10053o4869R2370j13001n776L3815j1936O1595o5359k717p2906J03071r355
1682b65121m8039K7956m8245j0656J32182o4994n9983M9436n1591J8256L705l4289
1670c51383J05160m710o2662J9038l9739J1560J06788j04289q901L9558r988Q4680
1658b14888j9476Or8194K5092O072L729M7947j73338R4869M2787K613p4313J52685
$$ plain form
1740 -203171 -238199 -349496 -252126 -274778 -362165 -266718 -363299 -318666 -336292 -268758 -320614
1729 -320614 -278108 -328663 -236989 -308496 -266799 -203956 -244252 -248053 -324553 -350782 -207843 -275056
1717 -275056 -287163 -354217 -246030 -304294 -224934 -287124 -329360 -247979 -275780 -326824 -323010 -226753
1705 -226753 -299919 -294286 -298439 -309018 -247231 -400686 -291448 -142024 -220796 -346150 -210053
1694 -210053 -274922 -182552 -295553 -301329 -267514 -279450 -217855 -283214 -285931 -358837 -255766 -265121
1682 -265121 -313160 -285204 -333449 -344105 -211923 -276917 -336900 -287464 -339055 -320799 -317094 -351383
1670 -351383 -246223 -250933 -313595 -294557 -334296 -322736 -215948 -320237 -329138 -289580 -299568 -214888
1658 -214888 -234364 -234358 -332552 -307460 -301388 -297659 -249712 -423050 -328181 -285394 -282781 -357094 -204409
1645b04409o2617J4694J3737n0199N1654k0233j1113Q398k8638J04837p4434O535
1633b51788j13618K5859M3852j4382N9724l3071j5770M0077k8255L8259n2561
1622c01674m3934O8515m2681q1836J29628N66j06035O4061j6840J3420j8818K4433
1610c11195K7300l8888J6493p435m0555M7347m7323K0719N6823N9946r3155L0155
1598b79768K2099l2035j2360L3788j1805K0739m4177n2061J5739J05322J0193
1587b24326p4853l2487K8751m6957J449M1713M0529l51n5719J25325l1879j11207
1575c40012J852J39485j10926q023O2481n2040J8258K4362L735k5183k6481J8965
1563b93527l5699N7150k4257n2904N5260L9575k7958p1288J8824K6608o757K7382
$$ plain form
1645 -204409 -267026 -252332 -238595 -288794 -237140 -257373 -268486 -260088 -288726 -183889 -258323 -251788
1633 -251788 -365406 -339547 -295695 -310077 -250353 -283424 -299194 -259117 -287372 -249113 -301674
1622 -301674 -345608 -277093 -319774 -401610 -271982 -271416 -377451 -313390 -330230 -316810 -335628 -311195
1610 -311195 -283895 -322783 -306290 -313725 -354280 -306933 -354256 -333537 -276714 -216768 -309923 -279768
1598 -279768 -257669 -289704 -302064 -268276 -280081 -259342 -303519 -355580 -339841 -234519 -224326
1587 -224326 -299179 -331666 -302915 -349872 -348423 -306710 -266181 -266532 -322251 -196926 -228805 -340012
1575 -340012 -338160 -198675 -309601 -317624 -255143 -307183 -288925 -264563 -260828 -286011 -312492 -293527
1563 -293527 -329226 -272076 -296333 -349237 -293977 -254402 -282360 -353648 -334824 -308216 -314973 -287591
1551b87591K3454J6709m936J9237n9810M0313q4136j7712Q1483m7474p2330R0650
1539c02143m1175M0130Q5658l3119n0668M1928J3187j23244J7092O1092k6090
1528c17352m8659K5413n919L9306l6796N3379k4926q0586Q3817K1385o302o0669
1516c57909Q6461o8074n8384Q3826P5934m9378r1770L2577N4559J706p8075O5457
1504c03070n9218L7088Q280k5382Q4381j00758Q4075k4314j3769K6477k3637L2912
1492b76935o2681L7085J0990o1849K6208J411L0303L0024J2854m4382k919k5088
1480c24979k7422J03881r8697J7107J2421K1343L9142j02530N0998p8669m4735
1469d32140R8981q775l1219M4651p396l0661J8805j6353J5876J10140M8972r8942
$$ plain form
1551 -287591 -264137 -247428 -252364 -233127 -292937 -252624 -336760 -354472 -272989 -320463 -392793 -302143
1539 -302143 -343318 -303188 -217530 -250649 -301317 -259389 -246202 -369446 -352354 -291262 -317352
1528 -317352 -366011 -340598 -346517 -307211 -344007 -290628 -315554 -396140 -312323 -290938 -297240 -357909
1516 -357909 -271448 -339522 -397906 -314080 -238146 -287524 -379294 -346717 -292158 -290452 -368527 -303070
1504 -303070 -362288 -325200 -316920 -342302 -257921 -358679 -274604 -298918 -312687 -286210 -309847 -276935
1492 -276935 -339616 -302531 -291541 -353390 -327182 -325771 -295468 -265444 -252590 -296972 -299891 -324979
1480 -324979 -352401 -248520 -347217 -330110 -317689 -296346 -257204 -359734 -308736 -387405 -432140
1469 -432140 -333159 -341934 -373153 -328502 -335898 -366559 -347754 -364107 -348231 -238091 -189119 -288061
1457b88061n1154J7918N2625k2234p4923J9417J19689l3686l1764M9197k1464
1446b64440j0966o0500J9554j6520j8410M7666N3587p4932k9697M6254J0314l1406
1434c29496K0575J4449j6905J6987k7714j157J05448p9184n7878O9432m8923l2672
1422c67038R1161J5352j67293J71904q7856M0766M8832p7958L1721Q152n2453
1411c44710o1454R9658o3098O5152j04146M6860N924N6732m0478k4744N5756k6829
1399c35377K042P9688j2080l8275n0218M8762J5197p3925k2710Q5292l7261k0044
1387c58909L0098K0418K0785j3118O676k9934l7752o5230J14623k262R719K8044
1375b76842n3140L299j1648j947N9149j41531K4438M7107M4143j4283m8833M1724
$$ plain form
1457 -288061 -339215 -321297 -268672 -290906 -365829 -346412 -226723 -260409 -292173 -242976 -264440
1446 -264440 -275406 -335906 -316352 -332872 -351282 -303616 -250029 -324961 -354658 -308404 -298090 -329496
1434 -329496 -308921 -294472 -311377 -294390 -322104 -323261 -217813 -296997 -354875 -285443 -334366 -367038
1422 -367038 -275877 -260525 -427818 -255914 -343770 -303004 -254172 -332130 -300409 -292257 -344710
1411 -344710 -406164 -306506 -369604 -304452 -408598 -361738 -355814 -299082 -339560 -364304 -308548 -335377
1399 -335377 -333335 -253647 -265727 -304002 -354220 -305458 -290261 -364186 -386896 -301604 -338865 -358909
1387 -358909 -328811 -308393 -287608 -300726 -294050 -323984 -361736 -426966 -312343 -314605 -304886 -276842
1375 -276842 -329982 -326683 -338331 -340278 -281129 -422660 -398222 -351115 -306972 -321255 -370088 -328364
1363c28364J0391K0031P1787o4908qo0233r140K2156j8744q082Q7245J0024r8312
1350c66157N0977l2333J06507j44511N7017J1416k6944M2484n5412P339L8768
1339c10849M7587k9960m3148P7262j92743J25502n1073O4603j342n3077K6291
1328c40947M8242J8142o6705j24643J63344O149n7674K3357J6619p96q3305k8884
1316d27101J6638J16653L0659n5177K107O8277o7042L7245p0227m6675k312O2913
1304c34042N9635N0542r5426Q179p7534M4667N325J0856k9055l6510M0672m1630
1292c94321M4729k5260j17214J96062m1690N5510p7990M8839P8838j24089o9254
1281d25840J32441m3155o949J6292r0136N3905K0418N9719j31920M7545P3767
$$ plain form
1363 -328364 -317973 -297942 -226155 -291063 -291071 -351304 -360444 -338288 -357032 -365114 -277869 -267845 -366157
1350 -366157 -315180 -347513 -241006 -385517 -328500 -317084 -344028 -301544 -356956 -349617 -310849
1339 -310849 -263262 -293222 -336370 -259108 -451851 -326349 -377422 -312819 -314161 -367238 -340947
1328 -340947 -292705 -274563 -341268 -465911 -302567 -296418 -354092 -330735 -314116 -314912 -398217 -427101
1316 -427101 -410463 -293810 -263151 -318328 -316221 -247944 -314986 -277741 -347968 -394643 -396955 -334042
1304 -334042 -274407 -223865 -319291 -311112 -388646 -343979 -338654 -327798 -356853 -393363 -352691 -394321
1292 -394321 -349592 -374852 -492066 -296004 -337694 -282184 -360174 -311335 -232497 -356586 -425840
1281 -425840 -293399 -336554 -343503 -327211 -417347 -363442 -343024 -283305 -415225 -367680 -293913
1270b93913n7479n1588R0344j05181J05168K6176M5184j29447k4178N6716L9548
1259b98650k8741l8413M1670L8112k5381l6734l0514K9749O4487r0731N5159l3052
1247c53039R1149p1254k2612M9177o3239K2397k6642o1859P2979J6972n6816M9160
1235c53627N6397o1380p452k9725n722K390J1341n870R6921l8928L2442q2104
1223c85317L5760J942l5883J6328N5270l3352o2622N1217m065p1249J13766J7425
1211c00780j7194p5327J02505o6775p883n3215P0201O616n2039l1243L8759l9689
1199d26064Q4504l1609j6233j190Q9632j20146P8208n2893j6569O9996N2298l5219
1187c25285L9993n2852O728j6150R0785k14385J16809M4777r962j4731J2723l0504
$$ plain form
1270 -293913 -351392 -402980 -312636 -417817 -312649 -286473 -241289 -370736 -394914 -338198 -298650
1259 -298650 -327391 -365804 -324134 -286022 -311403 -348137 -378651 -348902 -284415 -375146 -319987 -353039
1247 -353039 -261890 -333144 -355756 -306579 -369818 -347421 -374063 -435922 -362943 -345971 -402787 -353627
1235 -353627 -297230 -358610 -366062 -395787 -401509 -399119 -387778 -393648 -296727 -335655 -303213 -385317
1223 -385317 -349557 -347615 -383498 -367170 -311900 -345252 -407874 -356657 -360722 -431971 -318205 -300780
1211 -300780 -317974 -393301 -290796 -357571 -365454 -418669 -348468 -341852 -393891 -425134 -386375 -426064
1199 -426064 -341560 -373169 -389402 -390592 -300960 -421106 -342898 -395791 -412360 -342364 -290066 -325285
1187 -325285 -285292 -338144 -331416 -347566 -256781 -471166 -354357 -309580 -319542 -334273 -321550 -352054
1175c52054L0978m7869j7010L2608o3587J41684j18389J01423p3622L7028k1814
1164c50624k1205R9137j9689n3562N468K4590q2596L0561o2887P5828P4420p5566
1152c56125j1640M8715r356l4392m0325M6346J04255j04469l1250M4637l5519
1141c79123q6112J02566l4892M3481l4195N1058L2937r7525L4484L5459m519J5223
1129c21158o8462J08515o1711l9612R3527j8055m9695K2268m5645n310P9256j01162
1117d07244N9488L2541j22054O1093j32510O3068N5551J0178m1006R8703j20892
1106d43084Q5554n0194J10374n5626k8094K1732K5406k2928m1323K6976m08J16437
1094b55178j00375l7825M0073n8308M2038L590k7256q0693L3282Q4654L9074N272
$$ plain form
1175 -352054 -321076 -368945 -385955 -353347 -416934 -275250 -393639 -292216 -365838 -328810 -350624
1164 -350624 -371829 -272692 -292381 -345943 -340475 -315885 -398481 -367920 -430807 -354979 -280559 -356125
1152 -356125 -367765 -319050 -328406 -362798 -403123 -356777 -252522 -356991 -388241 -343604 -379123
1141 -379123 -465235 -362669 -397561 -354080 -388275 -337217 -304280 -401805 -367321 -331862 -336381 -321158
1129 -321158 -389620 -281105 -342816 -382428 -288901 -306956 -356651 -334383 -380028 -385338 -306082 -407244
1117 -407244 -347756 -315215 -437269 -376176 -508686 -445618 -390067 -379889 -420895 -322192 -443084
1106 -443084 -357530 -407724 -297350 -352976 -381070 -359338 -333932 -356860 -398183 -371207 -371615 -255178
1094 -255178 -355553 -393378 -353305 -411613 -369575 -365985 -393241 -473934 -440652 -355998 -316924 -311652
1082c11652p8466J1173J7202L3211m0033q133L4067K2817L9326n9567j23188O9179
1070c94064L7498n9537M0258l8693M6435R0441o5261q5673J07916n0033M2104
1059c28609o3457k9284J10561m0752j8677L056M4963o3494K1058j01224J58212
1048c07647J2796N380j05378N1834q5831O9666L8952j7665j6675m049L9761m9855
1036c68711P4020r3841j8848L8099K8011q3206O305J32132p3384K3106n4329p1321
1024d61967L0740M4806M5306n909n2942l0677O1480O7286n4603n4626O9221j13939
1012d55824O8296N3489n4357K3773l9206L5202l2952J00850j43308P7319n3853
1001d20571Q7644n4549L8361o3454L7370k1822m9214Q2517j3548m4803k7585J28556
$$ plain form
1082 -311652 -390118 -378945 -361743 -328532 -368565 -376698 -342631 -319814 -280488 -340055 -463243 -394064
1070 -394064 -356566 -416103 -375845 -414538 -368103 -277662 -342923 -428596 -320680 -370713 -328609
1059 -328609 -392066 -421350 -310789 -351541 -370218 -367162 -322199 -385693 -364635 -465859 -307647
1048 -307647 -294851 -289471 -394849 -343015 -428846 -359180 -320228 -337893 -354568 -358617 -318856 -368711
1036 -368711 -294691 -388532 -407380 -369281 -341270 -424476 -418171 -286039 -359423 -336317 -390646 -461967
1024 -461967 -431227 -386421 -341115 -347024 -399966 -430643 -369163 -301877 -356480 -411106 -341885 -455824
1012 -455824 -387528 -334039 -388396 -364623 -403829 -368627 -401579 -300729 -444037 -366718 -420571
1001 -420571 -332927 -387476 -349115 -412569 -375199 -397021 -446235 -363718 -377266 -422069 -449654 -321098
989c21098m0608J041L1146p6121K4422J144M8048l5578O6325r5982m0079M6626
977c90714j6379J57219p2686p7678p9822J00764M9729q6263J9747L1318k513q674
965c75952M7129p3481N2738p9126K2908M3062M0919m2685K4900J4010q5061N8177
953c52462l4666N0917k8957O662O1928p5287O8615k5699o635m8659L2335m1703
941c93611N8944m8780J6644o1094N5123j00008P1435K3205M5810J642p8263J9053
929c89900J8889j06233O4024J53895r8757n5787M7230m6586K8546j2958J1717
918c85920k5550l0650J12299j05740K3287j5310J48321k44898K17866p523o6098
907c79916O15l1762o8608J36814M6912k2635j12825O8275M7407p7156j4236N5356
$$ plain form
989 -321098 -361706 -360665 -329519 -405640 -381218 -380074 -332026 -367604 -301279 -397261 -437340 -390714
977 -390714 -407093 -249874 -322560 -400238 -480060 -379296 -329567 -415830 -396083 -364765 -367278 -375952
965 -375952 -328823 -402304 -349566 -428692 -405784 -362722 -321803 -364488 -339588 -325578 -410639 -352462
953 -352462 -387128 -336211 -365168 -358506 -296578 -371865 -303250 -328949 -335584 -384243 -351908 -393611
941 -393611 -334667 -383447 -366803 -427897 -372774 -472782 -401347 -378142 -332332 -330690 -408953 -389900
929 -389900 -371011 -477244 -413220 -259325 -358082 -413869 -366639 -413225 -384679 -397637 -385920
918 -385920 -411470 -442120 -329821 -435561 -412274 -427584 -279263 -524161 -306295 -313818 -379916
907 -379916 -379301 -411063 -479671 -342857 -295945 -318580 -431405 -363130 -315723 -392879 -407115 -351759
895c51759L225m8858m3612J24296q0354O088K1789j7240m1632Q5075J0854j0512
883c42640l8888O7644q0540o3871p4901J31195n1530J08414q2202J7813n072N6565
871c58013m1536R817M5465k3905p6521Q9216j5946M2202j16296M0049L5921R0254
859b79293j05321j3774R703m368j0606k0012Q0970o1778O7004l2722L502J0088
847c56607L6771j18401Q5532m8540j6523L4294P829o4336L3481J2133o5822K4033
835d36156Q0094o1119Q2162m8282M1337n5119l020Q7485l8321L0539m678n8959
823c84037j4719K934J301M4825q3508P0470N2878j00512l5917R7450j1523m6843
811d07201M3637M2957j5650O2404n7271p6374J01608j06867m1597L5256L1758
$$ plain form
895 -351759 -348534 -397392 -441004 -316708 -397062 -390974 -369185 -386425 -428057 -342982 -332128 -342640
883 -342640 -381528 -313884 -394424 -458295 -533196 -402001 -453531 -345117 -427319 -409506 -414578 -358013
871 -358013 -399549 -389732 -344267 -368172 -444693 -355477 -371423 -329221 -445517 -405468 -369547 -279293
859 -279293 -384614 -398388 -388685 -393053 -403659 -423671 -342701 -404479 -337475 -370197 -366695 -356607
847 -356607 -319836 -438237 -352705 -401245 -417768 -383474 -375645 -439981 -406500 -394367 -460189 -436156
835 -436156 -356062 -417181 -335019 -383301 -341964 -397083 -400103 -312618 -350939 -320400 -325078 -384037
823 -384037 -398756 -395822 -394521 -349696 -433204 -362734 -309856 -410368 -446285 -348835 -360358 -407201
811 -407201 -363564 -320607 -336257 -273853 -331124 -407498 -305890 -412757 -454354 -419098 -387340
800c87340R129j04700J08302r3640M3193K9698o3594Q207K7690l254P1381m7515
788d02443n8198L7660j796M6307l7110L1789j201q917n038n0600R7103m5059l2112
775d29615L7627J3625Q950n0912K8598K6753n4142P9599l3965L074o6647O2153
763c74902p097O1417j09959k2943N2715J3885K9015J7968l3813j09288Q7082O7994
751c27926q7676M3312p046j1110m1914M1456N529l6869P0061m3687l5526N9564
739c71832j7160k0053o7630L7098J30460j45782K7118J5324n5089j5238k426J23620
727c61590J1407o0342L9412l6174K8879J3908R835L4809q5870K564J201J15314
715b86647j35272J4590N0527r6462M5197n9405O9903K1720O9542j35835L3968
$$ plain form
800 -387340 -378211 -482911 -374609 -468249 -425056 -395358 -458952 -450745 -423055 -426309 -354928 -402443
788 -402443 -460641 -422981 -424777 -378470 -415580 -383791 -384992 -393909 -398947 -449547 -352444 -397503 -429615
775 -429615 -391988 -378363 -369413 -420325 -391727 -364974 -419116 -339517 -373482 -370408 -437055 -374902
763 -374902 -381999 -320582 -430541 -453484 -400769 -386884 -357869 -339901 -373714 -483002 -395920 -327926
751 -327926 -415602 -372290 -379336 -390446 -432360 -390904 -385375 -422244 -352183 -395870 -431396 -371832
739 -371832 -388992 -409045 -476675 -439577 -309117 -454899 -427781 -412457 -467546 -482784 -485210 -361590
727 -361590 -350183 -410525 -371113 -407287 -378408 -364500 -354665 -319856 -405726 -403162 -401961 -286647
715 -286647 -421919 -407329 -356802 -453264 -408067 -467472 -397569 -375849 -306307 -442142 -408174
704d08174j775N076l4148R1450N5436j05656r1854K9911k3531M9696N9237N6767
692c17565j25572Q5698q375n4705j475L4383p3050p782N0643K3024O981p4162
$$ plain form
704 -408174 -409949 -404873 -439021 -347571 -292135 -397791 -489645 -459734 -483265 -433569 -374332 -317565
692 -317565 -443137 -357439 -365814 -420519 -421994 -387611 -460661 -468443 -417800 -394776 -387795 -461957
$$ [...]
##END NTUPLES=NMR SPECTRUM
##END=
