##TITLE=abcd
##JCAMPDX= 6.0         $$ Bruker NMR JCAMP-DX V2.0
##DATA TYPE= NMR SPECTRUM
##DATA CLASS= NTUPLES
##ORIGIN= UXNMR, Bruker Analytische Messtechnik GmbH
##OWNER= root
$$ XWIN-NMR		Version 3.5
$$ Sat May  2 08:30:46 2026 Russian Standard Time (UT+4h)  servis@DPX200
##.OBSERVE FREQUENCY= 200.131235884673
##.OBSERVE NUCLEUS= ^1H
##.ACQUISITION MODE= SIMULTANEOUS
##.ACQUISITION SCHEME= undefined
##.AVERAGES= 16
##.DIGITISER RES= 18
##SPECTROMETER/DATA SYSTEM= spect
##.PULSE SEQUENCE= zg
##.SOLVENT NAME= DMSO
##.SHIFT REFERENCE= (INTERNAL, DMSO, 0, 16.4885)
##AUDIT TRAIL= $$ (NUMBER, WHEN, WHO, WHERE, WHAT)
$$ ##TITLE= Audit trail, XWIN-NMR		Version 3.5
$$ ##JCAMPDX= 5.01
$$ ##ORIGIN= Bruker BioSpin GmbH
$$ ##OWNER= servis
$$ F:\spectra/data/av/nmr/H1/1/pdata/1/auditp.txt
$$ ##AUDIT TRAIL=  $$ (NUMBER, WHEN, WHO, WHERE, WHAT)
(   1,<2026-05-02 08:30:05.46 +0400>,<servis>,<DPX200>,
      <created by zg, POWCHK disabled, PULCHK disabled
       terminated by command 'halt'
       configuration hash MD5:
       00 E9 B6 7A A2 85 ED C7 34 08 36 98 17 FE 4E 26
       data hash MD5: 32K
       26 BE 6E 1C 46 D1 5A 0E 17 DD 02 BB B9 A0 F3 41>)
(   2,<2026-05-02 08:30:07.32 +0400>,<servis>,<DPX200>,
      <Start of raw data processing
       efp BC_mod = 2 LB = 0.05 FT_mod = 6 PKNL = 1 PHC0 = -257.6274 PHC1 = 3.101563 SI = 16K 
       data hash MD5: 16K
       B7 ED B6 FF 0C CE 63 E7 0B 36 B2 90 F9 85 DD 09>)
$$ ##END=
$$ 
$$ hash MD5
$$ 3E 36 09 04 D0 C8 D4 3B 6F B9 6A 96 3C E9 1D DD
##$RELAX= 
##$RELAX= 
##$RELAX= 
##$RELAX= 
##$RELAX= 
##$RELAX= 
##$RELAX= 
##$RELAX= 
$$ Bruker specific parameters
$$ --------------------------
##$DU= <F:\spectra>
##$EXPNO= 1
##$NAME= <H1>
##$PROCNO= 1
##$TYPE= <nmr>
##$USER= <av>
##$AMP= (0..31)
100 100 100 100 100 100 100 100 100 100 100 100 100 100 100 100 100 100 
100 100 100 100 100 100 100 100 100 100 100 100 100 100 
##$AQSEQ= 0
##$AQ_mod= 1
##$AUNM= <au_zg>
##$AUTOPOS= <>
##$BF1= 200.13
##$BF2= 200.13
##$BF3= 200.13
##$BF4= 200.13
##$BF5= 500.13
##$BF6= 500.13
##$BF7= 500.13
##$BF8= 500.13
##$BYTORDA= 1
##$CFDGTYP= 0
##$CFRGTYP= 5
##$CHEMSTR= <none>
##$CNST= (0..31)
1 1 145 1 1 1 1 1 1 1 1 1 1 1 1 1 1 1 1 1 1 1 1 1 1 1 1 1 1 1 1 1 
##$CPDPRG= <>
##$CPDPRG1= <>
##$CPDPRG2= <>
##$CPDPRG3= <>
##$CPDPRG4= <mlev>
##$CPDPRG5= <mlev>
##$CPDPRG6= <mlev>
##$CPDPRG7= <mlev>
##$CPDPRG8= <mlev>
##$CPDPRGB= <>
##$CPDPRGT= <>
##$D= (0..31)
0 2 0 0 0 0 0 0 0 0.06 0 0 0 0 0 0 0.0002 0 0 0 0 0 0 0 0 0 0 0 0 0 0 
0 
##$DATE= 1777696205
##$DBL= (0..7)
120 120 120 120 120 120 120 120 
##$DBP= (0..7)
150 150 150 150 150 150 150 150 
##$DBP07= 0
##$DBPNAM0= <>
##$DBPNAM1= <>
##$DBPNAM2= <>
##$DBPNAM3= <>
##$DBPNAM4= <>
##$DBPNAM5= <>
##$DBPNAM6= <>
##$DBPNAM7= <>
##$DBPOAL= (0..7)
0.5 0.5 0.5 0.5 0.5 0.5 0.5 0.5 
##$DBPOFFS= (0..7)
0 0 0 0 0 0 0 0 
##$DE= 6
##$DECBNUC= <off>
##$DECIM= 32
##$DECNUC= <off>
##$DECSTAT= 4
##$DIGMOD= 1
##$DIGTYP= 9
##$DL= (0..7)
0 120 120 120 120 120 120 120 
##$DP= (0..7)
$$ [...]
##$SUBNAM4= <"">
##$SUBNAM5= <"">
##$SUBNAM6= <"">
##$SUBNAM7= <"">
##$SUBNAM8= <"">
##$SUBNAM9= <"">
##$SW= 20.6817932712277
##$SWIBOX= (0..15)
0 0 3 0 0 0 0 0 0 0 0 0 0 0 0 0 
##$SW_h= 4139.07284768212
##$TD= 32768
##$TD0= 1
##$TE= 0
##$TE2= 300
##$TE3= 300
##$TEG= 300
##$TL= (0..7)
0 120 120 120 120 120 120 120 
##$TP= (0..7)
150 150 150 150 150 150 150 150 
##$TP07= 0
##$TPNAME0= <>
##$TPNAME1= <>
##$TPNAME2= <>
##$TPNAME3= <>
##$TPNAME4= <>
##$TPNAME5= <>
##$TPNAME6= <>
##$TPNAME7= <>
##$TPOAL= (0..7)
0.5 0.5 0.5 0.5 0.5 0.5 0.5 0.5 
##$TPOFFS= (0..7)
0 0 0 0 0 0 0 0 
##$TUNHIN= 0
##$TUNHOUT= 0
##$TUNXOUT= 0
##$USERA1= <user>
##$USERA2= <user>
##$USERA3= <user>
##$USERA4= <user>
##$USERA5= <user>
##$V9= 5
##$VALIST= <valist>
##$VCLIST= <CCCCCCCCCCCCCCC>
##$VD= 0
##$VDLIST= <DDDDDDDDDDDDDDD>
##$VPLIST= <PPPPPPPPPPPPPPP>
##$VTLIST= <TTTTTTTTTTTTTTT>
##$WBST= 1024
##$WBSW= 30
##$XGAIN= (0..3)
0 0 0 0 
##$XL= 0
##$YL= 0
##$YMAX_a= 519144
##$YMIN_a= -546162
##$ZGOPTNS= <>
##$ZL1= 120
##$ZL2= 120
##$ZL3= 120
##$ZL4= 120
##$ABSF1= 0
##$ABSF2= 0
##$ABSG= 0
##$ABSL= 0
##$ALPHA= 0
##$AQORDER= 0
##$ASSFAC= 0
##$ASSFACI= 0
##$ASSFACX= 0
##$ASSWID= 0
##$AUNMP= <proc_1d>
##$AZFE= 0.1
##$AZFW= 0.1
##$BCFW= 0
##$BC_mod= 2
##$BYTORDP= 0
##$COROFFS= 0
##$CY= 18.4799938201904
##$DATMOD= 1
##$DC= 0
##$DFILT= <>
##$DTYPP= 0
##$F1P= 9.9274215381318
##$F2P= -0.165520771350173
##$FCOR= 1
##$FTSIZE= 16384
##$FT_mod= 6
##$GAMMA= 0
##$GB= 0
##$INTBC= 1
##$INTSCL= 4.127829e-11
##$ISEN= 128
##$LB= 0.05
##$LEV0= 0
##$LPBIN= 0
##$MAXI= 10000
##$MC2= 0
##$MEAN= 0
##$ME_mod= 0
##$MI= 50
##$NCOEF= 0
##$NC_proc= -5
##$NLEV= 6
##$NOISF1= 3.799351
##$NOISF2= 2.8
##$NSP= 0
##$NTH_PI= 0
##$NZP= 0
##$OFFSET= 16.48848
##$PC= 4
##$PHC0= -257.6274
##$PHC1= 3.101563
##$PH_mod= 1
##$PKNL= yes
##$PPARMOD= 0
##$PSCAL= 4
##$PSIGN= 0
##$REVERSE= no
##$SF= 200.130005582386
##$SI= 16384
##$SIGF1= 3
##$SIGF2= 2
##$SINO= 400
##$SIOLD= 16384
##$SREGLST= <1H.CDCl3>
##$SSB= 0
##$STSI= 16384
##$STSR= 0
##$SW_p= 4139.07284768211
##$SYMM= 0
##$S_DEV= 0
##$TDeff= 32768
##$TDoff= 0
##$TI= <>
##$TILT= no
##$TM1= 0
##$TM2= 0
##$TOPLEV= 0
##$USERP1= <user>
##$USERP2= <user>
##$USERP3= <user>
##$USERP4= <user>
##$USERP5= <user>
##$WDW= 1
##$XDIM= 16384
##$YMAX_p= 324678278
##$YMIN_p= -481255
$$ End of Bruker specific parameters
$$ ---------------------------------
##NTUPLES= NMR SPECTRUM
##VAR_NAME=  FREQUENCY,     SPECTRUM/REAL,   SPECTRUM/IMAG
##SYMBOL=    X,             R,               I
##VAR_TYPE=  INDEPENDENT,   DEPENDENT,       DEPENDENT
##VAR_FORM=  AFFN,          ASDF,            ASDF
##VAR_DIM=   16384,         16384,           16384
##UNITS=     HZ,            ARBITRARY UNITS, ARBITRARY UNITS
##FACTOR=    0.252644378177508, 1,           1
##FIRST=     3299.83951724647, 0,            0
##LAST=      -839.233330435636, 0,           0
##MIN=       -839.233330435636, -481255,     0
##MAX=       3299.83951724647, 324678278,    0
$$ Real data points
##PAGE= N=1
##DATA TABLE= (X++(R..R)), XYDATA
$$ [...]
$$ plain form
7720 541261 476693 522153 577611 458341 539553 497032 488542 520357 471005 438926 514891 408641
7708 408641 408541 434923 509558 437446 509521 494544 528610 542668 424655 492825 473141 448334
7696 448334 514167 537864 441738 542140 453636 495423 454080 423887 405882 467796 507862
7685 507862 541855 454409 475471 405200 523493 435151 405921 462631 462957 548198 469343 490247
7673 490247 467965 501151 455572 482246 440427 441121 439383 432733 482305 472651 453365 501749 546608
7660 546608 462392 497377 467803 464954 525045 507046 515276 519803 594933 661950 571448 635863
7648 635863 592776 651219 626775 630621 495776 507841 408923 481722 497296 504459 441076 482057
7636 482057 429198 438434 408908 391495 405941 433194 411570 370751 483915 398451 473352 430533
$$ packed form
7720E41261o4568M5460N5458j19270Q1212m2521q490L1815m9352l2079P5965j06250
7708D08641j00K6382P4635p2112P2075j4977L4066J4058j18013O8170j9684k4807
7696D48334O5833K3697r6126J00402q8504M1787m1343l0193j8005O1914M0066
7685E07862L3993q7446K1062p0271J18293q8342k9230N6710L26Q5241p8855K0904
7673D90247k2282L3186m5579K6674m1819O94j738o650M9572r654j9286M8384M4859
7660E46608q4216L4985k9574k849O0091j7999Q230M527P5130O7017r0502O4415
7648F35863m3087N8443k4444L846j34845J2065r8918P2799J5574P163o3383M0981
7636D82057n2859R236k9526j7413J4446K7253k1624m0819J13164q5464P4901m2819
$$ plain form
7624 430533 355933 399967 429182 409864 445505 399755 439015 480208 417179 466892 426551 382727
7612 382727 419010 423230 370777 472153 443342 420383 350941 461032 448668 448955 408615 399227
7600 399227 409023 435681 370333 366042 405622 318877 400294 413894 403385 454625 423954 432517
7588 432517 368108 391073 416591 430751 450232 423737 376786 447384 390002 414971 381626 331142
7576 331142 369648 439815 359443 439624 364832 378056 340165 414197 375697 402132 380178 368813
7564 368813 392380 370603 386956 420859 385212 340525 429259 407790 398379 351384 403912 394008
7552 394008 408725 395470 356963 388304 452041 353257 415054 354160 373963 327760 324141 418049
7540 418049 368299 389869 406303 413378 273821 402791 367139 373464 398660 378298 332191 337318
$$ packed form
7624D30533p4600M4034K9215j9318L5641m5750L9260M1193o3029M9713m0341m3824
7612C82727L6283M220n2453J01376k8811k2959o9442J10091j2364K87m0340r388
7600C99227R796K6658o5348m291L9580q6745Q1417J3600j0509N1240l0671Q563
7588D32517o4409K2965K5518J4160J9481k6495m6951P0598n7382K4969l3345n0484
7576C31142L8506P0167q0372Q0181p4792J3224l7891P4032l8500K6435k1954j1365
7564C68813K3567k1777J6353L3903l5647m4687Q8734k1469r411m6995N2528r904
7552C94008J4717j3255l8507L1341O3737r8784O1797o0894J9803m6203l619R3908
7540D18049m9750K1570J6434P075j39557J28970l5652O325K5196k0362m6107N127
$$ plain form
7528 337318 412583 357166 334550 326587 337396 388942 320734 437699 414287 333352 324893 371766
7516 371766 409163 350525 311581 282091 289331 346020 341566 394787 357641 360014 335061 375112
7504 375112 362332 388505 325949 291340 334026 433160 336861 391556 274690 305196 381285
7493 381285 400309 351698 309296 344459 405391 366082 347664 359784 341011 349215 324604 320520
7481 320520 304979 331347 273544 303722 276506 286638 311846 373873 325896 349349 336598 365643
7469 365643 402338 305982 270731 321929 349148 370646 371365 324098 306108 405991 357298 355049
7457 355049 325081 317283 327298 301479 338668 322264 294281 337504 340709 291801 316869 262830
7445 262830 374422 277453 349643 323324 268247 306625 346435 340517 329174 312198 301016 300392
$$ packed form
7528C37318P5265n5417k2616p963J0809N1546o8208J16965k3412q0935q459M6873
7516C71766L7397n8638l8944k9490P240N6689m454N3221l7146K373k4953M0051
7504C75112j2780K6173o2556l4609M2686R9134r6299N4695j16866L0506P6089
7493C81285J9024m8611m2402L5163O0932l9309j8418J2120j8773Q204k4611m084
7481C20520j5541K6368n7803L0178k7216J0132K5208O2027m7977K3453j2751K9045
7469C65643L6695r6356l5251N1198K7219K1498P19m7267j7990R9883m8693k249
7457C55049k9968p798J0015k5819L7189j6404k7983M3223L205m8908K5068n4039
7445B62830J11592r6969P2190k6319n5077L8378L9810n918j1343j6976j1182o24
$$ plain form
7433 300392 316202 328699 318689 306367 274411 313364 364293 377833 373712 266125 325114 332786
7421 332786 333672 385039 233312 263375 379974 290961 321480 306711 299562 318001 246377 327750
7409 327750 330332 328697 191378 228569 272881 310184 239755 248484 305220 273040 309322 315804
7397 315804 277257 259430 316965 288869 315160 315143 275957 210442 225741 287143 252574 318250
7385 318250 273453 253241 280985 315326 241649 283284 313666 271952 273838 245369 273825 179626
7373 179626 286169 213323 276438 334610 267708 284735 272211 264498 283648 265577 284753 269763
7361 269763 311584 242221 314629 297685 244315 258991 207411 293252 332755 250073 223620 169734
7349 169734 267660 215375 258605 202968 221214 172681 282049 258203 240391 273079 311282
$$ packed form
7433C00392J5810J2497j0010j2322l1956L8953N0929J3540m121j07587N8989P672
7421C32786Q86N1367j51727L0063J16599q9013L0519j4769p149J8439p1624Q1373
7409C27750K582j635j37319L7191M4312L7303p0429Q729N6736l2180L6282O482
7397C15804l8547j7827N7535k8096K6291j7l9186o5515J5299O1402l4569O5676
7385C18250m4797k0212K7744L4341p3677M1635L0382m1714J886k8469K8456r4199
7373A79626J06543p2846O3115N8172o6902J7027j2524p713J9150j8071J9176j4990
7361B69763M1821o9363P2408j6944n3370J4676n1580Q5841L9503q2682k6453n3886
7349A69734R7926n2285M3230n5637J8246m8533J09368k3846j7812L2688L8203
$$ plain form
7338 311282 272486 280040 255394 316047 226516 221772 291749 224348 253210 294183 305059 243686
7326 243686 276844 257217 269336 297939 193826 251973 220206 306559 331078 228430 187186
7315 187186 195012 256847 281160 285154 246968 269468 232916 215437 238191 209004 209079 209115 187026
7302 187026 269127 228023 201048 217794 170987 180927 212347 234032 220005 175102 299824 186386
7290 186386 277901 215760 196642 242495 258010 204883 260463 221540 187593 264621 196362 265900
7278 265900 201189 235194 246844 190908 235627 198737 250714 195470 188199 198981 178445 149910
7266 149910 216783 211145 203773 223131 171528 214356 210966 177229 198159 235386 206914 169573
7254 169573 224142 147344 239956 240236 177439 176782 165202 166149 224933 208761 213399 210916 249837
$$ packed form
7338C11282l8796P554k4646O0653q9531m744O9977o7401K8862M0973J0876o1373
7326B43686L3158j9627J2119K8603j04113N8147l1767Q6353K4519j02648m1244
7315A87186P826O1835K4313L994l8186K2500l6552j7479K2754k9187P5L6k2089
7302A87026Q2101m1104k6975J6746m6807R940L1420K1685j4027m4903J24722j13438
7290A86386R1515o2141j9118M5853J5515n3127N5580l8923l3947P7028o8259O9538
7278B65900o4711L4005J1650n5936M4719l6890N1977n5244p271J0782k0536k8535
7266A49910O6873n638p372J9358n1603M2828l390l3737K0930L7227k8472l7341
7254A69573N4569p6798R2612K80o2797o57j1580R47N8784j6172M638k483L8921
$$ plain form
7241 249837 173450 270260 209309 169561 206767 166336 137504 197839 161295 218425 193046 195454
7229 195454 190924 162087 251486 168068 255488 187685 178342 137084 131348 91848 123757 190732
7217 190732 196823 184898 228376 245268 197116 103357 271713 218027 166047 131926 226670 122664
7205 122664 208388 184261 141554 211311 177955 184352 182868 209872 127617 150559 170793 196005
7193 196005 163714 156998 164013 180969 175696 193952 212844 137190 164273 205981 164590 194782
7181 194782 182639 223485 200440 181913 192928 130286 151787 179812 177924 208433 161169 219589
7169 219589 211614 199906 149697 136981 189201 128387 179465 222801 153495 63335 133132 112856
7157 112856 149995 140131 211071 216563 187423 195572 188584 120703 169930 162930 141507 166392 176846
$$ packed form
7241B49837p6387R6810o0951l9748L7206m0431k8832O0335l6544N7130k5379K408
7229A95454m530k8837Q9399q3418Q7420o7803r343m1258n736l9500L1909O6975
7217A90732O091j1925M3478J6892m8152r3759J68356n3686n1980l4121R4744j04006
7205A22664Q5724k4127m2707O9757l3356O397j484K7004q2255K2942K0234K5212
7193A96005l2291o716P015J6956n273J8256J8892p5654K7083M1708m1391L0192
7181A94782j2143M0846k3045j8527J1015o2642K1501K8025j888L0509m7264N8420
7169B19589p975j1708n0209j2716N2220o0814N1078M3336o9306r0160O9797k0276
7157A12856L7139r864P0940N492k9140Q149o988o7881M9227p000k1423K4885J0454
$$ plain form
7144 176846 130190 156337 124026 139603 170229 141313 158197 119856 171944 137274 148794 171956
7132 171956 125158 141711 168816 141888 157367 163205 138402 176689 228050 140308 182406 216606
7120 216606 114654 155480 193983 155158 177363 158990 111658 121243 162963 166722 251941 163992
7108 163992 138973 171400 140269 107964 154505 170205 84092 113209 136127 196246 121796 114705
7096 114705 159578 102353 159303 188898 124283 103098 207160 165744 172578 156603 160776 122697
7084 122697 204024 154482 120584 152834 108521 120161 137033 136337 151002 103775 126155 140368
7072 140368 142496 140503 137667 153615 150288 154906 205678 210471 134869 127794 102190 104515 169643
7059 169643 136700 121888 159697 243940 187264 226964 195571 115657 154821 130677 95605 179538
$$ packed form
7144A76846m6656K6147l2311J5577L0626k8916J6884l8341N2088l4670J1520K3162
7132A71956m6798J6553K7105k6928J5479N838k4803L8287N1361q7742M2098L4200
7120B16606j01952M0826L8503l8825K2205j8373m7332R585M1720L759Q5219q7949
7108A63992k5019L2427l1131l2305M6541J5700q6113K9117K2918O0119p4450p091
7096A14705M4873n7225N6950K9595o4615k1185J04062m1416O834j5975M173l8079
7084A22697Q1327m9542l3898L2250m4313J1640J6872o96J4665m7227K2380J4213
7072A40368K128j993k836J5948l327M618N0772M793p5602p075k5604K325O5128
7059A69643l2943j4812L7809Q4243n6676L9700l1393p9914L9164k4144l5072Q3933
$$ plain form
7047 179538 133487 131994 117300 208355 145159 133015 114635 162183 94711 152509 143764 136676
7035 136676 72569 56238 114307 206842 161067 153345 87894 148907 150579 65740 120746 38208
7023 38208 160916 129918 173577 146204 169038 150748 120182 69169 123663 150525 68926 130915
7011 130915 175220 125906 133427 204047 174522 101233 130535 149330 107556 111504 104953 101979
6999 101979 84212 138520 179626 117878 91093 107784 129299 85571 80907 67725 120173 89631
6987 89631 106368 117608 77766 102098 92972 157067 72825 56384 166212 171675 135384 151157
6975 151157 152192 123342 123312 56083 99771 137775 149551 93961 146349 91174 133951 191565
6963 191565 128061 202701 113169 113719 142366 135142 94379 87926 164993 147687 41742 157555
$$ packed form
7047A79538m6051j493j4694R1055o3196j2144j8380M7548o7472N7798q745p088
7035A36676o4107j6331N8069R2535m5775p722o5451O1013J672q4839N5006q2538
7023C8208J22708l0998M3659k7373K2834j8290l0566n1013N4494K6862q1599O1989
7011A30915M4305m9314P521P0620k9525p3289K9302J8795m1774L948o551k974
6999A01979j7767N4308M1106o1748k6785J6691K1515m3728m664j3182N2448l0542
6987H9631J6737J1240l9842K4332r126O4095q4242j6441J09828N463l6291J5773
6975A51157J035k8850l0o7229M3688L8004J1776n5590N2388n5175M2777N7614
6963A91565o3504P4640q9532N50K8647p224m0763o453P7067j7306j05945J15813
$$ plain form
6951 157555 111599 148016 96622 158660 55853 79954 65888 105731 132592 126085 66427 116331
6939 116331 62471 116335 128081 138834 137066 90470 94194 60364 106829 50146 136384 77748
6927 77748 143960 95496 154977 129736 113786 128297 117206 57213 113070 94553 93845 67620
6915 67620 97983 213748 25788 124858 139216 96817 88754 132957 93866 106054 80195 148968
6903 148968 109828 169611 72720 129487 88757 75631 40046 120814 23457 131879 102906
6892 102906 75492 74513 82196 83230 105994 144503 123637 116018 146874 86492 120719 74000 159388
6879 159388 50621 192068 103882 152325 184640 70435 116412 78111 127745 69659 39428
6868 39428 87758 148175 131887 65630 91694 146238 87196 76654 102407 142262 111930 100228
$$ packed form
6951A57555m5956L6417n1394O2038j02807K4101j4066L9843K6861o507n9658M9904
6939A16331n3860N3864J1746J0753j768m6596L724l3830M6465n6683Q6238n8636
6927G7748O6212m8464N9481k5241j5950J4511j1091n9993N5857j8517p08k6225
6915F7620L0363J15765j87960R9070J4358m2399q063M4203l9091J2188k5859O8773
6903A48968l9140N9783r6891N6767m0730j3126l5585Q0768r7357J08422k8973
6892A02906k7414r79P683J034K2764L8509k0866p619L0856o0382L4227m6719Q5388
6879A59388j08767J41447q8186M8443L2315j14205M5977l8301M9634n8086l0231
6868C9428M8330O0417j6288o6257K6064N4544n9042j0542K5753L9855l0332j1702
$$ plain form
6856 100228 73323 132821 107020 155697 58536 215026 52843 125421 57140 53979 67986
6845 67986 84453 75075 23766 91432 103543 89682 88974 78824 104490 136394 90878 111758
6833 111758 92891 160511 190619 139503 120732 130918 35148 168007 131609 97844 94958 117212
6821 117212 83518 111073 89249 98770 36240 55465 118787 116254 130872 145434 111643 108733
6809 108733 117654 67123 66528 93072 83037 115552 68530 42612 76608 156234 -39927 48086
6797 48086 30584 35795 33071 73293 132025 53816 124306 91007 62727 121653 58096 56734
6785 56734 54230 77456 55967 86841 112532 88038 58834 28016 73275 33968 89164 127928
6773 127928 61949 41639 112364 99854 103895 91109 75756 144808 38333 100317 87158 146312
$$ packed form
6856A00228k6905N9498k5801M8677r7161J56490j62183P2578o8281l161J4007
6845F7986J6467r378n1309O7666J2111j3861p08j0150K5666L1904m5516K0880
6833A11758j8867O7620L0108n1116j8771J0186r5770J32859l6398l3765k886K2254
6821A17212l3694K7555k1824R521o2530J9225O3322k533J4618J4562l3791k910
6809A08733Q921n0531n95K6544j0035L2515m7022k5918L3996P9626j96161Q8013
6797D8086j7502N211k724M0222N8732p8209P0490l3299k8280N8926o3557j362
6785E6734k504K3226k1489L0874K5691k4494k9204l0818M5259l9307N5196L8764
6773A27928o5979k0310P0725j2510M041j2786j5353O9052j06475O1984j3159N9154
$$ plain form
6761 146312 145938 153071 56850 63370 158243 115647 109371 107631 97238 107712 167482 180260 118650
6748 118650 60808 101960 46674 51896 149466 94286 106285 106499 89211 79812 100581 127828
6736 127828 113363 54792 39578 78247 78989 90430 66872 66480 84915 60543 99160 95830 75168
6723 75168 83038 100630 113432 92851 56651 109267 116064 110008 64981 92449 84751 91634 91571
6710 91571 148612 92103 172371 105060 80975 100989 42786 90438 21946 98442 122128 31237
6698 31237 45272 64899 44939 59808 104589 51383 40728 70436 4521 120776 81059 186041
6686 186041 131163 128515 91637 142505 134986 96895 133470 41591 136814 60983 27383 74104
6674 74104 91819 73422 86107 188308 99699 140320 76963 138485 105692 69066 16734 102500
$$ packed form
6761A46312l74P133r6221O520R4873m2596o276j740j0393J0474N9770J2778o1610
6748A18650n7842M1152n5286N222R7570n5180J1999K14j7288r399K0769K7247
6736A27828j4465n8571j5214L8669P42J1441k3558l92J8435k4372L8617l330k0662
6723G5168P870J7592J2802k0581l6200N2616O797o056m5027K7468p698O883o3
6710I1571N7041n6509Q0268o7311k4085K0014n8203M7652o8492P6496K3686r0891
6698C1237J4035J9627j9960J4869M4781n3206j0655K9708o5915J16255l9717J04982
6686A86041n4878k648l6878N0868p519l8091L6575r1879R5223p5831l3600M6721
6674G4104J7715j8397J2685J02201q8609M0621o3357O1522l2793l6626n2332Q5766
$$ plain form
6662 102500 117523 98785 16277 143993 58209 53331 125567 101883 28216 117478 114407 104256
6650 104256 65573 127915 70576 137235 64728 121184 126695 68286 108999 61430 59985 129054
6638 129054 89502 96120 70313 -7007 110521 47426 132545 92666 125004 43309 106214 181699
6626 181699 140023 141771 118825 177678 92498 -28617 123711 117894 66066 131256 97112 87921
6614 87921 128819 161401 125060 43952 82180 133864 67971 113533 147272 117392 153514 143071
6602 143071 155367 126570 156960 136095 186835 110503 198680 108529 95856 86981 184412 169740
6590 169740 104254 121527 134444 92454 69644 109933 63906 68807 188962 124188 168590 121035
6578 121035 95539 221250 197912 125542 153721 161205 171535 162734 148894 137171 147816 103181
$$ packed form
6662A02500J5023j8738q2508J27716q5784m878P2236k3684p3667Q9262l071j0151
6650A04256l8683O2342n7339O6659p2507N6456N511n8409M0713m7569j445O9069
6638A29054l9552O618k5807p7320J17528o3095Q5119l9879L2338q1695O2905P5485
6626A81699m1676J748k2946N8853q5180j21115J52328n817n1828O5190l4144r191
6614H7921M0898L2582l6341q1108L8228N1684o5893M5562L3739k9880L6122j0443
6602A43071J2296k8797L0390k0865N0740p6332Q8177r0151j2673q875R7431j4672
6590A69740o5486J7273J2917m1990k2810M0289m6027M901J20155o4774M4402m7555
6578A21035k5496J25711k3338p2370K8179P484J0330q801j3840j1723J0645m4635
$$ plain form
6566 103181 153917 110535 114834 136565 147977 177403 139821 205628 140284 163339 136622 153778
6554 153778 166938 162703 92131 185475 195088 187243 94353 140975 179772 138752 154880 164381
6542 164381 140457 155836 164918 240129 182484 228461 220789 224702 220735 183523 254304 191369
6530 191369 216436 175181 147017 169582 211225 251952 294642 245158 165268 280497 263692
6519 263692 162061 226113 262334 300010 236278 340161 270968 299152 295999 280258 332066
6508 332066 357764 328667 352538 355108 331813 395886 391388 414418 347987 399665 351285 377528
6496 377528 384340 403843 342521 354097 406311 479889 442300 501419 481210 499881 542565 498199
6484 498199 562690 596580 522091 642017 653356 684930 696544 743478 768961 875966 1011167
$$ packed form
6566A03181N0736m3382M299K1731J1412K9426l7582O5807o5344K3055k6717J7156
6554A53778J3160m235p0572R3344R613p845r2890M6622L8797m1020J6128R501
6542A64381k3924J5379R082P5211n7645M5977p672L913l967l7212P0781o2935
6530A91369K5067m1255k8164K2565M1643M0727M2690m9484p9890J15229j6805
6519B63692j01631O4052L6221L7676o3732J03883o9193K8184l153j5741N1808
6508C32066K5698k9097K3871K570k3295O4073m498K3030o6431N1678m8380K6243
6496C77528O812J9503o1322J1576N2214P3578l7589N9119k0209J8671M2684m4366
6484D98199O4491L3890p4489J19926J1339L1574J1614M6934K5483J07005J35201
$$ plain form
6473 1011167 1089709 1218219 1444971 1606326 1873665 2232911 2625907 3276067 4109875 5185099
6463 5185099 6239167 7147424 7646753 7590717 7440230 6917350 6212410 5451753 4728834 4106447
6453 4106447 3645461 3331213 3213283 3182673 3348527 3563452 4006645 4898045 6100739 7295132
6443 7295132 7915646 7980389 7831766 7340529 6543130 5701951 4742205 3968963 3246405 2690731
6433 2690731 2359577 2050008 1807142 1692580 1504519 1427381 1423119 1205640 1149495 1034720
6423 1034720 951284 900539 841704 825567 824231 773100 750029 624547 707028 674221 631269
6412 631269 603943 649097 631569 563583 643434 528872 541491 534805 519038 531771 484989 509976
6400 509976 500116 506869 488839 437078 453700 431599 434403 420019 422700 401511 371751 431052
$$ packed form
6473A011167P8542J28510K26752J61355K67339L59246L92996O50160Q33808J075224
6463E185099J054068R08257M99329n6036j50487n22880p04940p60657p22919o22387
6453D106447m60986l14248j17930l0610J65854K14925M43193Q91400J202694J194393
6443G295132O20514O4743j48623m91237p97399q41179r59746p73242p22558n55674
6433B690731l31154l09569k42866j14562j88061p7138m262k17479n6145j14775
6423A034720q3436n0745n8835j6137j336n1131k3071j25482Q2481l2807m2952
6412F31269k7326M5154j7528o7986P9851j14562J2619o686j5767J2733m6782K4987
6400E09976r860O753j8030n1761J6622k2101K804j4384K681k1189k9760N9301
$$ plain form
6388 431052 394955 453350 429550 417353 363097 352232 367791 387818 315197 343515 387260 408402
6376 408402 354666 385288 356827 371593 354852 322097 294064 393643 383897 273985 360568 391040
6364 391040 309509 314180 408145 412259 378881 353543 307881 420899 381396 412555 414188 352949
6352 352949 419373 409763 395293 389180 435566 387875 361486 395938 384815 481747 420773 482135
6340 482135 398964 424888 505785 451843 484396 538070 501657 512887 545949 555046 578357 567621
6328 567621 600894 613565 636414 643979 599906 680458 617084 670684 711241 695128 741476 876535
6316 876535 825506 917960 912509 991659 1105748 1175926 1443320 1633679 1913609 2276465 2625624
6305 2625624 3149705 3703811 4526737 5672449 7474680 10016160 12956782 15102664 15674579
$$ packed form
6388D31052l6097N8395k3800j2197n4256j0865J5559K0027p2621K8318M3745K1142
6376D08402n3736L0622k8461J4766j6741l2755k8033R9579r746j09912Q6583L0472
6364C91040q1531M671R3965M114l3378k5338m5662J13018l9503L1159J633o1239
6352C52949O6424r610j4470o113M6386m7691k6389L4452j1123R6932o0974O1362
6340D82135q3171K5924Q0897n3942L2553N3674l6413J1230L3062R097K3311j0736
6328E67621L3273J2671K2849P565m4073Q0552o3374N3600M0557j6113M6348J35059
6316H76535n1029R2454n451P9150J14089P0178K67394J90359K79930L62856L49159
6305B625624N24081N54106Q22926J145712J802231K541480K940622K145882N71915
$$ plain form
6296 15674579 15639803 15204622 13756918 11971031 10041614 8209037 6702338 5393362 4494260
6287 4494260 3836687 3276724 2901066 2732039 2455240 2173635 1994298 1852895 1655293 1604199
6277 1604199 1449435 1307758 1258977 1134548 1086733 1130016 1017169 1015075 978429 820295 835147
6266 835147 817591 841332 788261 796313 795569 720556 636446 705084 673327 636980 698521 639568
6254 639568 706589 681195 722027 750820 671420 673138 654003 621607 670225 701582 627153 643978
6242 643978 763445 868438 913927 1023905 1161413 1282077 1360026 1375176 1325372 1252855 1251882
6231 1251882 1113340 950594 831633 712110 686899 626380 519163 537776 431434 473070
6221 473070 466215 484945 458030 430067 254590 457720 411149 380801 321057 385661 323189
$$ packed form
6296A5674579l4776m35181j447704j785887j929417j832577j506699j308976q99102
6287D494260o57573n59963l75658j69027k76799k81605j79337j41403j97602n1094
6277A604199j54764j41677m8781j24429m7815M3283j12847k094l6646j58134J4852
6266H35147j7556K3741n3071Q052p44p5013q4110O8638l1757l6347O1541n8953
6254F39568O7021k5394M0832K8793p9400J718j9135l2396M8618L1357p4429J6825
6242F43978J19467J04993M5489J09978J37508J20664P7949J5150m9804p2517r73
6231A251882j38542j62746j18961j19523k5211o0519j07217J8613j06342M1636
6221D73070o855J8730k6915k7963j75477K03130m6571l0348n9744O4604o2472
$$ plain form
6210 323189 220462 293699 327080 328887 238059 271938 302743 246775 246842 307264 207178 225050
6198 225050 221640 225641 156703 199552 217259 206897 218207 172074 195011 190192 162867 220089
6186 220089 171979 185076 175258 217516 191050 151047 154370 207075 201623 298495 224400 160898
6174 160898 222052 243303 219765 207117 176664 170001 137917 183398 204360 183074 201680 176693
6162 176693 211339 242354 227375 177705 180834 175666 206172 195007 229935 191395 246898 133879
6150 133879 199356 161899 161305 188642 176034 189943 146351 236635 202264 195389 214377 222541
6138 222541 197477 152307 170400 125471 138569 129795 175297 181286 138788 211012 106095 138121
6126 138121 160560 212695 185530 164255 289768 207050 180375 213907 271199 296861 324200
$$ packed form
6210C23189j02727P3237L3381J807r0828L3879L0805n5968O7O0422j00086J7872
6198B25050l410M001o8938M2849J7707j0362J1310m6133K2937m819k7325N7222
6186B20089m8110J3097r818M2258k6466m0003L323N2705n452R6872p4095o3502
6174A60898O1154K1251k3538j2648l0453o663l2084M5481K0962k1286J8606k4987
6162A76693L4646L1015j4979m9670L129n168L0506j1165L4928l8540N5503j13019
6150A33879O5477l7457n94K7337j2608J3909m3592R0284l4371o875J8988Q164
6138B22541k5064m5170J8093m4929J3098q774M5502N989m2498P2224j04917L2026
6126A38121K2439N2135k7165k1275J25513q2718k6675L3532N7292K5662K7339
$$ plain form
6115 324200 315080 447924 445485 300073 403296 364006 327045 308433 210478 304921 325601
6104 325601 283496 317815 255082 253676 341145 260943 205542 249134 211035 234230 187070 202097
6092 202097 161383 158310 228030 156790 152777 225696 212370 175901 220324 309551 228558 288189
6080 288189 310732 312679 359015 373660 388718 454512 448495 529121 562377 701758 671007 705138
6068 705138 697984 673744 661414 573987 593503 549346 502329 494706 424193 419914 391333 294327
6056 294327 375828 305149 290163 333520 318510 288653 227048 244531 274350 185532 205424 312944
6044 312944 176010 182702 202126 236494 184224 215939 215776 205881 192826 129320 165595 217701
6032 217701 199460 154104 131861 160227 165670 148235 143457 148340 196773 195720 187506 114655 218768
$$ packed form
6115C24200r120J32844k439j45412J03223l9290l6961j8612r7955R4443K0680
6104C25601m2105L4319o2733j406Q7469q0202n5401M3592l8099K3195m7160J5027
6092B02097m0714l073O9720p1240m013P2919j3326l6469M4423Q9227q0993N9631
6080B88189K2543J947M6336J4645J5058O5794o017Q0626L3256J39381l0751L4131
6068G05138p154k4240j2330q7427J9516m4157m7017p623p0513m279k8581r7006
6056B94327Q1501p0679j4986M3357j5010k9857o1605J7483K9819q8818J9892J07520
6044C12944j36934O692J9424L4368n2270L1715j63r895j3055o3506L6275N2106
6032B17701j8241m5356k2243K8366N443j7435m778M883M8433j053q214p2851J04113
$$ plain form
6019 218768 240612 253979 238756 191618 237039 253571 264386 179339 278774 221530 179829 198150
6007 198150 237945 243192 217125 172701 182339 259324 177406 238135 274692 211145 262484 278246
5995 278246 277152 258002 311573 306004 361324 339488 249350 323866 258970 289042 261337 234900
5983 234900 255109 228331 237747 266268 283533 303247 265678 307180 293982 342782 295976 320996
5971 320996 257146 263578 291619 270400 284724 264316 255927 274009 339720 290503 265759 309166
5959 309166 372389 282143 342923 249969 274155 354240 293872 341394 365984 281630 321276 407697
5947 407697 348909 399912 299957 397787 374295 345339 347644 388243 380029 424384 378223 472065
5935 472065 423757 443425 335156 455549 477026 427974 413746 420998 480572 439994 446494 443452
$$ packed form
6019B18768K1844J3367j5223m7138M5421J6532J0815q5047R9435n7244m1701J8321
6007A98150L9795N247k6067m4424R638P6985q1918O0729L6557o3547N1339J5762
5995B78246j094j9150N3571n569N5320k1836r0138P4516o4896L0072k7705k6437
5983B34900K0209k6778R416K8521J7265J9714l7569M1502j3198M8800m6806K5020
5971C20996o3850O432K8041k1219J4324k0408q389J8082O5711m9217k4744M3407
5959C09166O3223r0246O0780r2954K4186Q0085o0368M7522K4590q4354L9646Q6421
5947D07697n8788N1003r9955R7830k3492k8956K305M0599q214M4355m6161R3842
5935D72065m8308J9668j08269J20393K1477m9052j4228P252N9574m0578O500l042
$$ plain form
5923 443452 433802 516511 453340 400343 414241 515965 453932 528435 540063 448576 540905 602193
5911 602193 564934 566274 573413 538686 531712 636818 526285 605478 615235 610276 704174 744702
5899 744702 729321 732658 755659 769198 716815 724039 770320 788707 801582 833136 829429 828725 874313
5886 874313 902042 952919 914855 1003728 1107186 1075494 1120752 1122551 1196048 1162680 1172183 1229714
5874 1229714 1311082 1289956 1284025 1407122 1378589 1465865 1493668 1459479 1505440 1615080 1668676
5863 1668676 1717987 1808996 1839041 2002222 2072114 2229641 2337219 2575849 2762617 3159269
5853 3159269 3666233 4372650 5101916 6054518 7108288 8427834 10032001 12196625 15275624
5844 15275624 19864456 26321668 33962247 39988344 42173594 42331513 41348461 37745285
$$ packed form
5923D43452r650Q2709o3171n2997J3898J01724o2033P4503J1628r1487R2329O1288
5911F02193l7259J340P139l4727o974J05106j10533P9193R757m959R3898M0528
5899G44702j5381L337K3001J3539n2383P224M6281J8387J2875L1554l707p04M5588
5886H74313K7729N0877l8064Q8873J03458l1692M5258J799P3497l3368R503N7531
5874A229714Q1368k1126n931J23097k8533Q7276K7803l4189M5961J09640N3596
5863A668676M9311R1009L0045J63181O9892J57527J07578K38630J86768L96652
5853C159269N06964P06417P29266R52602J053770J319546J604167K164624L078999
5844A5275624M588832O457212P640579O026097K185250J57919r83052l603176
$$ plain form
5836 37745285 33132263 27971261 23107053 18791856 15099404 12433192 10544759 9088534
5828 9088534 8038951 7156778 6551010 5980813 5491344 4978127 4476009 4187754 3763300
5819 3763300 3525784 3250247 3069502 2873490 2666407 2611333 2378316 2405741 2257067 2112038
5809 2112038 2009069 1924948 1888966 1868211 1800041 1734367 1672003 1610422 1521837 1494044 1405766
5798 1405766 1410953 1287896 1366100 1266861 1272194 1173273 1209756 1123149 1153528 1090924 1079609 948157
5786 948157 921168 1001916 900413 804800 807775 781550 790684 758869 822576 751494 761132 704322
5774 704322 734742 783017 739336 746845 638699 677429 631608 659449 592025 639977 615877 650575
5762 650575 614035 591717 579165 562904 556486 518778 513363 470449 561960 485704 577236 535550
$$ packed form
5836C7745285m613022n161002m864208m315197l692452k666212j888433j456225
5828I088534j049583q82173o05768n70197m89469n13217n02118k88255m24454
5819C763300k37516k75537j80745j96012k07083n5074k33017K7425j48674j45029
5809B112038j02969q4121l5982k0755o8170o5674o2364o1581q8585k7793q8278
5798A405766N187j23057P8204r9239N333r8921L6483q6607L0379o2604j1315j31452
5786I48157k6989Q0748j01503r5613K975k6225R134l1815O3707p1082R638n6810
5774G04322L0420M8275m3681P509j08146L8730m5821K7841o7424M7952k4100L4698
5762F50575l6540k2318j2552j6261o418l7708n415m2914R1511p6256R1532m1686
$$ plain form
5750 535550 446730 499772 498012 559202 443764 385837 465957 392300 426472 413362 402262 320518
5738 320518 331379 348346 425329 374783 338617 319804 295177 317578 357793 358352 399676 349361
5726 349361 398470 354373 331735 299412 391510 303477 335151 340739 326846 317077 323165 338941
5714 338941 344355 314616 348725 250869 273415 239992 286730 247435 267276 234937 263811 196194
5702 196194 283712 268675 240929 229903 210699 262368 238364 311142 286449 238662 334879 320835
5690 320835 245607 239471 270721 313584 233953 260688 217779 183983 164308 178260 204868 187722
5678 187722 136318 139930 149838 156604 175899 190430 207655 239680 180314 211121 192079 236748
5666 236748 205107 217579 218023 199001 263979 171572 244259 240850 268673 194917 281606 238063
$$ packed form
5750E35550q8820N3042j760O1190j15438n7927Q0120p3657L4172j3110j1100q1744
5738C20518J0861J6967P6983n0546l6166j8813k4627K2401M0215N59M1324n0315
5726C49361M9109m4097k2638l2323R2098q8033L1674N588j3893r769O088J5776
5714C38941N414k9739L4109r7856K2546l3423M6738l9295J9841l2339K8874o7617
5702A96194Q7518j5037k7746j1026j9204N1669k4004P2778k4693m7787R6217j4044
5690C20835p5228o136L1250M2863p9631K6735m2909l3796j9675J3952K6608j7146
5678A87722n1404L612R908O766J9295J4531J7225L2025n9366L0807j9042M4669
5666B36748l1641J2472M44j9022O4978r2407P2687l409K7823p3756Q6689m3543
$$ plain form
5654 238063 233691 293627 303767 309991 338495 432044 370673 517490 543211 577223 608700 647117
5642 647117 594970 543658 545094 502835 458336 349735 346928 266826 299154 286279 306589 344175
5630 344175 197480 252929 259121 214649 222654 220793 212491 279828 254278 216817 211720 223054
5618 223054 213716 238896 204438 244697 256997 252868 166344 181189 267294 231609 230597 198329
5606 198329 227746 245597 262333 187583 210320 286722 212998 114884 244878 226209 248020
5595 248020 273336 228253 246278 181898 210860 222540 250081 217748 249768 270515 199562 322002
5583 322002 288128 244019 254729 249463 291638 260756 302387 269562 235934 345938 345641 332657
5571 332657 353264 370655 299657 393672 399311 404696 463459 388994 542976 527201 535063 486198
$$ packed form
5654B38063m372N9936J0140O224K8504R3549o1371J46817K5721L4012L1477L8417
5642F47117n2147n1312J436m2259m4499j08601k807q0102L2328j2875K0310L7586
5630C44175j46695N5449O192m4472Q005j861q302O7337k5550l7461n097J1334
5618B23054r338K5180l4458M0259J2300m129q6524J4845Q6105l5685j012l2268
5606A98329K9417J7851J6736p4750K2737P6402p3724r8114J29994j8669K1811
5595B48020K5316m5083J8025o4380K8962J1680K7541l2333L2020K0747p0953J22440
5583C22002l3874m4109J0710n266M2175l0882M1631l2825l3628J10004k97j2984
5571C32657K0607J7391p0998R4015N639N385N8763p4465J53982j5775P862m8865
$$ plain form
5559 486198 476678 376336 413306 459838 369576 436006 385196 345204 376413 379594 360150 362735
5547 362735 450115 391302 315026 347365 337103 335983 375551 456280 383741 367366 376396 382467
5535 382467 421970 389358 418494 380793 378607 429638 502413 452964 491518 523771 570078 708076
5523 708076 726386 772082 857573 883118 909018 888220 838268 845469 779658 740226 719181 750369
5511 750369 694323 716486 768491 743301 744584 781410 832257 872246 921258 951298 1059971 1189466
5499 1189466 1379489 1594002 1813940 2169692 2449741 2799554 3473888 4285359 5508631
5490 5508631 7270814 9447567 10993057 11434257 11451419 11184966 10144012 8861892 7489012
5481 7489012 6091805 5059877 4140795 3482566 2978570 2651453 2377109 2153101 1979163
$$ packed form
5559D86198r520j00342L6970M6532r0262O6430n0810l9992L1209L181j9444K585
5547C62735Q7380n8813p6276L2339j0262j120L9568Q0729p2539j6375R030O071
5535C82467L9503l2612K9136l7701k186N1031P2775m9449L8554L2253M6307J37998
5523G08076J8310M5696Q5491K5545K5900k0798m9952P201o5811l9432k1045L1188
5511G50369n6046K2163N2005k5190J283L6826N0847L9989M9012L0040J08673J29495
5499A189466J90023K14513K19938L55752K80049L49813O74334Q11471J223272
5490E508631J762183K176753J545490M41200J7162k66453j040954j282120j372880
5481G489012j397207j031928r19082o58229n03996l27117k74344k24008j73938
$$ plain form
5472 1979163 1903424 1724364 1620699 1403294 1340207 1236806 1144668 1056954 1019306 968893 982907
5461 982907 987832 859951 867306 871004 840894 825822 789652 788133 759793 706256 784221 725815
5449 725815 751549 668767 718848 687406 637678 641016 663250 640090 606938 635731 668793 626426
5437 626426 565910 650676 641420 587991 629328 626747 614242 598517 634633 645579 650257 690921
5425 690921 706191 722621 714696 662404 801109 774800 894161 902043 910426 964098 957253 840397
5413 840397 844064 794368 719012 651550 722088 655259 629321 613477 596610 649448 548658 579775
5401 579775 563930 589204 529096 516896 571866 572465 539928 572573 613323 530252 585411 610276
5389 610276 580040 515568 569372 512001 630192 558069 516156 593244 660119 544664 579643
$$ packed form
5472A979163p5739j79060j03665k17405o3087j03401r2138q7714l7648n0413J4014
5461I82907M925j27881P355L698l0110j5072l6170j519k8340n3537P7965n8406
5449G25815K5734q2782N0081l1442m9728L338K2234k3160l3152K8793L3062m2367
5437F26426o0516Q4766r256n3429M1337k581j2505j5725L6116J0946M678M0664
5425F90921J5270J6430p925n2292J38705k6309J19361P882Q383N3672o845j16856
5413H40397L667m9696p5356o7462P0538o6829k5938j5844j6867N2838j00790L1117
5401E79775j5845K5274o0108j2200N4970N99l2537L2645M0750q3071N5159K4865
5389F10276l0236o4472N3804n7371J18191p2123m1913P7088O6875j15455L4979
$$ plain form
5378 579643 597901 597339 681958 532176 648950 576919 602598 583887 645925 599137 631890 694009
5366 694009 685712 737095 687302 679161 739145 782387 780192 732553 741032 826984 834343 801800 784451
5353 784451 864976 797597 830665 868883 882036 934861 934453 999564 1010220 1109697 1140701 1238292
5341 1238292 1298501 1445997 1531964 1751555 1885305 2308302 2682432 3242558 3703762 3878664
5331 3878664 3936384 3950310 3817070 3559937 3300222 3035078 2884467 2755016 2656892 2743961
5321 2743961 2905202 3074094 3301014 3606723 3822728 4036061 4335141 4634190 4968084 5363694
5311 5363694 5713354 6059040 6260125 6513861 6805472 6980984 7270386 7562700 7697766 7826347
5301 7826347 7756426 7645775 7611302 7409189 7234877 7108240 6816590 6510841 6231877 5852771
$$ packed form
5378E79643J8258n62Q4619j49782J16774p2031K5679j8711O2038m6788L2753O2119
5366F94009q297N1383m9793q141N9984M3242k195m7639Q479Q5952P359l2543j7349
5353G84451Q0525o7379L3068L8218J3153N2825m08O5111J0656R9477L1004R7591
5341A238292O0209J47496Q5967K19591J33750M22997L74130N60126M61204J74902
5331C878664N7720J3926j33240k57133k59715k65144j50611j29451r8124Q7069
5321B743961J61241J68892K26920L05709K16005K13333K99080K99049L33894L95610
5311E363694L49660L45686K01085K53736K91611J75512K89402K92314J35066J28581
5301G826347o9921j10651l4473k02113j74312j26637k91650l05749k78964l79106
$$ plain form
5291 5852771 5527315 5213081 4961068 4666653 4285492 3998212 3655727 3491232 3193763 2970948
5281 2970948 2740458 2541808 2429963 2402631 2233388 2162810 2095019 2084149 2008870 1896260
5271 1896260 1923497 1888517 1872562 1840827 1828414 1853558 1829625 1815071 1849023 1865171 1892007
5260 1892007 1926120 1892743 2018437 1981620 1996868 2035153 2088945 1992617 1986189 1940847 1914685
5249 1914685 1878769 1849478 1742564 1751473 1767555 1710740 1655132 1641981 1650713 1705550 1669015 1640593
5237 1640593 1702725 1699564 1733370 1672207 1716856 1704668 1729094 1715109 1681060 1633605 1700751 1578740
5225 1578740 1592091 1653811 1580975 1619645 1633069 1564136 1585526 1525915 1588304 1585245 1553127 1505600
5213 1505600 1487532 1440758 1505392 1516873 1551867 1528276 1550943 1457519 1421405 1388906 1416596
$$ packed form
5291E852771l25456l14234k52013k94415l81161k87280l42485j64495k97469k22815
5281B970948k30490j98650j11845k7332j69243p0578o7791j0870p5279j12610
5271A896260K7237l4980j5955l1735j2413K5144k3933j4554L3952J6148K6836
5260A892007L4113l3377J25694l6817J5248L8285N3792r6328o428m5342k6162
5249A914685l5916k9291j06914Q909J6082n6815n5608j3151Q732N4837l6535k8422
5237A640593O2132l161L3806o1163M4649j2188K4426j3985l4049m7455O7146j22011
5225A578740J3351O1720p2836L8670J3424o8933K1390n9611O2389l059l2118m7527
5213A505600j8068m6774O4634J1481L4994k3591K2667r3424l6114l2499K7690
$$ plain form
5202 1416596 1460341 1456409 1407121 1412888 1317422 1393153 1365501 1339385 1247275 1319193 1316574 1297801
5190 1297801 1290763 1367585 1336154 1252973 1326717 1239720 1292153 1257247 1293225 1279882 1278190 1302823
5178 1302823 1305866 1235450 1317694 1332996 1313608 1342859 1325130 1364631 1350300 1345143 1335562 1439575
5166 1439575 1340900 1449045 1449363 1500114 1503401 1537172 1560821 1550640 1610475 1642576 1698131 1795735
5154 1795735 1842933 1911231 1985705 2029453 2091452 2194926 2247216 2309538 2418801 2415995 2479822
5143 2479822 2517338 2483899 2536341 2625095 2641423 2633534 2663208 2696427 2714820 2772561 2693608 2642759
5131 2642759 2680740 2632974 2542216 2577025 2501857 2475236 2375142 2362705 2323425 2350609 2326980
5120 2326980 2365101 2276441 2361143 2360545 2427412 2372553 2406790 2389698 2479185 2516062 2438286 2487463
$$ packed form
5202A416596M3745l932m9288N767r5466P5731k7652k6116r2110P1918k619j8773
5190A297801p038P6822l1431q3181P3744q6997N2433l4906L5978j3343j692K4633
5178A302823L043p0416Q2244J5302j9388K9251j7729L9501j4331n157r581J04013
5166A439575r8675J08145L18N0751L287L3771K3649j0181N9835L2101N5555R7604
5154A795735M7198O8298P4474M3748O1999J03474N2290O2322J09263k806O3827
5143B479822L7516l3439N2442Q8754J6328p889K9674L3219J8393N7741p8953n0849
5131B642759L7981m7766r0758L4809p5168k6621j00094j2437l9280K7184k3629
5120B326980L8121q8660Q4702n98O6867n4859L4237j7092Q9487L6877p7776M9177
$$ plain form
5108 2487463 2532352 2564050 2635837 2658463 2715220 2720256 2689481 2764032 2855971 2852099 2953405 2911578
5096 2911578 2898818 2966229 2907032 2989351 2970878 3075470 3139918 3162282 3187279 3132642 3228998
5085 3228998 3223716 3316279 3406639 3374826 3392705 3553642 3494544 3641792 3656597 3778220 3908969
5074 3908969 3870886 3908554 4073553 4104718 4280610 4305895 4447100 4533926 4512547 4750953 4869739
5063 4869739 4929613 5038981 5069022 5214764 5315308 5488195 5621876 5821583 5905598 6108209
5053 6108209 6301817 6413871 6604908 6781477 6934380 7146183 7326946 7537588 7792741 8006033
5043 8006033 8157823 8421788 8768816 9035701 9312468 9619047 9958459 10283074 10595413 11022277
5033 11022277 11481398 11944191 12443349 12922404 13472899 14137859 14707396 15504489 16200120
$$ packed form
5108B487463M4889L1698P1787K2626N6757N036l0775P4551R1939l872J01306m1827
5096B911578j2760O7411n9197Q2319j8473J04592O4448K2364K4997n4637R6356
5085C228998n282R2563R0360l1813J7879J60937n9098J47248J4805J21623J30749
5074C908969l8083L7668J64999L1165J75892K5285J41205Q6826k1379K38406J18786
5063D869739N9874J09368L0041J45742J00544J72887J33681J99707Q4015K02611
5053F108209J93608J12054J91037J76569J52903K11803J80763K10642K55153K13292
5043H006033J51790K63965L47028K66885K76767L06579L39412L24615L12339M26864
5033A1022277M59121M62793M99158M79055N50495O64960N69537P97093O95631
$$ plain form
5024 16200120 17085504 17988459 18979327 20011766 21166229 22360429 23543396 24913894 26295811
5015 26295811 27812927 29318499 30940861 32639465 34428966 36188049 38110163 40098127
5007 40098127 41967568 43884060 45970194 47828576 49763940 51598492 53458996 55254425
4999 55254425 57050778 58706907 60372799 62090538 63686088 65092644 66511369 67761474
4991 67761474 68961482 69939093 70836757 71755403 72595103 73371732 74104175 74703411 75426554
4982 75426554 76005221 76558387 77164009 77611889 78087470 78502364 79074482 79559005 80274186
4973 80274186 80978786 81619809 82364123 83020835 83691099 84315614 84876201 85433387 86007762
4964 86007762 86501244 87105599 87650604 88232043 88780933 89136635 89405520 89432568 89319343 89084828
$$ packed form
5024A6200120Q85384R02955R90868J032439J154463J194200J182967J370498J381917
5015B6295811J517116J505572J622362J698604J789501J759083J922114J987964
5007D0098127J869441J916492K086134J858382J935364J834552J860504J795429
4999E5254425J796353J656129J665892J717739J595550J406556J418725J250105
4991F7761474J200008R77611Q97664R18646Q39700P76629P32443N99236P23143
4982G5426554N78667N53166O05622M47880M75581M14894N72118M84523P15181
4973H0274186P04600O41023P44314O56712O70264O24515N60587N57186N74375
4964H6007762M93482O04355N45005N81439N48890L55702K68885K7048j13225k34515
$$ plain form
4954 89084828 88618680 88131030 87393213 86628468 85733543 84844031 83824512 82640974 81426556
4945 81426556 80023789 78443774 76611778 74802331 72924817 70792700 68778565 66790221
4937 66790221 64704491 62656364 60754569 58794701 56907360 54976616 53057729 51218901
4929 51218901 49464974 47878726 46169771 44665855 43238367 41927583 40744625 39648456
4921 39648456 38698797 37866827 37066928 36482224 35964820 35620673 35397543 35320588 35428027 35719670
4911 35719670 36252240 37000514 38234662 39823278 41823055 44606272 47829657 51828073
4903 51828073 56840405 62780433 69897343 78565511 88957167 101381309 115827358 132159553
4895 132159553 149490227 167046221 183136304 196992124 207671627 214790180 218648450
$$ packed form
4954H9084828m66148m87650p37817p64745q94925q89512j019519j183538j214418
4945H1426556j402767j580015j831996j809447j877514k132117k014135j988344
4937F6790221k085730k048127j901795j959868j887341j930744j918887j838828
4929E1218901j753927j586248j708955j503916j427488j310784j182958j096169
4921C9648456r49659q31970p99899n84704n17404l44147k23130p6955J07439K91643
4911C5719670N32570P48274J234148J588616J999777K783217L223385L998416
4903E1828073N012332N940028P116910Q668168J0391656J2424142J4446049J6332195
4895A32159553J7330674J7555994J6090083J3855820J0679503P118553L858270
$$ plain form
4888 218648450 219567148 218268372 215711908 212639498 209682068 206968972 204296484 201494078
4880 201494078 197699318 192445434 185423631 176368032 165483641 153294056 140347674 127430999
4872 127430999 114862239 103204158 92584225 83330419 75334394 68354407 62549213 57464496
4864 57464496 53251589 49558575 46421620 43679023 41450292 39427151 37802199 36469648
4856 36469648 35510453 34799485 34223201 33878765 33550592 33330646 33042476 32725132 32360897
4847 32360897 31902730 31474189 30989915 30448570 30045180 29595590 29263389 28868166 28538662
4838 28538662 28172262 27734031 27225727 26763651 26192532 25649574 25025824 24511488 23993036
4829 23993036 23603377 23300426 23071642 22887732 22804268 22642512 22730252 22769841 22948462 23209602
$$ packed form
4888B18648450R18698j298776k556464l072410k957430k713096k672488k802406
4880B01494078l794760n253884p021803r055599j0884391j2189585j2946382j2916675
4872A27430999j2568760j1658081j0619933r253806p996025o979987n805194n084717
4864E7464496m212907l693014l136955k742597k228731k023141j624952j332551
4856C6469648r59195p10968n76284l44436l28173k19946k88170l17344l64235
4847C2360897m58167m28541m84274n41345m03390m49590l32201l95223l29504
4838B8538662l66400m38231n08304m62076n71119n42958o23750n14336n18452
4829B3993036l89659l02951k28784j83910q3464j61756Q7740L9589J78621K61140
$$ plain form
4819 23209602 23554585 24028962 24632563 25211992 25838822 26459016 27244235 27999211 28792872
4810 28792872 29792805 31063340 32377976 33974804 35956842 38363063 41206048 44465950
4802 44465950 48344567 52656383 57351173 62670620 68631057 75140991 82262884 90231387
4794 90231387 98965284 108279735 118011348 127873041 137376215 145954370 153357902 159227984
4786 159227984 163502300 166371586 167879859 168386907 168130419 167356124 166140253 164611678
4778 164611678 162471527 159564057 155603512 150547006 144084164 136684112 128306923 119399152
4770 119399152 110356255 101276485 92592252 84533437 77141179 70594822 64691163 59535700
4762 59535700 54919885 50950923 47479461 44303407 41610689 39240097 37175920 35286373
$$ packed form
4819B3209602L44983M74377O03601N79429O26830O20194P85219P54976P93661
4810B8792872R99933J270535J314636J596828J982038K406221K842985L259902
4802D4465950L878617M311816M694790N319447N960437O509934P121893P968503
4794I0231387Q733897R314451R731613R861693R503174Q578155P403532N870082
4786A59227984M274316K869286J508273N07048k56488p74295j215871j528575
4778A64611678k140151k907470l960545n056506o462842p400052q377189q907771
4770A19399152r042897r079770q684233q058815p392258o546357n903659n155463
4762E9535700m615815l968962l471462l176054k692718k370592k064177j889547
$$ plain form
4754 35286373 33589030 32165183 30920481 29886546 29018926 28188841 27555017 27038149 26640642
4745 26640642 26288333 26133418 25905583 25759453 25511875 25301253 25049955 24720548 24450545
4736 24450545 24097129 23778527 23579429 23297700 23133324 23018919 22987914 23041840 22995784 22848582
4726 22848582 22407368 21934202 21280944 20723770 20026493 19374781 18909098 18335243 17825407
4717 17825407 17610983 17329951 17133431 16934868 16984790 16918008 16884428 16907859 16963772 17147455
4707 17147455 17174072 17379670 17651238 17965247 18389040 18912466 19487939 19941067 20289719 20594210
4697 20594210 20776904 21049834 21188062 21290053 21449894 21622881 21887897 22163295 22389039
4688 22389039 22720492 23090844 23476698 23897139 24262912 24737743 25162937 25567040 25957665
$$ packed form
4754C5286373j697343j423847j244702j033935q67620q30085o33824n16868l97507
4745B6640642l52309j54915k27835j46130k47578k10622k51298l29407k70003
4736B4450545l53416l18602j99098k81729j64376j14405l1005N3926m6056j47202
4726B2848582m41214m73166o53258n57174o97277o51712m65683n73855n09836
4717A7825407k14424k81032j96520j98563M9922o6782l3580K3431N5913J83683
4707A7147455K6617K05598K71568L14009M23793N23426N75473M53128L48652L04491
4697B0594210J82694K72930J38228J01991J59841J72987K65016K75398K25744
4688B2389039L31453L70352L85854M20441L65773M74831M25194M04103L90625
$$ plain form
4679 25957665 26422823 26883225 27342925 27945912 28510735 29144978 29796326 30640927 31581135
4670 31581135 32670063 33871785 35150447 36670135 38396542 40375593 42723129 45342038
4662 45342038 48521661 52229039 56483441 61470347 67290650 74033929 81798010 90609172
4654 90609172 100631192 111901599 124153634 137519571 151644338 166095232 180481765
4647 180481765 194525645 207942785 220645355 232680740 244008576 255182693 266111740
4640 266111740 276928893 287537000 297601817 306692980 314385704 320240271 323723484 324678278
4632 324678278 322888752 318545778 312154310 304072737 294733966 284808081 274715832 264504625
4624 264504625 254296832 244033528 233475136 222245408 210736923 198518708 186090832
$$ packed form
4679B5957665M65158M60402M59700O02987N64823O34243O51348Q44601R40208
4670C1581135J088928J201722J278662J519688J726407J979051K347536K618909
4662D5342038L179623L707378M254402M986906N820303O743279P764081Q811162
4654I0609172J0022020J1270407J2252035J3365937J4124767J4450894J4386533
4647A80481765J4043880J3417140J2702570J2035385J1327836J1174117J0929047
4640B66111740J0817153J0608107J0064817R091163P692724N854567L483213R54794
4632C24678278j789526m342974o391468q081573r338771r925885j0092249j0211207
4624B64504625j0207793j0263304j0558392j1229728j1508485j2218215j2427876
$$ plain form
4617 186090832 173362075 160644883 148402235 136720267 125676903 115626483 106631741
4610 106631741 98458502 91302996 84841935 79306331 74153307 69549043 65423237 61610508
4602 61610508 57986470 54761632 51741648 48907667 46229221 43890653 41728294 39766769
4594 39766769 37959852 36296706 34878054 33448358 32164612 31063678 30009516 29017739
4586 29017739 28063240 27189548 26458800 25688256 24857747 24175504 23450295 22735163 22090774
4577 22090774 21463830 20753441 20130944 19424354 18947647 18356214 17844164 17245028 16774149
4568 16774149 16344089 15877300 15387069 14894533 14487197 14067480 13605369 13215484 12853534
4559 12853534 12559301 12157428 11840804 11560393 11290715 11000762 10706138 10416414 10182106
$$ packed form
4617A86090832j2728757j2717192j2242648j1681968j1043364j0050420q994742
4610A06631741q173239p155506o461061n535604n153024m604264m125806l812729
4602F1610508l624038l224838l019984k833981k678446k338568k162359j961525
4594C9766769j806917j663146j418652j429696j283746j100934j054162r91777
4586B9017739r54499q73692p30748p70544q30509o82243p25209p15132o44389
4577B2090774o26944p10389o22497p06590m76707n91433n12050n99136m70879
4568A6774149m30060m66789m90231m92536m07336m19717m62111l89885l61950
4559A2853534k94233m01873l16624k80411k69678k89953k94624k89724k34308
$$ plain form
4550 10182106 10017430 9668341 9525489 9264477 9045058 8862951 8602822 8418957 8151270
4541 8151270 8026162 7835456 7618949 7495123 7389603 7170987 7086725 6984977 6823495 6799140
4531 6799140 6647650 6464940 6330427 6182508 6140875 6014207 5877213 5752921 5702016 5558389
4521 5558389 5492289 5374955 5249820 5105999 5023893 4908202 4848205 4663910 4544828 4461169
4511 4461169 4328161 4285497 4214365 4070809 3939167 3852120 3799321 3680720 3668151 3568003
4501 3568003 3539380 3498303 3376678 3297707 3288856 3202543 3087084 3091827 2992318 2945854 2889409
4490 2889409 2875661 2777222 2741399 2659204 2653315 2542529 2520479 2432605 2372074 2358135 2230104
4479 2230104 2174415 2098052 2141606 2068428 1923561 1973791 1838493 1806278 1790808 1783923 1702456
$$ packed form
4550A0182106j64676l49089j42852k61012k19419j82107k60129j83865k67687
4541H151270j25108j90706k16507j23826j05520k18616q4262j01748j61482k4355
4531F799140j51490j82710j34513j47919m1633j26668j36994j24292n0905j43627
4521E558389o6100j17334j25135j43821q2106j15691n9997j84295j19082q3659
4511D461169j33008m2664p1132j43556j31642q7047n2799j18601j2569j00148
4501C568003k8623m1077j21625p8971q851q6313j15459M743r9509m6464n6445
4490B889409j3748r8439l5823q2195n889j10786k2050q7874o0531j3939j28031
4479B230104n5689p6363M3554p3178j44867N0230j35298l2215j5470o885q1467
$$ plain form
4468 1702456 1674266 1651791 1654345 1555076 1506062 1502869 1499804 1499414 1431155 1442367 1407977 1369892
4456 1369892 1386882 1374772 1295932 1384275 1351010 1302590 1327479 1328791 1350871 1272324 1264367 1306044
4444 1306044 1287293 1244389 1200630 1231995 1258943 1180861 1161741 1081393 1115443 1135375 1066192
4433 1066192 989850 1062158 989062 1053021 934023 961296 889232 886182 839515 800140 808637 814524
4421 814524 815443 695350 705058 718956 663749 640323 610597 568196 624672 641023 611116 659719
4409 659719 610807 658659 661751 663713 713650 731013 789517 842516 938801 954305 1074608 1133054
4397 1133054 1099705 1296476 1335785 1380151 1498403 1476206 1609603 1564167 1686461 1747470 1773533
4386 1773533 1818683 1853765 1895297 1895383 1921084 1907560 1868471 1913216 1838476 1806213 1783772 1714237
$$ packed form
4468A702456k8190k2475K554r9269m9014l193l065l90o8259J1212l4390l8085
4456A369892J6990j2110p8840Q8343l3265m8420K4889J312K2080p8547p957M1677
4444A306044j8751m2904m3759L1365K6948p8082j9120q0348L4050J9932o9183
4433A066192p6342P2308p3096O3959j18998K7273p2064l050m6667l9375Q497N887
4421H14524R19j20093R708J3898n5207k3426k9726m2401N6476J6351k9907M8603
4409F59719m8912M7852L092J962M9937J7363N8504N2999R6285J5504J20303N8446
4397A133054l3349J96771L9309M4366J18252k2197J33397m5436J22294O1009K6063
4386A773533M5150L5082M1532Q6K5701j3524l9089M4745p4740l2263k2441o9535
$$ plain form
4374 1714237 1709549 1696715 1570712 1508759 1394992 1405671 1288688 1228518 1153634 1201080 1113416
4363 1113416 993879 917125 895746 845914 786325 731342 702222 640854 613653 566041 547937
4352 547937 557645 489727 500540 533911 502266 529992 432077 394824 510254 473648 449251 415428
4340 415428 425523 401436 507251 420263 451642 439171 404201 424363 519706 423235 356692
4329 356692 435597 437240 432905 441264 480556 407980 483658 442589 530857 525621 556727 532608
4317 532608 577008 566737 551437 584132 694469 768667 816107 848514 862772 937890 1056877
4306 1056877 1137348 1157098 1212394 1192065 1264754 1346488 1205606 1300675 1307699 1323217 1315852 1338023
4294 1338023 1414986 1367483 1422641 1488612 1527578 1567464 1661900 1689258 1702917 1750443 1670662
$$ packed form
4374A714237m688j2834j26003o1953j13767J0679j16983o0170p4884M7446q7664
4363A113416j19537p6754k1379m9832n9589n4983k9120o1368k7201m7612j8104
4352E47937R708o7918J0813L3371l1645K7726r7915l7253J15430l6606k4397l3823
4340D15428J0095k4087J05815q6988L1379j2471l4970K0162R5343r6471o6543
4329C56692P8905J643m335Q359L9292p2576P5678m1069Q8268n236L1106k4119
4317E32608M4400j0271j5300L2695J10337P4198M7440L2407J4258P5118J18987
4306A056877Q0471J9750N5296k0329P2689Q1734j40882R5069P024J5518p365K2171
4294A338023P6963m7503N5158O5971L8966L9886R4436K7358J3659M7526p9781
$$ plain form
4283 1670662 1677166 1634815 1535918 1464970 1268005 1130455 1013605 922760 752080 685095 615028
4272 615028 542522 507819 443841 326054 380427 351019 253417 227599 235517 207921 188712 255710
4260 255710 163611 183520 189346 117121 131547 102672 68812 77455 72383 85646 -9955 65877
4248 65877 -10843 4 61383 -42338 1990 3471 -6727 26532 69804 73456 46630 20611
4236 20611 -11127 -16251 -39474 -26094 -33736 -45709 -56812 -21425 -44151 -106180 -63551 -327
4224 -327 -22708 1698 2908 5515 26679 31393 29815 61603 -17219 18981 -68117 -83118 -89368
4211 -89368 -123862 -105141 -143692 -77458 -149831 -170092 -109995 -105470 -181754 -206445 -132359 -167884
4199 -167884 -156508 -163216 -153412 -82823 -89230 -130232 -69174 -2898 -29070 43637 -54658 -21842
$$ packed form
4283A670662O504m2351r8897p0948j96965j37550j16850r0845j70680o6985p0067
4272F15028p2506l4703o3978j17787N4373k9408r7602k5818P918k7596j9209O6998
4260B55710r2099J9909N826p2225J4426k8875l3860Q643n072J3263r5601P5832
4248F5877p6720J0847O1379j03721M4328J481j0198L3259M3272L652k6826k6019
4236B0611l1738n124k3223J3380p642j1973j1103L5387k2726o2029M2629O3224
4224c27k2381K4406J210K607K1164M714j578L1788p8822L6200q7098j5001o250
4211h9368l4494J8721l8551O6234p2373k0261O0097M525p6284k4691P4086l5525
4199a67884J1376o708R804P0589o407m1002O1058O6276k6172P2707r8295L2816
$$ plain form
4187 -21842 -67313 -88020 -31080 -70620 -93977 -123558 -195347 -142790 -157910 -104013 -177802 -267942
4175 -267942 -186630 -223057 -155184 -146543 -141422 -172990 -203765 -150194 -131120 -138429 -221087 -110286
4163 -110286 -105912 -117741 -123447 -162920 -131488 -113832 -164106 -129231 -107733 -157697 -204467 -240569
4151 -240569 -169295 -214039 -199064 -191344 -159758 -210066 -147871 -128189 -113621 -173077 -192158 -176696
4139 -176696 -150484 -243386 -204614 -174767 -172896 -210248 -251738 -162694 -181482 -199656 -148126 -242816
4127 -242816 -210377 -124454 -137289 -193927 -154558 -169193 -194263 -216918 -187856 -209495 -231944 -202470
4115 -202470 -173126 -234064 -198647 -235693 -231872 -259990 -266912 -226775 -218171 -268989 -171745 -207315
4103 -207315 -238454 -181338 -223340 -254760 -252377 -213865 -212937 -139622 -290529 -196411 -201077 -148696
$$ packed form
4187b1842m5471k0707N6940l9540k3357k9581p1789N2557j5120N3897p3789r0140
4175b67942Q1312l6427O7873Q641N121l1568l0775N3571J9074p309q2658J10801
4163a10286M374j1829n706l9473L1432J7656n0274L4875K1498m9964m6770l6102
4151b40569P1274m4744J4975P720L1586n0308O2195J9682J4568n9456j9081J5462
4139a76696K6212r2902L8772K9847J871l7352m1490Q9044j8788j8174N1530r4690
4127b42816L2439Q5923j2835n6638L9369j4635k5070k2655K9062k1639k2449K9474
4115b02470K9344o0938L5417l7046L821k8118o922M0137Q604n0818R7244l5570
4103b07315l1139N7116m2002l1420K383L8512R28P3315j50907R4118m666N2381
$$ plain form
4091 -148696 -177667 -168413 -213980 -163520 -254877 -208312 -195610 -215646 -214150 -213851 -241769 -168358
4079 -168358 -174861 -271503 -168598 -203767 -194735 -211972 -198560 -120945 -174482 -96926 -209112 -219560
4067 -219560 -118436 -120287 -137922 -174435 -169664 -94869 -135380 -119246 -109982 -170739 -168992 -165474
4055 -165474 -70589 -86119 -128787 -144293 -104419 -104711 -72194 -73909 -39097 -104949 -9692 -40837
4043 -40837 -55470 -46764 -11326 -53280 -41354 42710 58963 41803 49031 33343 110338 133288
4031 133288 143496 188735 119076 201224 193966 228396 212304 192776 263592 217337 216756 283423
4019 283423 300169 255166 303716 295436 300363 333182 358512 339074 339081 390384 406653 469129 482002
4006 482002 555094 576643 649525 640075 691412 574092 596532 580179 573330 514145 455472 408193
$$ packed form
4091a48696k8971R254m5567N0460r1357M6565J2702k0036J496K99k7918P3411
4079a68358o503r6642J02905l5169R032j7237J3412P7615n3537P7556j12186j0448
4067b19560J01124j851j7635l6513M771P4795m0511J6134R264o0757J747L518
4055a65474R4885j5530m2668j5506L9874k92L2517j715L4812o5852R5257l1145
4043d0837j4633Q706L5438m1954J1926Q4064J6253j7160P228j5688P6995K2950
4031A33288J0208M5239o9659Q2148p258L4430j6092j9528P0816m6255n81O6667
4019B83423J6746m5003M8550q280M927L2819K5330j9438PN1303J6269O2476J2873
4006D82002P3092K1549P2882r450N1337j17320K2440j6353o849n9185n8673m7279
$$ plain form
3994 408193 408742 365749 390980 326614 293392 407937 366132 376298 333214 363330 354847 297570
3982 297570 338120 306082 330463 324348 306142 306517 285383 299482 339579 253680 269504 207802
3970 207802 171109 163594 125710 87986 114148 40499 77907 61643 -11062 50884 29169 58552
3958 58552 -16103 43207 -38848 -37951 -87398 -54753 -96043 -82235 -138732 -136857 -167823 -99550
3946 -99550 -84631 -162214 -88108 -150435 -79600 -155656 -98562 -166474 -123143 -137816 -112630 -190522
3934 -190522 -144092 -212972 -207197 -153935 -187750 -144831 -124733 -122174 -209636 -122598 -178857 -219582
3922 -219582 -137748 -164857 -202929 -193862 -196872 -221496 -156069 -254952 -234964 -234421 -154005 -236755
3910 -236755 -233147 -231358 -212032 -211920 -270334 -230769 -218345 -206542 -213726 -207212 -161240 -205253 -202341
$$ packed form
3994D08193N49m2993K5231o4366l3222J14545m1805J0166m3084L0116q483n7277
3982B97570M0550l2038K4381o115j8206L75k1134J4099M0097q5899J5824o1702
3970B07802l6693p515l7884l7724K6162p3649L7408j6264p2705O1946k1715K9383
3958E8552p4655N9310q2055Q97m9447L2645m1290J3808n6497J875l0966O8273
3946i9550J4919p7583P4106o2327P0835p6056N7094o7912M3331j4673K5186p7892
3934a90522M6430o8880N775N3262l3815M2919K0098K559q7462Q7038n6259m0725
3922b19582Q1834k7109l8072R067l010k4624O5427r8883J9988N43Q0416q2750
3910b36755L608J789J9326J12n8414L9565J2424J1803p184O514M5972m4013K912
$$ plain form
3897 -202341 -113437 -181322 -190258 -213745 -208822 -225642 -155499 -214091 -187921 -179099 -218010 -226664
3885 -226664 -242015 -231691 -187456 -176310 -197195 -241121 -238458 -208463 -237541 -242365 -251545 -190037
3873 -190037 -264719 -200638 -254879 -224217 -240133 -189294 -265585 -252327 -216286 -325618 -209028
3862 -209028 -182510 -155434 -174870 -207241 -281760 -252374 -198582 -236003 -260671 -244488 -262964 -186418
3850 -186418 -227719 -243051 -241476 -235745 -221868 -223194 -248648 -249360 -259813 -240942 -167478 -183898 -295291
3837 -295291 -306596 -237149 -242449 -230277 -228904 -226142 -243444 -245613 -188454 -258558 -194879 -188997 -247021
3824 -247021 -199408 -193503 -224549 -300058 -247722 -262762 -210623 -283959 -218721 -279647 -261071 -206862
3812 -206862 -295574 -318799 -284122 -255192 -234896 -277095 -262677 -326165 -203447 -221347 -318895
$$ packed form
3897b02341Q8904o7885q936k3487M923j6820P0143n8592K6170Q822l8911q654
3885b26664j5351J0324M4235J1146k0885m3926K663K9995k9078m824r180O1508
3873a90037p4682O4081n4241L0662j5916N0839p6291J3258L6041j09332J16590
3862b09028K6518K7076j9436l2371p4519K9386N3792l7421k4668J6183j8476P6546
3850a86418m1301j5332J575N731J3877j326k5454p12j0453J8871P3464j6420j11393
3837b95291j1305O9447n300J2172J373K762j7302k169N7159p0104O3679N882n8024
3824b47021M7613N905l1046p5509N2336j5040N2139p3336O5238o0926J8576N4209
3812b06862q8712k3225L4677K8930K0296m2199J4418o3488J22718j7900r7548
$$ plain form
3801 -318895 -339480 -244016 -272388 -316404 -281587 -181055 -266546 -326570 -245230 -288468 -288550 -264906
3789 -264906 -327116 -233245 -243089 -287208 -285115 -331625 -350690 -304155 -340476 -236043 -275050 -309776
3777 -309776 -261375 -348692 -273628 -220205 -250382 -278374 -292565 -227808 -232953 -296241 -245766 -281294
3765 -281294 -336420 -248849 -262189 -274935 -249628 -295355 -310973 -226682 -216606 -326649 -311321
3754 -311321 -316835 -262367 -299151 -287173 -267826 -251055 -231120 -242441 -338226 -272372 -264607 -252797
3742 -252797 -239810 -285629 -262779 -280435 -220096 -263576 -251181 -281704 -294680 -249554 -227196 -277733
3730 -277733 -276257 -302206 -245331 -229648 -244904 -287819 -264996 -274593 -243024 -211922 -304314 -244603
3718 -244603 -264317 -261582 -280363 -299367 -228104 -201231 -237117 -311932 -301292 -311065 -210350 -268929
$$ packed form
3801c18895k0585R5464k8372m4016L4817J00532q5491o0024Q1340m3238q2K3644
3789b64906o2210R3871r844m4119K093m6510j9065M6535l6321J04433l9007l4726
3777c09776M8401q7317P5064N3423l0177k7992j4191O4757n145o3288N0475l5528
3765b81294n5126Q7571j3340j2746K5307m5727j5618Q4291J0076j10043J5328
3754c11321n514N4468l6784J1978J9347J6771J9935j1321r5785O5854P765J1810
3742b52797J2987m5819K2850j7656O0339m3480J2395l0523j2976M5126K2358n0537
3730b77733J476k5949N6875J5683j5256m2915K2823r597L1569L1102r2392N9711
3718b44603j9714K735j8781j9004P1263K6873l5886p4815J0640r773J00715n8579
$$ plain form
3706 -268929 -273809 -258056 -211217 -278732 -303056 -248873 -295160 -267009 -284738 -241023 -296748 -201237
3694 -201237 -165088 -257276 -230949 -290173 -269936 -248010 -293759 -200051 -264327 -163669 -186620
3683 -186620 -251731 -267968 -238844 -164550 -241784 -273546 -217533 -242075 -213782 -212947 -203848 -225865
3671 -225865 -275737 -267393 -236657 -239126 -258232 -241354 -270754 -333408 -247159 -270556 -262629 -322106
3659 -322106 -263287 -239004 -233187 -257926 -257228 -340612 -266157 -168478 -236506 -241507 -226807 -218741 -253101
3646 -253101 -233313 -226420 -269135 -255310 -262376 -271216 -291985 -299548 -252462 -215737 -243041 -268893
3634 -268893 -181558 -265239 -281431 -209738 -228996 -254859 -234547 -167945 -247502 -303065 -229909 -250749
3622 -250749 -270434 -263420 -267385 -244356 -256553 -255424 -272306 -287423 -292760 -235514 -241681 -285883 -202614
$$ packed form
3706b68929m880J5753M6839o7515k4324N4183m6287K8151j7729M3715n5725R5511
3694b01237L6149r2188K6327n9224K0237K1926m5749R3708o4276J00658k2951
3683a86620o5111j6237K9124P4294p7234l1762N6013k4542K8293Q35R099k2017
3671b25865m9872Q344L0736k469j9106J6878k9400o2654Q6249k3397P927n9477
3659c22106N8819K4283N817k4739O98q3384P4455R7679o8028n001J4700Q066l4360
3646b53101J9788O893m2715J3825p066q840k0769p563M7086L6725k7304k5852
3634b68893Q7335q3681j6192P1693j9258k5863K0312O6602p9557n5563P3156k0840
3622b50749j9685P014l965K3029j2197J129j6882j5117n337N7246o167m4202Q3269
$$ plain form
3609 -202614 -259900 -251252 -271581 -262960 -292492 -253320 -344649 -278001 -289028 -285178 -267948 -220948
3597 -220948 -243943 -253200 -298614 -184726 -303926 -260703 -228258 -222217 -235549 -223484 -257740 -227129
3585 -227129 -158682 -251742 -255845 -183701 -206158 -243829 -196039 -198191 -177486 -200396 -200416 -217512 -219465
3572 -219465 -274544 -181883 -219848 -209559 -233308 -235117 -170143 -178611 -240819 -213751 -179856 -214506
3560 -214506 -162041 -166596 -193847 -206980 -201444 -203947 -192394 -185371 -176263 -226601 -215221 -171008 -189438
3547 -189438 -280441 -189077 -169917 -183963 -139507 -160246 -100095 -121620 -108968 -70855 7564 92783
3535 92783 24687 68135 101517 92670 67321 89037 48625 28800 -17734 -46363 -33341 -49248
3523 -49248 -76437 -116636 -118037 -120106 -122305 -122852 -164613 -147222 -136629 -202998 -119349 -165319 -229220
$$ packed form
3609b02614n7286Q648k0329Q621k9532L9172r1329O6648j1027L850J7230M7000
3597b20948k2995r257m5414J13888j19200M3223L2445O041j3332J2065l4256L0611
3585b27129O8447r3060m103P2144k2457l7671M7790k152K0705k2910k0j7096j953
3572b19465n5079R2661l7965J0289k3749j809O4974q468o2208K7068L3895l4650
3560b14506N2465m555k7251j3133N536k503J1553P023R108n0338J1380M4213j8430
3547a89438r1003R1364J9160j4046M4456k0739O0151k1525J2652L8113P8419Q5219
3535I2783o8096M3448L3382q847k5349K1716m0412j9825m6534k8629J3022j5907
3523d9248k7189m0199j401k069k199n47m1761J7391J0593o6369Q3649m5970o3901
$$ plain form
3510 -229220 -201680 -136879 -98813 -150477 -192606 -192278 -173907 -162038 -152542 -131948 -131688 -129261 -149144
3497 -149144 -180730 -171262 -167295 -141783 -183998 -196844 -122542 -190883 -151316 -187327 -225039 -174927
3485 -174927 -170401 -140490 -178525 -64815 -181791 -137425 -85616 -147915 -82394 -98388 -99846 -147262
3473 -147262 -84196 -168367 -105748 -77794 -110288 -108012 -73324 -83325 -111478 -153105 -104094 -161496
3461 -161496 -180370 -14495 -75915 -80700 -34325 -80020 -93012 -117998 -29119 -101721 -131368 -89604
3449 -89604 -123457 -20028 -85104 -71422 -36526 -58691 -57106 -82539 -85432 -1727 -24478 -39775
3437 -39775 -24032 -28012 -17981 35012 45474 -85751 -17581 10145 14216 -38474 -8092 13591
3425 13591 9243 -56000 33288 24702 58826 26082 58316 92876 27316 14469 14492 106124 82866
$$ packed form
3510b29220K7540O4801L8066n1664m2129L28J8371J1869R496K0594K60K427j9883
3497a49144l1586R468L967K5512m2215j2846P4302o8341L9567l6011l7712N0112
3485a74927M526K9911l8035J13710j16976M4366N1809o2299O5521j5994j458m7416
3473a47262O3066q4171O2619K7954l2494K276L4688j0001k8153m1627M9011n7402
3461a61496j8874J65875o1420m785M6375m5695j2992k4986Q8879p2602k9647M1764
3449h9604l3853J03429o5076J3682L4896k2165J585k5433k893Q3705k2751j5297
3437c9775J5743l980J0031N2993J0462j31225O8170K7726M071n2690L0382K1683
3425A3591m348o5243Q9288q586L4124l2744L2234L4560o5560j2847K3R1632k3258
$$ plain form
3412 82866 127230 68868 191942 139099 136142 210684 146706 208198 193116 119998 146706 239470
3400 239470 187451 199751 217277 226566 219000 315685 349486 278516 237638 290040 281714 241035
3388 241035 290413 361968 301706 263759 262472 328593 196325 290896 271858 367064 410094 382827
3376 382827 375882 402609 442670 491010 469858 416948 490437 492908 492599 456570 567781 618275
3364 618275 623424 607951 655087 668953 694430 723528 739647 749661 858932 855703 829279 812984
3352 812984 781513 898907 907766 909777 987348 1083121 1065193 1108265 1166925 1236413 1280851 1331716
3340 1331716 1432855 1534705 1492840 1529389 1562458 1672196 1768178 1784398 1789102 1890784 1933282
3329 1933282 2014631 2099119 2191140 2272410 2472911 2524815 2733208 2942678 3089215 3262105
$$ packed form
3412H2866M4364n8362J23074n2843k957P4542o3978O1492j5082p3118K6708R2764
3400B39470n2019J2300J7526R289p566R6685L3801p0970m0878N2402q326m0679
3388B41035M9378P1555o0262l7947j287O6121j32268R4571j9038R5206M3030k7267
3376C82827o945K6727M0061M8340k1152n2910P3489K471l09l6029J11211N0494
3364F18275N149j5473M7136J3866K5477K9098J6119J0014J09271l229k6424j6295
3352H12984l1471J17394Q859K011P7571R5773j7928M3072N8660O9488M4438N0865
3340A331716J01139J01850m1865L6549L3069J09738R5982J6220M704J01682M2498
3329A933282Q1349Q4488R2021Q1270K00501N1904K08393K09470J46537J72890
$$ plain form
3319 3262105 3550838 4071164 4579371 5314389 6163709 7041883 8202642 9361171 10663379
3310 10663379 12152408 14095277 16609431 19922702 24620314 31841222 42392059 55495830
3302 55495830 65867840 69256077 69411596 68323892 62350056 54898802 46340023 38170703
3294 38170703 31232243 25174534 20861525 17961006 15850301 14372667 13000510 11971132
3286 11971132 11064333 9978306 9029261 8121054 7263543 6514351 5883069 5391948 4978403
3277 4978403 4680920 4365424 4016220 3774644 3591057 3412208 3232353 3070689 2863749 2835925
3267 2835925 2683738 2652012 2473747 2376860 2271761 2192112 2082917 2014607 1924063 1905596 1853780
3256 1853780 1791237 1669639 1721431 1630116 1574991 1527364 1439428 1437184 1314104 1277496 1188828
$$ packed form
3319C262105K88733N20326N08207P35018Q49320Q78174J160759J158529J302208
3310A0663379J489029J942869K514154L313271M697612P220908J0550837J3103771
3302E5495830J0372010L388237J55519j087704n973836p451254q558779q169320
3294C8170703o938460o057709m313009k900519k110705j477634j372157j029378
3286A1971132r06799j086027r49045r08207q57511p49192o31282m91121m13545
3277D978403k97483l15496l49204k41576j83587j78849j79855j61664k06940k7824
3267B835925j52187l1726j78265r6887j05099p9649j09195o8310r0544j8467n1816
3256A853780o2543j21598N1792r1315n5125m7627q7936k244j23080l6608q8668
$$ plain form
3245 1188828 1250896 1152727 1078632 1013728 951960 948371 960741 951201 915579 921107 904902 825337
3233 825337 844732 793362 783518 718738 694800 763944 696446 675081 692760 616948 612981 631380
3221 631380 574333 564425 554484 516074 486274 531612 451439 459680 377789 349096 410250 330881
3209 330881 371175 364307 361623 355879 276361 216848 202064 266137 161564 156830 205298 196588
3197 196588 114455 128814 152967 94953 139604 104846 64052 123530 113958 145650 132135 67421
3185 67421 65236 127026 12875 100278 58128 34652 129748 10614 57784 55396 106913 10798
3173 10798 84466 42724 45233 23370 -32087 1959 -3732 26338 -52141 -40916 -15694 4910
3161 4910 26283 25658 -7670 -9307 -37723 15553 -27112 -2325 292 -20336 9017 -83609 -6991
$$ packed form
3245A188828O2068r8169p4095o4904o1768l589J2370r540l5622N528j6205p9565
3233H25337J9395n1370r844o4780k3938O9144o7498k1365J7679p5812l967J8399
3221F31380n7047r908r941l8410k9800M5338q0173Q241q1891k8693O1154p9369
3209C30881M0294o868k684n744p9518n9513j4784O4073j04573m734M8468q710
3197A96588q2133J4359K4153n8014M4651l4758m0794N9478r572L1692j3515o4714
3185F7421k185O1790j14151Q7403m2150k3476R5096j19134M7170k388N1517r6115
3173A0798P3668m1742K509k1863n5457L4046n691L0070p8479J1225K5222K0604
3161D910K1373o25l3328j637k8416N3276m2665K4787K617k0628K9353r2626P6618
$$ plain form
3148 -6991 -7490 -50803 -58565 -110081 -144214 -146642 -110260 -160305 -105372 -113031 -229995 -167224 -84033
3135 -84033 -106082 -111015 -157570 -150995 -172668 -230696 -148363 -178248 -124069 -174374 -94011 -236894
3123 -236894 -162823 -168604 -173456 -154032 -185617 -135460 -102337 -102331 -76291 -152193 -95021 -129775 -172047
3110 -172047 -125697 -103939 -147713 -101881 -140358 -168883 -183669 -127223 -188584 -177195 -124074 -224024
3098 -224024 -215050 -138935 -243189 -187377 -216286 -264168 -169579 -185423 -204800 -183983 -154524 -235570
3086 -235570 -193370 -227439 -190644 -254431 -207708 -178090 -175994 -209701 -150076 -161606 -187599 -189097
3074 -189097 -161244 -121676 -169915 -72244 -64822 -65743 5853 150339 130508 181312 152128 105184
3062 105184 155272 48363 5798 -18019 -75102 -106629 -112491 -90234 -138312 -127841 -165068 -167840
$$ packed form
3148f991m99m3313p762n1516l4133k428L6382n0045N4933p659j16964O2771Q3191
3135h4033k2049m933m6555O575k1673n8028Q2333k9885N4179n0305Q0363j42883
3123b36894P4071n781m852J9424l1585N0157L3123OK6040p5902N7172l4754m2272
3110a72047M6350K1758m3774M5832l8477k8525j4786N6446o1361J1389N3121r9950
3098b24024Q974P6115j04254N5812k8909m7882R4589j5844j9377K0817K9459q1046
3086b35570M2200l4069L6795o3787M6723K9618K096l3707N9625j1530k5993j498
3074a89097K7853L9568m8239R7671P422r21P1596J44486j9831N0804k9184m6944
3062A05184N0088j06909m2565k3817n7083l1527n862K2257m8078J0471l7227k772
$$ plain form
3050 -167840 -116440 -239432 -144882 -210615 -201923 -193806 -221198 -183431 -176752 -219383 -241792 -240718
3038 -240718 -257369 -295009 -180189 -257660 -211630 -178444 -244292 -248276 -169578 -219787 -280202 -218388
3026 -218388 -273947 -222023 -239383 -254909 -208055 -269830 -287490 -274095 -208453 -297793 -299551 -348328
3014 -348328 -276465 -220951 -255924 -229519 -269510 -248127 -209215 -222718 -229107 -229147 -262039 -204348
3002 -204348 -206151 -282203 -256852 -284836 -255910 -235170 -230028 -211628 -259038 -264725 -330831 -237895
2990 -237895 -267984 -284143 -327675 -292394 -283320 -308193 -276142 -261474 -284271 -261363 -224003 -287892
2978 -287892 -233718 -253870 -205618 -238538 -285988 -278661 -311950 -339361 -274954 -273000 -281042 -222702
2966 -222702 -253503 -329090 -249266 -255494 -291643 -320481 -220245 -308297 -330204 -297876 -278146 -261213
$$ packed form
3050a67840N1400j22992R4550o5733Q692Q117k7392L7767O679m2631k2409J074
3038b40718j6651l7640J14820p7471M6030L3186o5848l984P8698n0209o0415O1814
3026b18388n5559N1924j7360j5526M6854o1775j7660J3395O5642q9340j758m8777
3014c48328P1863N5514l4973K6405l9991K1383L8912j3503o389m0l2892N7691
3002b04348j803p6052K5351k7984K8926K0740N142J8400m7410n687o6106R2936
2990b37895l0089j6159m3532L5281R074k4873L2051J4668k2797K2908L7360o3889
2978b87892N4174k0152M8252l2920m7450P327l3289k7411O4407J954q042N8340
2966b22702l0801p5587P9824o228l6149k8838J00236q8052k1907L2328J9730J6933
$$ plain form
2954 -261213 -206716 -348598 -234337 -223967 -374298 -257364 -295706 -249858 -274888 -253529 -248073
2943 -248073 -261624 -261286 -218398 -263529 -181820 -286150 -272099 -279321 -272649 -232914 -301362 -309743
2931 -309743 -266968 -300542 -352945 -280179 -288792 -268710 -280965 -256874 -262080 -228865 -224549 -329946
2919 -329946 -267412 -272589 -289289 -303648 -282078 -296207 -312840 -328275 -312005 -331964 -309102 -272338
2907 -272338 -249330 -225587 -269771 -221928 -226179 -249260 -269015 -245450 -237554 -310673 -291227 -312061
2895 -312061 -267142 -246795 -259367 -237969 -227122 -269913 -221012 -232826 -263676 -176553 -196972 -280441
2883 -280441 -262550 -299286 -193866 -339341 -246745 -267751 -240813 -302841 -298221 -279258 -243443
2872 -243443 -283998 -222965 -307386 -326838 -275244 -203844 -300392 -289724 -286186 -243413 -292936 -239839
$$ packed form
2954b61213N4497j41882J14261J0370j50331J16934l8342M5848k5030K1359N456
2943b48073j3551L38M2888m5131Q1709j04330J4051p222O672L9735o8448q381
2931c09743M2775l3574n2403P2766q613K0082j2255K4091n206L3215M316j05397
2919c29946O2534n177j6700j4359K1570j4129j6633j5435J6270j9959K2862L6764
2907b72338K3008K3743m4184M7843m251k3081j9755K3565P896p3119J9446k0834
2895c12061M4919K0347j2572K1398J0847m2791M8901j1814l0850Q7123k0419q3469
2883b80441J7891l6736J05420j45475R2596k1006K6938o2028M620J8963L5815
2872b43443m0555O1033q4421j9452N1594P1400r6548J0668L538M2773m9523N3097
$$ plain form
2860 -239839 -267445 -276504 -231807 -297056 -286193 -224234 -275171 -289779 -278541 -304882 -284651 -266030
2848 -266030 -258433 -288485 -282697 -252089 -281793 -231753 -285442 -246086 -262098 -340336 -288518 -227948
2836 -227948 -300577 -276848 -249498 -341354 -236329 -187864 -257882 -296594 -233598 -256882 -321375
2825 -321375 -252675 -290356 -264681 -287752 -246139 -252335 -358393 -295402 -273080 -322980 -246881 -258369
2813 -258369 -241313 -297382 -235545 -257423 -322555 -260987 -212270 -268390 -249502 -224601 -252828 -215275
2801 -215275 -220614 -325581 -283565 -217871 -267371 -283222 -228219 -209976 -226301 -249829 -274541 -259752
2789 -259752 -180964 -313264 -340448 -315505 -213057 -286546 -315592 -287800 -268966 -304812 -278993
2778 -278993 -242204 -228505 -282413 -246810 -279501 -261011 -314671 -289733 -312701 -272100 -307136 -330215
$$ packed form
2860b39839k7606r059M4697o5249J0863O1959n0937j4608J1238k6341K0231J8621
2848b66030P597l0052N788L0608k9704N0040n3689L9356j6012p8238N1818O0570
2836b27948p2629K3729K7350r1856J05025M8465p0018l8712O2996k3284o4493
2825c21375O8700l7681K5675k3071M1613o196j06058O2991K2322m9900P6099j1488
2813b58369J7056n6069O1837k1878o5132O1568M8717n6120J8888K4901k8227L7553
2801b15275n339j04967M2016O5694m9500j5851N5003J8243j6325k3528k4712J4789
2789b59752P8788j32300k7184K4943J02448p3489k9046K7792J8834l5846K5819
2778b78993L6789J3699n3908L5603l2691J8490n3660K4938k2968M0601l5036k3079
$$ plain form
2766 -330215 -328531 -217916 -305756 -266771 -319158 -315892 -248776 -245567 -316476 -227506 -301924 -232010
2754 -232010 -287579 -279094 -256502 -259478 -264441 -332310 -257118 -269804 -305629 -294014 -257498 -301011
2742 -301011 -280369 -251688 -278481 -256440 -290633 -315267 -247796 -259476 -199782 -239259 -251475 -297989
2730 -297989 -298829 -277670 -266699 -285675 -298981 -290281 -264742 -236708 -244133 -311606 -328115 -266400
2718 -266400 -261633 -260347 -236962 -232185 -241732 -357167 -265527 -261525 -256365 -223478 -284355 -212188 -305837
2705 -305837 -325523 -312625 -265429 -363470 -287312 -241907 -235542 -278287 -260923 -249162 -289391 -250717
2693 -250717 -263704 -258838 -255397 -269207 -233697 -261466 -238978 -264799 -251438 -263040 -258341 -248797
2681 -248797 -317099 -265899 -281309 -294976 -257754 -271178 -283381 -273043 -310789 -253236 -311908 -173619
$$ packed form
2766c30215J684J10615q7840L8985n2387L266O7116L209p0909Q8970p4418O9914
2754b32010n5569Q485K2592k976m963o7869P5192j2686l5825J1615L6516m3513
2742c01011K0642K8681k6793K2041l4193k4634O7471j1680N9694l9477j2216m6514
2730b97989q40K1159J0971j8976j3306Q700K5539K8034p425o7473j6509O1715
2718b66400M767J286K3385M777r547j15435R1640M002N160L2887o0877P2167r3649
2705c05837j9686J2898M7196r8041P6158M5405O365m2745J7364J1761m0229L8674
2693b50717j2987M866L441j3810L5510k7769K2488k5821J3361j1602M699R544
2681b48797o8302N1200j5410j3667L7222j3424j2203J0338l7746N7553n8672J38289
$$ plain form
2669 -173619 -332059 -262797 -252080 -227806 -312560 -215304 -259737 -265173 -214692 -281671 -311065 -288064
2657 -288064 -247884 -228447 -198663 -302669 -292609 -251627 -296111 -278678 -266508 -269564 -297973 -233612
2645 -233612 -224866 -202952 -213386 -311387 -245107 -263009 -241755 -205938 -211668 -301478 -243355 -297918
2633 -297918 -231344 -312677 -272443 -279499 -249673 -291726 -272572 -225323 -262006 -269341 -242336 -313663
2621 -313663 -257430 -378227 -267473 -234411 -222209 -261205 -313161 -259396 -220956 -269538 -231720
2610 -231720 -283994 -205176 -242302 -276710 -226785 -229986 -241452 -218115 -268510 -207411 -245636 -279072
2598 -279072 -229823 -300309 -247675 -304209 -281108 -261659 -251670 -265482 -202260 -205755 -265005 -246576
2586 -246576 -231358 -274214 -264519 -233681 -286200 -297428 -223403 -226977 -290943 -240788 -212701 -242782
$$ packed form
2669a73619j58440O9262J0717K4274q4754R7256m4433n436N0481o6979k9394K3001
2657b88064M0180J9437K9784j04006J0060M0982m4484J7433J2170l056k8409O4361
2645b33612Q746K1914j0434r8001O6280j7902K1254L5817n730q9810N8123n4563
2633b97918O6574q1333M0234p056K9826m2053J9154M7249l6683p335K7005p1327
2621c13663N6233j20797J10754L3062J2202l8996n1956N3765L8440m8582L7818
2610b31720n2274P8818l7126l4408M9925l201j1466K3337n0395O1099l8225l3436
2598b79072M9249p0486N2634n6534K3101J9449R989j3812O3222l495n9250J8429
2586b46576J5218m2856R695L0838n2519j1228P4025l574o3966N0155K8087l0081
$$ plain form
2574 -242782 -263271 -281392 -171703 -248163 -226591 -271718 -260995 -270054 -212102 -284358 -284270 -274410
2562 -274410 -158960 -213546 -242012 -289052 -256754 -279688 -246357 -256476 -300130 -239619 -267242
2551 -267242 -226767 -238327 -277017 -263763 -285191 -238124 -218067 -273805 -297195 -200992 -251042 -235297
2539 -235297 -227131 -202409 -290709 -302380 -220399 -297986 -200177 -240230 -269161 -293234 -280828 -317278
2527 -317278 -289587 -257159 -230310 -228740 -251519 -219825 -244923 -264198 -237951 -222317 -273739 -308526
2515 -308526 -267247 -260032 -302743 -208012 -287259 -265758 -203434 -312914 -261557 -235300 -214093 -265776
2503 -265776 -281348 -192098 -264293 -221509 -274795 -264868 -257837 -301619 -267957 -242865 -207469 -238736
2491 -238736 -230991 -275205 -258538 -257837 -235155 -275523 -247530 -238380 -258048 -290432 -224684 -261791
$$ packed form
2574b42782k0489j8121J09689p6460K1572m5127J0723r059N7952p2256Q8R860
2562b74410J15450n4586k8466m7040L2298k2934L3331j0119m3654O0511k7623
2551b67242M0475j1560l8690J3254k1428M7067K0057n5738k3390R6203n0050J5745
2539b35297Q166K4722q8300j1671Q1981p7587R7809m0053k8931k4073J2406l6450
2527c17278K7691L2428K6849J570k2779L1694k5098j9275K6247J5634n1422l4787
2515c08526M1279P215m2711R4731p9247K1501O2324j09480N1357K6257K1207n1683
2503b65776j5572Q9250p2195M2784n3286R927P031m3782L3662K5092L5396l1267
2491b38736P745m4214J6667P01K2682m0368K7993R150j9668l2384O5748l7107
$$ plain form
2479 -261791 -187874 -289564 -262466 -230769 -267979 -294705 -237871 -302695 -237931 -263532 -279262
2468 -279262 -282051 -154500 -257474 -249969 -243065 -277622 -258536 -210681 -311400 -275740 -273664 -196301
2456 -196301 -241079 -225752 -222567 -270874 -251897 -294141 -268030 -281365 -265484 -285554 -272902 -272909 -239364
2443 -239364 -199727 -230748 -222939 -254593 -281740 -190218 -262527 -281423 -195309 -260732 -252259 -204902
2431 -204902 -310489 -248223 -295376 -250104 -246719 -320780 -230690 -309049 -298554 -318990 -223936 -268609
2419 -268609 -282893 -193664 -326821 -186354 -228908 -260892 -255013 -261105 -202525 -246266 -245382 -253997
2407 -253997 -216574 -234519 -220029 -281062 -157399 -293742 -305882 -305740 -272924 -274260 -277123 -274981
2395 -274981 -302388 -283720 -285192 -227673 -246293 -287031 -276258 -232487 -217781 -194662 -251650 -226125
$$ packed form
2479b61791P3917j01690K7098L1697l7210k6726N6834o4824O4764k5601j5730
2468b79262k789J27551j02974P505O904l4557J9086M7855j00719L5660K076P7363
2456a96301m4778J5327L185m8307J8977m2244K6111j3335J5881k0070J2652pL3545
2443b39364L9637l1021P809l1654k7147R1522p2309j8896Q6114o5423Q473M7357
2431b04902j05587O2266m7153M5272L385p4061R0090p8359J0495k0436R5054m4673
2419b68609j4284Q9229j33157J40467m2554l1984N879o092N8580m3741Q84q615
2407b53997L7423j7945J4490o1033J23663j36343j2140J42L2816j336k863K142
2395b74981k7407J8668j472N7519j8620m0738J0773M3771J4706K3119n6988K5525
$$ plain form
2383 -226125 -268066 -213284 -241032 -233975 -285104 -246583 -243336 -303277 -263156 -213310 -314559 -324975
2371 -324975 -314013 -240556 -292088 -244367 -221841 -307370 -247046 -306225 -215887 -221020 -181363 -266771
2359 -266771 -283305 -247199 -272481 -275015 -268658 -270078 -246025 -258580 -292701 -241436 -205027 -289214
2347 -289214 -237971 -238395 -254152 -212645 -191007 -257502 -304223 -227386 -331986 -206236 -280795 -160339
2335 -160339 -269351 -266857 -210857 -285366 -258153 -208299 -285826 -291779 -294014 -297958 -313473 -286139
2323 -286139 -304129 -248493 -279190 -244201 -256835 -259742 -217481 -337237 -245726 -228818 -270955 -281447
2311 -281447 -248163 -240864 -229977 -207587 -204873 -252570 -288070 -261502 -285360 -203939 -222701 -260287
2299 -260287 -286936 -199372 -256982 -236264 -227456 -262399 -251210 -211776 -263465 -314551 -350331 -191381
$$ packed form
2383b26125m1941N4782k7748P057n1129L8521L247n9941M0121M9846j01249j0416
2371c24975J0962P3457n1532M7721K2526q5529O0324n9179R0338n133L9657q5408
2359b66771j6534L6106k5282k534O357j420K4053j2555l4121N1265L6409q4187
2347b89214N1243m24j5757M1507K1638o6495m6721P6837j04600J25750p4559J20456
2335a60339j09012K494N6000p4509K7213M9854p7527n953k235l944j5515K7334
2323b86139j7990N5636l0697L4989j2634k907M2261j19756R1511J6908m2137j0492
2311b81447L3284P299J0887K2390K714m7697l5500K6568k3858Q1421j8762l7586
2299b60287k6649Q7564n7610K0718Q808l4943J1189L9434n1689n1086l5780J58950
$$ plain form
2287 -191381 -237132 -252105 -228513 -228622 -264530 -214432 -345050 -261277 -203402 -260417 -245834 -163974
2275 -163974 -201598 -278500 -305991 -254986 -252279 -309231 -286951 -306072 -244955 -244532 -210753 -232278
2263 -232278 -208468 -298968 -305325 -270270 -273394 -304610 -295490 -188340 -255012 -281462 -268969 -265095
2251 -265095 -268865 -286984 -268374 -300681 -267574 -267415 -209777 -293317 -264606 -239678 -276855 -216900
2239 -216900 -314540 -231758 -256910 -272498 -259622 -213677 -309194 -190672 -214192 -237024 -300378
2228 -300378 -223178 -260705 -267696 -264341 -283595 -281575 -289112 -223443 -227237 -276332 -242054 -286632 -303129
2215 -303129 -205776 -255397 -251547 -306379 -236889 -230593 -199621 -277626 -220838 -324821 -277559 -242127
2203 -242127 -229139 -262687 -178232 -325578 -239945 -282783 -245811 -281776 -294830 -337061 -217074
$$ packed form
2287a91381m5751j4973K3592j09l5908N0098j30618Q3773N7875n7015J4583Q1860
2275a63974l7624p6902k7491N1005K707n6952K2280j9121O1117M23L3779k1525
2263b32278K3810r0500o357L5055l124l1216R120J07150o6672k6450J2493L874
2251b65095l770j8119J8610l2307L3107J59N7638q3540K8711K4928l7177N9955
2239b16900r7640Q2782k5152j5588J2876M5945r5517J18522k3520k2832o3354
2228c00378P7200l7527o991L355j9254K020p537O5669l794m9095L4278m4578j6497
2215c03129R7353m9621L850n4832O9490O296L0972p8005N6788j03983M7262L5432
2203b42127J2988l3548Q4455j47346Q5633m2838L6972l5965j3054m2231J19987
$$ plain form
2192 -217074 -242447 -224658 -308736 -309926 -272305 -268468 -275967 -231912 -295200 -205254 -246061 -233580
2180 -233580 -242800 -272832 -203468 -294594 -247941 -214162 -220581 -271078 -216663 -310779 -268104 -259011
2168 -259011 -292843 -250957 -328210 -224702 -241749 -241095 -268532 -245698 -207792 -232176 -223895 -246927
2156 -246927 -240510 -262727 -264657 -248280 -245768 -280881 -265300 -284845 -175022 -260550 -266451 -251601
2144 -251601 -232024 -278817 -253477 -271970 -219374 -242293 -328511 -273862 -206018 -218906 -292219 -227372
2132 -227372 -202879 -286454 -193743 -182926 -215757 -278773 -287010 -244881 -281105 -277425 -261957 -148555
2120 -148555 -300450 -224439 -273055 -223025 -293805 -295888 -218701 -247676 -281362 -201108 -262433 -269497
2108 -269497 -285358 -219946 -238764 -224809 -227853 -271122 -248452 -277856 -297476 -261245 -284000 -222266
$$ packed form
2192b17074k5373J7789q4078j190L7621L837p499M4055o3288Q9946m0807J2481
2180b33580r220l0032O9364r1126M6653L3779o419n0497N4415r4116M2675R093
2168b59011l3832M1886p7253J03508j7047O54k7437K2834L7906k4384Q281k3032
2156b46927O417k2217j930J6377K512l5113J5581j9545J09823q5528n901J4850
2144b51601J9577m6793K5340j8493N2596k2919q6218N4649O7844j2888p3313O4847
2132b27372K4493q3575R2711J0817l2831o3016q237M2129l6224L680J5468J13402
2120a48555j51895P6011m8616N0030p0780k083P7187k8975l3686Q0254o1325p064
2108b69497j5861O5412j8818J3955l044m3269K2670k9404j9620L6231k2755O1734
$$ plain form
2096 -222266 -321440 -271453 -282348 -294227 -193063 -246971 -263193 -271929 -199279 -186403 -231642 -220952
2084 -220952 -227284 -250243 -291729 -294918 -279920 -303736 -298165 -264236 -251229 -249069 -266135 -226906
2072 -226906 -262178 -252129 -247991 -235893 -216444 -282707 -258829 -239574 -254612 -253977 -277751 -227742
2060 -227742 -139689 -282823 -231707 -257710 -238566 -217638 -256443 -286716 -215111 -268340 -254416
2049 -254416 -248628 -252721 -199403 -260055 -236360 -266988 -266219 -190544 -186795 -193232 -297638 -187470
2037 -187470 -278898 -253791 -252605 -218757 -259986 -232281 -229165 -281603 -257294 -242393 -256660 -172837
2025 -172837 -296612 -260139 -258678 -218235 -246736 -227704 -230921 -240381 -257518 -241155 -237566 -172875
2013 -172875 -247811 -256932 -253889 -293264 -266771 -210281 -249788 -289657 -268922 -233251 -232697 -220164
$$ packed form
2096b22266r9174M9987j0895j1879J01164n3908j6222q736P2650J2876m5239J0690
2084b20952o332k2959m1486l189J4998k3816N571L3929J3007K160j7066L9229
2072b26906l5272J0049M138J2098J9449o6263K3878J9255j5038O35k3774N0009
2060b27742Q8053j43134N1116k6003J9144K0928l8805l0273P1605n3229J3924
2049b54416N788m093N3318o0652K3695l0628P69P5675L749o437j04406J10168
2037a87470r1428K5107J186L3848m1229K7705L116n2438K4309J4901j4267Q3823
2025a72837j23775L6473J461M0443k8501J9032l217r460j7137J6363L589O4691
2013a72875p4936r121L043l9375K6493N6490l9507l9869K0735L5671N54J2533
$$ plain form
2001 -220164 -206087 -230607 -253345 -204459 -230526 -292851 -239578 -327474 -196341 -232660 -214801
1990 -214801 -312650 -286548 -277070 -221842 -202906 -216206 -285368 -227069 -260916 -276550 -235061 -272759
1978 -272759 -292822 -212908 -299637 -258735 -190522 -212489 -228720 -277482 -274510 -228034 -270197 -219100
1966 -219100 -253316 -264720 -283660 -162649 -272221 -266652 -188289 -210930 -241243 -284088 -296360
1955 -296360 -265072 -272954 -257056 -236928 -282145 -269813 -258295 -213846 -224045 -235173 -329855 -275297
1943 -275297 -286768 -242527 -293550 -284680 -267149 -198101 -296262 -274034 -176851 -209655 -174843 -270677
1931 -270677 -270651 -268856 -222332 -220964 -214164 -253041 -289339 -292937 -229236 -278825 -230421 -258213 -307618
1918 -307618 -246105 -242617 -234867 -260147 -227429 -262759 -246712 -257425 -244884 -298258 -224573 -257611
$$ packed form
2001b20164J4077k4520k2738M8886k6067o2325N3273q7896J31133l6319J7859
1990b14801r7849K6102R478N5228J8936j3300o9162N8299l3847j5634M1489l7698
1978b72759k0063P9914q6729M0902O8213k1967j6231m8762K972M6476m2163N1097
1966b19100l4216j1404j8940J21011j09572N569P8363k2641l0313m2845j2272
1955b96360L1288p882J5898K0128m5217J2332J1518M4449j0199j1128r4682N4558
1943b75297j1471M4241n1023Q870J7531O9048r8161K2228R7183l2804L4812r5834
1931b70677K6J795M6524J368O800l8877l6298l598O3701m9589M8404k7792m9405
1918c07618O1513L488P750k5280L2718l5330J6047j0713J2541n3374P3685l3038
$$ plain form
1906 -257611 -203734 -268823 -198145 -192504 -250818 -223639 -260452 -246386 -220417 -268287 -261354 -247896
1894 -247896 -249858 -265127 -311502 -238321 -279036 -224017 -304190 -237783 -280433 -236203 -302292 -218432
1882 -218432 -233209 -251511 -230229 -207988 -253813 -236895 -281395 -187135 -232776 -209681 -330433
1871 -330433 -272200 -231075 -246715 -244506 -245383 -246852 -283609 -251964 -312035 -230713 -251314 -294142
1859 -294142 -249451 -279194 -229420 -321904 -290017 -207813 -202419 -202915 -251969 -213534 -276264 -287095
1847 -287095 -223022 -267913 -216875 -246448 -228219 -237948 -257478 -206445 -273853 -203333 -313305 -267690
1835 -267690 -219707 -239452 -220171 -220724 -237605 -225179 -238098 -332860 -299876 -218046 -230699 -231538
1823 -231538 -162519 -215599 -268198 -264386 -277250 -260008 -294561 -238945 -201910 -210027 -271646 -269880
$$ packed form
1906b57611N3877o5089P0678N641n8314K7179l6813J4066K5969m7870O933J3458
1894b47896j962j5269m6375P3181m0715N5019q0173O6407m2650M4230o6089Q3860
1882b18432j4777j8302K1282K2241m5825J6918m4500R4260m5641K3095j20752
1871c30433N8233M1125j5640K209q77j469l6757L1645o0071Q1322k0601m2828
1859b94142M4691k9743M9774r2484L1887Q2204N394m96m9054L8435o2730j0831
1847b87095O4073m4891N1038k9573J8229r729j9530N1033o7408P0520j09972M5615
1835b67690M7983j9745J9281n53j6881J2426j2919r4762L2984Q1830j2653q39
1823b31538O9019n3080n2599L812j2864J7242l4553N5616L7035q117o1619J766
$$ plain form
1811 -269880 -249440 -245851 -285831 -120257 -290543 -196991 -235388 -183914 -233177 -294786 -282318
1800 -282318 -241111 -211432 -227483 -217690 -269608 -263044 -323775 -246258 -215368 -219183 -327705 -261804
1788 -261804 -304253 -260356 -278986 -212229 -288110 -289664 -252279 -185926 -240072 -224665 -254957 -183227
1776 -183227 -256813 -274717 -255862 -271999 -260439 -221052 -201927 -270290 -259037 -223592 -262637 -241643
1764 -241643 -272595 -214103 -268923 -219542 -274425 -250958 -246704 -265485 -283495 -280393 -244254 -221986
1752 -221986 -182993 -179709 -227249 -274017 -278921 -327757 -252226 -297114 -227754 -244248 -295251 -251385
1740 -251385 -290797 -236442 -201159 -320459 -255456 -247708 -254850 -310745 -279142 -277557 -216886 -226507
1728 -226507 -211440 -218332 -193032 -202735 -291026 -221107 -219463 -271445 -168614 -218972 -187651 -236207
$$ packed form
1811b69880K0440L589l9980J65574j70286R3552l8397N1474m9263o1609J2468
1800b82318M1207K9679j6051R793n1918O564o0731P7517L0890l815j08522O5901
1788b61804m2449M3897j8630O6757p5881j554L7385O6353n4146J5407l0292P1730
1776a83227p3586j7904J8855j6137J1560L9387J9125o8363J1253L5445l9045K0994
1764b41643l0952N8492n4820M9381n4883K3467M254j8781j8010L102L6139K2268
1752b21986L8993L284m7540m6768m904m8836P5531m4888O9360j6494n1003M3866
1740b51385l9412N4355L5283j19300O5003P748p142n5895L1603J585O0671r621
1728b26507J5067o892K5300r703q8291O9919J644n1982J02831n0358L1321m8556
$$ plain form
1716 -236207 -277169 -224492 -232826 -282614 -284787 -349340 -280504 -240986 -323122 -229061 -255975 -219558
1704 -219558 -278502 -287332 -225867 -267269 -211017 -210390 -252166 -218758 -245610 -203010 -228857 -297702
1692 -297702 -331516 -289286 -274269 -190226 -226640 -246547 -284874 -269259 -217944 -282909 -316181 -259372
1680 -259372 -254353 -248079 -278252 -180119 -262065 -234329 -239717 -263916 -175490 -184741 -320433 -228576
1668 -228576 -249489 -314824 -263242 -232838 -235565 -238593 -238848 -267547 -258271 -256396 -244498 -254317 -258223
1655 -258223 -310201 -268554 -243809 -263166 -288748 -267722 -242135 -237363 -241743 -261728 -266874 -204462
1643 -204462 -237881 -266399 -227016 -197273 -241939 -219549 -217544 -217867 -269502 -241826 -214761 -263551
1631 -263551 -181319 -132725 -190450 -219374 -273523 -197284 -211847 -312909 -254943 -284363 -274395 -241017
$$ packed form
1716b36207m0962N2677q334m9788k173o4553O8836L9518q2136R4061k6914L6417
1704b19558n8944q830O1465m1402N6252O27m1776L3408k6852M2600k5847o8845
1692b97702l3814M2230J5017Q4043l6414j9907l8327J5615N1315o4965l3272N6809
1680b59372N019O274l0173R8133q1946K7736n388k4199Q8426r251j35692R1857
1668b28576k0913o5335N1582L0404k727l028k55k8699R276J875J1898r819l906
1655b58223n1978M1647K4745j9357k5582K1026K5587M772m380j9985n146O2412
1643b04462l3419k8518L9383K9743m4666K2390K005l23n1635K7676K7065m8790
1631b63551Q2232M8594n7725k8924n4149P6239j4563j01062N7966k9420R968L3378
$$ plain form
1619 -241017 -269242 -250118 -324662 -243202 -308260 -187814 -235473 -247959 -230917 -251390 -242353 -214087
1607 -214087 -327700 -222451 -222581 -258623 -351262 -309311 -243939 -208087 -248019 -235377 -210393 -234859
1595 -234859 -258354 -225360 -300424 -240261 -205455 -287439 -216211 -250569 -279520 -269099 -274420 -340521
1583 -340521 -258419 -208672 -251297 -206386 -202705 -202745 -270162 -225062 -199665 -228004 -240789 -196470
1571 -196470 -293375 -241095 -220415 -238783 -236032 -248303 -254193 -195982 -305060 -225025 -255588 -233926
1559 -233926 -231419 -133903 -207254 -274451 -294340 -260360 -247103 -250816 -218439 -251513 -257300 -257747 -238805
1546 -238805 -259955 -271050 -298344 -222948 -291074 -245782 -251360 -227259 -262598 -261983 -228164 -241522
1534 -241522 -219303 -291602 -256855 -216451 -229645 -239919 -230072 -220934 -210004 -264292 -236312 -234182
$$ packed form
1619b41017k8225J9124p4544Q1460o5058J20446m7659j2486J7042k0473R037K8266
1607b14087j13613J05249j30l6042r2639M1951O5372L5852l9932J2642K4984k4466
1595b34859k3495L2994p5064O0163L4806q1984P1228l4358k8951J0421n321o6101
1583c40521Q2102M9747m2625M4911L681m0o7417M5100K5397k8339j2785M4319
1571a96470r6905N2280K0680j8368K751j2271n890N8211j09078Q0035l0563K1662
1559b33926K507R7516p3351o7197j9889L3980J3257l713L2377l3074n787m47J8942
1546b38805k1150j1095k7294P5396o8126M5292n578K4101l5339O15L3819j3358
1534b41522K2219p2299L4747M0404j3194j0274R847R138J0930n4288K7980K130
$$ plain form
1522 -234182 -292424 -202681 -206144 -234940 -225665 -252083 -283044 -228552 -245215 -271674 -290909 -223648
1510 -223648 -226700 -260775 -278870 -353427 -197207 -234331 -296345 -226179 -220783 -202183 -207938 -206175
1498 -206175 -227448 -193095 -194294 -252288 -257037 -302016 -257232 -243050 -179311 -288768 -222660 -251907
1486 -251907 -277087 -306665 -178361 -225701 -249296 -216075 -234923 -191189 -300840 -222841 -212530
1475 -212530 -171394 -246591 -209929 -333158 -257500 -250409 -206116 -208184 -271097 -292554 -237469 -276081
1463 -276081 -204633 -290920 -246906 -237931 -183626 -261465 -266286 -176688 -232654 -257188 -236265 -250437
1451 -250437 -255900 -221568 -226872 -250638 -256580 -268280 -242741 -220583 -204336 -323944 -278437 -242937
1439 -242937 -234979 -205382 -191348 -223736 -243012 -237308 -289485 -256046 -248330 -211220 -288721 -305308
$$ packed form
1522b34182n8242Q9743l463k8796R275k6418l0961N4492j6663k6459j9235O7261
1510b23648l052l4075j8095p4557J56220l7124o2014P0166N396J8600n755J763
1498b06175k1273L4353j199n7994m749m4979M4784J4182O3739j09457O6108k9247
1486b51907k5180k9578J28304m7340k3595L3221j8848M3734j09651P7999J0311
1475b12530M1136p5197L6662j23229P5658P091M4293k068o2913k1457N5085l8612
1463b76081P1448q6287M4014Q975N4305p7839m821Q9598n5966k4534K0923j4172
1451b50437n463L4332n304k3766n942j1700K5539K2158J6247j19608M5507L5500
1439b42937P958K9597J4034l2388j9276N704n2177L3439P716L7110p7501j6587
$$ plain form
1427 -305308 -295831 -246623 -207709 -218915 -215557 -228679 -269127 -300404 -241320 -255653 -172753 -243541
1415 -243541 -220036 -195830 -251229 -207166 -248191 -247929 -257569 -243434 -219589 -263966 -279254 -233550
1403 -233550 -301367 -238975 -234961 -281448 -288120 -174566 -259852 -256582 -263260 -259829 -200572 -286250
1391 -286250 -221742 -213772 -273224 -306527 -300828 -244105 -251930 -216194 -270267 -182759 -237243 -221556
1379 -221556 -281740 -257955 -260196 -233210 -245508 -218155 -195205 -212723 -229599 -206067 -214034 -223075
$$ packed form
1427c05308R477M9208L8914j1206L358j3122m0448l1277N9084j4333Q2900p0788
1415b43541K3505K4206n5399M4063m1025K62r640J4135K3845m4377j5288M5704
1403b33550o7817O2392M014m6487o672J13554q5286L270o678L431N9257q5678
1391b86250O4508P970n9452l3303N699N6723p825L5736n4073Q7508n4484J5687
1379b21556o0184K3785k241K6986j2298K7353K2950j7518j6876K3532p967r041
$$ [...]
##END NTUPLES=NMR SPECTRUM
##END=
