##TITLE=abcd
##JCAMPDX= 6.0         $$ Bruker NMR JCAMP-DX V2.0
##DATA TYPE= NMR SPECTRUM
##DATA CLASS= NTUPLES
##ORIGIN= UXNMR, Bruker Analytische Messtechnik GmbH
##OWNER= root
$$ XWIN-NMR		Version 3.5
$$ Sat May  2 08:22:44 2026 Russian Standard Time (UT+4h)  servis@DPX200
##.OBSERVE FREQUENCY= 200.131235884673
##.OBSERVE NUCLEUS= ^1H
##.ACQUISITION MODE= SIMULTANEOUS
##.ACQUISITION SCHEME= undefined
##.AVERAGES= 24
##.DIGITISER RES= 18
##SPECTROMETER/DATA SYSTEM= spect
##.PULSE SEQUENCE= zg
##.SOLVENT NAME= DMSO
##.SHIFT REFERENCE= (INTERNAL, DMSO, 0, 16.4885)
##AUDIT TRAIL= $$ (NUMBER, WHEN, WHO, WHERE, WHAT)
$$ ##TITLE= Audit trail, XWIN-NMR		Version 3.5
$$ ##JCAMPDX= 5.01
$$ ##ORIGIN= Bruker BioSpin GmbH
$$ ##OWNER= servis
$$ F:\spectra/data/av/nmr/H1/1/pdata/1/auditp.txt
$$ ##AUDIT TRAIL=  $$ (NUMBER, WHEN, WHO, WHERE, WHAT)
(   1,<2026-05-02 08:22:08.43 +0400>,<servis>,<DPX200>,
      <created by zg, POWCHK disabled, PULCHK disabled
       terminated by command 'halt'
       configuration hash MD5:
       00 E9 B6 7A A2 85 ED C7 34 08 36 98 17 FE 4E 26
       data hash MD5: 32K
       B0 B8 4C BE 18 D4 0A 84 AD FE 5B 32 A9 91 56 3C>)
(   2,<2026-05-02 08:22:10.25 +0400>,<servis>,<DPX200>,
      <Start of raw data processing
       efp BC_mod = 2 LB = 0.05 FT_mod = 6 PKNL = 1 PHC0 = -257.6274 PHC1 = 3.101563 SI = 16K 
       data hash MD5: 16K
       E9 FA DA D2 F0 EE 5A DC 7A 9F 15 C6 4F 73 91 FD>)
$$ ##END=
$$ 
$$ hash MD5
$$ E6 C2 73 12 3F 76 44 09 D5 BC 62 4F 48 81 BC 27
##$RELAX= 
##$RELAX= 
##$RELAX= 
##$RELAX= 
##$RELAX= 
##$RELAX= 
##$RELAX= 
##$RELAX= 
$$ Bruker specific parameters
$$ --------------------------
##$DU= <F:\spectra>
##$EXPNO= 1
##$NAME= <H1>
##$PROCNO= 1
##$TYPE= <nmr>
##$USER= <av>
##$AMP= (0..31)
100 100 100 100 100 100 100 100 100 100 100 100 100 100 100 100 100 100 
100 100 100 100 100 100 100 100 100 100 100 100 100 100 
##$AQSEQ= 0
##$AQ_mod= 1
##$AUNM= <au_zg>
##$AUTOPOS= <>
##$BF1= 200.13
##$BF2= 200.13
##$BF3= 200.13
##$BF4= 200.13
##$BF5= 500.13
##$BF6= 500.13
##$BF7= 500.13
##$BF8= 500.13
##$BYTORDA= 1
##$CFDGTYP= 0
##$CFRGTYP= 5
##$CHEMSTR= <none>
##$CNST= (0..31)
1 1 145 1 1 1 1 1 1 1 1 1 1 1 1 1 1 1 1 1 1 1 1 1 1 1 1 1 1 1 1 1 
##$CPDPRG= <>
##$CPDPRG1= <>
##$CPDPRG2= <>
##$CPDPRG3= <>
##$CPDPRG4= <mlev>
##$CPDPRG5= <mlev>
##$CPDPRG6= <mlev>
##$CPDPRG7= <mlev>
##$CPDPRG8= <mlev>
##$CPDPRGB= <>
##$CPDPRGT= <>
##$D= (0..31)
0 2 0 0 0 0 0 0 0 0.06 0 0 0 0 0 0 0.0002 0 0 0 0 0 0 0 0 0 0 0 0 0 0 
0 
##$DATE= 1777695728
##$DBL= (0..7)
120 120 120 120 120 120 120 120 
##$DBP= (0..7)
150 150 150 150 150 150 150 150 
##$DBP07= 0
##$DBPNAM0= <>
##$DBPNAM1= <>
##$DBPNAM2= <>
##$DBPNAM3= <>
##$DBPNAM4= <>
##$DBPNAM5= <>
##$DBPNAM6= <>
##$DBPNAM7= <>
##$DBPOAL= (0..7)
0.5 0.5 0.5 0.5 0.5 0.5 0.5 0.5 
##$DBPOFFS= (0..7)
0 0 0 0 0 0 0 0 
##$DE= 6
##$DECBNUC= <off>
##$DECIM= 32
##$DECNUC= <off>
##$DECSTAT= 4
##$DIGMOD= 1
##$DIGTYP= 9
##$DL= (0..7)
0 120 120 120 120 120 120 120 
##$DP= (0..7)
$$ [...]
##$SUBNAM4= <"">
##$SUBNAM5= <"">
##$SUBNAM6= <"">
##$SUBNAM7= <"">
##$SUBNAM8= <"">
##$SUBNAM9= <"">
##$SW= 20.6817932712277
##$SWIBOX= (0..15)
0 0 3 0 0 0 0 0 0 0 0 0 0 0 0 0 
##$SW_h= 4139.07284768212
##$TD= 32768
##$TD0= 1
##$TE= 0
##$TE2= 300
##$TE3= 300
##$TEG= 300
##$TL= (0..7)
0 120 120 120 120 120 120 120 
##$TP= (0..7)
150 150 150 150 150 150 150 150 
##$TP07= 0
##$TPNAME0= <>
##$TPNAME1= <>
##$TPNAME2= <>
##$TPNAME3= <>
##$TPNAME4= <>
##$TPNAME5= <>
##$TPNAME6= <>
##$TPNAME7= <>
##$TPOAL= (0..7)
0.5 0.5 0.5 0.5 0.5 0.5 0.5 0.5 
##$TPOFFS= (0..7)
0 0 0 0 0 0 0 0 
##$TUNHIN= 0
##$TUNHOUT= 0
##$TUNXOUT= 0
##$USERA1= <user>
##$USERA2= <user>
##$USERA3= <user>
##$USERA4= <user>
##$USERA5= <user>
##$V9= 5
##$VALIST= <valist>
##$VCLIST= <CCCCCCCCCCCCCCC>
##$VD= 0
##$VDLIST= <DDDDDDDDDDDDDDD>
##$VPLIST= <PPPPPPPPPPPPPPP>
##$VTLIST= <TTTTTTTTTTTTTTT>
##$WBST= 1024
##$WBSW= 30
##$XGAIN= (0..3)
0 0 0 0 
##$XL= 0
##$YL= 0
##$YMAX_a= 1328120
##$YMIN_a= -966469
##$ZGOPTNS= <>
##$ZL1= 120
##$ZL2= 120
##$ZL3= 120
##$ZL4= 120
##$ABSF1= 0
##$ABSF2= 0
##$ABSG= 0
##$ABSL= 0
##$ALPHA= 0
##$AQORDER= 0
##$ASSFAC= 0
##$ASSFACI= 0
##$ASSFACX= 0
##$ASSWID= 0
##$AUNMP= <proc_1d>
##$AZFE= 0.1
##$AZFW= 0.1
##$BCFW= 0
##$BC_mod= 2
##$BYTORDP= 0
##$COROFFS= 0
##$CY= 18.4799938201904
##$DATMOD= 1
##$DC= 0
##$DFILT= <>
##$DTYPP= 0
##$F1P= 9.9274215381318
##$F2P= -0.165520771350173
##$FCOR= 1
##$FTSIZE= 16384
##$FT_mod= 6
##$GAMMA= 0
##$GB= 0
##$INTBC= 1
##$INTSCL= 4.127829e-11
##$ISEN= 128
##$LB= 0.05
##$LEV0= 0
##$LPBIN= 0
##$MAXI= 10000
##$MC2= 0
##$MEAN= 0
##$ME_mod= 0
##$MI= 50
##$NCOEF= 0
##$NC_proc= -3
##$NLEV= 6
##$NOISF1= 3.799351
##$NOISF2= 2.8
##$NSP= 0
##$NTH_PI= 0
##$NZP= 0
##$OFFSET= 16.48848
##$PC= 4
##$PHC0= -257.6274
##$PHC1= 3.101563
##$PH_mod= 1
##$PKNL= yes
##$PPARMOD= 0
##$PSCAL= 4
##$PSIGN= 0
##$REVERSE= no
##$SF= 200.130005582386
##$SI= 16384
##$SIGF1= 3
##$SIGF2= 2
##$SINO= 400
##$SIOLD= 16384
##$SREGLST= <1H.CDCl3>
##$SSB= 0
##$STSI= 16384
##$STSR= 0
##$SW_p= 4139.07284768211
##$SYMM= 0
##$S_DEV= 0
##$TDeff= 32768
##$TDoff= 0
##$TI= <>
##$TILT= no
##$TM1= 0
##$TM2= 0
##$TOPLEV= 0
##$USERP1= <user>
##$USERP2= <user>
##$USERP3= <user>
##$USERP4= <user>
##$USERP5= <user>
##$WDW= 1
##$XDIM= 16384
##$YMAX_p= 281351336
##$YMIN_p= -238004
$$ End of Bruker specific parameters
$$ ---------------------------------
##NTUPLES= NMR SPECTRUM
##VAR_NAME=  FREQUENCY,     SPECTRUM/REAL,   SPECTRUM/IMAG
##SYMBOL=    X,             R,               I
##VAR_TYPE=  INDEPENDENT,   DEPENDENT,       DEPENDENT
##VAR_FORM=  AFFN,          ASDF,            ASDF
##VAR_DIM=   16384,         16384,           16384
##UNITS=     HZ,            ARBITRARY UNITS, ARBITRARY UNITS
##FACTOR=    0.252644378177508, 1,           1
##FIRST=     3299.83951724647, 0,            0
##LAST=      -839.233330435636, 0,           0
##MIN=       -839.233330435636, -238004,     0
##MAX=       3299.83951724647, 281351336,    0
$$ Real data points
##PAGE= N=1
##DATA TABLE= (X++(R..R)), XYDATA
$$ [...]
$$ plain form
8951 4612559 4713357 4806548 4915143 5043199 5209253 5350068 5527750 5736131 5999989 6272390
8941 6272390 6618113 6975435 7361715 7726833 8064403 8369195 8613178 8825795 8949444 9042216
8931 9042216 9120485 9180531 9212661 9244474 9237866 9224040 9155393 9024670 8820537 8558614 8276144
8920 8276144 7969434 7668604 7382111 7175178 6984569 6856766 6803268 6831641 6902549 7034694
8910 7034694 7191178 7387155 7671193 7866262 8126222 8369334 8590843 8782588 8979523 9147661
8900 9147661 9288723 9371656 9445279 9507710 9569536 9609563 9647495 9691789 9719341 9714432 9667841
8889 9667841 9571593 9467289 9301534 9120928 9007021 8895121 8843509 8786580 8757101 8738550
8879 8738550 8710379 8669618 8670164 8700082 8758392 8888072 9066505 9220044 9310507 9394871 9384024
$$ packed form
8951D612559J00798R3191J08595J28056J66054J40815J77682K08381K63858K72401
8941F272390L45723L57322L86280L65118L37570L04792K43983K12617J23649R2772
8931I042216P8269O0046L2130L1813o608j3826o8647j30723k04133k61923k82470
8920H276144l06710l00830k86493k06933j90609j27803n3498K8373P0908J32145
8910G034694J56484J95977K84038J95069K59960K43112K21509J91745J96935J68138
8900I147661J41062Q2933P3623O2431O1826M0027L7932M4294K7552m909m6591
8889I667841r6248j04304j65755j80606j13907j11900n1612n6929k9479j8551
8879H738550k8171m0761N46K9918N8310J29680J78433J53539R0463Q4364j0847
$$ plain form
8868 9384024 9302945 9214233 9103602 8991420 8895696 8860038 8852823 8928044 9003999 9076388 9100966
8857 9100966 9088723 9013491 8910282 8774290 8657902 8583783 8517853 8503652 8511189 8496354 8486375
8846 8486375 8443243 8410604 8320621 8227140 8079209 7927626 7758088 7603474 7525945 7473831 7448690
8835 7448690 7501803 7548671 7590567 7564187 7507203 7413261 7286172 7140535 7004001 6899365 6839713
8824 6839713 6852506 6881528 6946431 7024287 7028418 7020514 6889956 6783926 6629624 6499886 6335151
8813 6335151 6212822 6117012 5972515 5804433 5606085 5391567 5126474 4859887 4580170 4361869
8803 4361869 4155221 3944259 3780686 3637947 3504896 3392018 3289325 3180668 3123521 3055569
8793 3055569 2963054 2902065 2841491 2771602 2698498 2632085 2565604 2470439 2475488 2408531 2350461 2317647
$$ packed form
8868I384024q1079q8712j10631j12182r5724l5658p215P5221P5955P2389K4578
8857I100966j2243p5232j03209j35992j16388p4119o5930j4201P537j4835r979
8846H486375m3132l2639q9983r3481j47931j51583j69538j54614p7529n2114k5141
8835G448690N3113M6868M1896k6380n6984r3942j27089j45637j36534j04636n9652
8824F839713J2793K9022O4903P7856M131p904j30558j06030j54302j29738j64735
8813F335151j22329r5810j44497j68082j98348k14518k65093k66587k79717k18301
8803D361869k06648k10962j63573j42739j33051j12878j02693j08657n7147o7952
8793C055569r2515o0989o0574o9889p3104o6413o6481r5165N049o6957n8070l2814
$$ plain form
8781 2317647 2296986 2275488 2235645 2203213 2176237 2164579 2129527 2158101 2146857 2127635 2128074 2133874
8769 2133874 2119643 2140840 2162638 2157657 2202288 2232984 2287101 2387994 2538160 2787302 3060645
8758 3060645 3294953 3412278 3384194 3230173 3041611 2803165 2602768 2431214 2299845 2223381
8748 2223381 2173552 2110975 2081056 2059842 2067778 2062802 2079905 2138428 2177365 2229315 2310654 2425376
8736 2425376 2553065 2640497 2736028 2824371 2850312 2868393 2840120 2855277 2825071 2834232 2902369
8725 2902369 2918648 2985701 3002883 2966869 2951266 2867311 2777905 2728842 2643592 2618832 2590927
8714 2590927 2589448 2612382 2650320 2694475 2752295 2823726 2883621 3007956 3153834 3278897 3450989
8703 3450989 3623743 3855719 4106638 4368456 4627783 4832486 5001589 5095609 5136289 5138347
$$ packed form
8781B317647k0661k1498l9843l2432k6976j1658l5052K8574j1244j9222M39N800
8769B133874j4231K1197K1798m981M4631L0696N4117J00893J50166K49142K73343
8758C060645K34308J17325k8084j54021j88562k38446k00397j71554j31369p6464
8748B223381m9829o2577k9919k1214P936m976J7103N8523L8937N1950Q1339J14722
8736B425376J27689Q7432R5531Q8343K5941J8081k8273J5157l0206R161O8137
8725B902369J6279O7053J7182l6014j5603q3955q9406m9063q5250k4760k7905
8714B590927j479K2934L7938M4155N7820P1431N9895J24335J45878J25063J72092
8703C450989J72754K31976K50919K61818K59327K04703J69103R4020M0680K058
$$ plain form
8693 5138347 5124587 5114821 5133660 5179776 5225369 5222005 5165940 5106070 4969661 4799544 4617805
8682 4617805 4415304 4223708 4091917 3970288 3870584 3811932 3781483 3783916 3816449 3861298 3910417
8671 3910417 3996346 4056164 4176495 4294778 4439867 4597334 4786232 4973595 5142052 5266558
8661 5266558 5373214 5397112 5395658 5406391 5388905 5379626 5377313 5363330 5342082 5283067 5210402 5099520
8649 5099520 4937977 4742626 4572068 4383599 4232187 4048280 3903479 3773047 3669074 3547199
8639 3547199 3443278 3389592 3320079 3273733 3210082 3194030 3150864 3128541 3108835 3101060 3102792 3084318
8627 3084318 3080199 3067699 3047884 3040482 3027823 3040498 3010068 2983031 2991662 2954474 2895624 2832371
8615 2832371 2786162 2739962 2686086 2605366 2552494 2466952 2375961 2311436 2224452 2166127 2091510
$$ packed form
8693E138347j3760r766J8839M6116M5593l364n6065n9870j36409j70117j81739
8682D617805k02501j91596j31791j21629r9704n8652l0449K433L2533M4849M9119
8671C910417Q5929N9818J20331J18283J45089J57467J88898J87363J68457J24506
8661E266558J06656K3898j454J0733j7486r279k313j3983k1248n9015p2665j10882
8649E099520j61543j95351j70558j88469j51412j83907j44801j30432j03973j21875
8639C547199j03921n3686o9513m6346o3651j6052m3166k2323j9706p775J732j8474
8627C084318m119j2500j9815p402j2659J2675l0430k7037Q631l7188n8850o3253
8615B832371m6209m6200n3876q0720n2872q5542r0991o4525q6984n8325p4617
$$ plain form
8604 2091510 2004069 1933420 1890670 1826905 1769878 1688390 1644140 1582360 1512849 1464984 1430271
8593 1430271 1384794 1344811 1316354 1301562 1278789 1264581 1272159 1251465 1232759 1233216 1192110 1185731
8581 1185731 1170987 1141650 1103003 1096357 1090192 1061021 1070914 1039564 1021177 1006059 980849 956363
8569 956363 946655 928271 878172 880990 871521 844657 805224 806251 786016 766914 743421 725182
8557 725182 727838 704416 708229 685409 686710 684757 669200 647588 639781 643061 604113 624261 607410
8544 607410 580823 605141 581996 583284 571632 575435 553256 560610 550300 547487 526444 531232 517233
8531 517233 439321 498469 482400 478053 493218 479692 488059 480276 489954 470251 448729 463672
8519 463672 464061 442064 456647 427650 459357 423843 419337 432159 426584 418425 392618 408243 424161
$$ packed form
8604B091510q7441p0649m2750o3765n7027q1488m4250o1780o9511m7865l4713
8593A430271m5477l9983k8457j4792k2773j4208P578k0694j8706M57m1106o379
8581A185731j4744k9337l8647o646o165k9171R893l1350j8387j5118k5210k4486
8569I56363r708j8384n0099K818r469k6864l9433J027k0235j9102k3493j8239
8557G25182K656k3422L813k2820J301j953j5557k1612p807L280l8948K0148j6851
8544F07410k6587K4318k3145J288j1652L803k2179P354j0310k813k1043M788j3999
8531E17233p7912N9148j6069m347J5165j3526Q367p783R678j9703k1522J4943
8519D63672L89k1997J4583k8997L1707l5514m506J2822n575q159k5807J5625J5918
$$ plain form
8506 424161 393617 399126 402471 395447 397384 379033 387344 374970 399094 390573 374893 367717 336057
8493 336057 354509 357307 368847 357020 334220 334540 309913 330605 324250 341482 319468 316887 323659
8480 323659 322304 326033 308001 321989 317353 328421 301011 305921 306606 301723 285494 282672 310047
8467 310047 291317 299080 289846 280763 294228 276481 298255 288841 289777 289450 279356 275751 270903 275614
8453 275614 276816 265499 266323 275392 260965 270742 283200 267790 277699 274454 252662 253930 279813
8440 279813 286051 261042 272335 246520 242970 256042 246232 249396 243762 252996 264956 238554 252795
8427 252795 251523 242017 244430 241348 262598 229102 237107 246455 245321 242782 234747 222464 229556 232822
8413 232822 248957 235299 246281 250466 256242 252550 226415 240411 245763 223806 242664 203433
$$ packed form
8506D24161l0544N509L345p024J937j8351Q311j2374K4124q521j5680p176l1660
8493C36057J8452K798J1540j1827k2800L20k4627K0692o355J7232k2014k581O772
8480C23659j355L729j8032J3988m636J1068k7410M910O85m883j6229k822K7375
8467C10047j8730P763r234r083J3465j7747K1774r414R36l27j0094l605m848M711
8453B75614J202j1317Q24R069j4427R777J2458j5410R909l245k1792J268K5883
8440B79813O238k5009J1293k5815l550J3072r810L164n634R234J1960k6402J4241
8427B52795j272r506K413l082K1250l3496Q005R348j134k539q035j2283P092L266
8413B32822J6135j3658J0982M185N776l692k6135J3996N352k1957J8858l9231
$$ plain form
8401 203433 248323 219926 202212 220711 198931 201208 235110 207666 245047 220493 214145 206751
8389 206751 226099 229624 230417 238462 222358 231831 236108 227519 230836 218589 219637 218792 219856 249815
8375 249815 240750 241657 254194 252934 257729 242049 239109 260494 230953 235803 255953 243690 234925
8362 234925 233036 234260 239455 230875 235142 223598 222198 228219 232890 240476 236138 236717 244780 229466
8348 229466 231732 212608 221812 218982 243984 245493 226749 235994 224016 227577 234067 210378 243576
8335 243576 235646 209189 206628 199419 219219 227496 232091 227069 212188 209341 249095 224788 214767
8322 214767 238237 217254 217087 204219 212019 218159 224002 227441 202179 210216 221699 200800 215416
8309 215416 218197 236021 214296 185134 212241 207144 225348 219351 223949 219471 211906 218058 223131
$$ packed form
8401B03433M4890k8397j7714J8499k1780K277L3902k7444L7381k4554o348p394
8389B06751J9348L525P93Q045j6104R473M277q589L317j2247J048q45J064K9959
8375B49815r065R07J2537j260M795j5680k940K1385k9541M850K0150j2263q765
8362B34925j889J224N195q580M267j1544j400O021M671P586m338N79Q063j5314
8348B29466K266j9124R204k830K5002J509j8744R245j1978L561O490k3689L3198
8335B43576p930k6457k561p209J9800Q277M595n022j4881k847L9754k4307j0021
8322B14767K3470k0983j67j2868P800O140N843L439k5262Q037J1483k0899J4616
8309B15416K781J7824k1725k9162K7107n097J8204n997M598m478p565O152N073
$$ plain form
8296 223131 208267 212756 213224 194075 198905 199683 207993 192886 225053 222189 227273 205851 220472
8283 220472 228833 212928 208201 180950 208784 211777 222731 224333 211208 205328 235865 245534 217681
8270 217681 200027 221825 216761 228436 231034 228095 230753 219408 229319 227070 213166 227105 211021
8257 211021 238692 216304 205363 228542 224144 219335 235389 215782 231187 214286 218198 219028 213028
8244 213028 220550 231783 220801 238429 211265 196953 205059 211424 197754 206785 208512 210950 201483
8231 201483 207559 209816 207977 228636 218428 203154 226449 243592 223099 199479 216452 220624
8219 220624 214099 233482 222060 202784 215604 222376 236299 215213 213435 207882 229148 221448 231271
8206 231271 214445 216708 206219 221756 237492 236614 227215 195646 177041 222854 246287 248123 255768
$$ packed form
8296B23131j4864M489M68j9149M830P78Q310j5107L2167k864N084k1422J4621
8283B20472Q361j5905m727k7251K7834K993J0954J602j3125n880L0537R669k7853
8270B17681j7654K1798n064J1675K598k939K658j1345R911k249j3904J3939j6084
8257B11021K7671k2388j0941K3179m398m809J6054j9607J5405j6901L912Q30o000
8244B13028P522J1233j0982J7628k7164j4312Q106O365j3670R031J727K438r467
8231B01483O076K257j839K0659j0208j5274K3295J7143k0493k3620J6973M172
8219B20624o525J9383j1422j9276J2820O772J3923k1086j778n553K1266p700R823
8206B31271j6826K263j0489J5537J5736q78r399l1569j8605M5813K3433J836P645
$$ plain form
8193 255768 254523 256685 158061 173315 200343 198681 178609 192579 200734 186680 181973 190654 204776
8180 204776 188168 205165 191534 194726 172145 173892 218448 188706 219610 199706 204766 199848
8168 199848 222828 205439 196983 203098 202132 211652 216152 198399 212520 224137 192418 223184 181508
8155 181508 199863 196328 184826 196123 217613 210726 198216 194229 197982 212781 221742 198195 196525
8142 196525 200214 186391 208626 207143 217116 207568 201345 199227 194190 192390 184060 214068 202207
8129 202207 194030 190344 200503 199942 208901 221050 201849 219104 217173 212669 198683 195605 212815
8116 212815 214772 202037 231668 223886 216092 220571 234147 198440 195273 216114 223525 224070 224008 221871
8102 221871 219425 197239 233002 230468 206148 223598 215973 252874 226915 252807 249140 273305
$$ packed form
8193B55768j245K162r8624J5254K7028j662k0072J3970Q155j4054m707Q681J4122
8180B04776j6608J6997j3631L192k2581J747M4556k9742L0904j9904N060m918
8168A99848K2980j7389q456O115r66R520M500j7753J4121J1617l1719L0766m1676
8155A81508J8355l535j1502J1297K1490o887j2510l987L753J4799Q961k3547j670
8142A96525L689j3823K2235j483R973r548o223k118n037j800q330L0008j1861
8129B02207q177l686J0159n61Q959J2149j9201J7255j931m504j3986l078J7210
8116B12815J957j2735K9631p782p794M479J3576l5707l167K0841P411N45o2k137
8102B21871k446k2186L5763k534k4320J7450p625L6901k5959K5892l667K4165
$$ plain form
8090 273305 276210 263809 267613 253992 230135 245792 244575 216837 227659 243365 251233 237301
8078 237301 233274 251482 242600 238091 237244 243038 253194 245283 275172 284786 263880 297150 323388
8065 323388 387237 380269 388244 382731 406658 358268 355416 327135 318648 297969 293261 284451 256775
8052 256775 261627 258191 252160 264611 272062 251061 241708 259512 270193 281840 285504 289286 326074
8039 326074 346074 377924 398906 415148 407741 395674 378947 363949 347750 327438 319372 302885
8027 302885 307566 287470 294726 251978 261476 258118 251162 244553 282436 252385 255971 252793 261529
8014 261529 271639 275421 242975 273546 287867 290725 298400 272107 271761 257052 260828 257506 254406
8001 254406 252429 229550 259910 225180 237191 248023 228610 232125 228735 218598 216930 220577 218759
$$ packed form
8090B73305K905j2401L804j3621k3857J5657j217k7738J0822J5706P868j3932
8078B37301m027J8208q882m509q47N794J0156p911K9889R614k0906L3270K6238
8065C23388O3849o968P975n513K3927m8390k852k8281q487k0679m708q810k7676
8052B56775M852l436o031J2451P451k1001r353J7804J0681J1647L664L782L6788
8039C26074K0000L1850K0982J6242p407j2067j6727j4998j6199k0312q066j6487
8027C02885M681k0096P256m2748R498l358o956o609L7883l0051L586l178Q736
8014B61529J0110L782l2446L0571J4321K858P675k6293l46j4709L776l322l100
8001B54406j977k2879L0360l4730J2011J0832j9413L515l390j0137j668L647j818
$$ plain form
7988 218759 220879 232328 219873 219045 214512 214980 194912 209797 214757 211742 213598 222482 217531 210847
7974 210847 205011 210105 221859 218515 222348 216656 223428 196254 214970 216375 227589 216405 213797
7961 213797 215487 217494 232059 228774 205840 205532 224176 223124 209213 210741 217466 208559 206332 204182
7947 204182 220286 221516 230747 208888 218020 220561 205787 202782 187075 227062 233703 225307 220525
7934 220525 198899 213894 212341 210253 225994 208636 239392 227177 229187 221596 219856 210289 225978
7921 225978 234423 215582 236486 224074 194429 211345 225872 220508 219570 219685 224810 223812 231017 238322
7907 238322 233781 229216 221509 226055 232929 211858 238523 239782 216651 247804 227875 239414 233615
7894 233615 227404 234581 206924 245907 226024 225277 240601 224458 252552 232304 223750 256084 226818
$$ packed form
7988B18759K120J1449j2455q28m533M68k0068J4885M960l015J856Q884m951o684
7974B10847n836N094J1754l344L833n692O772k7174J8716J405J1214j1184k608
7961B13797J690K007J4565l285k2934l08J8644j052j3911J528O725q907k227k150
7947B04182J6104J230R231k1859R132K541j4774l005j5707L9987O641q396m782
7934B20525k1626J4995j553k088J5741j7358L0756j2215K010p591j740r567J5689
7921B25978Q445j8841K0904j2412k9645J6916J4527n364r38J15N125r98P205P305
7907B38322m541m565p707M546O874k1071K6665J259k3131L1153j9929J1539n799
7894B33615o211P177k7657L8983j9883p47J5324j6143K8094k0248q554L2334k9266
$$ plain form
7881 226818 240978 247274 235872 248978 222458 251033 252585 248844 241330 243662 246649 271215 241262
7868 241262 260472 237371 243587 248270 255840 254858 279953 256296 273748 256360 275107 270910 285776
7855 285776 312831 393536 174279 171542 219617 204810 240984 234565 233626 244560 254808 247285
7843 247285 279808 267036 254737 251666 270387 271684 279928 261050 268444 268568 261823 273279 252150
7830 252150 265444 272753 289255 290390 275877 281747 282245 280621 273516 276149 257576 263528 281026
7817 281026 270358 276142 253577 272981 265078 264462 263888 282536 263602 283724 267289 258543 270430
7804 270430 286743 281846 297741 288973 273953 289978 267681 280362 284365 268429 284592 276492
7792 276492 274455 304075 296572 291261 294631 281721 289378 299544 304322 301545 309820 318113 292855
$$ packed form
7881B26818J4160O296j1402J3106k6520K8575J552l741p514K332K987K4566k9953
7868B41262J9210k3101O216M683P570r82K5095k3657J7452j7388J8747m197J4866
7855B85776K7055Q0705k19257k737M8075j4807L6174o419r39J0934J0248p523
7843B47285L2523j2772j2299l071J8721J297Q244j8878P394J24o745J1456k1129
7830B52150J3294P309J6502J135j4513N870M98j624p105K633j8573N952J7498
7817B81026j0668N784k2565J9404p903o16n74J8648j8934K0122j6435q746J1887
7804B70430J6313m897J5895q768j5020J6025k2297J2681M003j5936J6163q100
7792B76492k037K9620p503n311L370j2910P657J0166M778k777Q275Q293k5258
$$ plain form
7779 292855 317223 284913 314240 306660 297299 309908 295845 314505 323438 291672 312383 297461
7767 297461 330076 324751 313223 339889 344776 341125 319465 338926 340046 310061 323867 327768 341209
7754 341209 344251 343275 346497 350592 358545 336042 337216 348011 367546 378746 364450 343952 353611
7741 353611 369501 380975 360014 349445 372914 372262 408373 372261 388841 392871 412532 410356
7729 410356 411794 408766 401632 420696 413888 432373 431200 444746 442211 447437 445864 439796 440399 449972
7715 449972 442422 460054 469821 447546 478233 475677 489133 493587 494375 491779 511156 518560 520194
7702 520194 537278 529150 544740 574533 586996 594418 626890 638695 665265 690376 734542 813431
7690 813431 834797 897049 950133 992396 1079022 1205387 1369875 1558223 1843785 2247302 2908405
$$ packed form
7779B92855K4368l2310K9327p580r361J2609j4063J8660Q933l1766K0711j4922
7767B97461L2615n325j1528K6666M887l651k1660J9461J120k9985J3806L901J3441
7754C41209L042r76L222M095P953k2503J174J0795J9535J1200j4296k0498R659
7741C53611J5890J1474k0961j0569K3469o52L6111l6112J6580M030J9661k176
7729D10356J438l028p134J9064o808J8485j173J3546k535N226j573o068O03R573
7715D49972p550J7632R767k2275L0687k556J3456M454P88k596J9377P404J634
7702E20194J7084q128J5590K9793J2463P422L2472J1805K6570K5111M4166P8889
7690H13431K1366O2252N3084M2263Q6626J26365J64488J88348K85562M03517O61103
$$ plain form
7679 2908405 3770247 4777877 5545472 5840034 5699926 5259618 4600358 3867494 3189152
7670 3189152 2638045 2202098 1870770 1653260 1492204 1373815 1199710 1128802 1012419 951188
7660 951188 911586 860124 819738 808862 767432 760963 716814 694018 700551 691688 649113 630573
7648 630573 656614 632850 612281 596596 610173 586022 589567 587932 604685 586890 599689 579302
7636 579302 583359 567861 570366 578052 555264 578921 567933 553661 544850 541218 555926 548726 552530
7623 552530 550307 559244 552350 532775 541589 556806 541102 531979 519742 529760 538688 532908 548828
7610 548828 541182 524931 570389 579160 524388 545682 556261 544980 557246 528408 568407 530992
7598 530992 536794 547503 563358 550954 564183 551983 556587 560749 561519 574546 575803 581734 583401
$$ packed form
7679B908405Q61842J007630P67595K94562j40108m40308o59260p32864o78342
7670C189152n51107m35947l31328k17510j61056j18389j74105p0908j16383o1231
7660I51188l9602n1462m0386j0876m1430o469m4149k2796O533q863m2575j8540
7648F30573K6041k3764k0569j5685J3577k4151L545j635J6753j7795J2799k0387
7636E79302M057j5498K505P686k2788K3657j0988j4272q811l632J4708p200L804
7623E52530k223Q937o894j9575Q814J5217j5704r123j2237J0018Q928n780J5920
7610E48828p646j6251M5458Q771n4772K1294J0579j1281J2266k8838L9999l7415
7598E30992N802J0709J5855j2404J3229j2200M604M162P70J3027J257N931J667
$$ plain form
7585 583401 575356 580708 580810 587838 600557 628447 610873 630272 626948 612948 605126 592477 611511
7572 611511 615264 600254 598601 591888 609596 600116 603083 608050 611566 618081 640398 633068 629899 604864
7558 604864 614415 623702 599119 614880 608734 612025 600945 606054 619251 604330 601710 626781 623685
7545 623685 601706 601082 622563 609686 615196 635800 595789 596104 610574 608039 579241 620707 614987
7532 614987 604249 603556 611650 596532 603133 589797 586914 571436 592909 600986 559379 572604 565976
7519 565976 560035 586572 561522 574136 557128 565532 566041 579324 566424 541332 555313 575294
7507 575294 557850 554256 559042 574301 561484 555025 554694 542825 537313 540186 556568 534969 533230
7494 533230 527574 527046 543167 533739 531029 533770 534672 517958 522722 514379 538172 514325 521386 537259
$$ packed form
7585E83401q045N352J02P028J2719K7890j7574J9399l324j4000p822j2649J9034
7572F11511L753j5010j653o713J7708r480K967M967L516O515K2317p330l169k5035
7558F04864R551R287k4583J5761o146L291j1080N109J3197j4921k620K5071l096
7545F23685k1979o24K1481j2877N510K0604m0011L15J4470k535k8798M1466n720
7532F14987j0738o93Q094j5118O601j3336k883j5478K1473Q077m1607J3225o628
7519E65976n941K6537k5050J2614j7008Q404N09J3283j2900k5092J3981J9981
7507E75294j7444l594M786J5259j2817o459l31j1869n512K873J6382k1599j739
7494E33230n656n28J6121r428k710K741R02j6714M764q343K3793k3847P061J5873
$$ plain form
7480 537259 515663 512224 516358 522574 524728 519579 481302 522594 529171 506207 518964 502703 497580
7467 497580 517380 501356 504968 508022 512795 505712 509017 527301 508058 517523 507015 517861 526389
7454 526389 491875 511593 521019 507867 523561 501973 507706 499524 523278 508825 513426 501501
7442 501501 518252 518673 524647 520409 525780 535559 530404 554798 537107 534692 542265 536922 550128 564388
7428 564388 577704 563940 578848 588054 570741 557682 586515 584518 598147 586155 597635 590057
7416 590057 595051 607798 600771 621129 603294 619797 630904 624765 648261 677642 680405 672772 680144
7403 680144 699554 680854 693765 706084 714808 710203 714563 737177 725513 722082 730569 768795 738557
7390 738557 745552 737156 744242 754211 744387 768106 758007 769064 766205 778645 798091 784606 787521
$$ packed form
7480E37259k1596l439M134O216K154n149l8277M1292O577k2964J2757j6261n123
7467D97580J9800j6024L612L054M773p083L305J8284j9243R465j0508J0846Q528
7454E26389l4514J9718R426j3152J5694k1588N733q182K3754j4453M601j1925
7442E01501J6751M21N974m238N371R779n155K4394j7691k415P573n343J3206J4260
7428E64388J3316j3764J4908R206j7313j3059K8833j997J3629j1992J1480p578
7416E90057M994J2747p027K0358j7835J6503J1107o139K3496K9381K763p633P372
7403F80144J9410j8700J2911J2319Q724m605M360K2614j1664l431Q487L8226l0238
7390G38557O995q396P086R969r824K3719j0099J1057k859J2440J9446j3485K915
$$ plain form
7377 787521 776345 779932 795224 791244 778401 772526 780242 795169 769193 756872 765150 751730 754865
7364 754865 749140 734615 750064 758932 746750 740085 721911 724236 721959 715042 710962 718269 691967
7351 691967 686671 670691 690558 673971 662771 647987 653499 649302 616280 586704 595734 610308
7339 610308 586008 582621 577023 563565 563976 560443 537608 543502 506373 531315 531350 528046 524669 491367
7325 491367 511714 513674 519539 522858 505868 481612 504788 500741 489697 483054 464531 460875 451737
7312 451737 448789 448762 449759 456650 426782 441747 398609 413646 409479 385922 411606 390092 394952
7299 394952 406567 411346 395671 384322 397287 393004 391524 386107 397268 372954 401734 390393
7287 390393 382654 400826 386935 397022 401500 393221 392506 380761 379650 386371 403146 367758 379032
$$ packed form
7377G87521j1176L587J5292l980j2843n875P716J4927k5976j2321Q278j3420L135
7364G54865n725j4525J5449Q868j2182o665j8174K325k277o917m080P307k6302
7351F91967n296j5980J9867j6587j1200j4784N512m197l3022k9576R030J4574
7339F10308k4300l387n598j3458M11l533k2835N894l7129K4942L5l304l377l3302
7325D91367K0347J960N865L319j6990k4256K3176m047j1044o643j8523l656r138
7312D51737k948k7R97O891k9868J4965m3138J5037m167k3557K5684k1514M860
7299C94952J1615M779j5675j1349J2965m283j480n417J1161k4314K8780j1341
7287C90393p739J8172j3891J0087M478q279p15j1745j111O721J6775l5388J1274
$$ plain form
7274 379032 373662 384896 355752 398508 377113 374814 385908 388326 403837 381414 381086 400550 372249
7261 372249 379513 365631 396169 366434 381756 393342 388061 389377 383084 369261 375147 376557 375387
7248 375387 372980 358857 379817 375112 357904 381142 373901 375252 367525 387403 393965 378314 367236
7235 367236 357545 356328 346137 377038 372679 360380 367287 353076 366671 365844 361751 379044 367745
7222 367745 369201 358674 366681 379636 376672 384234 366131 379603 391761 371862 375109 373656 393305
7209 393305 380005 350539 365977 378373 376117 380137 366526 382854 365897 359774 372864 362825
7197 362825 385033 374813 366093 362938 380104 382127 360477 368474 376218 361270 379959 382592 378918
7184 378918 359100 401601 370419 365188 383034 374155 370655 364608 376414 389923 386366 378963 378430
$$ packed form
7274C79032n370J1234k9144M2756k1395k299J1094K418J5511k2423l28J9464k8301
7261C72249P264j3882L0538k9735J5322J1586n281J316o293j3823N886J410j170
7248C75387k407j4123K0960m705j7208K3238p241J351p727J9878O562j5651j1078
7235C67236r691j217j0191L0901m359j2299O907j4211J3595q27m093J7293j1299
7222C67745J456j0527Q007J2955k964P562j8103J3472J2158j9899L247j453J9649
7209C93305j3300k9466J5438J2396k256M020j3611J6328j6957o123J3090j0039
7197C62825K2208j0220q720l155J7166K023k1650P997P744j4948J8689K633l674
7184C78918j9818M2501l1182n231J7846q879l500o047J1806J3509l557p403n33
$$ plain form
7171 378430 365014 381936 381385 373036 364961 370723 378591 345858 388648 358374 371108 354167 355532
7158 355532 356466 348373 368794 379556 389341 368363 386387 379602 373327 363376 383309 374738 380428
7145 380428 361015 379058 364187 367504 378843 390420 380135 365218 392546 380497 391332 352686
7133 352686 356573 383279 353142 352174 363294 362315 360009 369604 368132 348354 361394 355745 368524
7120 368524 373814 369764 370810 359073 365366 368908 370159 366028 372082 359579 366617 359215 376973 369300
7106 369300 394492 385307 367303 372764 363839 368442 362686 345699 355571 366098 366715 374373 370939 375026
7092 375026 357927 331464 353053 352675 373516 359064 351626 340815 363118 363751 359556 357705 382818
7079 382818 372044 353691 368494 374942 357565 352143 362001 355109 352012 365214 359273 364117 356972
$$ packed form
7171C78430j3416J6922n51q349q075N762P868l2733M2790l0274J2734j6941J365
7158C55532R34q093K0421J0762R785k0978J8024o785o275r951J9933q571N690
7145C80428j9413J8043j4871L317J1339J1577j0285j4917K7328j2049J0835l8646
7133C52686L887K6706l0137r68J1120r79k306R595j472j9778J3040n649J2779
7120C68524N290m050J046j1737O293L542J251m131O054j2503P038p402J7758p673
7106C69300K5192r185j8004N461q925M603n756j6987R872J0527O17P658l434M087
7092C75026j7099k6463K1589l78K0841j4452p438j0811K2303O33m195j851K5113
7079C82818j0774j8353J4803O448j7377n422R858o892l097J3202n941M844p145
$$ plain form
7066 356972 371877 345406 366937 366202 347354 352489 360857 352331 364965 367962 373227 372199 376062
7053 376062 376497 372431 367287 362733 372697 362547 374338 384116 372809 371485 370443 354783 360761 374318
7039 374318 402572 351033 372634 374682 369064 367589 369486 376824 362173 384132 370383 364414 375302
7026 375302 374378 385214 368458 384383 382182 380353 398838 393483 367198 369322 373177 379013 378236 384347
7012 384347 376834 381013 381609 380537 390037 396872 371076 374996 378378 391167 388125 386802 376983 374226
6998 374226 376530 402614 399548 387912 383340 379981 390336 393582 410638 417339 384253 404483 392083
6985 392083 397722 397112 398651 396721 418498 407048 429283 411781 410018 436486 426862 431539 423560
6972 423560 417028 440410 426815 406349 432019 419946 445233 449331 442490 444223 462112 444814
$$ packed form
7066C56972J4905k6471K1531p35j8848N135Q368q526J2634K997N265j028L863
7053C76062M35m066n144m554R964j0150J1791R778j1307j324j042j5660N978J3557
7039C74318K8254n1539K1601K048n618j475J897P338j4651K1959j3749n969J0888
7026C75302r24J0836j6756J5925k201j829J8485n355k6285K124L855N836p77O111
7012C84347p513M179N96j072R500O835k5796L920L382J2789l042j323r819k757
6998C74226K304K6084l066j1636m572l359J0355L246J7056O701l3086K0230j2400
6985C92083N639o10J539j930K1777j1450K2235j7502j763K6468r624M677p979
6972D23560o532K3382j3595k0466K5670j2073K5287M098o841J733J7889j7298
$$ plain form
6960 444814 471100 446777 468537 465714 454479 484784 488645 471983 489320 481832 491173 503762
6948 503762 493628 495009 512741 513832 519825 497228 528542 524519 521118 521051 525214 534969 544133 559832
6934 559832 559521 554161 580516 582761 582799 571530 614496 601579 584973 599872 626295 628515 657219
6921 657219 641062 623828 657211 669203 652726 664928 680648 704494 692499 717328 717184 737816
6909 737816 772811 764585 788197 767106 824557 851211 858174 880711 904220 930328 949450 990871
6897 990871 1023132 1039762 1056251 1118282 1120542 1184619 1226056 1269603 1305814 1337673 1377540 1408948
6885 1408948 1439404 1466566 1490667 1482779 1533138 1539413 1562018 1570970 1557612 1577751 1602388 1595949
6873 1595949 1621001 1640330 1630977 1632776 1679224 1669288 1678057 1671306 1707099 1707971 1707782 1734223 1738064
$$ packed form
6960D44814K6286k4323K1760k823j1235L0305L861j6662J7337p488R341J2589
6948E03762j0134J381J7732J091N993k2597L1314m023l401o7M163R755R164J5699
6934E59832l11n360K6355K245L8j1269M2966j2917j6606J4899K6423K220K8704
6921F57219j6157j7234L3383J1992j6477J2202J5720K3846j1995K4829j44K0632
6909G37816L4995q226K3612k1091N7451K6654O963K2537K3509K6108J9122M1421
6897I90871L2261J6630J6489O2031K260O4077M1437M3547L6211L1859L9867L1408
6885A408948L0456K7162K4101p888N0359O275K2605Q952j3358K0139K4637o439
6873A595949K5052J9329r353J799M6448r936Q769o751L5793Q72j89K6441L841
$$ plain form
6860 1738064 1730652 1721563 1698937 1683217 1666853 1625471 1614153 1585807 1569549 1535110 1553340 1508423
6848 1508423 1507730 1495502 1488329 1478616 1482072 1480026 1510785 1537645 1600989 1651155 1739812 1795658 1878241
6835 1878241 1997176 2033920 2043077 2037410 1990915 1978390 1949570 1932945 1952317 1982422 2018243 2073391
6823 2073391 2063788 2064912 1991513 1938790 1842021 1750150 1635842 1552692 1482763 1424848 1388807 1342237
6811 1342237 1292405 1259791 1252769 1234658 1213615 1213504 1194862 1171094 1183373 1154689 1148844 1138910
6799 1138910 1127479 1140682 1116216 1110357 1109585 1131703 1121468 1137073 1141578 1153876 1175277 1176908
6787 1176908 1199959 1217692 1230557 1251274 1281412 1322035 1376034 1445886 1489019 1593444 1736439
6776 1736439 1843877 1996290 2187193 2318306 2428370 2482330 2480561 2444859 2387539 2344657 2335303
$$ packed form
6860A738064p412r089k2626j5720j6364m1382j1318k8346j6258l4439J8230m4917
6848A508423o93j2228p173r713L456k046L0759K6860O3344N0166Q8657N5846Q2583
6835A878241J18935L6744R157n667m6495j2525k8820j6625J9372L0105L5821N5148
6823B073391r603J124p3399n2723r6769r1871j14308q3150o9929n7915l6041m6570
6811A342237m9832l2614p022j8111k1043j11j8642k3768J2279k8684n845r934
6799A138910j1431J3203k4466n859p72K2118j0235J5605M505J2298K1401J631
6787A176908K3051J7733J2865K0717L0138M0623N3999O9852M3133J04425J42995
6776A736439J07438J52413J90903J31113J10064N3960j769l5702n7320m2882r354
$$ plain form
6765 2335303 2342440 2388119 2436030 2503944 2522645 2541764 2489650 2364182 2239058 2115201 1949538
6754 1949538 1845452 1735096 1626093 1548776 1508730 1433643 1395852 1354089 1334287 1284821 1298886
6743 1298886 1259653 1246776 1251339 1223552 1216816 1190383 1204115 1210342 1199328 1219300 1191086 1201870
6731 1201870 1194322 1217031 1203725 1217912 1211577 1222106 1225873 1236789 1227010 1220284 1226206 1247747 1245858
6718 1245858 1258670 1263216 1268768 1247479 1253441 1266227 1268517 1288131 1317342 1302590 1324125 1357891
6706 1357891 1354597 1333248 1378159 1387704 1383615 1413425 1384362 1411835 1403364 1417960 1438177 1449120
6694 1449120 1450089 1480129 1496113 1500077 1520605 1557890 1532577 1579374 1562699 1591165 1631173 1637776
6682 1637776 1657757 1667882 1702345 1725613 1752747 1770944 1812554 1848410 1872738 1903177 1902135 1945266
$$ packed form
6765B335303P137M5679M7911O7914J8701J9119n2114j25468j25124j23857j65663
6754A949538j04086j10356j09003p7317m0046p5087l7791m1763j9802m9466J4065
6743A298886l9233j2877M563k7787o736k6433J3732O227j1014J9972k8214J0784
6731A201870p548K2709j3306J4187o335J0529L767J0916r779o726N922K1541j889
6718A245858J2812M546N552k1289N962J2786K290J9614K9211j4752K1535L3766
6706A357891l294k1349M4911R545m089K9810k9063K7473q471J4596K0217J0943
6694A449120R69L0040J5984L964K0528L7285k5313M6797j6675K8466M0008O603
6682A637776J9981J0125L4463K3268K7134J8197M1610L5856K4328L0439j042M3131
$$ plain form
6670 1945266 1964686 2003215 2037548 2037244 2073302 2102413 2117393 2132090 2162433 2134918 2162454 2176859
6658 2176859 2201628 2231425 2227975 2276712 2297041 2345497 2365391 2413664 2470119 2506496 2537326 2565491
6646 2565491 2613974 2642416 2676357 2690534 2709151 2732766 2731222 2714373 2743163 2770813 2777860 2797859
6634 2797859 2833447 2873745 2897325 2944274 3000446 3027850 3066781 3122293 3127531 3161449 3197546 3197585
6622 3197585 3215511 3232903 3231616 3249695 3271060 3288902 3346658 3365477 3404856 3430779 3461606 3439072
6610 3439072 3503013 3517917 3579807 3601884 3656518 3692897 3725203 3775087 3824077 3873300 3952204
6599 3952204 4006849 4027753 4096910 4152474 4243815 4319528 4414616 4484690 4558027 4607785 4677850
6588 4677850 4719398 4725843 4745852 4732718 4729406 4731840 4707556 4733026 4748762 4776464 4840311 4906800
$$ packed form
6670A945266J9420L8529L4333l04L6058K9111J4980J4697L0343k7515K7536J4405
6658B176859K4769K9797l450M8737K0329M8456J9894M8273N6455L6377L0830K8165
6646B565491M8483K8442L3941J4177J8617K3615j544j6849K8790K7650P047J9999
6634B797859L5588M0298K3580M6949N6172K7404L8931N5512N238L3918L6097L9
6622C197585J7926J7392j287J8079K1365J7842N7756J8819L9379K5923L0827k2534
6610C439072O3941J4904O1890K2077N4634L6379L2306M9884M8990M9223P8904
6599C952204N4645K0904O9157N5564R1341P5713R5088P0074P3337M9758P0065
6588D677850M1548O445K0009j3134l312K434k4284K5470J5736K7702O3847O6489
$$ plain form
6576 4906800 4998836 5100268 5232732 5384385 5562655 5698266 5787925 5829892 5792638 5722679
6566 5722679 5582834 5415454 5280941 5102874 5004386 4873942 4799637 4718072 4669346 4647929
6556 4647929 4634908 4646192 4706490 4775503 4902602 5017967 5116823 5191480 5229098 5180257 5123639
6545 5123639 4986031 4843199 4699595 4586596 4472142 4367862 4325803 4283499 4223501 4193880
6535 4193880 4194476 4176649 4191095 4233308 4243923 4304792 4347334 4404080 4462620 4509321 4541290 4579967
6523 4579967 4615108 4631514 4633064 4600744 4550559 4512275 4474319 4432760 4400078 4349722 4342775 4359621
6511 4359621 4385264 4461943 4522800 4594102 4640198 4662951 4666127 4654349 4635871 4664042 4661482 4696763
6499 4696763 4729711 4818509 4880269 4954878 4993815 5059406 5090579 5094454 5131479 5126835 5151916 5132955
$$ packed form
6576D906800R2036J01432J32464J51653J78270J35611Q9659M1967l7254o9959
6566E722679j39845j67380j34513j78067r8488j30444p4305q1565m8726k1417
6556D647929j3021J1284O0298O9013J27099J15365R8856P4657L7618m8841n6618
6545E123639j37608j42832j43604j12999j14454j04280m2059m2304n9998k9621
6535D193880N96j7827J4446M2213J0615O0869M2542N6746N8540M6701L1969L8677
6523D579967L5141J6406J550l2320n0185l8284l7956m1559l2682n0356o947J6846
6511D359621K5643P6679O0857P1302M6096K2753L176j1778j8478K8171k560L5281
6499D696763L2948Q8798O1760P4609L8937O5591L1173L875L7025m644K5081j8961
$$ plain form
6487 5132955 5127269 5093487 5014301 4906005 4806111 4678757 4574805 4500551 4406598 4347901 4349450
6476 4349450 4315510 4300902 4306841 4301001 4278213 4268548 4257034 4234872 4204888 4148465 4099352 4040309
6464 4040309 3995988 3922217 3901514 3827328 3774600 3737016 3705461 3665855 3612056 3570879 3565849 3524946
6452 3524946 3512595 3502927 3513718 3470258 3503811 3509933 3536830 3558425 3611969 3667474 3691576 3724766
6440 3724766 3767165 3806394 3813470 3818374 3811242 3765155 3753100 3680770 3629048 3571835 3520760 3462505
6428 3462505 3414331 3368475 3320347 3287035 3280862 3255168 3242067 3223058 3244385 3216725 3213144 3220128
6416 3220128 3221470 3202083 3197266 3180219 3152495 3115809 3097657 3074688 3049768 3015732 3008105 3004070
6404 3004070 2977666 2967398 2941127 2935369 2956398 2943205 2962024 2956497 2938051 2944628 2925091 2909194
$$ packed form
6487E132955n686l3782p9186j08296r9894j27354j03952p4254r3953n8697J549
6476D349450l3940j4608N939n840k2788r665j1514k2162k9984n6423m9113n9043
6464D040309m4321p3771k0703p4186n2728l7584l1555l9606n3799m1177n030m0903
6452C524946j2351r668J0791m3460L3553O122K6897K1595N3544N5505K4102L3190
6440C724766M2399L9229P076M904p132m6087j2055p2330n1722n7213n1075n8255
6428C462505m8174m5856m8128l3312o173k5694j3101j9009K1327k7660l581O984
6416C220128J342j9387m817j7047k7724l6686j8152k2969k4920l4036p627m035
6404C004070k6404j0268k6271n758K1029j3193J8819n527j8446O577j9537j5897
$$ plain form
6392 2909194 2882192 2870228 2846717 2823591 2776159 2754656 2736950 2687059 2661640 2619813 2577918
6381 2577918 2555155 2524999 2503926 2463881 2422287 2409088 2397376 2369191 2352931 2309987 2309581 2279253
6369 2279253 2255138 2220224 2177268 2154246 2124935 2054347 2034732 1969873 1959335 1889366 1863202
6358 1863202 1828998 1809356 1766232 1740563 1721978 1678519 1680258 1661715 1657248 1629106 1613226 1611738
6346 1611738 1598402 1607602 1610636 1599579 1605125 1636977 1634286 1642446 1673735 1719080 1748968 1783631
6334 1783631 1849976 1915562 1983703 2059907 2164482 2310707 2509489 2763764 3129077 3641639
6324 3641639 4478090 5571157 6761039 7701598 8014393 7832907 7263472 6453650 5561050
6315 5561050 4752717 4027709 3532195 3109863 2839377 2622130 2438111 2303414 2146876 2026611
$$ packed form
6392B909194k7002j1964k3511k3126m7432k1503j7706m9891k5419m1827m1895
6381B577918k2763l0156k1073m0045m1594j3199j1712k8185j6260m2944m06l0328
6369B279253k4115l4914m2956k3022k9311p0588j9615o4859j0538o9969k6164
6358A863202l4204j9642m3124k5669j8585m3459J739j8543m467k8142j5880j488
6346A611738j3336R200L034j1057N546L1852k691Q160L1289M5345K9888L4663
6334A783631O6345O5586O8141P6204J04575J46225J98782K54275L65313N12562
6324C641639Q36451J093067J189882R40559L12795j81486n69435q09822q92600
6315E561050q08333p25008m95514m22332k70486k17247j84019j34697j56538j20265
$$ plain form
6305 2026611 1939124 1839985 1792508 1747425 1706764 1672649 1632189 1650576 1585528 1574218 1576566 1564855
6293 1564855 1525332 1509099 1472272 1471153 1464964 1440982 1455547 1428137 1441775 1425000 1425279 1425052 1391491
6280 1391491 1395243 1376495 1381224 1358266 1343526 1346994 1310408 1315324 1292685 1273492 1266840 1246610
6268 1246610 1239925 1208489 1198704 1168513 1171447 1162819 1140066 1138336 1135845 1111376 1082402 1081095 1082440
6255 1082440 1066718 1052467 1030738 1026363 1036405 1018941 999766 1003163 1002451 993909 983331 963875
6243 963875 966670 939967 934950 910843 905624 911424 902309 884704 870148 893254 873018 865392 859280
6230 859280 855366 852810 823613 828192 852933 832325 833073 823378 843898 818436 820979 813681 802761
6217 802761 797809 796007 810810 795396 800859 804151 778404 783571 798336 776721 764249 776811 772483
$$ packed form
6305B026611q7487r9139m7477m5083m0661l4115m0460J8387o5048j1310K348j1711
6293A564855l9523j6233l6827j119o189k3982J4565k7410J3638j6775K79k27l3561
6280A391491L752j8748M729k2958j4740L468l6586M916k2639j9193o652k0230
6268A246610o685l1436r785l0191K934q628k2753j730k491k4469k8974j307J345
6255A082440j5722j4251k1729m375J0042j7464j9175L397p12q542j0578j9456
6243I63875K795k6703n017k4107n219N800r115j7605j4556K3106k0236p626o112
6230H59280l914k556k9197M579K4741k0608P48r695K0520k5462K543p298j0920
6217H02761m952j802J4803j5414N463L292k5747N167J4765k1615j2472J2562m328
$$ plain form
6204 772483 755804 756646 757746 737203 733002 741328 722783 772318 753319 749227 734048 738774 735301
6191 735301 720717 713694 723800 742509 703024 717082 722475 716828 741399 746497 728705 721886 710322
6178 710322 723719 722910 712331 738290 713628 714676 725865 701376 726133 700607 704437 697507 709811
6165 709811 696909 675824 664111 683994 690357 684592 702675 708055 693623 706529 700120 705026 720258
6152 720258 730061 727735 721400 727541 714659 713686 726557 716912 735026 739408 733749 747301 751058 749611
6138 749611 739048 774129 758162 781273 769775 784624 778635 757435 766528 790013 779171 788758
6126 788758 776467 780911 768824 776809 767341 784728 790186 785466 771734 742053 754000 762519 742769
6113 742769 749125 753119 737389 755344 744389 761099 766160 752617 771168 762888 773286 827393
$$ packed form
6204G72483j6679Q42J100k0543m201Q326j8545M9535j8999m092j5179M726l473
6191G35301j4584p023J0106J8709l9485J4058N393n647K4571N098j7792o819j1564
6178G10322J3397q09j0579K5959k4662J048J1189k4489K4757k5526L830o930J2304
6165G09811j2902k1085j1713J9883O363n765J8083N380j4432J2906o409M906J5232
6152G20258R803k326o335O141j2882r73J2871r645J8114M382n659J3552L757j447
6138G49611j0563L5081j5967K3111j1498J4849n989k1200R093K3485j0842R587
6126G88758j2291M444j2087P985r468J7387N458m720j3732k9681J1947Q519j9750
6113G42769O356L994j5730J7955j0955J6710N061j3543J8551q280J0398N4107
$$ plain form
6101 827393 795028 811675 824438 818006 802634 788415 775014 778797 791567 757591 763191 762202 778250
6088 778250 764285 752305 772629 765172 754400 742478 749245 783127 775870 801174 817137 837321
6076 837321 839621 851065 881351 892579 918274 908854 925671 925458 903084 920423 909539 929177
6064 929177 938896 928699 927381 905847 930230 929829 900383 878410 876266 872255 863691 865675 877227
6051 877227 838829 834762 854654 830203 849227 876549 893382 914283 899537 887622 864307 892722
6039 892722 869624 870392 847102 833534 833444 815318 804202 810455 817122 813862 816477 825090 839307 839308
6025 839308 827883 816782 853461 849756 863862 869916 867795 869413 885408 904889 882064 901593
6013 901593 903555 939114 931866 918212 908210 899859 883389 898179 879347 862992 842129 826384
$$ packed form
6101H27393l2365J6647J2763o432j5372j4219j3401L783J2770l3976N600r89J6048
6088G78250j3965j1980K0324p457j0772j1922O767L3882p257K5304J5963K0184
6076H37321K300J1444L0286J1228K5695r420J6817k13k2374J7339j0884J9638
6064I29177R719j0197j318k1534K4383m01k9446k1973k144m011q564J984J1552
6051H77227l8398m067J9892k4451J9024K7322J6833K0901j4746j1915k3315K8415
6039H92722k3098P68k3290j3568r0j8126j1116O253O667l260K615Q613J4217J
6025H39308j1425j1101L6679l705J4106O054k121J618J5995J9481k2825J9529
6013I01593J962L5559p248j3654j0002q351j6470J4790j8832j6355k0863j5745
$$ plain form
6001 826384 789781 819334 810744 825066 804248 805371 804590 784597 836466 844308 856226 842959 860308
5988 860308 842931 839147 825023 818535 785094 781656 778398 757099 762150 753919 758620 790684 769984
5975 769984 762784 751467 717172 739693 731872 715511 727524 722938 729002 731383 726472 711953 725928
5962 725928 723782 702783 707206 688182 688726 704084 701525 706500 714363 708607 733427 712501 745751
5949 745751 735743 755041 774984 780239 818678 813315 812432 813562 847548 820444 835199 839417 844945
5936 844945 837910 864984 877343 897196 892868 909512 960289 987371 1008455 1056421 1080885 1136428
5924 1136428 1171659 1236451 1328773 1419017 1567842 1740107 1961036 2179900 2375051 2499972
5914 2499972 2528251 2452323 2321394 2197969 2011553 1842889 1724286 1616003 1521653 1448981
$$ packed form
6001H26384l6603K9553q590J4322k0818J123p81j9993N1869P842J1918j3267J7349
5988H60308j7377l784j4124o488l3441l438l258k1299N051q231M701L2064k0700
5975G69984p200j1317l4295K2521p821j6361J2013m586O064K381m911j4519J3975
5962G25928k146k0999M423j9024N44J5358k559M975P863n756K4820k0926L3250
5949G45751j0008J9298J9943N255L8439n363q83J130L3986k7104J4755M218N528
5936H44945p035K7074J2359J9853m328J6644N0777K7082K1084M7966K4464N5543
5924A136428L5231O4792R2322R0244J48825J72265K20929K18864J95151J24921
5914B499972K8279p5928j30929j23425j86416j68664j18603j08283r4350p2672
$$ plain form
5904 1448981 1412728 1360105 1303564 1246883 1221966 1212982 1188870 1190186 1160101 1172682 1156483 1145810
5892 1145810 1150724 1126416 1123679 1117614 1116341 1136233 1146024 1118827 1146405 1158841 1205834 1191919
5880 1191919 1212221 1231334 1236987 1280237 1270287 1286662 1316685 1325437 1322763 1308880 1322354 1295455
5868 1295455 1276321 1284806 1282191 1284849 1276319 1254895 1250499 1260357 1248125 1239610 1262842 1300662 1340193
5855 1340193 1392075 1420390 1493360 1493275 1552294 1585149 1608421 1654000 1649624 1726717 1732822 1784791
5843 1784791 1836324 1866657 1911058 1978200 2010385 2106988 2197487 2255696 2346114 2396753 2450625
5832 2450625 2521082 2554063 2572529 2643610 2716145 2803559 2883130 2968415 3049007 3113021 3200642
5821 3200642 3250718 3321118 3379940 3471591 3543504 3621803 3718262 3809590 3952072 4112433 4310523
$$ packed form
5904A448981l6253n2623n6541n6681k4917q984k4112J316l0085J2581j6199j0673
5892A145810M914k4308k737o065j273J9892R791k7197K7578J2436M6993j3915
5880A191919K0302J9113N653M3250r950J6375L0023Q752k674j3883J3474k6899
5868A295455j9134Q485k615K658q530k1424m396R858j2232q515K3232L7820L9531
5855A340193N1882K8315P2970q5N9019L2855K3272M5579m376P7093O105N1969
5843A784791N1533L0333M4401O7142L2185R6603R0499N8209R0418N0639N3872
5832B450625P0457L2981J8466P1081P2535Q7414P9571Q5285Q0592O4014Q7621
5821C200642N0076P0400N8822R1651P1913P8299R6459R1328J42482J60361J98090
$$ plain form
5810 4310523 4529977 4718204 4851008 4913297 4874990 4725016 4587667 4410884 4251998 4081965
5800 4081965 3983675 3861795 3764759 3671475 3581717 3455943 3382223 3284174 3257275 3231773 3190958
5789 3190958 3202629 3193801 3193710 3165996 3096682 3095600 3044868 2987328 2976400 2958360 2960142 2994307 3020537
5776 3020537 3073503 3107142 3144168 3178007 3207206 3232802 3274822 3289130 3246560 3263940 3261563 3242863
5764 3242863 3252253 3292570 3293147 3345530 3409238 3494731 3557019 3626627 3692044 3767101 3812074 3863091
5752 3863091 3940708 3978301 4004185 4099516 4148547 4208589 4246198 4324394 4379502 4435204 4506824
5741 4506824 4524358 4552444 4588861 4590060 4605600 4593053 4593889 4628186 4652238 4692278 4753142 4796685
5729 4796685 4880009 4957877 4999315 5025363 5090601 5088903 5139528 5173518 5242341 5272981 5342071 5399135
$$ packed form
5810D310523K19454J88227J32804O2289l8307j49974j37349j76783j58886j70033
5800D081965r8290j21880r7036r3284q9758j25774p3720r8049k6899k5502m0815
5789C190958J1671q828r1k7714o9314j082n0732n7540j0928j8040J782L4165K6230
5776C020537N2966L3639L7026L3839K9199K5596M2020J4308m2570J7380k377j8700
5764C242863R390M0317N77N2383O3708Q5493O2288O9608O5417P5057M4973N1017
5752C863091P7617L7593K5884R5331M9031O0042L7609P8196N5108N5702P1620
5741D506824J7534K8086L6417J199J5540j2547Q36L4297K4052M0040O0864M3543
5729D796685Q3324P7868M1438K6048O5238j698N0625L3990O8823L0640O9090N7064
$$ plain form
5717 5399135 5453805 5453269 5499291 5560205 5604472 5710870 5750919 5859063 5910586 6061971 6147815
5706 6147815 6248743 6337885 6436971 6504192 6584420 6655871 6767929 6914596 7081318 7250417
5696 7250417 7419325 7606957 7778414 7992326 8198884 8337992 8474920 8616924 8770716 8917554
5686 8917554 9060996 9229816 9394193 9548035 9729871 10000881 10249142 10590814 10967884 11418218
5676 11418218 11822380 12212808 12564135 12936383 13357216 13787462 14306504 14884630 15527315
5667 15527315 16261784 17190251 18281500 19618033 21212235 23100699 25242443 27684541
5659 27684541 30385327 33392994 36878118 41120550 46488721 53425174 62420051 74202629
5651 74202629 90311979 112982315 144427350 183895645 225769719 260591901 280173487
$$ packed form
5717E399135N4670n36M6022O0914M4267J06398M0049J08144N1523J51385Q5844
5706F147815J00928Q9142R9086O7221Q0228P1451J12058J46667J66722J69099
5696G250417J68908J87632J71457K13912K06558J39108J36928J42004J53792J46838
5686H917554J43442J68820J64377J53842J81836K71010K48261L41672L77070M50334
5676A1418218M04162L90428L51327L72248M20833M30246N19042N78126O42685
5667A5527315P34469R28467J091249J336533J594202J888464K141744K442098
5659B7684541K700786L007667L485124M242432N368171O936453Q994877J1782578
5651G4202629J6109350K2670336L1445035L9468295M1874074L4822182J9581586
$$ plain form
5644 280173487 281351336 266302626 239937625 207681018 174582570 144535222 119627484
5637 119627484 100213650 85444260 74105090 64991986 57325041 50771627 45275291 40780324
5629 40780324 37139645 34215653 31840174 29881670 28257980 26880348 25690434 24674165
5621 24674165 23754381 22979221 22228521 21507536 20795474 20121923 19532894 19072379 18706130
5612 18706130 18402772 18166822 17924825 17701410 17512190 17286585 17043927 16790239 16533437
5603 16533437 16243324 15964810 15712711 15443695 15187799 14972459 14762446 14562197 14396259
5594 14396259 14225518 14116674 14056587 14021988 13995660 14000100 14023037 14029274 14050580 14091580 14130631
5583 14130631 14184295 14230854 14296698 14315018 14350038 14269923 14272537 14231615 14179538 14165942 14149430
$$ packed form
5644B80173487J177849j5048710k6365001l2256607l3098448l0047348k4907738
5637A19627484j9413834j4769390j1339170r113104p666945o553414n496336m494967
5629D0780324l640679k923992k375479j958504j623690j377632j189914j016269
5621B4674165r19784p75160p50700p20985p12062o73551n89029m60515l66249
5612A8706130l03358k35950k41997k23415j89220k25605k42658k53688k56802
5603A6533437k90113k78514k52099k69016k55896k15340k10013k00249j65938
5594A4396259j70741j08844o0087l4599k6328M440K2937O237K1306M1000L9051
5583A4130631N3664M6559O5844J8320L5020q0115K614m0922n2077j3596j6512
$$ plain form
5572 14149430 14190417 14300748 14476529 14695335 14930390 15151536 15412966 15637915 15906245 16235411
5562 16235411 16630660 17104886 17645659 18249962 19000581 19884862 20950062 22227035 23747465
5553 23747465 25568608 27629114 29886226 32378025 35233512 38579538 42780818 48273612
5545 48273612 55484500 65030028 77948591 96039843 121460344 154674858 192969529
5538 192969529 229868815 257704944 271077624 267796037 250062779 223193032 192224417
5531 192224417 161329321 133829181 111223731 93593069 80174355 69760619 61394480
5524 61394480 54476679 48624115 43752333 39801345 36665637 34189123 32281417 30906817
5516 30906817 30062934 29582275 29177989 28583147 27672928 26537068 25301254 23968206 22715774
$$ packed form
5572A4149430M0987J10331J75781K18806K35055K21146K61430K24949K68330L29166
5562A6235411L95249M74226N40773O04303P50619Q84281J065200J276973J520430
5553B3747465J821143K060506K257112K491799K855487L346026M201280N492794
5545D8273612P210888R545528J2918563J8091252K5420501L3214514L8294671
5538A92969529L6899286K7836129J3372680l281587j7733258k6869747l0968615
5531A92224417l0895096k7500140k2605450j7630662j3418714j0413736q366139
5524F1394480o917801n852564m871782l950988l135708k476514j907706j374600
5516C0906817q43883m80659m04286n94842r10219j135860j235814j333048j252432
$$ plain form
5507 22715774 21547551 20556298 19777853 19160322 18610051 18155004 17714496 17257568 16875472
5498 16875472 16509935 16144525 15801802 15468720 15208161 14960421 14770551 14623869 14501717
5489 14501717 14383299 14306839 14296461 14259581 14237012 14239131 14211707 14138863 14017181 13872750 13735873
5478 13735873 13544895 13401117 13309813 13231208 13140705 13050541 12920328 12757575 12568635 12360374
5468 12360374 12153120 11993164 11881156 11760526 11734064 11706091 11791138 11836135 11943615 12042998
5458 12042998 12110587 12130020 12127553 12088896 11969112 11794393 11567894 11280039 10971865 10641588
5448 10641588 10365247 10140280 9933558 9807215 9738104 9710458 9762838 9876865 10012915 10197844
5438 10197844 10356043 10452134 10498679 10534379 10557803 10605194 10635183 10629348 10648841 10687614 10724661
$$ packed form
5507B2715774j168223r91253p78445o17531n50271m55047m40508m56928l82096
5498A6875472l65537l65410l42723l33082k60559k47740j89870j46682j22152
5489A4501717j18418p6460j0378l6880k2569K119k7424p2844j21682j44431j36877
5478A3735873j90978j43778r1304p8605r0503r0164j30213j62753j88940k08261
5468A2360374k07254j59956j12008j20630k6462k7973Q5047M4997J07480R9383
5458A2042998O7589J9433k467l8657j19784j74719k26499k87855l08174l30277
5448A0641588k76341k24967k06722j26343o9111k7646N2380J14027J36050J84929
5438A0197844J58199R6091M6545L5700K3424M7391K9989n835J9493L8773L7047
$$ plain form
5427 10724661 10783448 10837981 10935055 11029668 11173159 11314481 11473693 11660853 11861827 12069259
5417 12069259 12354501 12599855 12891355 13222097 13493306 13792860 14065636 14327681 14584988
5408 14584988 14820497 15030855 15198063 15331779 15433561 15505313 15518445 15532167 15526859 15471504
5398 15471504 15427378 15394190 15351440 15274972 15188667 15078147 14969424 14841131 14697954 14554658
5388 14554658 14415940 14225197 14041594 13834265 13573315 13322004 13082546 12797182 12531924
5379 12531924 12272197 12017367 11811090 11675176 11553536 11471433 11376368 11229222 11006851 10679959
5369 10679959 10274118 9858675 9421306 9008483 8635363 8282138 7974786 7704412 7427952
5360 7427952 7191193 6958614 6750368 6572265 6388833 6222176 6077603 5921221 5794071 5665106
$$ packed form
5427A0724661N8787N4533R7074R4613J43491J41322J59212J87160K00974K07432
5417A2069259K85242K45354K91500L30742K71209K99554K72776K62045K57307
5408A4584988K35509K10358J67208J33716J01782P1752J3132J3722n308n5355
5398A5471504m4126l3188m2750p6468q6305j10520j08723j28293j43177j43296
5388A4554658j38718j90743j83603k07329k60950k51311k39458k85364k65258
5379A2531924k59727k54830k06277j35914j21640q2103r5065j47146k22371l26892
5369A0679959m05841m15443m37369m12823l73120l53225l07352k70374k76460
5360G427952k36759k32579k08246j78103j83432j66657j44573j56382j27150j28965
$$ plain form
5350 5665106 5559046 5415104 5314110 5162632 5056245 4932714 4867276 4753223 4678309 4614701
5340 4614701 4531857 4506422 4464100 4474399 4490353 4536607 4608602 4681513 4717131 4710089 4614894 4474858
5328 4474858 4329609 4164323 4001503 3914276 3835477 3787324 3799142 3796415 3827813 3892053 3909895
5317 3909895 3976063 4061205 4088411 4186654 4282958 4422994 4541641 4645423 4754222 4832094 4881690
5306 4881690 4939799 4958261 5052476 5117070 5098439 5057435 4988432 4889968 4783912 4686466 4593625
5295 4593625 4461108 4304831 4140949 3951390 3747688 3569809 3371066 3198349 3023615 2865408
5285 2865408 2674291 2532421 2387597 2227186 2103353 1985475 1893903 1823389 1740926 1670882
5275 1670882 1643044 1560942 1533631 1504426 1518037 1524528 1551440 1628651 1731418 1865805 2059321
$$ packed form
5350E665106j06060j43942j00994j51478j06387j23531o5438j14053p4914o3608
5340D614701q2844k5435m2322J0299J5954M6254P1995P2911L5618p042r5195j40036
5328D474858j45249j65286j62820q7227p8799m8153J1818k727L1398O4240J7842
5317C909895O6168Q5142K7206R8243R6304J40036J18647J03782J08799P7872M9596
5306D881690N8109J8462R4215O4594j8631m1004o9003r8464j06056r7446r2841
5295D593625j32517j56277j63882j89559k03702j77879j98743j72717j74734j58207
5285B865408j91117j41870j44824j60411j23833j17878r1572p0514q2463p0044
5275A670882k7838q2102k7311k9205J3611O491K6912P7211J02767J34387J93516
$$ plain form
5264 2059321 2225565 2389214 2470869 2499153 2403245 2300537 2137588 1979730 1822562 1707568
5254 1707568 1592971 1522972 1469573 1438335 1411659 1397990 1401232 1402884 1421589 1455468 1486221 1541422
5242 1541422 1626711 1767124 1948566 2108516 2295285 2408503 2473890 2471886 2443237 2401215 2364512
5231 2364512 2353132 2396457 2505925 2585050 2652676 2629472 2601891 2526527 2438086 2371599 2300114
5220 2300114 2325556 2375539 2423237 2452926 2413334 2381387 2292601 2213857 2154159 2127017 2128435 2183097
5208 2183097 2206014 2215945 2170628 2064270 1949703 1807349 1647169 1521791 1377820 1298148
5198 1298148 1236124 1170588 1128995 1075840 1038640 1014780 1006862 952674 934828 925457 904586 908397
5186 908397 898165 911147 896807 894457 867706 866710 868151 846585 853094 816680 834786 831960 805040
$$ packed form
5264B059321J66244J63649Q1655K8284r5908j02708j62949j57858j57168j14994
5254A707568j14597o9999n3399l1238k6676j3669L242J652J8705L3879L0753N5201
5242A541422Q5289J40413J81442J59950J86769J13218O5387k004k8649m2022l6703
5231B364512j1380M3325J09468P9125O7626k3204k7581p5364q8441o6487p1485
5220B300114K5442M9983M7698K9689l9592l1947q8786p8744n9698k7142J418N4662
5208B183097K2917R931m5317j06358j14567j42354j60180j25378j43971p9672
5198A298148o2024o5536m1593n3155l7200k3860p918n4188j7846r371k0871L811
5186I08397j0232J2982j4340k350k6751r96J441k1566O509l6414J8106k826k6920
$$ plain form
5173 805040 820149 821470 812808 825863 819239 821998 833662 840706 854943 857953 876849 863591 854827
5160 854827 857997 885551 903697 910086 940541 973576 1026793 1097483 1167871 1251490 1344809 1459239
5148 1459239 1537089 1603199 1656561 1665623 1615653 1562476 1490224 1391018 1295190 1203849 1123440 1046289
5136 1046289 991828 964868 899100 869087 830544 830562 815527 773276 736338 734527 713558 699924
5124 699924 683601 661439 650806 627639 611052 605180 613173 593605 625525 617968 643606 626032
5112 626032 634008 638823 643725 650847 662140 679015 674744 650676 652951 658861 634212 617351 627461
5099 627461 631751 632303 632523 632677 630072 637566 650157 657410 664801 646068 635426 633166 641303 641176 651870
5084 651870 628322 643579 637775 625111 654703 636185 657502 659501 681653 680310 707755 706069
$$ packed form
5173H05040J5109J321q662J3055o624K759J1664P044J4237L010J8896j3258q764
5160H54827L170K7554J8146O389L0455L3035N3217P0690P0388Q3619R3319J14430
5148A459239P7850O6110N3362R062m9970n3177p2252r9206r5828r1341q0409p7151
5136A046289n4461k6960o5768l0013l8543J8j5035m2251l6938j811k0969j3634
5124F99924j6323k2162j0633k3167j6587n872P993j9568L1920p557K5638j7574
5112F26032P976M815M902P122J1293J6875m271k4068K275N910k4649j6861J0110
5099F27461M290N52K20J54k605P494J2591P253P391j8733j0642k260Q137j27J0694
5084F51870k3548J5257n804j2664K9592j8518K1317J999K2152j343K7445j686
$$ plain form
5072 706069 693368 719433 715850 727716 736782 726168 729338 711227 732395 725142 735529 731489 739779
5059 739779 716414 748273 750757 774300 777590 791523 811921 806899 823087 802728 834353 832249
5047 832249 869357 842612 861866 886339 885593 859477 886050 870555 885065 896416 870499 901801
5035 901801 904266 910732 894688 903574 893631 919666 922261 924650 945012 944075 977201 998006 1001927
5022 1001927 1003425 1016421 1050709 1070055 1086990 1098948 1130797 1162709 1161516 1203724 1234242 1269414
5010 1269414 1313267 1317162 1350699 1382264 1379648 1374288 1352021 1332959 1339144 1299132 1293846 1294970 1266592
4997 1266592 1298895 1292892 1298111 1280204 1299321 1305876 1318547 1322818 1322778 1340979 1346928 1346116 1341551 1356103
4983 1356103 1359380 1377748 1359693 1372792 1396613 1403352 1423353 1425069 1416979 1427154 1403659 1420807
$$ packed form
5072G06069j2701K6065l583J1866R066j0614L170j8111K1168p253J0387m040Q290
5059G39779k3365L1859K484K3543L290J3933K0398n022J6188k0359L1625k104
5047H32249L7108k6745J9254K4473p46k6116K6573j5495J4510J1351k5917L1302
5035I01801K465O466j6044Q886r943K6035K595K389K0362r37L3126K0805L921
5022A001927J498J2996L4288J9346J6935J1958L1849L1912j193M2208L0518L5172
5010A269414M3853L895L3537L1565k616n360k2267j9062O185m0012n286J124k8378
4997A266592L2303o003N219j7907J9117O555J2671M271m0J8201N949q12m565J4552
4983A356103L277J8368j8055J3099K3821O739K0001J716q090J0175k3495J7148
$$ plain form
4971 1420807 1408746 1440036 1432254 1456516 1436509 1461346 1437144 1455006 1492654 1509307 1472885 1509485
4959 1509485 1536928 1530369 1559425 1576498 1578353 1584929 1580128 1598316 1598825 1603395 1595005 1614906 1622449
4946 1622449 1640492 1655525 1695598 1689202 1727021 1754421 1800019 1842393 1894866 1928872 1990339 2087367
4934 2087367 2117969 2198625 2242707 2314368 2380415 2458028 2550645 2661235 2819516 2953753 3042885
4923 3042885 3072371 3039184 2971061 2871868 2774480 2690281 2598704 2523006 2471822 2419782 2396149
4912 2396149 2383421 2352171 2342878 2355356 2367958 2379966 2392682 2420046 2448295 2490389 2514836 2563944
4900 2563944 2613469 2640305 2698742 2714029 2782499 2803715 2853769 2908046 2954420 3012826 3087039
4889 3087039 3164018 3213045 3310956 3403773 3472520 3554082 3634931 3711270 3801579 3880124 3995276
$$ packed form
4971A420807j2061L1290p782K4262k0007K4837k4202J7862L7648J6653l6422L6600
4959A509485K7443o559K9056J7073J855O576m801J8188N09M570q390J9901P543
4946A622449J8043J5033M0073o396L7819K7400M5598M2374N2473L4006O1467R7028
4934B087367L0602Q0656M4082P1661O6047P7613R2617J10590J58281J34237Q9132
4923C042885K9486l3187o8123r9193r7388q4199r1577p5698n1184n2040k3633
4912B396149j2728l1250r293J2478J2602J2008J2716K7364K8249M2094K4447M9108
4900B563944M9525K6836N8437J5287O8470K1216N0054N4277M6374N8406P4213
4889C087039P6979M9027R7911R2817O8747Q1562Q0849P6339R0309P8545J15152
$$ plain form
4878 3995276 4086109 4185803 4282092 4371011 4502100 4567382 4705204 4821156 4922765 5081406
4868 5081406 5193314 5328340 5493768 5631497 5806450 5972638 6110663 6234589 6387535 6510805
4858 6510805 6661391 6777178 6916073 7066588 7238145 7407253 7579884 7765519 7963438 8156613
4848 8156613 8306853 8450906 8588409 8713981 8845419 8983317 9167936 9358492 9565883 9799098
4838 9799098 10033652 10271961 10489402 10732123 10955068 11172189 11387985 11594684 11781965 11995826
4828 11995826 12164089 12354615 12540564 12739498 12951989 13180000 13422412 13713249 13997597
4819 13997597 14315032 14621603 14907953 15206637 15459963 15687839 15931856 16155542 16346028
4810 16346028 16550427 16707236 16865196 17007437 17111617 17222373 17295212 17351127 17406380 17450290
$$ packed form
4878C995276R0833R9694R6289Q8919J31089O5282J37822J15952J01609J58641
4868E081406J11908J35026J65428J37729J74953J66188J38025J23926J52946J23270
4858F510805J50586J15787J38895J50515J71557J69108J72631J85635J97919J93175
4848H156613J50240J44053J37503J25572J31438J37898J84619J90556K07391K33215
4838I799098K34554K38309K17441K42721K22945K17121K15796K06699J87281K13861
4828A1995826J68263J90526J85949J98934K12491K28011K42412K90837K84348
4819A3997597L17435L06571K86350K98684K53326K27876K44017K23686J90486
4810A6346028K04399J56809J57960J42241J04180J10756P2839N5915N5253M3910
$$ plain form
4800 17450290 17464198 17486294 17491295 17498808 17441866 17415830 17331645 17238192 17163570 17040103 16956798
4789 16956798 16819895 16724773 16645609 16539640 16431623 16334254 16209833 16099286 15928544 15762591
4779 15762591 15577082 15395610 15174519 14977203 14765249 14560600 14345340 14149287 13940565
4770 13940565 13710054 13495543 13240381 13029016 12802070 12582763 12385365 12169772 11957253
4761 11957253 11789992 11582057 11449667 11257138 11102162 10977011 10881782 10791551 10757607 10666370
4751 10666370 10543265 10350983 10092331 9811400 9553262 9250735 8974439 8716832 8498576
4742 8498576 8283462 8079655 7894449 7676078 7552228 7351998 7207190 7041532 6900664 6738213
4732 6738213 6607842 6457098 6367388 6253512 6174324 6146774 6138068 6095261 6002032 5879314 5706430
$$ packed form
4800A7450290J3908K2096N001P513n6942k6036q4185r3453p4622j23467q3305
4789A6956798j36903r5122p9164j05969j08017r7369j24421j10547j70742j65953
4779A5762591j85509j81472k21091j97316k11954k04649k15260j96053k08722
4770A3940565k30511k14511k55162k11365k26946k19307j97398k15593k12519
4761A1957253j67261k07935j32390j92529j54976j25151r5229r0231l3944r1237
4751A0666370j23105j92282k58652k80931k58138l02527k76296k57607k18256
4742H498576k15114k03807j85206k18371j23850k00230j44808j65658j40868j62451
4732F738213j30371j50744q9710j13876p9188k7550q706m2807r3229j22718j72884
$$ plain form
4721 5706430 5511217 5302551 5094514 4890286 4709405 4572441 4422365 4289597 4169640 4061449
4711 4061449 3950525 3850044 3752860 3638783 3581084 3479654 3391183 3312594 3236769 3157424 3095962
4700 3095962 3056468 2964251 2926259 2856697 2800126 2729240 2678816 2638540 2572227 2558589 2484285
4689 2484285 2472893 2434647 2394504 2357644 2327415 2292161 2303222 2294056 2265339 2241986 2259536 2229499
4677 2229499 2252287 2226567 2224510 2202854 2209604 2194146 2199153 2176500 2171337 2176506 2173500 2172530 2152233
4664 2152233 2131613 2084106 2080507 2041436 2009988 1971463 1944929 1900279 1879855 1884290 1843933 1835621
4652 1835621 1807113 1771587 1780594 1736006 1709075 1681494 1657213 1620140 1587006 1569327 1525555 1494091
4640 1494091 1467427 1420052 1370476 1330562 1304696 1281361 1229047 1217113 1192213 1165763 1124814
$$ packed form
4721E706430j95213k08666k08037k04228j80881j36964j50076j32768j19957j08191
4711D061449j10924j00481r7184j14077n7699j01430q8471p8589p5825p9345o1462
4700C095962l9494r2217l7992o9562n6571p0886n0424m0276o6313j3638p4304
4689B484285j1392l8246m0143l6860l0229l5254J1061r166k8717k3353J7550l0037
4677B229499K2788k5720k057k1656O750j5458N007k2653n163N169l006r70k0297
4664B152233k0620m7507l599l9071l1448l8525k6534m4650k0424M435m0357q312
4652A835621k8508l5526R007m4588k6931k7581k4281l7073l3134j7679m3772l1464
4640A494091k6664m7375m9576l9914k5866k3335n2314j1934k4900k6450m0949
$$ plain form
4629 1124814 1104922 1093860 1082676 1046465 1050832 1042876 1030782 1007588 991164 945072 939501 936428
4617 936428 939820 910460 905361 882908 842740 850219 832847 798572 801930 781849 782690 780826 750440
4604 750440 756769 749674 739514 734062 735580 735542 715747 713430 678173 685784 659003 665416 655375 649177
4590 649177 652262 652248 643845 611036 597595 619562 601034 592175 597546 590308 600636 583509 607194
4577 607194 573648 587993 577360 570120 567506 572001 554075 547944 549315 528742 520955 551717 532280
4564 532280 515754 537705 492641 492999 497825 501154 478290 487192 487196 486237 477320 480916 484689 472664
4550 472664 466173 472022 481562 458290 451219 449099 462053 456903 440578 450435 440358 433731 436239
4537 436239 417257 425916 430426 433599 427073 434484 420819 425053 416433 444112 429904 413384 426640
$$ packed form
4629A124814j9892j1062j1184l6211M367p956j2094k3194j6424m6092n571l073
4617I36428L392k9360n099k2453m0168P479j7372l4275L358k0081Q41j864l0386
4604G50440O329p095j0160n452J518l8j9795k317l5257P611k6781O413j0041o198
4590F49177L085j4q403l2809j3441K1967j8528q859N371p238J0328j7127K3685
4577F07194l3546J4345j0633p240k614M495j7926o131J371k0573p787L0762j9437
4564E32280j6526K1951m5064L58M826L329k2864Q902Mr59q917L596L773j2025
4550D72664o491N849R540k3272p071k120J2954n150j6325R857j0077o627K508
4537D36239j8982Q659M510L173o526P411j3665M234q620K7679j4208j6520J3256
$$ plain form
4524 426640 429154 410400 396139 386416 389277 386797 376506 378790 376650 379997 354697 370476 362065
4511 362065 375350 347626 323160 387591 347413 356876 344461 345734 342244 340755 324972 342367
4499 342367 320478 324482 308848 343779 330096 320424 329132 305961 320654 290213 288534 289070 290709
4486 290709 298708 295297 302040 298307 283319 289084 300719 285449 286027 281101 294372 280732 251125
4473 251125 265816 284012 288179 276504 278542 280797 277147 269807 293558 264107 244917 259956 273854
4460 273854 276026 255412 239930 260892 235543 257990 262893 264710 271572 238518 234610 249678 242671
4447 242671 233078 233106 242435 249899 261540 267839 246348 250991 241294 250924 243060 254385 226535 247745
4433 247745 249426 246946 236305 234951 260097 239231 223139 229743 227377 245727 254607 247890 255426
$$ packed form
4524D26640K514j8754j4261r723K861k480j0291K284k140L347k5300J5779q411
4511C62065J3285k7724k4466O4431m0178R463j2415J273l490j489j5783J7395
4499C42367k1889M004j5634L4931j3683r672Q708k3171J4693l0441j679N36J639
4486B90709P999l411O743l733j4988N765J1635j5270N78m926J3271j3640k9607
4473B51125J4691J8196M167j1675K038K255l650p340K3751k9451j9190J5039J3898
4460B73854K172k0614j5482K0962k5349K2447M903J817O862l3054l908J5068p007
4447B42671r593K8R329P464J1641O299k1491M643r697R630p864J1325k7850K1210
4433B47745J681k480j0641j354K5146k0866j6092O604k366J8350Q880o717P536
$$ plain form
4420 255426 253502 281147 271319 246040 249671 266722 278661 253735 282102 270031 272636 289124
4408 289124 288931 265619 269775 288678 299456 287510 299114 299292 299431 313521 311592 327166 308928
4395 308928 310452 318757 316140 353188 323279 350456 345276 352409 354701 361739 380313 354461 373854
4382 373854 375036 392000 407967 405576 436609 426559 446037 434742 442677 466888 449897 483602
4370 483602 475888 476848 497217 512843 504219 515514 544234 567041 551236 562247 587435 606558
4358 606558 624285 652091 620965 663926 687858 695931 715803 739514 767221 830703 846531 904858
4346 904858 932909 1002462 1047908 1090965 1155673 1236448 1310230 1394893 1483248 1590509 1691881
4335 1691881 1804090 1892708 2004039 2087508 2159417 2153518 2175499 2145002 2030190 1919454 1795360
$$ packed form
4420B55426j924K7645r828k5279L631J7051J1939k4926K8367j2071K605J6488
4408B89124j93k3312M156J8903J0778j1946J1604J78J39J4090j929J5574j8238
4395C08928J524Q305k617L7048k9909K7177n180P133K292P038J8574k5852J9393
4382C73854J182J6964J5967k391L1033j0050J9478j1295P935K4211j6991L3705
4370D83602p714R60K0369J5626q624J1295K8720K2807j5805J1011K5188J9123
4358F06558J7727K7806l1126M2961K3932Q073J9872K3711K7707O3482J5828N8327
4346I04858K8051O9553M5446M3057O4708Q0775P3782Q4663Q8355J07261J01372
4335A691881J12209Q8618J11331Q3469P1909n899K1981l0497j14812j10736j24094
$$ plain form
4324 1795360 1673596 1551791 1444744 1330219 1224657 1153556 1077085 997201 964844 887667
4314 887667 860861 812035 784127 753913 722256 687630 663857 655399 655845 629614 588932 604052
4302 604052 566130 562383 559087 528625 501394 507800 474993 499228 448409 462708 441444 418318
4290 418318 412604 393838 373814 380037 372259 371539 391729 357677 351231 336296 310702 314147 307080
4277 307080 318687 295608 278892 283232 263423 257539 256096 261316 250396 243704 241001 239783 228851
4264 228851 240745 210101 223722 225883 219029 199718 239840 195915 209849 230171 223091 206184
4252 206184 211042 203640 207988 219143 221630 211856 206502 235333 229522 240693 227659 214184 229661
4239 229661 226841 225923 213080 228855 227528 214860 219022 229127 225882 218738 216205 192968 163946
$$ packed form
4324A795360j21764j21805j07047j14525j05562p1101p6471p9884l2357p7177
4314H87667k6806m8826k7908l0214l1657l4626k3773q458M46k6231m0682J5120
4302F04052l7922l747l296l0462k7231O406l2807K4235n0819J4299k1264k3126
4290D18318n714j8766k0024O223p778p20K0190l4052o446j4935k5594L445p067
4277C07080J1607k3079j6716M340j9809n884j443N220j0920o692k703j218j0932
4264B28851J1894l0644J3621K161o854j9311M0122m3925J3934K0322p080j6907
4252B06184M858p402M348J1155K487r774n354K8831n811J1171j3034j3475J5477
4239B29661k820r18j2843J5775j327j2668M162J0105l245p144k533k3237k9022
$$ plain form
4226 163946 196421 168049 171259 185757 148609 163797 182163 195520 193223 226482 190049 180066
4214 180066 184240 195270 189889 176922 178786 175745 165000 174198 184758 180191 199839 204579 185963
4201 185963 152269 158663 135304 137711 94464 107579 97191 90396 107491 87539 104782 92066
4189 92066 110129 114497 126319 117728 122472 113132 104776 119378 132047 105851 106046 104283 102736 115642
4175 115642 103904 93045 92661 75890 93897 74688 63363 74184 62599 51813 83449 71231
4163 71231 31732 62420 53541 35357 49097 50958 49674 44669 60905 63026 52912 57996 40515
4150 40515 34976 43574 56200 53316 53194 58921 72768 88076 76873 64589 90105 90131 104171 100047
4136 100047 113722 132418 131042 137748 175399 183877 200272 199510 231531 256222 290560 338139 363356
$$ packed form
4226A63946L2475k8372L210J4498l7148J5188J8366J3357k297L3259l6433r983
4214A80066M174J1030n381j2967J864l041j0745R198J0560m567J9648M740j8616
4201A85963l3694O394k3359K407m3247J3115j0388o795J7095j9952J7243j2716
4189I2066J8063M368J1822q591M744r340q356J4602J2669k6196J95j763j547J2906
4175A15642j1738j0859l84j6771J8007j9209j1325J0821j1585j0786L1636j2218
4163G1231l9499L0688q879j8184J3740J861j284n005J6236K121j0114N084j7481
4150D0515n539Q598J2626k884j22N727J3847J5308j1203j2284K5516K6J4040m124
4136A00047J3675J8696j376O706L7651Q478J6395p62L2021K4691L4338M7579K5217
$$ plain form
4123 363356 375735 407777 390840 411026 404122 416169 405660 402944 418039 346793 367660 362063
4111 362063 356097 327432 333891 321815 330278 329342 325615 337298 359095 381885 392474 433053 466796
4098 466796 505570 566428 609960 688568 744077 827252 897102 949582 998900 990742 984792 946807
4086 946807 916074 874355 849699 786358 724318 694624 645406 581045 541470 533778 514587 475230
4074 475230 459598 468843 463445 490052 492762 502346 511312 540505 564187 606646 629933 673402 714865
4061 714865 753635 772913 811030 809568 790852 788235 798793 727676 720682 689839 651188 649792
4049 649792 626718 619159 598126 596791 600129 602613 591867 600859 601955 579033 564845 558371 540397
4036 540397 517270 497515 460259 479651 432033 448661 463432 471405 485007 496310 509968 548761
$$ packed form
4123C63356J2379L2042j6937K0186o904J2047j0509k716J5095p1246K0867n597
4111C62063n966k8665O459j2076Q463r36l727J1683K1797K2790J0589M0579L3743
4098D66796L8774O0858M3532P8608N5509Q3175O9850N2480M9318q158n950l7985
4086I46807l0733m1719k4656o3341o2040k9694m9218o4361l9575p692j9191l9357
4074D75230j5632R245n398K6607K710R584Q966K9193K3682M2459K3287M3469M1463
4061G14865L8770J9278L8117j462j8716k617J0558p1117o994l0843l8651j396
4049F49792k3074p559k1033j335L338K484j0746Q992J096k2922j4188o474j7974
4036E40397k3127j9755l7256J9392m7618J6628J4771P973J3602J1303J3658L8793
$$ plain form
4024 548761 595358 622987 647721 677283 713559 750420 785391 759509 750249 739706 698033 680199
4012 680199 611738 576854 533794 519701 473579 454233 434014 420608 393884 366018 385789 357782
4000 357782 349960 336128 326941 317228 318937 309834 276072 282110 272064 262693 239667 206370 203591
3987 203591 182199 188549 156065 151519 121559 118464 115256 97344 94419 77007 78051 55176 51672
3974 51672 22883 37304 35698 19286 43520 28961 -168 17301 15521 12831 -1428 -14760
3962 -14760 -15024 -29001 -19209 -37775 -36932 -44725 -48292 -59457 -43712 -49158 -59798 -63544 -84923 -60274
3948 -60274 -91208 -68049 -53179 -62595 -67119 -80262 -67374 -70815 -76330 -101412 -94580 -71594 -107235
3935 -107235 -106066 -97522 -111380 -107232 -105773 -96766 -85714 -116640 -108397 -131096 -118789 -115325 -128100
$$ packed form
4024E48761M6597K7629K4734K9562L6276L6861L4971k5882r260j0543m1673j7834
4012F80199o8461l4884m3060j4093m6122j9346k0219j3406k6724k7866J9771k8007
4000C57782p822j3832r187r713J709r103l3762O038j0046r371k3026l3297k779
3987B03591k1392O350l2484m546k9960l095l208j7912k925j7412J044k2875l504
3974E1672k8789J4421j606j6412K4234j4559k9129J7469j780k690j4259j3332
3962a4760k64j3977R792j8566Q43p793l567j1165J5745n446j0640l746k1379K4649
3948f0274l0934K3159J4870r416m524j3143J2888l441n515k5082O832K2986l5641
3935a07235J169Q544j3858M148J459R007J1052l0926Q243k2699J2307L464j2775
$$ plain form
3922 -128100 -132309 -118736 -108638 -136085 -113980 -121302 -131118 -125111 -124163 -139430 -147932 -154171 -137945
3909 -137945 -114453 -126141 -147223 -131803 -140557 -144152 -148317 -156039 -152703 -123055 -144801 -149811 -136666
3896 -136666 -148777 -143445 -160028 -148884 -159134 -141289 -149512 -148825 -157818 -143839 -159863 -162307 -158998
3883 -158998 -157683 -155835 -153937 -176362 -143438 -161772 -144256 -157056 -162641 -169903 -159712 -146838 -159615
3870 -159615 -178214 -148602 -143934 -172973 -153481 -162799 -155170 -169277 -152909 -165023 -172435 -174259 -166604
3857 -166604 -168042 -157588 -179353 -160948 -153190 -169688 -140545 -157657 -157159 -149503 -156597 -186936 -159338
3844 -159338 -148429 -145322 -160937 -158741 -171726 -153049 -167406 -164159 -155655 -160364 -156182 -145433 -142209
3831 -142209 -128943 -153413 -142643 -142261 -140508 -121653 -130880 -135268 -116738 -125432 -132119 -115737 -138082
$$ packed form
3922a28100m209J3573J0098k7447K2105p322r816O007R48j5267q502o239J6226
3909a37945K3492j1688k1082J5420q754l595m165p722L336K9648k1746n010J3145
3896a36666j2111N332j6583J1144j0250J7845q223O87q993J3979j6024k444L309
3883a58998J315J848J898k2425L2924j8334J7516j2800n585p262J0191J2874j2777
3870a59615j8599K9612M668k9039J9492r318P629j4107J6368j2114p412j824P655
3857a66604j438J0454k1765J8405P758j6498K9143j7112M98P656p094l0339K7598
3844a59338J0909L107j5615K196j2985J8677j4357L247Q504m709M182J0749L224
3831a42209J3266k4470J0770L82J753J8855r227m388J8530q694o687J6382k2345
$$ plain form
3818 -138082 -109793 -117372 -115100 -98427 -87732 -68769 -84647 -94731 -64781 -69479 -65295 -40375
3806 -40375 -58631 -57988 -42002 -40756 -42258 -55614 -36901 -47206 -30484 -27460 -28870 -26306 -4641
3793 -4641 -2400 -21824 -6063 7282 -5273 39709 32143 59834 75877 54969 80247 83048 108788
3780 108788 96418 103584 86353 100559 93516 86419 98417 96008 68181 103989 74792 103156
3768 103156 93905 93265 113455 111833 102800 127182 116979 113467 105707 145248 153775 175632 181966
3755 181966 210120 221846 218494 225255 226303 237076 217724 201976 165837 150711 131611 133085
3743 133085 142026 103516 122809 96601 100354 90398 105948 97799 112168 74417 99395 76759
3731 76759 87413 64854 87717 109770 108218 103575 133771 126402 175684 148655 133218 123546 106137
$$ packed form
3818a38082K8289p579K272J6673J0695J8963j5878j0084K9950m698M184K4920
3806d0375j8256O43J5986J246j502j3356J8713j0305J6722L024j410K564K1665
3793d641K241j9424J5761J3345j2555M4982p566K7691J6043k0908K5278K801K5740
3780A08788j2370P166j7231J4206p043p097J1998k409k7827L5808k9197K8364
3768A03156r251o40K0190j622r033K4382j0203l512p760L9541Q527K1857O334
3755A81966K8154J1726l352O761J048J0773j9352j5748l6139j5126j9100J474
3743A33085Q941l8510J9293k6208L753r956J5550q149J4369l7751K4978k2636
3731G6759J0654k2559K2863K2053j552m643L0196p369M9282k7029j5437r672j7409
$$ plain form
3718 106137 87739 56949 54509 48123 42567 21497 6855 2466 -22177 -5217 7293 -6192
3706 -6192 -9365 -27278 -32949 -22426 -56227 -45660 -71739 -72005 -92446 -53796 -69279 -73473 -63747
3693 -63747 -64100 -77429 -60310 -73010 -76060 -72804 -90937 -91198 -107872 -100542 -105407 -114228 -116594 -126099
3679 -126099 -130892 -117456 -133100 -121827 -128068 -137210 -135475 -135443 -145286 -136224 -159877 -152510 -154614 -146419
3665 -146419 -146537 -170679 -160710 -170334 -169197 -165140 -170852 -149006 -184320 -163866 -168308 -161698 -164717 -178182
3651 -178182 -173910 -154882 -165994 -169734 -176980 -179882 -157857 -152016 -169034 -176473 -157717 -197244 -171886
3638 -171886 -160606 -156089 -177234 -162229 -164627 -170572 -159039 -184512 -180761 -177064 -175152 -182437 -152208
3625 -152208 -157417 -159239 -157968 -166486 -182922 -158621 -152716 -172152 -168904 -167699 -168998 -160260 -162375 -176469
$$ packed form
3718A06137j8398l0790k440o386n556k1070j4642m389k4643J6960J2510j3485
3706f192l173j7913n671J0523l3801J0567k6079k66k0441L8650j5483m194R726
3693f3747l53j3329J7119j2700l050L256j8133k61j6674P330m865q821k366r505
3679a26099m793J3436j5644J1273o241r142J735L2r843R062k3653P367k104Q195
3665a46419j18k4142R969r624J137M057n712K1846l5314K0454m442O610l019j3465
3651a78182M272J9028j1112l740p246k902K2025N841j7018p439J8756l9527K5358
3638a71886J1280M517k1145J5005k398n945J1533k5473L751L697J912p285L0229
3625a52208n209j822J271q518j6436K4301N905j9436L248J205j299Q738k115j4094
$$ plain form
3611 -176469 -152587 -180250 -168294 -175768 -175697 -161603 -172615 -172896 -168426 -183080 -167914 -143583 -150934
3598 -150934 -182150 -169168 -183028 -174409 -171494 -172209 -166814 -180456 -164345 -172691 -167047 -148349 -153858
3585 -153858 -146943 -139406 -165282 -144275 -141610 -124520 -96863 -105776 -81721 -53980 -43163 -28388
3573 -28388 -28892 -21218 -39046 -77195 -54673 -90583 -97006 -100214 -143300 -140542 -145298 -129370 -150606
3560 -150606 -160198 -133827 -162606 -137385 -142537 -153213 -156623 -138021 -156860 -147139 -152879 -131632 -139950
3547 -139950 -150322 -147501 -150648 -133587 -160816 -159778 -144133 -150316 -159907 -176396 -145946 -126800 -138153
3534 -138153 -154089 -152536 -147500 -158797 -158669 -141166 -145584 -161495 -176221 -168287 -159243 -136817 -159570
3521 -159570 -147515 -131737 -127123 -140921 -163320 -142409 -132643 -148368 -139063 -131809 -126309 -146850 -131816
$$ packed form
3611a76469K3882k7663J1956p474P1J4094j1012k81M470j4654J5166K4331p351
3598a50934l1216J2982j3860Q619K915p15N395j3642J6111q346N644J8698n509
3585a53858O915P537k5876K1007K665J7090K7657q913K4055K7741J0817J4775
3573b8388n04P674j7828l8149K2522l5910o423l208m3086K758m756J5928k1236
3560a50606r592K6371k8779K5221n152j0676l410J8602j8839R721n740K1247q318
3547a39950j0372K821l147J7061k7229J038J5645o183r591j6489L0450J9146j1353
3534a38153j5936J553N036j1297J28J7503m418j5911j4726P934R044K2426k2753
3521a59570J2055J5778M614j3798k2399K0911R766j5725R305P254N500k0541J5034
$$ plain form
3508 -131816 -120755 -131670 -132577 -129485 -127221 -123312 -117749 -133905 -110546 -122963 -130826 -106883 -117863
3495 -117863 -114761 -106540 -124619 -107744 -111380 -100085 -111623 -125146 -127722 -104845 -119180 -94633
3483 -94633 -97830 -98270 -118701 -98210 -91318 -93562 -86370 -105613 -118192 -105581 -103239 -99901 -87030
3470 -87030 -78783 -94477 -79643 -84084 -96309 -73112 -80487 -72357 -90499 -72697 -84350 -66532 -62792
3457 -62792 -67899 -59770 -44292 -39660 -28916 2401 -28309 -14542 -4888 -18351 8440 1580 3746
3444 3746 -4605 -4765 10045 -13830 -5611 12817 22302 32098 14443 19419 -60 7928 12570 23096
3430 23096 23821 26086 20415 28537 10287 42431 32307 35697 45425 79252 66347 70517 68214 85290
3416 85290 75657 78978 66476 91738 73630 79396 75851 90460 85725 104385 109883 115422 133268
$$ packed form
3508a31816J1061j0915r07L092K264L909N563j6156K3359j2417p863K3943j0980
3495a17863L102Q221j8079J6875l636J1295j1538j3523k576K2877j4335K4547
3483i4633l197m40k0431K0491O892k244P192j9243j2579J2611K342L338J2871
3470h7030Q247j5694J4834m441j2225K3197p375Q130j8142J7802j1653J7818L740
3457f2792n107Q129J5478M632J0744L1317l0710J3767R654j3463K6791o860K166
3444C746q351j60J4810k3875Q219J8428R485R796j7655M976j9479P988M642J0526
3430B3096P25K265n671Q122j8250L2144j0124L390R728L3827j2905M170k303J7076
3416H5290r633L321j2502K5262j8108N766l545J4609m735J8660N498N539J7846
$$ plain form
3403 133268 153981 161676 179702 195758 194048 187229 211683 228616 235939 220989 250813 272829
3391 272829 300270 304943 336612 336793 361467 359717 367734 375183 410658 407376 423182 432784 434381
3378 434381 454488 478830 495478 534720 580169 623710 661463 699499 683669 750729 799565 827564
3366 827564 881122 949788 1009641 1089124 1155222 1296343 1433331 1655164 1917591 2223974 2559954
3355 2559954 2889403 3125213 3361486 3659238 4041945 4580808 5349572 6388985 7877226
3346 7877226 10070088 13479446 18033291 22823229 26337391 27378050 26349854 24025976
3338 24025976 20793935 17199407 13906163 11147559 9085979 7601586 6540659 5800195
3330 5800195 5202074 4665315 4172921 3710710 3301348 2942653 2606360 2327642 2125019 1933443
$$ packed form
3403A33268K0713P695J8026J6056j710o819K4454J6933P323j4950K9824K2016
3391B72829K7441M673L1669J81K4674j750Q017P449L5475l282J5806R602J597
3378D34381K0107K4342J6648L9242M5449M3541L7753L8036j5830O7060M8836K7999
3366H27564N3558O8666N9853P9483O6098J41121J36988K21833K62427L06383L35980
3355B559954L29449K35810K36273K97752L82707N38863P68764J039413J488241
3346G877226K192862L409358M553845M789938L514162J040659j028196k323878
3338B4025976l232041l594528l293244k758604k061580j484393j060927p40464
3330E800195n98121n36759m92394m62211m09362l58695l36293k78718k02623j91576
$$ plain form
3320 1933443 1791137 1649764 1525529 1427774 1323480 1257394 1169596 1090810 1005056 956365 901238
3309 901238 847742 811266 789613 751469 722979 694028 666116 623055 602901 593939 521294 510290
3297 510290 492429 474609 434803 421636 385921 369045 360058 367977 339761 335396 320983 319336
3285 319336 309541 292727 266822 265014 231036 227852 207340 206337 195547 191603 184244 163188 158721
3272 158721 138189 136148 132655 114985 91712 101312 82207 90623 60138 73659 47866 28729
3260 28729 21750 31651 6981 16777 -1244 18555 22443 5141 1190 -87 -23032 -31407 -28080
3247 -28080 -20222 -48171 -52200 -32815 -54334 -77811 -83396 -84536 -99449 -83273 -82056 -94768 -89882
3234 -89882 -90612 -102479 -94027 -88005 -81304 -101455 -98641 -116023 -87322 -116187 -118759 -108297 -109674
$$ packed form
3320A933443j42306j41373j24235r7755j04294o6086q7798p8786q5754m8691n5127
3309I01238n3496l6476k1653l8144k8490k8951k7912m3061k0154q962p2645j1004
3297E10290j7861j7820l9806j3167l5715j6876q987P919k8216m365j4413j647
3285C19336r795j6814k5905j808l3978l184k0512j003j0790l944p359k1056m467
3272A58721k0532k041l493j7670k3273R600j9105Q416l0485J3521k5793j9137
3260B8729o979R901k4670R796j8021J9799L888j7302l951j277k2945q375L327
3247b8080P858k7949m029J9385k1519k3477n585j140j4913J6176J217j2712M886
3234h9882p30j1867Q452O022O701k0151K814j7382K8701k8865k572J0462j377
$$ plain form
3221 -109674 -97980 -109074 -85698 -123796 -110891 -98559 -129989 -113451 -148069 -113915 -121603 -115531
3209 -115531 -136769 -143704 -109216 -133354 -133546 -135372 -148941 -117647 -144229 -145500 -140378 -147281 -160580
3196 -160580 -169209 -148417 -150426 -140649 -164257 -161848 -151412 -144795 -170004 -158445 -173698 -155688 -157840
3183 -157840 -175859 -180195 -176709 -162036 -174689 -159898 -153034 -177445 -172537 -169823 -181155 -153160 -164039
3170 -164039 -174237 -166624 -162480 -168997 -162823 -174188 -163630 -183529 -171361 -151793 -147855 -170075 -176123
3157 -176123 -173767 -173955 -168714 -179460 -162457 -156661 -166761 -156152 -177431 -175760 -180676 -168158 -176202
3144 -176202 -182223 -182310 -184491 -163683 -179485 -183624 -185209 -187038 -202900 -183555 -167439 -161597 -197750
3131 -197750 -178922 -184509 -186288 -191022 -200921 -179036 -156009 -189395 -178046 -194295 -200034 -196985 -173727
$$ packed form
3221a09674J1694j1094K3376l8098J2905J2332l1430J6538l4618L4154p688O072
3209a15531k1238o935L4488k4138j92j826j3569L1294k6582j271N122o903j3299
3196a60580q629K0792k009R777k3608K409J0436O617k5209J1559j5253J8010k152
3183a57840j8019m336L486J4673j2653J4791O864k4411M908K714j1332K7995j0879
3170a64039j0198P613M144o517O174j1365J0558j9899J2168J9568L938k2220o048
3157a76123K356j88N241j0746J7003N796j0100J0609k1279J671m916J2518q044
3144a76202o021q7k181K0808j5802m139j585j829j5862J9345J6116N842l6153
3131a97750J8828n587j779m734r899K1885K3027l3386J1349j6249n739L049K3258
$$ plain form
3118 -173727 -200052 -174342 -186756 -149089 -147438 -161588 -124313 -134390 -131889 -105252 -84629 -80772
3106 -80772 -60340 -60827 -55825 -89217 -98486 -121520 -134346 -154391 -155215 -154146 -159991 -147423 -171645
3093 -171645 -182040 -173539 -173934 -177407 -196921 -171096 -205441 -182859 -204144 -180326 -198196 -209532
3081 -209532 -195829 -208643 -194575 -172330 -191957 -200884 -205778 -179041 -194825 -190013 -187746 -202121
3069 -202121 -212681 -201868 -208687 -204706 -189281 -202736 -199507 -192546 -196689 -196954 -191417 -191445 -184636 -236057
3055 -236057 -188715 -190432 -188855 -182796 -186098 -176942 -197852 -190774 -193521 -209006 -186000 -187120 -191817
3042 -191817 -190709 -194004 -202729 -198450 -195592 -184540 -204129 -198872 -182477 -183609 -171350 -190454 -192575
3029 -192575 -198364 -200332 -195283 -201178 -200326 -181727 -199844 -191750 -174321 -180071 -184609 -182710 -177860 -205766
$$ packed form
3118a73727k6325K5710j2414L7667J651j4150L7275j0077K501K6637K0623L857
3106h0772K0432m87N002l3392r269k3034j2826k0045q24J069n845J2568k4222
3093a71645j0395Q501l95l473j9514K5825l4345K2582k1285K3818j7870j1336
3081b09532J3703j2814J4068K2245j9627q927m894K6737j5784M812K267j4375
3069b02121j0560J0813o819L981J5425j3455L229O961m143k65N537k8O809n1421
3055b36057M7342j717J577O059l302R156k0910P078k747j5485K3006j120m697
3042a91817J108l295q725M279K858J1052j9589N257J6395j132J2259j9104k121
3029a92575n789j968N049n895Q52J8599j8117Q094J7429n750m538J899M850k7906
$$ plain form
3015 -205766 -188992 -198073 -205415 -181089 -198319 -178652 -190928 -186083 -193141 -187592 -200831 -183488 -206210
3002 -206210 -201564 -218774 -184524 -195338 -199451 -181607 -205165 -216940 -206753 -206260 -200075 -199323 -208119
2989 -208119 -165837 -183912 -188454 -199426 -207785 -191985 -218319 -202929 -204900 -209492 -198167 -202989 -187271
2976 -187271 -212280 -195309 -201978 -212795 -213244 -199883 -200074 -203866 -184680 -186909 -204610 -196165 -188574
2963 -188574 -190099 -211944 -206938 -187442 -201075 -200660 -193676 -205892 -193427 -195776 -189752 -198730 -213015
2950 -213015 -192101 -168056 -202717 -192682 -200751 -174954 -189295 -196341 -184720 -179790 -223590 -189097
2938 -189097 -189226 -201069 -196450 -184830 -209743 -208503 -206489 -194092 -195743 -203098 -225333 -194991 -181977
2925 -181977 -200177 -219247 -186344 -181220 -187235 -209174 -206074 -183117 -208352 -226039 -206513 -196233
$$ packed form
3015b05766J6774r081p342K4326j7230J9667j2276M845p058N549j3239J7343k2722
3002b06210M646j7210L4250j0814m113J7844k3558j1775J0187M93O185P52q796
2989b08119M2282j8075m542j0972q359J5800k6334J5390j971m592J1325m822J5718
2976a87271k5009J6971o669j0817m49J3361j91l792J9186k229j7701Q445P591
2963a88574j525k1845N006J9496j3633M15O984j2216J2465k349O024q978j4285
2950b13015K0914K4045l4661J0035q069K5797j4341p046J1621M930m3800L4493
2938a89097j29j1843M619J1620k4913J240K014J2397j651p355k2235L0342J3014
2925a81977j8200j9070L2903N124o015k1939L100K2957k5235j7687J9526J0280
$$ plain form
2913 -196233 -199651 -180453 -218711 -183923 -197712 -205813 -182538 -176033 -202991 -204702 -194303 -204168 -189867
2900 -189867 -184603 -195581 -188507 -208704 -202492 -205766 -181919 -188960 -199316 -189305 -202744 -202901 -183461
2887 -183461 -189744 -209243 -191202 -192295 -204774 -209589 -185449 -190065 -187809 -203258 -176092 -197415 -220905
2874 -220905 -172995 -203095 -195977 -202146 -191022 -203632 -182588 -216322 -193924 -212563 -200035 -213937
2862 -213937 -205275 -198672 -204985 -204602 -170110 -183076 -213708 -204768 -178993 -193435 -183794 -211434 -183787
2849 -183787 -166659 -198877 -191599 -191204 -210497 -211361 -180489 -213478 -178170 -196635 -202528 -200910 -199167
2836 -199167 -212105 -185851 -203936 -204745 -183002 -218175 -204095 -191056 -191406 -192360 -193480 -175431 -201961
2823 -201961 -184907 -179726 -183815 -183619 -200226 -179356 -199683 -192832 -189164 -201666 -184373 -194510 -199702
$$ packed form
2913a96233l418J9198l8258L4788j3789q101K3275O505k6958j711J0399r865J4301
2900a89867N264j0978P074k0197O212l274K3847p041j0356J0011j3439j57J9440
2887a83461o283j9499J8041j093j2479m815K4140m616K256j5449K7166k1323k3490
2874b20905M7910l0100P118o169J1124j2610K1044l3734K2398j8639J2528j3902
2862b13937Q662O603o313L83L4492j2966l0632Q940K5775j4442R641k7640K7647
2849a83787J7128l2218P278L95j9293q64L0872l2989L5308j8465n893J618J743
2836a99167j2938K6254j8085q09K1743l5173J4080J3039l50r54j120J8049k6530
2823b01961J7054N181m089J96j6607K0870k0327O851L668j2502J7293j0137n192
$$ plain form
2810 -199702 -186501 -198455 -212278 -193579 -211428 -178231 -183405 -179294 -188285 -193246 -189978 -199903 -198322
2797 -198322 -162615 -196060 -170727 -203227 -190917 -199769 -208101 -185286 -189005 -183879 -197846 -207099 -204013
2784 -204013 -189939 -220530 -185812 -178662 -186305 -199285 -194260 -190528 -183643 -178851 -188393 -202653 -180046
2771 -180046 -180199 -168414 -193476 -181260 -183788 -186106 -204250 -209170 -206594 -187835 -180997 -195648 -184513
2758 -184513 -212936 -205608 -187376 -188680 -215530 -196456 -193891 -171888 -189088 -184617 -181170 -207027 -190542
2745 -190542 -200431 -200201 -190643 -215586 -201787 -185116 -198447 -176024 -171439 -195169 -203560 -195244 -183200
2732 -183200 -191066 -205098 -186481 -196260 -191309 -186042 -191007 -185486 -191847 -168488 -187342 -204740 -191271
2719 -191271 -185255 -166824 -185479 -177278 -181544 -185304 -184586 -180074 -179560 -181057 -193349 -188004 -210876 -187188
$$ packed form
2810a99702J3201j1954j3823J8699j7849L3197n174M111q991m961L268r925J581
2797a98322L5707l3445K5333l2500J2310q852q332K2815l719N126j3967r253L086
2784b04013J4074l0591L4718P150p643j2980N025L732O885M792r542j4260K2607
2771a80046j53J1785k5062J2216k528k318j8144m920K576J8759O838j4651J1135
2758a84513k8423P328J8232j304k6850J9074K565K2003j7200M471L447k5857J6485
2745a90542r889K30R558k4943J3799J6671j3331K2423M585k3730q391Q316J2044
2732a83200p866j4032J8617r779M951N267m965N521o361K3359j8854j7398J3469
2719a91271O016J8431j8655Q201m266l760P18M512N14j497j2292N345k2872K3688
$$ plain form
2705 -187188 -172726 -203682 -177117 -189925 -173146 -182100 -197005 -180849 -209817 -178723 -196472 -195850
2693 -195850 -187542 -172135 -197158 -200380 -182602 -187625 -189792 -204323 -190867 -203523 -193215 -190086 -182350
2680 -182350 -194479 -192491 -173316 -212632 -195911 -186108 -198525 -168084 -189647 -201974 -209559 -194136
2668 -194136 -178775 -177477 -175647 -198783 -193282 -195716 -170913 -181965 -200116 -200342 -178711 -197116 -184941
2655 -184941 -193110 -174511 -168548 -207738 -191453 -183602 -189684 -198039 -200392 -192051 -187310 -167704 -191529
2642 -191529 -183391 -189745 -179914 -196161 -193122 -182187 -201016 -178444 -188821 -188726 -189666 -186033 -188641 -184130
2628 -184130 -176677 -202778 -181730 -166930 -196279 -165240 -184490 -170786 -194604 -191963 -176611 -188505
2616 -188505 -173987 -171365 -207392 -176085 -179461 -184801 -176929 -192013 -201864 -182372 -186786 -151528 -192190
$$ packed form
2705a87188J4462l0956K6565j2808J6779q954j4905J6156k8968L1094j7749O22
2693a95850Q308J5407k5023l222J7778n023k167j4531J3456j2656J0308L129P736
2680a82350j2129J988J9175l9316J6721R803j2417L0441k1563j2327p585J5423
2668a94136J5361J298J830k3136N501k434K4803j1052j8151k26K1631j8405J2175
2655a84941q169J8599N963l9190J6285P851o082q355k353Q341M741J9606k3825
2642a91529Q138o354R831j6247L039J0935j8829K2572j0377R5r40L633k608M511
2628a84130P453k6101K1048J4800k9349L1039j9250J3704k3818K641J5352j1894
2616a88505J4518K622l6027L1307l376n340P872j5084r851J9492m414L5258m0662
$$ plain form
2603 -192190 -217239 -188081 -185708 -203272 -188606 -201610 -189116 -173183 -174693 -205352 -176688 -183055
2591 -183055 -181228 -175335 -186603 -187069 -201538 -174619 -180602 -193857 -181733 -177599 -170834 -190688 -181899
2578 -181899 -198571 -188190 -180359 -183916 -180255 -180103 -165233 -161310 -183634 -186210 -171834 -177986 -186110
2565 -186110 -181913 -168355 -178708 -191946 -199803 -188104 -191092 -198223 -177251 -190833 -216933 -199400
2553 -199400 -176004 -197160 -193062 -188816 -187585 -200887 -191035 -195828 -187583 -180325 -182831 -201686 -172665
2540 -172665 -180979 -169421 -161559 -180104 -206008 -198451 -171340 -184969 -202407 -177192 -179306 -178549 -220545
2527 -220545 -177500 -183758 -171958 -165903 -182060 -191131 -197448 -188039 -180391 -184090 -198098 -182444 -194365
2514 -194365 -200886 -177363 -187851 -193686 -194229 -185478 -184590 -172761 -196993 -187201 -193220 -171757 -165202 -177378
$$ packed form
2603a92190k5049K9158K373j7564J4666j3004J2494J5933j510l0659K8664o367
2591a83055J827N893j1268m66j4469K6919n983j3255J2124M134O765j9854Q789
2578a81899j6672J0381P831l557L661J52J4870L923k2324k576J4376o152q124
2565a86110M197J3558j0353j3238p857J1699k988p131K0972j3582k6100J7533
2553a99400K3396k1156M098M246J231j3302R852m793Q245P258k506j8855K9021
2540a72665q314J1558P862j8545k5904P557K7111j3629j7438K5215k114P57m1996
2527b20545M3045o258J1800O055j6157r071o317R409P648l699j4008J5654j1921
2514a94365o521K3523j0488n835n43Q751Q88J1829k4232R792o019K1463O555j2176
$$ plain form
2500 -177378 -180540 -171531 -195972 -194546 -169987 -175937 -178842 -180462 -185152 -186250 -175824 -193436 -173853
2487 -173853 -182274 -188555 -166448 -183208 -166142 -189918 -202607 -184369 -178151 -175121 -184103 -199522 -171312
2474 -171312 -168720 -181604 -176735 -168742 -189837 -179691 -206460 -206226 -176100 -188505 -185986 -182033 -190621
2461 -190621 -177603 -183054 -191410 -185215 -189793 -171646 -175960 -198708 -189530 -183655 -189199 -185484 -170630
2448 -170630 -194176 -185200 -188546 -168816 -191998 -173914 -186183 -188224 -178285 -177436 -179440 -183834 -176680
2435 -176680 -183282 -189458 -192362 -193674 -183323 -173155 -188333 -191597 -193181 -168522 -180963 -186465 -195989
2422 -195989 -191824 -180374 -185086 -179294 -183485 -211173 -186732 -184004 -165149 -166703 -186626 -183531 -176358
2409 -176358 -202928 -186536 -189197 -182079 -190367 -183089 -167087 -191979 -162092 -183432 -174309 -174931 -188786
$$ packed form
2500a77378l162R009k4441J426K4559n950k905j620m690j098J0426j7612J9583
2487a73853q421o281K2107j6760J7066k3776j2689J8238O218L030q982j5419K8210
2474a71312K592j2884M869P993k1095J0146k6769K34L0126j2405K519L953q588
2461a90621J3018n451q356O195m578J8147m314k2748R178N875n544L715J4854
2448a70630k3546Q976l346J9730k3182J8084j2269k041R939Q49k004m394P154
2435a76680o602o176k904j312J0351J0168j5178l264j584K4659j2441n502r524
2422a95989M165J1450m712N792m191k7688K4441K728J8855j554j9923L095P173
2409a76358k6570J6392k661P118q288P278J6002k4892K9887k1340R123o22j3855
$$ plain form
2396 -188786 -177007 -169100 -179755 -169442 -199183 -171659 -186579 -195942 -179651 -177691 -180524 -180045 -197564
$$ packed form
2396a88786J1779P907j0655J0313k9741K7524j4920r363J6291J960k833M79j7519
$$ [...]
##END NTUPLES=NMR SPECTRUM
##END=
