##TITLE=abcd
##JCAMPDX= 6.0         $$ Bruker NMR JCAMP-DX V2.0
##DATA TYPE= NMR SPECTRUM
##DATA CLASS= NTUPLES
##ORIGIN= UXNMR, Bruker Analytische Messtechnik GmbH
##OWNER= root
$$ XWIN-NMR		Version 3.5
$$ Fri Oct 24 18:13:31 2025 Russian Standard Time (UT+4h)  servis@DPX200
##.OBSERVE FREQUENCY= 200.131235884673
##.OBSERVE NUCLEUS= ^1H
##.ACQUISITION MODE= SIMULTANEOUS
##.ACQUISITION SCHEME= undefined
##.AVERAGES= 16
##.DIGITISER RES= 18
##SPECTROMETER/DATA SYSTEM= spect
##.PULSE SEQUENCE= zg
##.SOLVENT NAME= CDCl3
##.SHIFT REFERENCE= (INTERNAL, CDCl3, 0, 16.4885)
##AUDIT TRAIL= $$ (NUMBER, WHEN, WHO, WHERE, WHAT)
$$ ##TITLE= Audit trail, XWIN-NMR		Version 3.5
$$ ##JCAMPDX= 5.01
$$ ##ORIGIN= Bruker BioSpin GmbH
$$ ##OWNER= servis
$$ F:\spectra/data/av/nmr/H1/1/pdata/1/auditp.txt
$$ ##AUDIT TRAIL=  $$ (NUMBER, WHEN, WHO, WHERE, WHAT)
(   1,<2025-10-24 18:13:03.98 +0400>,<servis>,<DPX200>,
      <created by zg, POWCHK disabled, PULCHK disabled
       terminated by command 'halt'
       configuration hash MD5:
       00 E9 B6 7A A2 85 ED C7 34 08 36 98 17 FE 4E 26
       data hash MD5: 32K
       D4 12 66 92 AC B9 F1 D0 0C 46 F8 1B B9 B0 FF 39>)
(   2,<2025-10-24 18:13:05.78 +0400>,<servis>,<DPX200>,
      <Start of raw data processing
       efp BC_mod = 2 LB = 0.05 FT_mod = 6 PKNL = 1 PHC0 = -270.9076 PHC1 = 6.501565 SI = 16K 
       data hash MD5: 16K
       38 EE 8B 7E EA F1 09 10 E4 B4 30 02 F1 6D 2D 25>)
$$ ##END=
$$ 
$$ hash MD5
$$ 6C 49 EB CB B7 B1 26 95 0A 6D AD A6 DB 2A D6 6B
##$RELAX= 
##$RELAX= 
##$RELAX= 
##$RELAX= 
##$RELAX= 
##$RELAX= 
##$RELAX= 
##$RELAX= 
$$ Bruker specific parameters
$$ --------------------------
##$DU= <F:\spectra>
##$EXPNO= 1
##$NAME= <H1>
##$PROCNO= 1
##$TYPE= <nmr>
##$USER= <av>
##$AMP= (0..31)
100 100 100 100 100 100 100 100 100 100 100 100 100 100 100 100 100 100 
100 100 100 100 100 100 100 100 100 100 100 100 100 100 
##$AQSEQ= 0
##$AQ_mod= 1
##$AUNM= <au_zg>
##$AUTOPOS= <>
##$BF1= 200.13
##$BF2= 200.13
##$BF3= 200.13
##$BF4= 200.13
##$BF5= 500.13
##$BF6= 500.13
##$BF7= 500.13
##$BF8= 500.13
##$BYTORDA= 1
##$CFDGTYP= 0
##$CFRGTYP= 5
##$CHEMSTR= <none>
##$CNST= (0..31)
1 1 145 1 1 1 1 1 1 1 1 1 1 1 1 1 1 1 1 1 1 1 1 1 1 1 1 1 1 1 1 1 
##$CPDPRG= <>
##$CPDPRG1= <>
##$CPDPRG2= <>
##$CPDPRG3= <>
##$CPDPRG4= <mlev>
##$CPDPRG5= <mlev>
##$CPDPRG6= <mlev>
##$CPDPRG7= <mlev>
##$CPDPRG8= <mlev>
##$CPDPRGB= <>
##$CPDPRGT= <>
##$D= (0..31)
0 2 0 0 0 0 0 0 0 0.06 0 0 0 0 0 0 0.0002 0 0 0 0 0 0 0 0 0 0 0 0 0 0 
0 
##$DATE= 1761315183
##$DBL= (0..7)
120 120 120 120 120 120 120 120 
##$DBP= (0..7)
150 150 150 150 150 150 150 150 
##$DBP07= 0
##$DBPNAM0= <>
##$DBPNAM1= <>
##$DBPNAM2= <>
##$DBPNAM3= <>
##$DBPNAM4= <>
##$DBPNAM5= <>
##$DBPNAM6= <>
##$DBPNAM7= <>
##$DBPOAL= (0..7)
0.5 0.5 0.5 0.5 0.5 0.5 0.5 0.5 
##$DBPOFFS= (0..7)
0 0 0 0 0 0 0 0 
##$DE= 6
##$DECBNUC= <off>
##$DECIM= 32
##$DECNUC= <off>
##$DECSTAT= 4
##$DIGMOD= 1
##$DIGTYP= 9
##$DL= (0..7)
0 120 120 120 120 120 120 120 
##$DP= (0..7)
$$ [...]
##$SUBNAM4= <"">
##$SUBNAM5= <"">
##$SUBNAM6= <"">
##$SUBNAM7= <"">
##$SUBNAM8= <"">
##$SUBNAM9= <"">
##$SW= 20.6817932712277
##$SWIBOX= (0..15)
0 0 3 0 0 0 0 0 0 0 0 0 0 0 0 0 
##$SW_h= 4139.07284768212
##$TD= 32768
##$TD0= 1
##$TE= 0
##$TE2= 300
##$TE3= 300
##$TEG= 300
##$TL= (0..7)
0 120 120 120 120 120 120 120 
##$TP= (0..7)
150 150 150 150 150 150 150 150 
##$TP07= 0
##$TPNAME0= <>
##$TPNAME1= <>
##$TPNAME2= <>
##$TPNAME3= <>
##$TPNAME4= <>
##$TPNAME5= <>
##$TPNAME6= <>
##$TPNAME7= <>
##$TPOAL= (0..7)
0.5 0.5 0.5 0.5 0.5 0.5 0.5 0.5 
##$TPOFFS= (0..7)
0 0 0 0 0 0 0 0 
##$TUNHIN= 0
##$TUNHOUT= 0
##$TUNXOUT= 0
##$USERA1= <user>
##$USERA2= <user>
##$USERA3= <user>
##$USERA4= <user>
##$USERA5= <user>
##$V9= 5
##$VALIST= <valist>
##$VCLIST= <CCCCCCCCCCCCCCC>
##$VD= 0
##$VDLIST= <DDDDDDDDDDDDDDD>
##$VPLIST= <PPPPPPPPPPPPPPP>
##$VTLIST= <TTTTTTTTTTTTTTT>
##$WBST= 1024
##$WBSW= 30
##$XGAIN= (0..3)
0 0 0 0 
##$XL= 0
##$YL= 0
##$YMAX_a= 1414199
##$YMIN_a= -1024253
##$ZGOPTNS= <>
##$ZL1= 120
##$ZL2= 120
##$ZL3= 120
##$ZL4= 120
##$ABSF1= 0
##$ABSF2= 0
##$ABSG= 0
##$ABSL= 0
##$ALPHA= 0
##$AQORDER= 0
##$ASSFAC= 0
##$ASSFACI= 0
##$ASSFACX= 0
##$ASSWID= 0
##$AUNMP= <proc_1d>
##$AZFE= 0.1
##$AZFW= 0.1
##$BCFW= 0
##$BC_mod= 2
##$BYTORDP= 0
##$COROFFS= 0
##$CY= 18.4799938201904
##$DATMOD= 1
##$DC= 0
##$DFILT= <>
##$DTYPP= 0
##$F1P= 9.9274215381318
##$F2P= -0.165520771350173
##$FCOR= 1
##$FTSIZE= 16384
##$FT_mod= 6
##$GAMMA= 0
##$GB= 0
##$INTBC= 1
##$INTSCL= 4.127829e-11
##$ISEN= 128
##$LB= 0.05
##$LEV0= 0
##$LPBIN= 0
##$MAXI= 10000
##$MC2= 0
##$MEAN= 0
##$ME_mod= 0
##$MI= 50
##$NCOEF= 0
##$NC_proc= -5
##$NLEV= 6
##$NOISF1= 3.799351
##$NOISF2= 2.8
##$NSP= 0
##$NTH_PI= 0
##$NZP= 0
##$OFFSET= 16.48848
##$PC= 4
##$PHC0= -270.9076
##$PHC1= 6.501565
##$PH_mod= 1
##$PKNL= yes
##$PPARMOD= 0
##$PSCAL= 4
##$PSIGN= 0
##$REVERSE= no
##$SF= 200.130005582386
##$SI= 16384
##$SIGF1= 3
##$SIGF2= 2
##$SINO= 400
##$SIOLD= 16384
##$SREGLST= <1H.CDCl3>
##$SSB= 0
##$STSI= 16384
##$STSR= 0
##$SW_p= 4139.07284768211
##$SYMM= 0
##$S_DEV= 0
##$TDeff= 32768
##$TDoff= 0
##$TI= <>
##$TILT= no
##$TM1= 0
##$TM2= 0
##$TOPLEV= 0
##$USERP1= <user>
##$USERP2= <user>
##$USERP3= <user>
##$USERP4= <user>
##$USERP5= <user>
##$WDW= 1
##$XDIM= 16384
##$YMAX_p= 422644320
##$YMIN_p= -1422491
$$ End of Bruker specific parameters
$$ ---------------------------------
##NTUPLES= NMR SPECTRUM
##VAR_NAME=  FREQUENCY,     SPECTRUM/REAL,   SPECTRUM/IMAG
##SYMBOL=    X,             R,               I
##VAR_TYPE=  INDEPENDENT,   DEPENDENT,       DEPENDENT
##VAR_FORM=  AFFN,          ASDF,            ASDF
##VAR_DIM=   16384,         16384,           16384
##UNITS=     HZ,            ARBITRARY UNITS, ARBITRARY UNITS
##FACTOR=    0.252644378177508, 1,           1
##FIRST=     3299.83951724647, 0,            0
##LAST=      -839.233330435636, 0,           0
##MIN=       -839.233330435636, -1422491,    0
##MAX=       3299.83951724647, 422644320,    0
$$ Real data points
##PAGE= N=1
##DATA TABLE= (X++(R..R)), XYDATA
$$ [...]
$$ plain form
6578 9058620 9098964 9049904 9097464 9084146 9018080 9002610 9015435 8981820 9029950 9080497 9164427
6567 9164427 9279809 9338770 9484520 9654506 9789715 9937895 10111642 10232337 10448399 10602243
6557 10602243 10696509 10827097 10961918 11059780 11212643 11232687 11290125 11338924 11385670 11375171 11418102
6546 11418102 11342265 11326951 11311970 11248883 11214400 11127841 11097985 11033813 11006362 10909360 10951920
6535 10951920 10988875 10981852 11037335 11136554 11193770 11272989 11450844 11667505 11863464 12174232 12395094
6524 12395094 12684600 12973770 13248308 13524143 13796957 13899294 14021515 14016981 13955294 13744617
6514 13744617 13520093 13280396 12979604 12609987 12326155 11941559 11699141 11356275 11076163
6505 11076163 10743618 10539522 10268365 10075201 9881103 9574015 9369681 9288058 9121378 8978844
$$ packed form
6578I058620M0344m9060M7560j3318o6066j5470J2825l3615M8130N0547Q3930
6567I164427J15382N8961J45750J69986J35209J48180J73747J20695K16062J53844
6557A0602243R4266J30588J34821R7862J52863K0044N7438M8799M6746j0499M2931
6546A1418102p5837j5314j4981o3087l4483q6559k9856o4172k7451r7002M2560
6535A0951920L6955p023N5483R9219N7216P9219J77855K16661J95959L10768K20862
6524A2395094K89506K89170K74538K75835K72814J02337J22221m534o1687k10677
6514A3744617k24524k39697l00792l69617k83832l84596k42418l42866k80112
6505A1076163l32545k04096k71157j93164j94098l07088k04334q1623j66680j42534
$$ plain form
6495 8978844 8942358 8809558 8688315 8585275 8539703 8602063 8665525 8566832 8648522 8556011 8617982
6484 8617982 8609102 8562850 8542782 8478543 8463528 8418333 8378406 8316358 8263180 8123877 8147984
6473 8147984 8080339 8050204 8046997 8051071 8048530 8084959 8112341 8172429 8236814 8291979 8492889 8598043
6461 8598043 8748565 8915879 9129101 9276609 9608545 9913170 10141631 10404438 10568705 10909311
6451 10909311 11093767 11382797 11637345 11732453 11844499 12055720 12203002 12287905 12377430 12511575
6441 12511575 12657977 12833890 12897364 13050195 13220820 13299375 13427548 13579433 13706521 13720308
6431 13720308 13789995 13836745 13799090 13820753 13835056 13821268 13848134 13839033 13904648 13939689 13932252 14011958
6419 14011958 14170648 14202889 14360198 14485988 14668902 14697589 14905415 15058325 15259333 15227100
$$ packed form
6495H978844l6486j32800j21243j03040m5572O2360O3462r8693Q1690r2511O1971
6484H617982q880m6252k0068o4239j5015m5195l9927o2048n3178j39303K4107
6473H147984o7645l0135l207M074k541L6429K7382O0088O4385N5165K00910J05154
6461H598043J50522J67314K13222J47508L31936L04625K28461K62807J64267L40606
6451A0909311J84456K89030K54548R5108J12046K11221J47282Q4903Q9525J34145
6441A2511575J46402J75913O3474J52831J70625P8555J28173J51885J27088J3787
6431A3720308O9687M6750l7655K1663J4303j3788K6866r101O5615L5041p437P9706
6419A4011958J58690L2241J57309J25790J82914K8687K07826J52910K01008l2233
$$ plain form
6409 15227100 15409322 15363744 15364372 15244867 15117846 14890833 14656977 14367860 14001741 13692288
6399 13692288 13392392 13106915 12901539 12577482 12340585 12151602 11879162 11727223 11573482
6390 11573482 11432059 11343196 11309219 11240068 11171722 11090071 11172613 11272173 11224198 11297051 11325743
6379 11325743 11400346 11433232 11537956 11648429 11713082 11879534 12023083 12140068 12216557 12436837
6369 12436837 12536119 12602142 12655150 12721717 12820694 12801325 12828198 12858471 12806535 12782691 12718490
6358 12718490 12670949 12559940 12538273 12440679 12402354 12189576 12098298 11839965 11717414 11597895
6348 11597895 11440077 11185206 11129125 10891831 10748947 10606072 10600680 10400900 10244609 10117932
6338 10117932 10006402 9918884 9790466 9630981 9651155 9417085 9443079 9355213 9268696 9221609
$$ packed form
6409A5227100J82222m5578O28j19505j27021k27013k33856k89117l66119l09453
6399A3692288k99896k85477k05376l24057k36897j88983k72440j51939j53741
6390A1573482j41423q8863l3977o9151o8346q1651Q2542R9560m7975P2853K8692
6379A1325743P4603L2886J04724J10473O4653J66452J43549J16985P6489K20280
6369A2436837R9282O6023N3008O6567R8977j9369K6873L0273n1936k3844o4201
6358A2718490m7541j11009k1667r7594l8325k12778r1278k58333j22551j19519
6348A1597895j57818k54871n6081k37294j42884j42875n392j99780j56291j26677
6338A0117932j11530q7518j28418j59485K0174k34070K5994q7866q6517m7087
$$ plain form
6328 9221609 9094102 9163094 9065179 8921002 8942186 8904626 8800581 8771226 8691899 8740744 8680283
6317 8680283 8626562 8618956 8557174 8509321 8588625 8528373 8475704 8408677 8503933 8501580 8604754 8555334
6305 8555334 8562675 8565519 8658246 8665143 8743617 8793118 8827936 8897816 8985937 9074423 9126074 9199798
6293 9199798 9265698 9343454 9437011 9438712 9537177 9644039 9707618 9857359 9882957 10025245 10180777
6282 10180777 10189143 10366054 10428196 10517045 10720962 10839827 10965590 11135744 11226550 11449430
6272 11449430 11557787 11745551 11925045 12080075 12248793 12384253 12648374 12846433 13016378
6263 13016378 13215148 13504438 13688340 13897781 14139983 14395929 14663219 14958797 15254583
6254 15254583 15610197 15857518 16236495 16580551 17008697 17336469 17669457 17999866 18384903
$$ packed form
6328I221609j27507O8992r7915j44177K1184l7560j04045k9355p9327M8845o0461
6317H680283n3721p606o1782m7853P9304o0252n2669o7027R5256k353J03174m9420
6305H555334P341K844R2727O897P8474M9501L4818O9880Q8121Q8486N1651P3724
6293I199798O5900P7756R3557J701R8465J06862O3579J49741K5598J42288J55532
6282A0180777Q366J76911O2142Q8849K03917J18865J25763J70154R0806K22880
6272A1449430J08357J87764J79494J55030J68718J35460K64121J98059J69945
6263A3016378J98770K89290J83902K09441K42202K55946K67290K95578K95786
6254A5254583L55614K47321L78977L44056M28146L27772L32988L30409L85037
$$ plain form
6245 18384903 18768698 19107661 19459317 19761870 20126205 20507114 20787415 21084298 21402277
6236 21402277 21716108 21977618 22239352 22535112 22748387 22958007 23094915 23358036 23485276
6227 23485276 23629765 23690380 23737356 23749592 23871827 24016878 24146678 24316259 24442351 24680291
6217 24680291 24864234 25177359 25530628 25875269 26276506 26697716 27161436 27707896 28328077
6208 28328077 29022022 29826253 30650217 31510604 32306072 33204735 34023245 34649644 35160628
6199 35160628 35494178 35711612 35732659 35539753 35302515 35039834 34750703 34509990 34214257 33916956
6189 33916956 33894012 33873449 33838146 34093721 34412088 34959751 35795484 36786371 37991710 39376403
6179 39376403 41114372 43004573 45087448 47339556 49655609 52070994 54289238 56325539
$$ packed form
6245A8384903L83795L38963L51656L02553L64335L80909K80301K96883L17979
6236B1402277L13831K61510K61734K95760K13275K09620J36908K63121J27240
6227B3485276J44489O0615M6976J2236J22235J45051J29800J69581J26092K37940
6217B4680291J83943L13125L53269L44641M01237M21210M63720N46460O20181
6208B8328077O93945Q04231Q23964Q60387P95468Q98663Q18510O26399N10984
6199C5160628L33550K17434K1047j92906k37238k62681k89131k40713k95733k97301
6189C3916956k2944k0563l5303K55575L18367N47663Q35733R90887J205339J384693
6179C9376403J737969J890201K082875K252108K316053K415385K218244K036301
$$ plain form
6171 56325539 57981835 59226692 60079425 60425808 60342461 59684703 58689744 57210527 55512961
6162 55512961 53687110 51779009 49828278 47919967 45952796 44120946 42486216 40958853
6154 40958853 39625239 38429848 37252689 36369787 35572438 34790948 34174423 33546872 33042077
6145 33042077 32472783 31837378 31138958 30411888 29557579 28783908 27935811 27066106 26285300
6136 26285300 25361823 24611445 23985715 23281257 22714965 22034512 21623337 21106705 20632123
6127 20632123 20221350 19838898 19447256 18947439 18585432 18204957 17793335 17395453 16993972
6118 16993972 16598818 16197109 15795734 15495065 15160313 14812726 14607026 14384206 14111257
6109 14111257 14005820 13750945 13679671 13545673 13365452 13333159 13273494 13261771 13293047 13386183
$$ packed form
6171E6325539J656296J244857Q52733L46383q3347o57758r94959j479217j697566
6162E5512961j825851j908101j950731j908311j967171j831850j634730j527363
6154D0958853j333614j195391j177159q82902p97349p81490o16525o27551n04795
6145C3042077n69294o35405o98420p27070q54309p73671q48097q69705p80806
6136B6285300r23477p50378o25730p04458n66292o80453m11175n16632m74582
6127B0632123m10773l82452l91642m99817l62007l80475m11622l97882m01481
6118A6993972l95154m01709m01375l00669l34752l47587k05700k22820k72949
6109A4111257j05437k54875p1274j33998j80221l2293n9665j1723L1276R3136
$$ plain form
6099 13386183 13402370 13395599 13485025 13595977 13744784 13876987 14049432 14170750 14300574 14416721
6089 14416721 14509707 14536761 14586102 14543024 14432380 14376929 14132327 13992175 13771332 13600230
6079 13600230 13338495 13093711 12864070 12651787 12459415 12226123 12002010 11717434 11524671
6070 11524671 11406321 11183120 11017263 10848255 10701641 10586999 10471070 10398927 10220024 10110164
6060 10110164 10035056 9884788 9744378 9637849 9543140 9424696 9351995 9110258 9057067 8927804
6050 8927804 8812102 8637322 8508512 8500097 8320221 8295647 8152494 8052921 8035841 7977540 8030086
6039 8030086 7983972 7893688 7901287 7874978 7808330 7806175 7805586 7786212 7808936 7748832 7810618 7726520
6027 7726520 7787576 7729341 7711044 7723748 7721212 7615160 7685438 7641719 7679635 7727013 7671928
$$ packed form
6099A3386183J6187o771Q9426J10952J48807J32203J72445J21318J29824J16147
6089A4416721R2986K7054M9341m3078j10644n5451k44602j40152k20843j71102
6079A3600230k61735k44784k29641k12283j92372k33292k24113k84576j92763
6070A1524671j18350k23201j65857j69008j46614j14642j15929p2143j78903j09860
6060A0110164p5108j50268j40410j06529r4709j18444p2701k41737n3191j29263
6050H927804j15702j74780j28810q415j79876k4574j43153r9573j7080n8301N2546
6039H030086m6114r0284P599k6309o6648k155n89j9374K2724o0104O1786q4098
6027G726520O1056n8235j8297J2704k536j06052P0278m3719L7916M7378n5085
$$ plain form
6016 7671928 7707740 7732468 7813635 7722261 7857656 7862893 7919331 7908530 7956266 7934029 8032963
6005 8032963 8010692 8028242 8118190 8135186 8198313 8239748 8291083 8418447 8417012 8544124 8658624
5994 8658624 8754640 8936734 9106533 9294123 9448612 9680637 9905417 10212342 10439978 10747596
5984 10747596 11104888 11547089 11965751 12465394 12976440 13496189 14073785 14709635 15175570
5975 15175570 15747481 16271715 16729466 17167231 17466858 17738100 17897561 17940713 18027045 18077088
5965 18077088 18086075 18105711 18165249 18191678 18205882 18308915 18476561 18774102 19041106 19549882
5955 19549882 20068267 20764677 21562392 22310086 23151225 24024638 24785759 25542247 26213925
5946 26213925 26781535 27069321 27314151 27379910 27237485 26888704 26530161 26017607 25327324 24416697
$$ packed form
6016G671928L5812K4728Q1167r1374J35395N237N6438j0801M7736k2237R8934
6005H032963k2271J7550Q9948J6996O3127M1435N1335J27364j435J27112J14500
5994H658624R6016J82094J69799J87590J54489K32025K24780L06925K27636L07618
5984A0747596L57292M42201M18662M99643N11046N19749N77596O35850M65935
5975A5175570N71911N24234M57751M37765K99627K71242J59461M3152Q6332N0043
5965A8077088Q987J9636N9538K6429J4204J03033J67646K97541K67004N08776
5955A9549882N18385O96410P97715P47694Q41139Q73413P61121P56488O71678
5946B6213925N67610K87786K44830O5759j42425l48781l58543n12554o90283r10627
$$ plain form
5936 24416697 23487057 22580216 21769072 20891854 20180326 19693580 19236560 18890489 18534539
5927 18534539 18403076 18290428 18280491 18306229 18393669 18412732 18393257 18444833 18304914 18087288 17877026
5916 17877026 17561373 17064538 16494599 15745791 15117749 14281945 13508799 12667466 11978516
5907 11978516 11320838 10733772 10127693 9629310 9255849 8774728 8465039 8120942 7954320
5898 7954320 7743641 7606544 7489615 7412231 7383157 7419971 7453340 7489296 7538038 7534775 7598847
5887 7598847 7586320 7480342 7368898 7165830 6989770 6711105 6501700 6291988 6098831 5939354
5877 5939354 5788597 5693143 5542341 5529754 5373746 5323809 5245224 5157990 5156840 5128884 5042105
5866 5042105 5056029 4938421 5059545 5024348 4969907 5004788 5011452 5068711 5089855 5198899 5170328
$$ packed form
5936B4416697r29640r06841q11144q77218p11528m86746m57020l46071l55950
5927A8534539j31463j12648r937K5738Q7440J9063j9475N1576j39919k17626k10262
5916A7877026l15653m96835n69939p48808o28042q35804p73146q41333o88950
5907A1978516o57678n87066o06079m98383l73461m81121l09689l44097j66622
5898G954320k10679j37097j16929p7384k9074L6814L3369L5956M8742l263O4072
5887G598847j2527j05978j11444k03068j76060k78665k09405k09712j93157j59477
5877E939354j50757r5454j50802j2587j56008m9937p8585q7234j150k7956q6779
5866E042105J3924j17608J21124l5197n4441L4881O664N7259K1144J09044k8571
$$ plain form
5855 5170328 5245071 5242428 5407771 5468339 5489224 5642342 5801519 5943231 6126429 6299835
5845 6299835 6457201 6673845 6790752 6973950 6983072 7023943 7080938 6988320 6965472 6883746 6682975
5834 6682975 6629734 6603786 6554906 6547091 6568266 6524020 6586201 6560898 6538349 6661168 6701375
5823 6701375 6807939 6917681 6990604 7020207 7104721 7177455 7254980 7258075 7411640 7460196 7458350
5812 7458350 7538941 7566765 7572078 7569515 7666341 7666474 7639873 7811383 7807806 7941804 8061281 8095687
5800 8095687 8210380 8290545 8485647 8576181 8686296 8748061 8881908 8986985 8984711 9028406 9066065
5789 9066065 9149043 9157548 9214029 9157331 9084963 9177402 9134288 9218078 9226799 9278009 9299856 9428104
5777 9428104 9604382 9804514 9936954 10179075 10557796 10849920 11224523 11657934 12184400 12730475
$$ packed form
5855E170328P4743k643J65343O0568K0885J53118J59177J41712J83198J73406
5845F299835J57366K16644J16907J83198R122M0871N6995r2618k2848q1726k00771
5834F682975n3241k5948m8880p815K1175m4246O2181k5303k2549J22819M0207
5823F701375J06564J09742P2923K9603Q4514P2734P7525L095J53565M8556j846
5812G458350Q0591K7824N313k563R6826J33k6601J71510l577J33998J19477L4406
5800H095687J14693Q0165J95102R0534J10115O1765J33847J05077k274M3695L7659
5789I066065Q2978Q505N6481n6698p2368R2439m3114Q3790Q721N1210K1847J28248
5777I428104J76278K00132J32440K42121L78721K92124L74603M33411N26466N46075
$$ plain form
5767 12730475 13400694 14091939 14829599 15495166 16234812 16930074 17532677 18077816 18526770
5758 18526770 18755398 18995045 18991289 19011826 18947876 18864230 18632932 18569648 18438004 18369543 18346785
5747 18346785 18336767 18558516 18748176 19104104 19547254 20168499 20862742 21514876 22264576 23041904
5737 23041904 23675406 24337424 24840122 25235682 25441953 25517837 25425941 25231522 24919172 24430341
5727 24430341 23961771 23188621 22483961 21595960 20827917 20210689 19382297 18821531 18350827
5718 18350827 17860962 17620931 17445410 17432298 17409408 17477431 17644747 17861216 18053836 18233430
5708 18233430 18341314 18430069 18530258 18412681 18268492 17996477 17692446 17216061 16700272 16221614
5698 16221614 15769315 15240603 14811741 14457924 14073502 13823623 13530350 13371292 13323363 13195078
$$ packed form
5767A2730475O70219O91245P37660O65567P39646O95262O02603N45139M48954
5758A8526770K28628K39647l756K0537o3950q3646k31298o3284j31644o8461k2758
5747A8346785j0018K21749J89660L55928M43150O21245O94243O52134P49700P77328
5737B3041904O33502O62018N02698L95560K06271P5884r1896j94419l12350m88831
5727B4430341m68570p73150p04660q88001p68043o17228q28392n60766m70704
5718A8350827m89865k40031j75521j3112k2890O8023J67316K16469J92620J79594
5708A8233430J07884Q8755J00189j17577j44189k72015l04031m76385n15789m78658
5698A6221614m52299n28712m28862l53817l84422k49879k93273j59058m7929j28285
$$ plain form
5688 13195078 13144858 13100162 13135754 13271999 13293645 13403553 13471290 13676374 13844983 14010781
5678 14010781 14208184 14359109 14465598 14734134 14931246 14964386 15237687 15507201 15698953 16001111
5668 16001111 16250414 16611885 16882705 17140212 17567888 18021544 18526378 18972921 19566203
5659 19566203 20137617 20665400 21223930 21804805 22490075 23158976 23765805 24515018 25112384
5650 25112384 25737931 26433791 27174541 27904555 28724476 29624257 30337102 31476290 32483266
5641 32483266 33676610 35088337 36967394 39122085 41862751 45089039 49033725 53850956
5633 53850956 59830554 66914589 75122953 84001400 93472992 103763083 115810551 131130105
5625 131130105 150518237 174101112 201722438 233160332 264312573 296381941 325354429
$$ packed form
5688A3195078n0220m4696L5592J36245K1646J09908O7737K05084J68609J65798
5678A4010781J97403J50925J06489K68536J97112L3140K73301K69514J91752L02158
5668A6001111K49303L61471K70820K57507M27676M53656N04834M46543N93282
5659A9566203N71414N27783N58530N80875O85270O68901O06829P49213N97366
5650B5112384O25547O95860P40750P30014Q19921Q99781P12845J139188J006976
5641C2483266J193344J411727J879057K154691K740666L226288L944686M817231
5633E3850956N979598P084035Q208364Q878447R471592J0290091J2047468J5319554
5625A31130105J9388132K3582875K7621326L1437894L1152241L2069368K8972488
$$ plain form
5618 325354429 350514472 371835146 382737635 383284346 372919254 349680291 320386878
5611 320386878 286520421 252592770 222956762 196700394 173251736 152286554 133580534
5604 133580534 117785452 104432751 93160322 83593509 75963433 69830041 65102179 61551895
5596 61551895 58895466 56927065 55714721 54955773 54899861 55280698 56245114 57951574 60293239
5587 60293239 63488605 67625100 72914375 79022369 85862235 93578817 102355003 112780793
5579 112780793 125915621 142609247 162614316 186650070 214045955 240384409 268916180
5572 268916180 295035309 316895295 335806406 344077952 344809718 337664888 316918127 291401579
5564 291401579 263671018 233361868 206095827 181020754 158937691 139968875 122330134
$$ packed form
5618C25354429K5160043K1320674J0902489N46711j0365092k3238963k9293413
5611C20386878l3866457l3927651k9636008k6256368k3448658k0965182j8706020
5604A33580534j5795082j3352701j1272429r566813p630076o133392m727862l550284
5596F1551895k656429j968401j212344p58948n5912L80837R64416J706460K341665
5587F0293239L195366M136495N289275O107994O839866P716582Q776186J0425790
5579A12780793J3134828J6693626K0005069K4035754K7395885K6338454K8531771
5572B68916180K6119129K1859986J8911111Q271546P31766p144830k0746761k5516548
5564B91401579k7730561l0309150k7266041k5075073k2083063j8968816j7638741
$$ plain form
5557 122330134 107234203 94458244 83712474 74548505 66972881 60755261 55697474 51612067
5549 51612067 48289774 45669940 43489102 41698189 40128526 38836298 37585107 36527844
5541 36527844 35465369 34533363 33663668 32922341 32281194 31733488 31302762 31012741 30751853
5532 30751853 30664871 30570270 30492574 30579184 30568611 30708367 30740850 30858657 30973970 31123048
5522 31123048 31181102 31350794 31493276 31674246 31880322 31984215 32224734 32440774 32779178 33092553
5512 33092553 33490986 33894997 34341149 34883985 35531151 36232240 37080043 38075953 39158803
5503 39158803 40446690 41879535 43570265 45450223 47519263 49929434 52639934 55591436
5495 55591436 59017766 62765692 66899263 71513112 76363064 81419252 86417828 91244887
$$ packed form
5557A22330134j5095931j2775959j0745770r163969p575624o217620n057787m085407
5549E1612067l322293k619834k180838j790913j569663j292228j251191j057263
5541C6527844j062475r32006q69695p41327o41147n47706m30726k90021k60888
5532C0751853q6982r4601p7696Q6610j0573J39756L2483J17807J15313J49078
5522C1123048N8054J69692J42482J80970K06076J03893K40519K16040L38404L13375
5512C3092553L98433M04011M46152N42836O47166P01089Q47803R95910J082850
5503C9158803J287887J432845J690730J879958K069040K410171K710500K951502
5495E5591436L426330L747926M133571M613849M849952N056188M998576M827059
$$ plain form
5487 91244887 95708670 99367303 102113356 103840753 104256684 103603574 101676264 98902812
5479 98902812 95290507 91324191 87356030 83233349 79442188 75884762 72638896 69640223
5471 69640223 67033160 64617023 62392031 60426938 58517399 56758662 55093442 53387360
5463 53387360 51770966 50220237 48620337 47176430 45621979 44197951 42899505 41540400
5455 41540400 40362755 39268593 38226170 37369928 36567906 35866114 35293850 34759022 34365948
5446 34365948 34123762 33930612 33868810 33704686 33736722 33776665 33869470 34053404 34225134 34413742
5436 34413742 34679110 34843212 35055680 35189102 35327295 35418542 35513712 35514868 35498990 35457321
5426 35457321 35305230 35169113 35001075 34881404 34663271 34352724 34134163 33952051 33648413
$$ packed form
5487I1244887M463783L658633K746053J727397M15931o53110j927310k773452
5479I8902812l612305l966316l968161m122681l791161l557426l245866k998673
5471F9640223k607063k416137k224992j965093j909539j758737j665220j706082
5463E3387360j616394j550729j599900j443907j554451j424028j298446j359105
5455D1540400j177645j094162j042423q56242q02022p01792n72264n34828l93074
5446C4365948k42186j93150o1802j64124L2036L9943R2805J83934J71730J88608
5436C4413742K65368J64102K12468J33422J38193R1247R5170J156j5878m1669
5426C5457321j52091j36117j68038j19671k18133l10547k18561j82112l03638
$$ plain form
5417 33648413 33272041 32906368 32511663 32151638 31735427 31299816 30876275 30459863 30127902
5408 30127902 29769216 29523616 29160154 28953306 28700927 28506216 28286511 28121146 28029744 27851724
5398 27851724 27740027 27698729 27637966 27589795 27637200 27698306 27833256 27866109 27998322 28211093
5388 28211093 28374561 28548938 28686631 28809549 28933497 28974014 28954184 28953350 28994129 29066518 29045414
5377 29045414 29087218 29057275 29120155 29017665 29097226 28892856 28837460 28764496 28521798 28355567
5367 28355567 28199526 27984682 27891827 27748270 27653886 27676093 27647511 27632550 27682507 27680993 27758193
5356 27758193 27796206 27826267 27889804 27959083 28085840 28318213 28477319 28733555 29019126 29330464
5346 29330464 29675701 30044719 30419592 30711783 31061362 31288552 31493195 31490292 31607610 31539631
$$ packed form
5417C3648413l76372l65673l94705l60025m16211m35611m23541m16412l31961
5408C0127902l58686k45600l63462k06848k52379j94711k19705j65365r1402j78020
5398B7851724j11697m1298o0763m8171M7405O1106J34950L2853J32213K12771
5388B8211093J63468J74377J37693J22918J23948M0517j9830q34M0779P2389k1104
5377B9045414M1804k9943O2880j02490P9561k04370n5396p2964k42698j66231
5367B8355567j56041k14844r2855j43557r4384K2207k8582j4961M9957j514P7200
5356B7758193L8013L0061O3537O9279J26757K32373J59106K56236K85571L11338
5346B9330464L45237L69018L74873K92191L49579K27190K04643k903J17318o7979
$$ plain form
5336 31539631 31474785 31493720 31495110 31553256 31640036 31737667 31884830 32078060 32255112 32666514 32952537
5325 32952537 33294745 33902628 34587091 35226083 36101169 37048237 38066090 39256152 40577055
5316 40577055 41797501 43283053 44820550 46404651 48070520 49763436 51570248 53412751
5308 53412751 55437638 57590324 59950663 62695070 65822167 69570602 73835176 78544459
5300 78544459 83528592 88595021 93513696 97951204 101699640 104534907 106198526 106191613 104872383
5291 104872383 102371162 99004086 95347273 91986788 88818177 86086667 83808610 81803712
5283 81803712 80211992 78720058 77468513 76185327 74997498 73718484 72433216 71075576
5275 71075576 69734843 68318718 66843210 65291593 63820517 62322994 60916726 59556367
$$ packed form
5336C1539631o4846J8935J390N8146Q6780R7631J47163J93230J77052M11402K86023
5325C2952537L42208O07883O84463O38992Q75086R47068J017853J190062J320903
5316D0577055J220446J485552J537497J584101J665869J692916J806812J842503
5308E3412751K024887K152686K360339K744407L127097L748435M264574M709283
5300G8544459M984133N066429M918675M437508L748436K835267J663619o913j319230
5291A04872383k501221l367076l656813l360485l168611k731510k278057k004898
5283H1803712j591720j491934j251545j283186j187829j279014j285268j357640
5275G1075576j340733j416125j475508j551617j471076j497523j406268j360359
$$ plain form
5267 59556367 58423773 57259467 56277895 55555992 54980269 54486951 54202784 54151958 54153707 54411520
5257 54411520 54845134 55490579 56258855 57254048 58500348 59995311 61741065 63725362 65965974
5248 65965974 68315060 70806722 73538899 76113409 78842933 81573298 84451445 87361947
5240 87361947 90372884 93596356 96901230 100554193 104355885 108217350 112252418 116301928
5232 116301928 120317377 124270346 128115900 131940460 135626826 139458390 143442064 147769461
5224 147769461 152199340 156650337 160967272 164841208 168044426 170227052 171285753 170948958
5216 170948958 168990562 165433447 160227447 153568278 145920307 137596409 129179404 120865554
5208 120865554 113193468 106211138 99976075 94646336 89878380 85967289 82532963 79704042
$$ packed form
5267E9556367j132594j164306r81572p21903n75723m93318k84167n0826J749K57813
5257E4411520M33614O45445P68276R95193J246300J494963J745754J984297K240612
5248F5965974K349086K491662K732177K574510K729524K730365K878147K910502
5240H7361947L010937L223472L304874L652963L801692L861465M035068M049510
5232A16301928M015449L952969L845554L824560L686366L831564L983674M327397
5224A47769461M429879M450997M316935L873936L203218K182626J058701l36795
5216A70948958j958396l557115n206000o659169p647971q323898q417005q313850
5208A20865554p672086o982330o235063n329739m767956l911091l434326k828921
$$ plain form
5200 79704042 77379002 75369013 73731903 72243315 70962689 69711507 68540446 67297613
5192 67297613 66069596 64828292 63821381 62891925 62154880 61611913 61288343 61384351 61622120
5183 61622120 62152322 62859125 63740420 64614367 65517736 66293503 66875564 67112249 67085732 66631828
5173 66631828 65924423 64841497 63574664 62065965 60573365 59124348 57562644 56159488
5165 56159488 54838232 53542915 52260571 51143973 50205232 49268135 48452450 47758964 47139616
5156 47139616 46619092 46270063 45996956 45751883 45561199 45389366 45214201 45022504 44876708
5147 44876708 44599300 44463185 44123902 43870124 43795278 43654437 43592399 43719442 43775688 43873867
5137 43873867 43946108 44031250 44024618 43981916 43839186 43563185 43273271 42871667 42430556 42022188
$$ packed form
5200G9704042k325040k009989j637110j488588j280626j251182j171061j242833
5192F7297613j228017j241304j006911r29456p37045n42967l23570R6008K37769
5183F1622120N30202P06803Q81295Q73947R03369P75767N82061K36685k6517m53904
5173F6631828p07405j082926j266833j508699j492600j449017j561704j403156
5165E6159488j321256j295317j282344j116598r38741r37097q15685o93486o19348
5156D7139616n20524l49029k73107k45073j90684j71833j75165j91697j45796
5147D4876708k77408j36115l39283k53778p4846j40841o2038J27043N6246R8179
5137D3873867P2241Q5142o632m2702j42730k76001k89914m01604m41111m08368
$$ plain form
5127 42022188 41589959 41314837 41056411 40830786 40688994 40579916 40469675 40449070 40432481 40469623
5117 40469623 40440543 40268127 40354320 40195348 40039830 39942137 39833648 39732901 39635557 39576260
5107 39576260 39524265 39533152 39500134 39592721 39730666 40097916 40539292 41232997 42084110 43114554
5097 43114554 44313529 45802189 47329795 49015904 50714376 52508775 54298590 56098459
5089 56098459 57760672 59312405 60685917 61857535 62689926 63241301 63455356 63263413 62611004
5080 62611004 61393873 59730693 57626307 55340691 52847187 50399940 48214272 46232480
5072 46232480 44407892 42770048 41291754 39903431 38692981 37613790 36719327 35851534
5064 35851534 35078891 34461319 33924552 33422533 32942108 32611603 32237199 32024293 31831045
$$ packed form
5127D2022188m32229k75122k58426k25625j41792j09078j10241k0605j6589L7142
5117D0469623k9080j72416Q6193j58972j55518r7693j08489j00747r7344n9297
5107C9576260n1995Q887l3018R2587J37945L67250M41376O93705Q51113J030444
5097D3114554J198975J488660J527606J686109J698472J794399J789815J799869
5089E6098459J662213J551733J373512J171618Q32391N51375K14055j91943o52409
5080F2611004j217131j663180k104386k285616k493504k447247k185668j981792
5072D6232480j824588j637844j478294j388323j210450j079191q94463q67793
5064C5851534p72643o17572n36767n02019m80425l30505l74404k12906j93248
$$ plain form
5055 31831045 31732217 31663381 31783405 31839248 32059036 32236861 32398985 32624936 32741011 32847694
5045 32847694 32735942 32565444 32234342 31815786 31412957 30871171 30340307 29921533 29415693
5036 29415693 28975449 28602434 28207146 28042388 27929642 27739785 27828713 27822393 27875416 27905536
5026 27905536 27971629 27919239 27935427 27806880 27706815 27580492 27458990 27388680 27312481 27358509
5016 27358509 27389111 27505046 27592814 27815506 28090372 28447708 28852869 29286565 29699680 30299142
5006 30299142 30972732 31754723 32515786 33394923 34307740 35253230 36273931 37356470 38404869
4997 38404869 39573417 40794328 42072878 43320562 44718598 46130244 47611273 49087538
4989 49087538 50632873 52151259 53621703 55012246 56307378 57364877 58302501 58985693
$$ packed form
5055C1831045r8828o8836J20024N5843K19788J77825J62124K25951J16075J06683
5045C2847694j11752j70498l31102m18556m02829n41786n30864m18774n05840
5036B9415693m40244l73015l95288j64758j12746j89857Q8928o320N3023L0120
5026B7905536O6093n2390J6188j28547j00065j26323j21502p0310p6199M6028
5016B7358509L0602J15935Q7768K22692K74866L57336M05161M33696M13115N99462
5006C0299142O73590P81991P61063Q79137R12817R45490J020701J082539J048399
4997C8404869J168548J220911J278550J247684J398036J411646J481029J476265
4989D9087538J545335J518386J470444J390543J295132J057499R37624O83192
$$ plain form
4981 58985693 59444412 59603047 59530307 59208354 58680167 58045080 57437595 56717369 55940556 55225793
4971 55225793 54511810 53687807 52864684 52131980 51386148 50624499 49829031 48973366 48073004
4962 48073004 47136895 46266476 45240822 44261028 43193972 42191309 41217827 40174605 39077914
4953 39077914 38059131 36953006 35936803 34788482 33766838 32684962 31679768 30584724
4945 30584724 29539451 28456246 27476834 26527903 25551799 24554915 23659746 22746313 21876273
4936 21876273 21121966 20204491 19468980 18756372 18016963 17283436 16591290 15982640 15344824
4927 15344824 14694511 14133456 13518270 13031263 12564865 11977627 11595193 11179023 10799131
4918 10799131 10404282 10038944 9688544 9452591 9218477 8864504 8653650 8340618 8225241
$$ packed form
4981E8985693M58719J58635p2740l21953n28187o35087o07485p20226p76813p14763
4971E5225793p13983q24003q23123p32704p45832p61649p95468q55665r00362
4962D8073004r36109q70419j025654r79794j067056j002663r73482j043222j096691
4953C9077914j018783j106125j016203j148321j021644j081876j005194j095044
4945C0584724j045273j083205r79412r48931r76104r96884q95169r13433q70040
4936B1876273p54307r17475p35511p12608p39409p33527o92146o08650o37816
4927A5344824o50313n61055o15186m87007m66398n87238l82434m16170l79892
4918A0799131l94849l65338l50400k35953k34114l53973k10854l13032j15377
$$ plain form
4909 8225241 7999980 7808982 7614074 7364011 7263662 7059891 6978167 6789030 6728029 6610831
4899 6610831 6496686 6266387 6128030 6061313 5953506 5864788 5651561 5575309 5414768 5331696
4889 5331696 5267600 5087923 4960887 4960607 4813814 4723191 4606859 4482061 4421302 4437737 4329366
4878 4329366 4322592 4205021 4118181 4140830 4048375 3992423 3962231 3926753 3850438 3873417 3874838 3776280
4866 3776280 3799444 3796522 3739797 3758090 3672610 3684291 3622385 3581749 3632778 3569323 3628926 3557328
4854 3557328 3509080 3478414 3452637 3375653 3328332 3310795 3206064 3241041 3232141 3201841 3165511
4843 3165511 3121378 3044632 3122636 3019017 3031332 2986828 2974408 2993547 2933443 2974464 2883417
4832 2883417 2887251 2872084 2868044 2892549 2909307 2898522 2844260 2845617 2907763 2818616 2878033 2891465
$$ packed form
4909H225241k25261j90998j94908k50063j00349k03771q1724j89137o1001j17198
4899F610831j14145k30299j38357o6717j07807q8718k13227p6252j60541q3072
4889E331696o4096j79677j27036k80j46793r0623j16332j24798o0759J6435j08371
4878D329366o774j17571q6840K2649r2455n5952l0192l5478p6315K2979J421r8558
4866C776280K3164k922n6725J8293q5480J1681o1906m0636N1029o3455N9603p1598
4854C557328m8248l0666k5777p6984m7321j7537j04731L4977q900l0300l6330
4843C165511m4133p6746P8004j03619J2315m4504j2420J9139o0104M1021r1047
4832B883417L834j5167m040K4505J6758j0785n4262J357O2146q9147N9417J3432
$$ plain form
4820 2891465 2882794 2841625 2845357 2746827 2768757 2822582 2739504 2771401 2755357 2694105 2629492 2713150
4808 2713150 2704853 2712100 2646493 2659826 2611350 2593928 2583831 2645735 2574064 2542993 2605487 2603213
4796 2603213 2608466 2651069 2620811 2596487 2594260 2585040 2625653 2624221 2658975 2658366 2733386 2708755 2708745
4783 2708745 2695290 2727482 2702183 2734879 2769758 2819065 2791353 2750206 2827034 2841861 2896572
4772 2896572 2880269 2874255 2913876 2853609 2776821 2807154 2834410 2786267 2783190 2775531 2741806 2797282
4760 2797282 2784169 2756326 2733513 2671713 2657954 2676842 2648127 2610284 2636747 2569634 2609240
4749 2609240 2521649 2536847 2512569 2542282 2498814 2487636 2468992 2422591 2448896 2463963 2395190
4738 2395190 2428649 2472807 2388707 2440959 2429450 2475794 2462979 2495997 2484633 2446325 2470060
$$ packed form
4820B891465q671m1169L732r8530K1930N3825q3078L1897j6044o1252o4613Q3658
4808B713150q297P247o5607J3333m8476j7422j0097O1904p1671l1071O2494k274
4796B603213N253M2603l0258k4324k227r220M0613j432L4754o09P5020k4631j0
4783B708745j3455L2192k5299L2696L4879M9307k7712m1147P6828J4827N4711
4772B896572j6303o014L9621o0267p6788L0333K7256m8143l077p659l3725N5476
4760B797282j3113k7843k2813o1800j3759J8888k8715l7843K6463o7113L9606
4749B609240q7591J5198k4278K9713m3468j1178j8644m6401K6305J5067o8773
4738B395190L3459M4158q4100N2252j1509M6344j2815L3018j1364l8308K3735
$$ plain form
4727 2470060 2493733 2407866 2499774 2497231 2412904 2531514 2581171 2559350 2561516 2546074 2503705 2599248
4715 2599248 2565279 2561190 2600214 2571479 2568391 2644709 2582337 2650142 2581504 2634745 2666375 2677568
4703 2677568 2628966 2664790 2681220 2620357 2721940 2701500 2760276 2655431 2645892 2648569 2722994
4692 2722994 2700717 2617461 2670152 2638215 2614618 2617713 2620054 2652070 2584133 2546319 2546962 2570206
4680 2570206 2573029 2538290 2538916 2545283 2555900 2499171 2569296 2551718 2620289 2561116 2684132 2612136
4668 2612136 2663786 2661436 2758703 2645557 2740453 2733435 2779721 2829990 2869355 2908043 2997453 2936005
4656 2936005 2993036 3024936 2931893 3044703 3013073 2945668 3067546 2943569 2986969 2965765 2962476
4645 2962476 2919792 2981182 2910727 2988107 2996693 3026325 2969597 3072397 3072989 3155807 3159909 3215687
$$ packed form
4727B470060K3673q5867R1908k543q4327J18610M9657k1821K166j5442m2369R5543
4715B599248l3969m089L9024k8735l088P6318o2372O7805o8638N3241L1630J1193
4703B677568m8602L5824J6430o0863J01583k0440N8776j04845r539K677P4425
4692B722994k2277q3256N2691l1937k3597L095K341L2016o7937l7814O43K3244
4680B570206K823l4739O26O367J0617n6729P0125j7578O8571n9173J23016p1996
4668B612136N1650k350R7267j13146R4896p018M6286N0269L9365L8688Q9410o1448
4656B936005N7031L1900r3043J12810l1630o7405J21878j23977M3400k1204l289
4645B962476m2684O1390p0455P7380Q586K9632n6728J02800N92Q2818M102N5778
$$ plain form
4633 3215687 3229708 3199611 3264167 3278108 3261747 3338757 3337621 3375455 3294918 3331263 3306216 3314936
4621 3314936 3273317 3309685 3322807 3363920 3327615 3365982 3347187 3364876 3393796 3385324 3378946 3467163
4609 3467163 3458108 3457384 3472637 3532644 3483730 3568253 3585281 3679359 3664812 3689964 3726708 3645795
4597 3645795 3681151 3767501 3839451 3848242 3884409 3880020 3926732 3931887 4026486 4036874 4074563 4199009
4585 4199009 4173697 4249509 4248977 4196057 4319041 4378018 4457433 4473783 4483391 4494612 4538264 4552470
4573 4552470 4552697 4724761 4732068 4815579 4950076 4931445 5024599 5140564 5126024 5252386 5319256
4562 5319256 5435076 5521716 5614571 5744833 5814364 5927412 5989326 6150997 6176557 6360919
4552 6360919 6491205 6631258 6710268 6815563 6959233 7075642 7274702 7311288 7475765 7544146
$$ packed form
4633C215687J4021l0097O4556J3941j6361P7010j136L7834q0537L6345k5047Q720
4621C314936m1619L6368J3122M1113l6305L8367j8795J7689K8920q472o378Q8217
4609C467163r055p24J5253O0007m8914Q4523J7028R4078j4547K5152L6744q0913
4597C645795L5356Q6350P1950Q791L6167m389M6712N155R4599J0388L7689J24446
4585D199009k5312P5812n32n2920J22984N8977P9415J6350R608J1221M3652J4206
4573D552470K27J72064P307Q3511J34497j8631R3154J15965j4540J26362O6870
4562E319256J15820Q6640R2855J30262O9531J13048O1914J61671K5560J84362
4552F360919J30286J40053P9010J05295J43670J16409J99060L6586J64477O8381
$$ plain form
4542 7544146 7694174 7809987 7907775 8091991 8237008 8314229 8495094 8541175 8651581 8848234
4532 8848234 8956245 9063155 9162387 9237925 9413766 9505026 9625401 9707526 9867179 10016536
4522 10016536 10126892 10310308 10482103 10759112 10819562 10979294 11251091 11464100 11668572 11955460
4512 11955460 12109561 12388252 12671029 12879948 13205882 13534179 13799989 14137475 14459840
4503 14459840 14780869 15125995 15427933 15714384 16058817 16437490 16744953 17009618 17245320
4494 17245320 17638316 17935706 18169072 18548161 18762642 19032481 19445993 19594136 19891772
4485 19891772 20165403 20418515 20647755 20798834 21009475 21283683 21493997 21724879 21954877
4476 21954877 22124234 22334728 22567929 22803398 23073500 23251831 23437499 23722453 23891716
$$ packed form
4542G544146J50028J15813R7788J84216J45017P7221J80865M6081J10406J96653
4532H848234J08011J06910R9232P5538J75841R1260J20375Q2125J59653J49357
4522A0016536J10356J83416J71795K77009O0450J59732K71797K13009K04472K86888
4512A1955460J54101K78691K82777K08919L25934L28297K65810L37486L22365
4503A4459840L21029L45126L01938K86451L44433L78673L07463K64665K35702
4494A7245320L92996K97390K33366L79089K14481K69839M13512J48143K97636
4485A9891772K73631K53112K29240J51079K10641K74208K10314K30882K29998
4476B1954877J69357K10494K33201K35469K70102J78331J85668K84954J69263
$$ plain form
4467 23891716 24188345 24536624 24794299 25084944 25424505 25720500 26112118 26525269 26860089
4458 26860089 27264450 27578940 28108802 28428290 28800366 29318662 29700778 30114834 30461225
4449 30461225 30886486 31245625 31616769 32036878 32473490 32953490 33362331 33746937 34165422
4440 34165422 34570409 35002104 35371437 35732267 36147881 36513206 36796457 37075842 37359379
4431 37359379 37580398 37820668 37987271 38221250 38318863 38396822 38484447 38546458 38543191 38458501 38392931
4420 38392931 38237429 38104738 37816679 37603741 37288552 37013928 36623133 36345227 35984590
4411 35984590 35687501 35439376 35130805 34998302 34683058 34553385 34411773 34388424 34338927 34345637
4401 34345637 34325938 34473073 34574503 34843540 35092075 35455060 35809440 36357173 36990384 37597617
$$ packed form
4467B3891716K96629L48279K57675K90645L39561K95995L91618M13151L34820
4458B6860089M04361L14490N29862L19488L72076N18296L82116M14056L46391
4449C0461225M25261L59139L71144M20109M36612M80000M08841L84606M18485
4440C4165422M04987M31695L69333L60830M15614L65325K83251K79385K83537
4431C7359379K21019K40270J66603K33979R7613P7959Q7625O2011l267q4690o5570
4420C8392931j55502j32691k88059k12938l15189k74624l90795k77906l60637
4411C5984590k97089k48125l08571j32503l15244j29673j41612k3349m9497O710
4401C4345637j9699J47135J01430K69037K48535L62985L54380N47733O33211O07233
$$ plain form
4391 37597617 38423413 39195398 40186371 41079916 42135080 43187928 44294525 45411882 46585468
4382 46585468 47719807 48860895 49910035 51010627 52055822 53064894 54167419 55135303
4374 55135303 56185384 57146493 58109995 59235805 60372856 61450217 62622159 63862650
4366 63862650 65131115 66273533 67601299 68714106 69884372 71009479 72012366 72972639
4358 72972639 73712588 74346950 74894174 75365344 75713313 75970129 76144280 76349793 76539888
4349 76539888 76789270 76886572 77047758 77233554 77303623 77301544 77256777 77333286 77270082 77312730 77518581
4338 77518581 77764534 78266733 78977786 79818825 80944129 82442978 84137272 86196044 88536798
4329 88536798 91205660 94245885 97610771 101314993 105347077 109694550 114545074 119537385
$$ packed form
4391C7597617Q25796P71985R90973Q93545J055164J052848J106597J117357J173586
4382D6585468J134339J141088J049140J100592J045195J009072J102525R67884
4374E5135303J050081R61109R63502J125810J137051J077361J171942J240491
4366F3862650J268465J142418J327766J112807J170266J125107J002887R60273
4358G2972639P39949O34362N47224M71170L47969K56816J74151K05513J90095
4349G6539888K49382R7302J61186J85796P0069k079m4767P6509o3204M2648K05851
4338G7518581K45953N02199P11053Q41039J125304J498849J694294K058772K340754
4329H8536798K668862L040225L364886L704222M032084M347473M850524M992311
$$ plain form
4321 119537385 124962315 130637498 136593398 142814518 149151119 155659611 162343874 169037071
4313 169037071 175832095 182534362 189378077 196008461 202688971 209229216 215640096 221935122
4305 221935122 228054414 233852351 239314711 244198894 248538607 252167163 254976810 257065300
4297 257065300 258214694 258515825 258033326 256835150 254919538 252476755 249568479 246141663
4289 246141663 242245898 238012472 233230235 228077179 222487775 216524778 210289032 203711023
4281 203711023 196986866 190136635 183354322 176535625 169889480 163488830 157380717 151510666
4273 151510666 145878252 140604225 135502213 130736654 126185402 122047237 118301614 114824047
4265 114824047 111701531 108735049 106079730 103719702 101434870 99421615 97451937 95676978
$$ packed form
4321A19537385N424930N675183N955900O221120O336601O508492O684263O693197
4313A69037071O795024O702267O843715O630384O680510O540245O410880O295026
4305B21935122O119292N797937N462360M884183M339713L628556K809647K088490
4297B57065300J149394L01131m82499j198176j915612k442783k908276l426816
4289B46141663l895765m233426m782237n153056n589404n962997o235746o578009
4281B03711023o724157o850231o782313o818697o646145o400650o108113n870051
4273A51510666n632414n274027n102012m765559m551252m138165l745623l477567
4265A14824047l122516k966482k655319k360028k284832k013255j969678j774959
$$ plain form
4257 95676978 94020290 92428429 91054086 89844017 88618684 87635565 86750247 85702411
4249 85702411 84851701 84021308 83234124 82412039 81444534 80374020 79259978 78111030 76913153
4240 76913153 75809387 74911331 74124851 73363115 72582437 71983954 71311903 70726130 70295330
4231 70295330 69757385 69359802 69045741 68839205 68768651 68768048 69042971 69315734 69832529 70401473
4221 70401473 71106867 71867236 72751148 73663099 74648534 75690717 76743229 77948888 79211074
4212 79211074 80722957 82365464 84120999 86082254 88138140 90286852 92420484 94793694
4204 94793694 97090307 99272867 101584766 103764670 105982117 108088518 110081481 111955926
4196 111955926 113620790 115079877 116440250 117464392 118293943 118923418 119095680 119237384 119015488
$$ packed form
4257I5676978j656688j591861j374343j210069j225333r83119q85318j047836
4249H5702411q50710q30393p87184q22085r67505j070514j114042j148948j197877
4240G6913153j103766q98056p86480p61736p80678n98483o72051n85773m30800
4231G0295330n37945l97583l14061k06536p0554o03K74923K72763N16795N68944
4221G0401473P05394P60369Q83912R11951R85435J042183J052512J205659J262186
4212G9211074J511883J642507J755535J961255K055886K148712K133632K373210
4204I4793694K296613K182560K311899K179904K217447K106401J992963J874445
4196A11955926J664864J459087J360373J024142Q29551O29475J72262J41704k21896
$$ plain form
4187 119015488 118592444 118021455 117181522 116206364 115268211 114148848 112928541 111741634 110583117
4178 110583117 109468989 108448144 107563477 106692916 106099294 105617537 105263024 105169324 105140675
4169 105140675 105287160 105635897 105975474 106469381 106955521 107509315 108086572 108602534 109035803
4160 109035803 109335284 109551226 109380600 109053071 108590771 107900357 106803704 105537926 104092766
4151 104092766 102530009 100681285 98831756 96991130 95023206 92969275 91050008 89054235
4143 89054235 87042857 84959732 82787625 80606371 78265506 75914161 73482438 70899424
4135 70899424 68314386 65657453 62991632 60192407 57429262 54685905 52006065 49392319
4127 49392319 46800170 44342814 42026415 39768260 37769021 35903874 34195179 32600714
$$ packed form
4187A19015488m23044n70989q39933r75158r38153j119363j220307j186907j158517
4178A10583117j114128j020845q84667q70561n93622m81757l54513r3700k8649
4169A05140675J46485L48737L39577M93907M86140N53794N77257N15962M33269
4160A09035803K99481K15942j70626l27529m62300o90414j096653j265778j445160
4151A04092766j562757j848724j849529j840626j967924k053931j919267j995773
4143H9054235k011378k083125k172107k181254k340865k351345k431723k583014
4135G0899424k585038k656933k665821k799225k763145k743357k679840k613746
4127D9392319k592149k457356k316399k258155j999239j865147j708695j594465
$$ plain form
4119 32600714 31269768 29964730 28916692 27887917 27045173 26285659 25607054 24980068 24471450
4110 24471450 24022937 23520043 23206943 22925034 22683989 22387430 22175277 21958453 21754328
4101 21754328 21587582 21391237 21139300 20967928 20798986 20463407 20256540 20001398 19797767
4092 19797767 19582669 19267354 19034340 18775985 18435106 18170708 17874091 17455853 17027135
4083 17027135 16668751 16303929 15928652 15549893 15180686 14798456 14536385 14215994 14023229
4074 14023229 13765865 13552550 13385431 13279902 13158688 12970043 12919882 12957411 12874363 12900730
4064 12900730 12903772 12943046 12943774 12990569 13035815 13107766 13160649 13201627 13255746 13335821 13393555 13435293
4052 13435293 13459126 13636756 13706825 13691618 13856300 13927635 13988418 14047138 14215777 14272403 14493869
$$ packed form
4119C2600714j330946j305038j048038j028775q42744p59514o78605o26986n08618
4110B4471450m48513n02894l13100k81909k41045k96559k12153k16824k04125
4101B1754328j66746j96345k51937j71372j68942l35579k06867k55142k03631
4092A9797767k15098l15315k33014k58355l40879k64398k96617m18238m28718
4083A7027135l58384l64822l75277l78759l69207l82230k62071l20391j92765
4074A4023229k57364k13315j67119j05529j21214j88645n0161L7529q3048K6367
4064A2900730L042L9274P28M6795M5246P1951N2883M0978N4119Q0075N7734M1738
4052A3435293K3833J77630P0069j5207J64682P1335O0783N8720J68639N6626K21466
$$ plain form
4041 14493869 14613746 14791108 14949659 15163806 15395379 15569035 15768868 15990168 16314206
4032 16314206 16474898 16713716 16953516 17249244 17524726 17817539 18198937 18526317 18938659
4023 18938659 19342659 19751850 20192478 20684400 21223631 21807078 22412979 23094123 23862268
4014 23862268 24592928 25355030 26191686 27138923 28050535 29065513 30025658 31109086 32171401
4005 32171401 33202277 34248441 35209641 36192749 37147118 38219378 39257570 40403561 41571480
3996 41571480 42902722 44385222 45935400 47613157 49572523 51709343 54077442 56705090
3988 56705090 59664567 62865811 66400764 70403372 74771829 79728118 85312515 91554688
3980 91554688 98471680 106379988 115070241 124827225 135588389 147356530 159968109 173425930
$$ packed form
4041A4493869J19877J77362J58551K14147K31573J73656J99833K21300L24038
4032A6314206J60692K38818K39800K95728K75482K92813L81398L27380M12342
4023A8938659M04000M09191M40628M91922N39231N83447O05901O81144P68145
4014B3862268P30660P62102Q36656R47237R11612J014978R60145J083428J062315
4005C2171401J030876J046164R61200R83108R54369J072260J038192J145991J167919
3996D1571480J331242J482500J550178J677757J959366K136820K368099K627648
3988E6705090K959477L201244L534953M002608M368457M956289N584397O242173
3980I1554688O916992P908308Q690253R756984J0761164J1768141J2611579J3457821
$$ plain form
3972 173425930 187780764 203255460 220003810 238012968 257278239 277589568 298711002
3965 298711002 320157288 341314458 361586510 380213299 396398309 409334719 418186873
3958 418186873 422538576 422644320 418662766 411415841 401394056 389405222 375747499 360567051
3950 360567051 344222582 326954293 309422026 291884983 274579333 257742396 241524621
3943 241524621 226136021 211417594 197358808 183793006 170967815 158487776 146711287
3936 146711287 135442919 124866652 115075773 106088899 97713013 90128002 83136672 76907657
3928 76907657 71248079 66110052 61400263 57219230 53375267 49969146 46862242 44017462
3920 44017462 41445996 39186885 37075560 35049656 33333139 31619869 30227249 28750849
$$ packed form
3972A73425930J4354834J5474696J6748350J8009158J9265271K0311329K1121434
3965B98711002K1446286K1157170K0272052J8626789J6185010J2936410Q852154
3958D18186873M351703J05744l981554p246925j0021785j1988834j3657723j5180448
3950C60567051j6344469j7268289j7532267j7537043j7305650j6836937j6217775
3943B41524621j5388600j4718427j4058786j3565802j2825191j2480039j1776489
3936A46711287j1268368j0576267r790879q986874q375886p585011o991330o229015
3928G6907657n659578n138027m709789m181033l843963l406121l106904k844780
3920D4017462k571466k259111k111325k025904j716517j713270j392620j476400
$$ plain form
3912 28750849 27485061 26242886 25178336 24117667 23058776 22173185 21313966 20559487 19747915
3903 19747915 19049030 18346541 17660693 17126803 16536604 15994940 15499812 15008467 14592362
3894 14592362 14137999 13737729 13336589 12905795 12595754 12202663 11831879 11564595 11190803
3885 11190803 10819329 10549290 10204090 9886514 9511824 9222857 8983804 8759619 8459118
3876 8459118 8254937 8050242 7774412 7568158 7415727 7218385 7038076 6954491 6746785 6706412
3866 6706412 6589994 6442682 6320365 6274135 6215865 6114179 5998621 5941668 5813945 5869217
3856 5869217 5731175 5646359 5678505 5621493 5612826 5568648 5587212 5598349 5658120 5691082 5675383
3845 5675383 5710105 5705730 5681807 5514861 5512293 5494679 5343624 5216582 5025959 4942869 4797415
$$ packed form
3912B8750849j265788j242175j064550j060669j058891q85591q59219p54479q11572
3903A9747915o98885p02489o85848n33890n90199n41664m95128m91345m16105
3894A4592362m54363m00270m01140m30794l10041l93091l70784k67284l73792
3885A1190803l71474k70039l45200l17576l74690k88967k39053k24185l00501
3876H459118k04181k04695k75830k06254j52431j97342j80309q3585k07706m0373
3866F706412j16418j47312j22317m6230n8270j01686j15558n6953j27723N5272
3856E869217j38042q4816L2146n7012q667m4178J8564J1137N9771L2962j5699
3845E675383L4722m375k3923j66946k568j7614j51055j27042j90623q3090j45454
$$ plain form
3834 4797415 4658419 4523601 4413964 4352857 4241668 4198392 4196800 4161198 4217902 4228352 4345696
3823 4345696 4276095 4330831 4373702 4359018 4419032 4375593 4294135 4295946 4150631 4104160 3896903
3812 3896903 3822196 3714976 3587654 3437732 3444332 3373231 3273947 3174178 3030691 3056916 2986292
3801 2986292 2862021 2871182 2788506 2711994 2641988 2551449 2541282 2521022 2475369 2459872 2376621
3790 2376621 2345398 2304168 2203523 2174733 2128802 2084955 2056621 1901278 1855740 1804821 1718266
3779 1718266 1668506 1672745 1561938 1570897 1465885 1421166 1423795 1379730 1395021 1296387 1364564 1364911
3767 1364911 1297561 1236821 1221902 1285516 1249820 1201618 1221295 1219590 1224845 1174619 1199226 1102240
3755 1102240 1157243 1108936 1104226 1042876 1076022 974229 1139480 1110730 1041210 1120603 966809
$$ packed form
3834D797415j38996j34818j09637o1107j11189m3276j592l5602N6704J0450J17344
3823D345696o9601N4736M2871j4684O0014m3439q1458J811j45315m6471k07257
3812C896903p4707j07220j27322j49922O600p1101r9284r9769j43487K6225p0624
3801B986292j24271R161q2676p6512p0006r0539j0167k0260m5653j5497q3251
3790B376621l1223m1230j00645k8790m5931m3847k8334j55343m5538n0919q6555
3779A718266m9760M239j10807Q959j05012m4719K629m4065J5291r8634O8177L47
3767A364911o7350o0740j4919O3614l5696m8202J9677j705N255n0226K4607r6986
3755A102240N5003m8307m710o1350L3146j01793J65251k8750o9520P9393j53794
$$ plain form
3744 966809 971683 1076172 1001693 1013526 1015373 1048365 1063719 1074650 1021497 1092750 1125602 1208509
3732 1208509 1225832 1252648 1339739 1448029 1451141 1470007 1558283 1590163 1669180 1696996 1840916
3721 1840916 1898397 1979862 1953413 2053602 2159417 2308564 2296977 2368823 2454031 2510523 2546186
3710 2546186 2528430 2484110 2457597 2377127 2377654 2245534 2148928 2101035 2028824 1920129 1756569
3699 1756569 1720614 1628032 1552170 1465405 1422270 1327297 1222512 1155058 1086296 976529 932453
3688 932453 842889 746443 768081 761085 602251 638911 562494 496588 551576 484087 423961 466378
3676 466378 398223 426675 445500 365215 378202 395989 405036 330940 203380 329008 246298
3665 246298 295106 312488 290349 256977 237610 205853 210215 227429 231523 227655 214019 154338
$$ packed form
3744I66809M874J04489p4479J1833J847L2992J5354J0931n3153P1253L2852Q2907
3732A208509J7323K6816Q7091J08290L112J8866Q8276L1880P9017K7816J43920
3721A840916N7481Q1465k6449J00189J05815J49147j1587P1846Q5208N6492L5663
3710B546186j7756m4320k6513q0470N27j32120r6606m7893p2211j08695j63560
3699A756569l5955r2582p5862q6765m3135r4973j04785o7454o8762j09767m4076
3688I32453q9564r6446K1638o996j58834L6660p6417o5906N4988o7489o0126M2417
3676D66378o8155K8452J8825q0285J2987J7787R047p4096j27560J25628q2710
3665B46298M8808J7382k2139l3372j9367l1757M362J7214M094l868j3636n9681
$$ plain form
3653 154338 195149 142314 107986 117073 103374 121432 85013 29696 63577 62270 108323 38823
3641 38823 45786 87524 29181 61614 31840 82402 3001 26124 70901 27772 6041 51916
3629 51916 -901 -66201 15124 32472 -6218 636 15707 -50537 -3316 -26828 -13200 -46138
3617 -46138 -35805 -17822 -38881 -13057 15552 -82272 -19381 -34240 -70740 -17268 -528 -122831
3605 -122831 -95612 -36413 -41679 -49464 -79043 -69679 -63457 -39464 -75913 -49936 -67360 -35233
3593 -35233 -58076 -109431 12504 -63125 -30760 -161985 -70550 -63466 -153735 -102942 -63631 -46929
3581 -46929 -91115 -94674 -101594 -87963 -31933 -38458 -19771 -26307 -37674 -86526 -112519 -74093 -65046
3568 -65046 -133009 -52602 -115691 -131094 -85459 -72086 -71734 -31711 -115355 -56596 -115429 -61882
$$ packed form
3653A54338M0811n2835l4328R087j3699J8058l6419n5317L3881j307M6053o9500
3641C8823O963M1738n8343L2433k9774N0562p9401K3123M4777m3129k1731M5875
3629E1916n2817o5300Q1325J7348l8690O854J5071o6244M7221k3512J3628l2938
3617d6138J0333J7983k1059K5824K8609r7824O2891j4859l6500N3472J6740j22303
3605a22831K7219N9199n266p785k9579R364O222K3993l6449K5977j7424L2127
3593c5233k2843n1355J21935p5629L2365j31225R1435P084r0269N0793L9311J6702
3581d6929m4186l559o920J3631N6030o525J8687o536j1367m8852k5993L8426R047
3568f5046o7963Q0407o3089j5403M5635J3373L52M0023q3644N8759n8833N3547
$$ plain form
3556 -61882 -81530 -54055 -51905 -112068 -108022 -102395 -62381 -32072 -73144 -9295 -21306 -7886
3544 -7886 -36242 34764 2699 -48239 -22212 -10513 20131 20547 -37112 1727 -15873 -11898 -59696
3531 -59696 -53117 -1412 -42625 -152959 -115764 -81391 -102212 -132789 -122648 -185602 -154292 -147346
3519 -147346 -175166 -209963 -132901 -155047 -155640 -132237 -200472 -201470 -158685 -118545 -152957 -205593
3507 -205593 -98696 -174633 -129814 -194943 -166488 -167061 -165741 -181017 -197807 -167504 -141641 -226271
3495 -226271 -198770 -155738 -173714 -199173 -192921 -195688 -150040 -190847 -201855 -182440 -226918 -223886
3483 -223886 -135294 -181240 -145049 -175036 -216390 -137223 -163882 -250505 -138740 -205215 -179539
3472 -179539 -205175 -104698 -183884 -151591 -155846 -225589 -174669 -218439 -229649 -252153 -205523 -174042
$$ packed form
3556f1882j9648K7475K150o0163M046N627M0014L0309m1072O3849j2011J3420
3544g886k8356P1006l2065n0938K6027J1699L0644M16n7659L8839j7600L975m7798
3531e9696O579N1705m1213j10334L7195L4373k0821l0577J0141o2954L1310O946
3519a47346k7820l4797P7062k2146n93K3403o8235r98M2785M0140l4412n2636
3507b05593J06897p5937M4819o5129K8455n73J320j5276j6790L0303K5863q4630
3495b26271K7501M3032j7976k5459O252k767M5648m0807j1008J9415m4478L032
3483b23886Q8592m5946L6191k9987m1354P9167k6659q6623J11765o6475K5676
3472a79539k5636J00477p9186L2293m255o9743N0920m3770j1210k2504M6630L1481
$$ plain form
3460 -174042 -159092 -229874 -178889 -227846 -172983 -145390 -148125 -173920 -195496 -166715 -147699 -214880
3448 -214880 -185047 -177739 -197111 -116337 -178146 -191325 -175585 -183496 -173958 -121081 -83231 -138722
3436 -138722 -140983 -174776 -155591 -179159 -157315 -104616 -181414 -109931 -179246 -94631 -151019 -107109
3424 -107109 -89850 -163443 -75438 -145494 -122313 -74415 -149381 -87439 -152500 -94744 -94649 -91178
3412 -91178 -70691 -93549 -38873 -5159 -64207 -78761 -58134 -7202 -2421 -37565 -23484 -48212
3400 -48212 -13688 337 17752 1992 6259 -7743 40815 -9347 17440 -27596 28297 88715
3388 88715 37288 37592 72574 54675 84875 118387 46788 93182 59622 65731 64452 91814 108960
3375 108960 180307 138061 132503 102105 168037 132735 183126 213400 237250 178330 203581 247702
$$ packed form
3460a74042J4950p0782N0985m8957N4863K7593k735k5795k1576K8781J9016o7181
3448b14880K9833P308j9372Q0774o1809j3179J5740p911R538N2877L7850n5491
3436a38722k261l3793J9185k3568K1844N2699p6798P1483o9315Q4615n6388M3910
3424a07109J7259p3593Q8005p0056K3181M7898p4966O1942o5061N7756R5L471
3412i1178K0487k2858N4676L3714n9048j4554K0627N0932M781l5144J4081k4728
3400d8212L4524J4025J7415j5760M267j4002M8558n0162K6787m5036N5893O0418
3388H8715n1427L04L4982j7899L0200L3512p1599M6394l3560O109j279K7362J7146
3375A08960P1347m2246n558l0398O5932l5302N0391L0274K3850n8920K5251M4121
$$ plain form
3363 247702 244192 307669 330924 287069 391490 373785 361344 392046 402256 446301 455792 464061
3351 464061 577042 553029 616070 680911 675546 748032 882288 861692 960815 988218 978400 1040906
3339 1040906 1152634 1221473 1252887 1267692 1409637 1469024 1556900 1703346 1732077 1889926 2007313
3328 2007313 2288861 2490468 2779795 3205767 3751478 4281654 4883148 5694394 6579202 7386754
3318 7386754 8240076 9093247 10340042 12003795 14064339 16569334 19196616 22582506 25058887
3309 25058887 27776482 30310559 32143911 33676795 33461156 31791567 30200979 27020261
3301 27020261 23545684 20545635 17814778 15680666 13540938 11542742 9781642 8520481
3293 8520481 7297709 6231452 5317805 4538116 3896591 3371691 2820082 2523479 2209223
$$ packed form
3363B47702l510O3477K3255m3855J04421j7705j2441L0702J0210M4045R491Q269
3351D64061J12981k4013O3041O4841n365P2486J34256k0596R9123K7403r818O2506
3339A040906J11728O8839L1414J4805J41945N9387Q7876J46446K8731J57849J17387
3328B007313K81548K01607K89327M25972N45711N30176O01494Q11246Q84808Q07552
3318G386754Q53322Q53171J246795J663753K060544K504995K627282L385890K476381
3309B5058887K717595K534077J833352J532884k15639j669589j590588l180718
3301B7020261l474577l000049k730857k134112k139728j998196j761100j261161
3293H520481j222772j066257r13647p79689o41525n24900n51609k96603l14256
$$ plain form
3284 2209223 1981102 1739269 1542164 1348384 1229393 1067146 997310 811892 738647 624917
3274 624917 533678 509959 522400 394828 345846 324109 253288 218462 195918 236937 162950
3263 162950 193757 125885 98969 129694 106691 47793 44290 89897 55826 32133 -10052 -31242
3251 -31242 -5664 -46262 -100848 -70167 -119537 -93842 -162020 -110809 -105351 -107631 -130190 -95589
3239 -95589 -91542 -164281 -123484 -128388 -211499 -171869 -170362 -194621 -140896 -183096 -224266 -197473
3227 -197473 -239268 -207446 -213216 -316176 -220375 -200439 -219203 -240036 -264231 -310562 -279104 -319062
3215 -319062 -306135 -301800 -256979 -298881 -290802 -247836 -348274 -299152 -248652 -331996 -303120 -342650
3203 -342650 -333864 -303612 -364506 -312943 -331417 -270756 -322619 -331077 -369941 -309668 -351833 -330394
$$ packed form
3284B209223k28121k41833j97105j93780j18991j62247o9836j85418p3245j13730
3274F24917r1239k3719J2441j27572m8982k1737p0821l4826k2544M1019p3987
3263A62950L0807o7872k6916L0725k3003n8898l503M5607l4071k3693m2185k1190
3251c1242K5578m0598n4586L0681m9370K5695o8178N1211N458k280k2559L4601
3239i5589M047p2739M0797m904q3111L9630J507k4259N3725m2200m1170K6793
3227a97473m1795L1822n770j02960R5801J9936j8764k0833k4195m6331L1458l9958
3215c19062J2927M335M4821m1902Q079M2966j00438M9122N0500q3344K8876l9530
3203c42650Q786L0252o0894N1563j8474O0661n1863q458l8864O0273m2165K1439
$$ plain form
3191 -330394 -318746 -273517 -327733 -396613 -294728 -308327 -327938 -279432 -322264 -356245 -331984
3180 -331984 -331179 -290249 -279139 -378078 -276231 -295022 -369419 -330768 -337137 -298146 -396220 -386996
3168 -386996 -343331 -292832 -357984 -327179 -332883 -383298 -312413 -363756 -250742 -332826 -337037 -375753
3156 -375753 -298031 -293786 -387606 -375451 -371480 -372800 -356890 -281514 -308257 -301555 -333764 -377406
3144 -377406 -387430 -365717 -403290 -374260 -391034 -412894 -322623 -329794 -380582 -277150 -412704
3133 -412704 -428957 -343804 -339423 -327251 -368965 -381850 -358787 -437765 -356417 -388314 -380728 -386581
3121 -386581 -373361 -405036 -368098 -408010 -329092 -366965 -437535 -343532 -382534 -400423 -356720 -399300
3109 -399300 -435177 -397092 -411985 -346191 -345003 -459366 -429716 -409340 -291606 -334956 -385856
$$ packed form
3191c30394J1648M5229n4216o8880J01885j3599j9611M8506m2832l3981K4261
3180c31984Q05M0930J1110r8939J01847j8791p4397L8651o369L8991r8074R224
3168c86996M3665N0499o5152L0805n704n0415P0885n1343J13014q2084m211l8716
3156c75753P7722M245r3820J2155L971j320J5910P5376k6743O702l2209m3642
3144c77406j0024K1713l7573K9030j6774k1860R0271p171n0788J03432j35554
3133d12704j6253Q5153M381J2172m1714j2885K3063p8978Q1348l1897P586n853
3121c86581J3220l1675L6938l9912P8918l7873p0570R4003l9002j7889M3703m2580
3109c99300l5877L8085j4893O5794J188j14363K9650K0376J17734m3350n0900
$$ plain form
3098 -385856 -338641 -338365 -409816 -378640 -422184 -366869 -379138 -418490 -392007 -382825 -432863 -418700
3086 -418700 -365085 -419601 -358057 -352963 -430453 -299673 -301458 -329979 -322153 -340986 -281663 -305513
3074 -305513 -210458 -179266 -253675 -165733 -230151 -265553 -206459 -301010 -257074 -250281 -331009 -307907
3062 -307907 -352610 -311335 -366672 -336065 -312837 -304559 -366346 -392842 -412901 -402575 -375231 -344501
3050 -344501 -361732 -378499 -400676 -423736 -340660 -465183 -306293 -377852 -432221 -388445 -387258
3039 -387258 -396412 -398537 -431508 -479984 -443919 -412161 -348655 -348015 -416103 -349937 -413261 -391223
3027 -391223 -403898 -394458 -318851 -393723 -470340 -384939 -345029 -425796 -425404 -396078 -309922 -420436
3015 -420436 -392909 -351981 -362867 -417730 -375872 -347237 -356776 -472407 -411230 -494788 -388462
$$ packed form
3098c85856M7215K76p1451L1176m3544N5315j2269l9352K6483R182n0038J4163
3086d18700N3615n4516O1544N094p7490J30780j785k8521P826j8833N9323k3850
3074c05513R5055L1192p4409Q7942o4418l5402N9094r4551M3936O793q0728K3102
3062c07907m4703M1275n5337L0607K3228Q278o1787k6496k0059J0326K7344L0730
3050c44501j7231j6767k2177k3060Q3076j24523J58890p1559n4369M3776J187
3039c87258r154k125l2971m8476L6065L1758O3506O40o8088O6166o3324K2038
3027c91223j2675R440P5607p4872p6617Q5401L9910q0767L92K9326Q6156j10514
3015d20436K7527M0928j0886n4863M1858K8635r539j15631O1177q3558J06326
$$ plain form
3004 -388462 -403051 -464253 -382100 -381940 -395127 -381835 -330372 -366177 -460426 -492027 -433264 -348036
2992 -348036 -417888 -420132 -427204 -439496 -458482 -393955 -478123 -448633 -432902 -426944 -459344 -394821
2980 -394821 -412149 -340599 -352528 -428319 -391847 -410682 -369399 -397106 -411263 -484660 -479136 -428201
2968 -428201 -458981 -394918 -414550 -414762 -412729 -400386 -369986 -455307 -448048 -412528 -388000 -374209
2956 -374209 -430415 -443607 -447387 -435299 -404363 -406517 -398013 -415429 -460765 -462032 -434936 -416288
2944 -416288 -340932 -399131 -438824 -402794 -364452 -406174 -395430 -398284 -453310 -423618 -356152 -399138
2932 -399138 -401446 -376115 -386921 -433101 -357232 -374693 -438424 -434548 -412155 -410842 -345818 -436212
2920 -436212 -363534 -420579 -409459 -415793 -370179 -452743 -364101 -393231 -374874 -446440 -448001 -399514
$$ packed form
3004c88462j4589o1202Q2153J60j3187J3292N1463l5805r4249l1601N8763Q5228
2992c48036o9852k244p072j2292j8986O4527q4168K9490J5731N958l2400O4523
2980c94821j7328P1550j1929p5791L6472j8835M1283k7707j4157p3397N524N0935
2968d28201l0780O4063j9632k12K033J2343L0400q5321P259L5520K4528J3791
2956c74209n6206j3192l780J2088L0936k154Q504j7416m5336j267K7096J8648
2944d16288P5356n8199l9693L6030L8342m1722J0744k854n5026K9692O7466m2986
2932c99138k308K5331j0806m6180P5869j7461o3731L876K2393J313O5024r0394
2920d36212P2678n7045J1120o334M5614q2564Q8642k9130J8357p1566j561M8487
$$ plain form
2908 -399514 -411196 -407120 -440830 -475596 -461387 -414613 -363084 -430436 -441351 -432616 -381091 -414717
2896 -414717 -396660 -476251 -366783 -421505 -392057 -391084 -444146 -450675 -429552 -394819 -453026 -477253
2884 -477253 -412088 -410165 -381716 -445513 -447091 -354345 -352695 -470309 -441124 -452685 -405713 -380781
2872 -380781 -447456 -410526 -451323 -429423 -454947 -417048 -375209 -425666 -445256 -435120 -381761 -437257
2860 -437257 -387569 -407467 -424267 -430722 -422800 -427787 -388509 -482993 -445751 -510927 -426055 -457704
2848 -457704 -509261 -458514 -432935 -452706 -434644 -479197 -381736 -404701 -418466 -405992 -376893 -485049
2836 -485049 -422559 -387366 -412547 -495942 -408104 -478256 -454839 -419592 -455084 -381068 -481698
2825 -481698 -422016 -367504 -436036 -438178 -414043 -425810 -478002 -375372 -409338 -476792 -461304 -438860
$$ packed form
2908c99514j1682M076l3710l4766J4209M6774N1529o7352j0915Q735N1525l3626
2896d14717J8057p9591J09468n4722K9448R73n3062o529K1123L4733n8207k4227
2884d77253O5165J923K8449o3797j578R2746J650j17614K9185j1561M6972K4932
2872c80781o6675L6930m0797K1900k5524L7899M1839n0457j9590J0136N3359n5496
2860d37257M9688j9898j6800o455P922m987L9278r4484L7242o5176Q4872l1649
2848d57704n1557N0747K5579j9771J8062m4553R7461k2965j3765J2474K9099j08156
2836d85049O2490L5193k5181q3395Q7838p0152K3417L5247l5492P4016j00630
2825d81698N9682N4512o8532k142K4135j1767n2192J02630l3966o7454J5488K2444
$$ plain form
2813 -438860 -390084 -480711 -480203 -387209 -416409 -429456 -426283 -397135 -454681 -451484 -365251 -388937
2801 -388937 -418061 -384471 -457510 -424981 -386572 -440107 -375129 -350246 -479056 -385551 -450558
2790 -450558 -430967 -385305 -509246 -422020 -419721 -477364 -462398 -432037 -484460 -413540 -442094 -476513
2778 -476513 -426913 -384047 -468006 -458732 -412758 -375319 -353617 -378923 -461671 -455374 -416822 -430049
2766 -430049 -447472 -387535 -444561 -386621 -449763 -432927 -435605 -452558 -436307 -431910 -470522 -382869
2754 -382869 -470038 -436246 -435656 -451275 -470236 -419607 -474144 -468806 -493713 -389935 -406803 -452698
2742 -452698 -420890 -443086 -350678 -404726 -485148 -421632 -441727 -461753 -461696 -429671 -432966 -461547
2730 -461547 -470833 -474659 -413459 -521266 -424715 -448298 -478269 -421434 -387739 -440006 -417195 -475940
$$ packed form
2813d38860M8776r0627N08R2994k9200j3047L173K9148n7546L197Q6233k3686
2801c88937k9124L3590p3039L2529L8409n3535O4978K4883j28810R3505o5007
2790d50558J9591M5662j23941Q7226K299n7643J4966L0361n2423P0920k8554l4419
2778d76513M9600M2866q3959R274M5974L7439K1702k5306q2748O297L8552j3227
2766d30049j7423N9937n7026N7940o3142J6836k678j6953J6251M397l8612Q7653
2754c82869q7169L3792N90j5619j8961N0629n4537N338k4907J03778j6868m5895
2742d52698L1808k2196R2408n4048q0422O3516k0095k0026N7L2025l295k8581
2730d61547r286l826O1200j07807R6551k3583k9971N6835L3695n2267K2811n8745
$$ plain form
2718 -475940 -470458 -471740 -426404 -461667 -460572 -466554 -477630 -482783 -489625 -378520 -419116 -450633 -423889
2705 -423889 -459313 -447141 -393249 -439378 -411323 -478027 -438701 -468155 -418742 -465123 -415797 -414686
2693 -414686 -452889 -452320 -411932 -441930 -378865 -425277 -394164 -450182 -433509 -429528 -423622 -385845
2681 -385845 -393859 -443591 -468462 -502329 -368915 -406293 -427320 -438335 -389815 -422401 -421054 -456990
2669 -456990 -416184 -389035 -416950 -408495 -428619 -404920 -463391 -421482 -503956 -431921 -396974 -504523
2657 -504523 -422563 -491585 -485224 -468450 -481512 -393587 -426928 -435626 -435144 -415847 -514249 -443965
2645 -443965 -406024 -450148 -401686 -460960 -402066 -410830 -395591 -419867 -371608 -390594 -417523 -430586
2633 -430586 -430936 -441652 -453258 -407491 -503333 -453070 -454340 -458504 -384849 -452280 -469143 -473727 -441244
$$ packed form
2718d75940N482j282M5336l5263J095n982j1076n153o842J11105m0596l1517K6744
2705d23889l5424J2172N3892m6129K8055o6704L9326k9454M9413m6381M9326J111
2693d14686l8203N69M0388k9998O3065m6412L1113n6018J6673L981N906L7777
2681c85845q014m9732k4871l3867J33414l7378k1027j1015M8520l2586J347l5936
2669d56990M0806K7149k7915Q455k0124K3699n8471M1909q2474P2035L4947j07549
2657e04523Q1960o9022O361J6774j3062Q7925l3341q698M82J9297r8402P0284
2645d43965L7941m4124M8462n9274N8894q764J5239k4276M8259j8986k6929j3063
2633d30586l50j0716j1606M5767r5842N0263j270m164P3655o7431j6863m584L2483
$$ plain form
2620 -441244 -438035 -470425 -447907 -465679 -430063 -427255 -435040 -444867 -439561 -462071 -456644 -450680 -528081
2607 -528081 -464486 -447054 -464100 -422443 -406410 -451808 -450430 -495322 -465719 -460482 -492994 -468320
2595 -468320 -437723 -433734 -396588 -478447 -423692 -431538 -493327 -475125 -448967 -450515 -485901 -416393
2583 -416393 -506922 -417096 -420715 -489705 -437397 -449575 -518865 -449530 -452241 -439501 -398745 -442606
2571 -442606 -463041 -511971 -482478 -438761 -470149 -523206 -508677 -461763 -434789 -449700 -424349 -463590
2559 -463590 -451528 -504460 -507336 -424472 -434071 -442065 -458752 -396431 -469112 -531090 -478003 -423836
2547 -423836 -506477 -484759 -507378 -533670 -475923 -463434 -465458 -423312 -464106 -446659 -484259 -425382
2535 -425382 -433577 -495568 -392028 -417810 -460935 -387887 -415034 -561147 -472514 -414787 -417361 -417156
$$ packed form
2620d41244L209l2390K2518j7772L5616K808p785r827N306k2510N427N964p7401
2607e28081O3595J7432j7046M1657J6033m5398J378m4892K9603N237l2512K4674
2595d68320L0597L989L7146q1859N4755p846o1789J8202K6158j548l5386O9508
2583d16393r0529Q9826l619o8990N2308j2178o9290O9335k711J2740M0756m3861
2571d42606k0435m8930K9493M3717l1388n3057J4529M6914K6974j4911K5351l9241
2559d63590J2062n2932k876Q2864r599p994j6687O2321p2681o1978N3087N4167
2547d23836q2641K1718k2619k6292N7747J2489k024M2146m0794J7447l7600N8877
2535d25382q195o1991J03540k5782m3125P3048k7147j46113Q8633N7727k574K05
$$ plain form
2523 -417156 -436008 -442327 -382779 -399388 -440657 -353159 -410980 -439337 -381649 -430591 -476420 -474187
2511 -474187 -433914 -449669 -438912 -478277 -365348 -468225 -410079 -415398 -408531 -438399 -453969 -443912
2499 -443912 -446440 -430613 -484671 -461327 -469106 -506219 -490191 -482427 -436955 -512490 -474895 -512137
2487 -512137 -451058 -470145 -459396 -433285 -382270 -431701 -461307 -472573 -464366 -470630 -437650 -429296
2475 -429296 -450078 -388594 -406625 -480361 -389699 -400612 -411014 -422034 -408560 -489129 -436026 -487789
2463 -487789 -444056 -439480 -465300 -499187 -404772 -461190 -421688 -481538 -443828 -506693 -448103 -411422
2451 -411422 -499206 -438474 -477425 -423593 -472775 -455555 -429203 -441371 -496891 -479792 -484394 -434582
2439 -434582 -478595 -469059 -449084 -433639 -471581 -436485 -477049 -452106 -449355 -483966 -455846 -485929
$$ packed form
2523d17156j8852o319N9548j6609m1269Q7498n7821k8357N7688m8942m5829K233
2511d74187M0273j5755J0757l9365J12929j02877N8146n319O867k9868j5570J0057
2499d43912k528J5827n4058K3344p779l7113J6028P764M5472p5535L7595l7242
2487e12137O1079j9087J0749K6111N1015m9431k9606j1266Q207o264L2980Q354
2475d29296k0782O1484j8031p3736R0662j0913j0402j1020J3474q0569N3103n1763
2463d87789M3733M576k5820l3887R4415n6418L9502n9850L7710o2865N8590L6681
2451d11422q7784O0732l8951N3832m9182J7220K6352j2168n5520J7099m602M9812
2439d34582m4013R536J9975J5445l7942L5096m0564K4943K751l4611K8120l0083
$$ plain form
2427 -485929 -365819 -443187 -446096 -484400 -383066 -410788 -426759 -422997 -417119 -420016 -435743 -484342
2415 -484342 -457512 -450346 -484186 -475315 -496029 -425393 -415520 -432567 -413317 -520560 -512093 -480240
2403 -480240 -462368 -435422 -416534 -493802 -495725 -445404 -544575 -420017 -465184 -501257 -450627 -466555
2391 -466555 -508051 -425870 -441722 -473840 -449178 -410600 -433691 -569750 -447419 -483285 -431804
2380 -431804 -456683 -458691 -482590 -411325 -483107 -435098 -439321 -470223 -443546 -425316 -448741 -465279
2368 -465279 -501631 -462485 -475442 -448565 -439670 -427895 -419400 -477360 -454861 -529811 -455580 -479531
2356 -479531 -464046 -449667 -434623 -405578 -464698 -504242 -420876 -444958 -461956 -448027 -412482 -494413
2344 -494413 -542380 -479247 -497397 -453036 -455583 -463393 -456121 -450820 -502172 -436482 -443324 -555835
$$ packed form
2427d85929J20110p7368k909l8304J01334k7722j5971L762N878k897j5727m8599
2415d84342K6830P166l3840Q871k0714P0636R873j7047J9250j07243Q467L1853
2403d80240J7872K6946J8888p7268j923N0321r9171J24558m5167l6073N0630j5928
2391d66555m1496Q2181j5852l2118K4662L8578k3091j36059J22331l5866N1481
2380d31804k4879k008k3899P1265p1782M8009m223l0902K6677J8230k3425j6538
2368d65279l6352L9146j2957K6877Q895J1775Q495n7960K2499p4950P4231k3951
2356d79531J5485J4379J5044K9045n9120l9544Q3366k4082j6998J3929L5545q1931
2344d94413m7967O3133j8150M4361k547p810P272N301n1352O5690o842j12511
$$ plain form
2332 -555835 -454953 -446541 -450264 -462701 -455843 -497033 -405495 -436601 -457089 -476600 -484778 -540491
2320 -540491 -456728 -479658 -505848 -558341 -441304 -458791 -452509 -409271 -457699 -428122 -433383 -478389
2308 -478389 -459567 -501535 -438774 -556544 -436801 -400733 -464250 -432987 -490195 -426255 -464597
2297 -464597 -427662 -492888 -395611 -439281 -460392 -487056 -410832 -440307 -418491 -496617 -456779 -455392
2285 -455392 -451286 -473658 -459804 -471708 -515649 -467559 -444587 -446219 -460061 -486664 -455626 -474980
2273 -474980 -433932 -455397 -482061 -495731 -430170 -474496 -470164 -456485 -488681 -414641 -397367 -485989
2261 -485989 -500662 -435800 -467882 -494002 -436568 -494707 -430928 -505891 -462026 -426511 -483909 -456582
2249 -456582 -453197 -554557 -502126 -459995 -440755 -433988 -432653 -374774 -467054 -450106 -544158 -445715
$$ packed form
2332e55835J00882Q412l723j2437O858m1190R1538l1106k0488j9511q178n5713
2320e40491Q3763k2930k6190n2493J17037j7487O282M3238m8428K9577n261m5006
2308d78389J8822m1968O2761j17770J19743L6068o3517L1263n7208O3940l8342
2297d64597L6935o5226R7277m3670k1111k6664P6224k9475K1816p8126L9838J387
2285d55392M106k2372J3854j1904m3941M8090K2972j632j3842k6603L1038j9354
2273d74980M1048k1465k6664j3670O5561m4326M332J3679l2196P4040J7274q8622
2261d85989j4673O4862l2082k6120N7434n8139O3779p4963M3865L5515n7398K7327
2249d56582L385j01360N2431M2131J9240O767J335N7879r2280J6948r4052R8443
$$ plain form
2237 -445715 -509039 -463432 -459243 -407790 -448591 -493792 -503492 -466968 -484033 -488961 -457128 -463512
2225 -463512 -462861 -434602 -462999 -413707 -437560 -484990 -498946 -449779 -488959 -448831 -405012 -414304
2213 -414304 -436410 -489445 -390577 -504130 -430462 -455634 -489802 -491080 -488710 -506375 -459909 -484497
2201 -484497 -487138 -449696 -470407 -441165 -394782 -457477 -530263 -450889 -477681 -459296 -491117 -449933
2189 -449933 -468502 -456926 -413568 -496111 -493274 -511562 -456018 -482710 -446417 -509428 -438683 -431759
2177 -431759 -487327 -496685 -466012 -453515 -494256 -509599 -483657 -456852 -479176 -478517 -481463 -446028
2165 -446028 -478950 -407982 -469063 -444214 -413111 -547241 -484452 -414847 -471239 -452079 -407916
2154 -407916 -375361 -436257 -430271 -434723 -469293 -431683 -383719 -476116 -434822 -428855 -450466 -498031
$$ packed form
2237d45715o3324M5607M189N1453m0801m5201r700L6524j7065m928L1833o384
2225d63512O51K8259k8397M9292k3853m7430j3956M9167l9180M0128M3819r292
2213d14304k2106n3035R8868j13553P3668k5172l4168j278K370j7665M6466k4588
2201d84497k641L7442k0711K9242M6383o2695p2786P9374k6792J8385l1821M1184
2189d49933j8569J1576M3358q2543K837j8288N5544k6692L6293o3011P0745O924
2177d31759n5568r358L0673J2497m0741j5343K5942K6805k2324O59k946L5435
2165d46028l2922P0968o1081K4849L1103j34130O2789O9605n6392J9160M4163
2154d07916L2555o0896N986m452l4570L7610M7964r2397M1294N967k1611m7565
$$ plain form
2142 -498031 -454836 -444834 -460187 -405959 -451935 -490796 -514720 -515127 -457621 -445646 -445285 -478176
2130 -478176 -563022 -409762 -550557 -424263 -470707 -457964 -446254 -440872 -411636 -507418 -498041
2119 -498041 -442188 -467887 -433086 -466490 -447975 -465941 -473515 -457828 -447493 -436653 -470172 -464676
2107 -464676 -499245 -427422 -447208 -477271 -445239 -495045 -527625 -477078 -478876 -439432 -434947 -443445
2095 -443445 -521261 -446252 -451000 -473953 -410246 -455928 -386941 -452557 -425577 -437045 -402756 -420351
2083 -420351 -427123 -487783 -506431 -442865 -523060 -429375 -476872 -462089 -421684 -464937 -441273 -490664
2071 -490664 -482767 -566974 -462486 -485808 -467034 -464362 -432678 -505518 -461598 -419663 -465201 -460476
2059 -460476 -496924 -498764 -495737 -496082 -545970 -482858 -477756 -441755 -492207 -499761 -460495 -433274 -468446
$$ packed form
2142d98031M3195J0002j5353N4228m5976l8861k3924m07N7506J1975L61l2891
2130d78176q4846J53260j40795J26294m6444J2743J1710N382K9236r5782R377
2119d98041N5853k5699L4801l3404J8515j7966p574J5687J0335J0840l3519N496
2107d64676l4569P1823j9786l0063L2032m9806l2580N0547j798L9444M485q498
2095d43445p7816P5009m748k2953O3707m5682O8987o5616K6980j1468L4289j7595
2083d20351o772o0660j8648O3566q0195R3685m7497J4783M0405m3253K3664m9391
2071d90664P897q4207J04488k3322J8774K672L1684p2840M3920M1935m5538M725
2059d60476l6448j840L027l45m9888O3112N102L6001n0452p554L9266K7221l5172
$$ plain form
2046 -468446 -551506 -468221 -504100 -420886 -445387 -416889 -511924 -510778 -501394 -434525 -446750 -449871
2034 -449871 -460513 -520395 -444321 -476851 -527048 -469523 -451802 -445215 -433384 -539521 -436367
2023 -436367 -451408 -459434 -491416 -483859 -483058 -479373 -450660 -437660 -497884 -502482 -466401 -429625 -463345
2010 -463345 -459704 -478081 -521112 -526150 -509774 -510507 -477880 -539963 -461503 -542644 -499966 -469843
1998 -469843 -505402 -486152 -469527 -508558 -467033 -486388 -497701 -480552 -490387 -548791 -494297 -482061
1986 -482061 -429452 -434893 -506594 -458091 -478682 -501215 -415755 -518787 -430708 -437080 -445761 -424605
1974 -424605 -420257 -438586 -492840 -473137 -443478 -408492 -466497 -483629 -485882 -438459 -515936 -464328
1962 -464328 -466923 -491313 -460915 -474635 -455354 -443901 -546359 -486655 -476880 -490530 -542303 -488377
$$ packed form
2046d68446q3060Q3285l5879Q3214k4501K8498r5035J146R384O6869j2225l121
2034d49871j0642n9882P6074l2530n0197N7525J7721O587J1831j06137J03154
2023d36367j5041q026l1982P557Q01L685K8713J3000o0224m598L6081L6776l3720
2010d63345L641j8377m3031n038J6376p33L2627o2083P8460q1141M2678L0123
1998d69843l5559J9250J6625l9031M1525j9355j1313J7149r835n8404N4494J2236
1986d82061N2609n441p1701M8503k0591k2533Q5460j03032Q8079o372q681K1156
1974d24605M348j8329n4254J9703K9659L4986n8005j7132k253M7423p7477N1608
1962d64328k595k4390L0398j3720J9281J1453j02458N9704R775j3650n1773N3926
$$ plain form
1950 -488377 -454956 -514252 -496552 -444804 -475138 -429865 -477645 -497438 -527250 -461889 -535611 -441205
1938 -441205 -527301 -466334 -446298 -490656 -438853 -496663 -492500 -491799 -471110 -423620 -469273 -440209
1926 -440209 -503286 -455818 -449596 -456028 -423507 -523063 -493713 -535613 -512344 -526598 -486435 -491936
1914 -491936 -502150 -481103 -493692 -445832 -448503 -483605 -521759 -406037 -413027 -481494 -486319 -457553
1902 -457553 -470612 -545477 -501959 -506792 -430122 -507569 -494701 -429027 -414454 -410259 -507282 -472647
1890 -472647 -479194 -490454 -530266 -504090 -463748 -516718 -455402 -426018 -499560 -517703 -523067 -497270
1878 -497270 -472216 -469176 -532393 -441593 -361395 -487293 -490242 -422841 -433870 -413021 -473008 -396715
1866 -396715 -440501 -471382 -515041 -515613 -439619 -492866 -501500 -491201 -485008 -502055 -423894 -397452
$$ packed form
1950d88377L3421n9296J7700N1748l0334M5273m7780j9793k9812O5361p3722R4406
1938d41205q6096O0967K0036m4358N1803n7810M163P01K0689M7490m5653K9064
1926d40209o3077M7468O222o432L2521r9556K9350m1900K3269j4254M0163n501
1914d91936j0214K1047j2589M7860k671l5102l8154J15722o990o8467m825K8766
1902d57553j3059p4865M3518m833P6670p7447J2868O5674J4573M195r7023L4635
1890d72647o547j1260l9812K6176M0342n2970O1316K9384p3542j8143n364K5797
1878d97270K5054L040o3217R0800Q0198j25898k949O7401j1029K0849n9987P6293
1866c96715m3786l0881m3659n72P5994n3247q634J0299O193j7047P8161K6442
$$ plain form
1854 -397452 -509938 -471925 -473370 -468099 -459312 -457959 -439878 -461686 -436519 -406118 -435786 -436566 -535634
1841 -535634 -460021 -443139 -463455 -448908 -457729 -458470 -508336 -450791 -474059 -432817 -445994 -446948 -447065
1828 -447065 -528420 -505009 -474367 -456235 -495776 -530690 -468575 -451992 -485004 -467319 -465574 -528672
1816 -528672 -412473 -468285 -478891 -489260 -436229 -436954 -525807 -537289 -459355 -458353 -450188 -465352
1804 -465352 -472656 -428712 -513818 -515127 -466237 -455357 -451788 -494126 -450948 -528825 -506812 -488754
1792 -488754 -449782 -535214 -456726 -432459 -460818 -527751 -516403 -472228 -450868 -380477 -444802 -427661
1780 -427661 -489036 -530725 -472104 -432652 -405272 -486857 -526853 -484659 -510705 -493921 -530913 -453176
1768 -453176 -518844 -484580 -488161 -480600 -474047 -475483 -394724 -430285 -527815 -445440 -451347 -439040 -475710
$$ packed form
1854c97452j12486L8013j445N271Q787J353J8081k1808K5167L0401k9668p80r9068
1841e35634P5613J6882k0316J4547q821p41m9866N7545k3268M1242j3177r54j17
1828d47065q1355K3411L0642J8132l9541l4914O2115J6583l3012J7685J745o3098
1816e28672J16199n5812j0606j0369N3031p25q8853j1482P7934J002Q165j5164
1804d65352p304M3944q5106j309M8890J0880L569m2338M3178p7877K2013J8058
1792d88754L8972q5432P8488K4267k8359o6933J1348M4175K1360P0391o4325J7141
1780d27661o1375m1689N8621L9452K7380q1585l9996M2194k6046J6784l6992P7737
1768d53176o5668L4264l581P561O553j436Q0759l5561r7530Q2375n907J2307l6670
$$ plain form
1755 -475710 -459716 -497957 -481380 -396590 -494763 -497403 -444090 -468407 -451826 -495579 -515297 -464638
1743 -464638 -489006 -472048 -406064 -481284 -487275 -443604 -514881 -491685 -461346 -467243 -475039 -467576
1731 -467576 -494154 -502146 -388962 -422035 -401813 -488880 -550867 -481862 -474688 -522029 -473818 -497244
1719 -497244 -428243 -477225 -484600 -447931 -441818 -480558 -499385 -503443 -476227 -538709 -466387 -539677
1707 -539677 -511829 -496738 -535265 -475255 -495419 -432224 -495576 -473491 -431607 -520490 -487299 -478955
1695 -478955 -518337 -478627 -455292 -571141 -505597 -472900 -508853 -463063 -514725 -471706 -553614
1684 -553614 -437321 -473062 -571992 -505126 -417087 -487898 -479966 -538261 -433739 -559563 -485976
1673 -485976 -464793 -495865 -480107 -499899 -501581 -495004 -393702 -486668 -510305 -464989 -497494 -432823
$$ packed form
1755d75710J5994l8241J6577Q4790r8173k640N3313k4317J6581m3753j9718N0659
1743d64638k4368J6958O5984p5220n991M3671p1277K3196L0339n897p796P463
1731d67576k6578p992J13184l3073K0222q7067o1987O9005P174m7341M8211k3426
1719d97244O9001m8982p375L6669O113l8740j8827m058K7216o2482P2322p3290
1707e39677K7848J5091l8527O0010k0164O3195o3352K2085M1884q8883L3191Q344
1695d78955l9382L9710K3335j15849O5544L2697l5953M5790n1662M3019q1908
1684e53614J16293l5741r8930O6866Q8039p0811P932n8295J04522j25824P3587
1673d85976K1183l1072J5758j9792j682O577J01302r2966k3637M5316l2505O4671
$$ plain form
1661 -432823 -496150 -499035 -494000 -459191 -523174 -400216 -428454 -510362 -478073 -529056 -492415 -492655
1649 -492655 -531750 -456782 -529351 -422935 -438161 -458245 -460310 -481702 -528961 -521193 -464241 -399543
1637 -399543 -422133 -574670 -551545 -497156 -420384 -437199 -459703 -396586 -483680 -507032 -491988
1626 -491988 -441004 -453344 -452881 -486438 -510241 -431638 -434239 -467167 -533216 -487078 -505051 -488979
1614 -488979 -482880 -486553 -465021 -480355 -451029 -426968 -479536 -483495 -435323 -473453 -512805 -449421
1602 -449421 -503983 -458740 -455581 -434724 -477223 -445109 -467732 -520603 -469943 -512390 -412609 -468728
1590 -468728 -438565 -430360 -463139 -482455 -481295 -451890 -457988 -421094 -460416 -517499 -441331 -459825
1578 -459825 -477893 -498529 -534120 -482394 -479558 -479982 -505137 -488142 -497620 -449403 -447255 -493555 -443354
$$ packed form
1661d32823o3327k885N035L4809o3983J22958k8238q1908L2289n0983L6641k40
1649d92655l9095P4968p2569J06416j5226k0084k065k1392m7259P768N6952O4698
1637c99543k2590j52537K3125N4389P6772j6815k2504O3117q7094k3352J5044
1626d91988N0984j2340M63l3557k3803P8603k601l2928o6049M6138j7973J6072
1614d88979O099l673K1532j5334K9326K4061n2568l959M8172l8130l9352O3384
1602d49421n4562M5243L159K0857m2499L2114k2623n2871N0660m2447R9781n6119
1590d68728L0163Q205l2779j9316J160K9405o098L6894l9322n7083P6168j8494
1578d59825j8068k0636l5591N1726K836m24k5155J6995r478M8217K148m6300N0201
$$ plain form
1565 -443354 -484065 -484124 -474137 -483638 -407180 -439146 -469062 -472676 -430403 -414289 -519616 -446930 -491769
1552 -491769 -496623 -476146 -477455 -486979 -539162 -427826 -458845 -501749 -437185 -472680 -468652 -511949
1540 -511949 -472936 -489770 -475113 -496456 -460776 -505416 -535236 -496567 -403371 -486663 -520227 -512935
1528 -512935 -510401 -523351 -486272 -512720 -433937 -436212 -477795 -456679 -436005 -509833 -491961 -393668
1516 -393668 -537880 -495122 -453819 -484542 -487657 -497476 -446531 -537643 -402630 -482021 -471711 -477185
1504 -477185 -493740 -479323 -453448 -495982 -477778 -444884 -541044 -449443 -499960 -445599 -476090 -439468
1492 -439468 -481786 -481223 -477194 -428643 -423577 -437658 -528240 -513791 -386158 -536584 -443498 -480122
1480 -480122 -425100 -460000 -537698 -449712 -446236 -502130 -475885 -507817 -469467 -464126 -459573 -481185
$$ packed form
1565d43354m0711n9R987r501P6458l1966k9916l614M2273J6114j05327P2686m4839
1552d91769m854K0477j309r524n2183J11336l1019m2904O4564l5495M028m3297
1540e11949L9013j6834J4657k1343L5680m4640k9820L8669R3196q3292l3564P292
1528e12935K534j2950L7079k6448P8783k275m1583K1116K0674p3828J7872R8293
1516c93668j44212M2758M1303l0723l115r819N0945r1112J35013p9391J0310n474
1504d77185j6555J4417K5875m2534J8204L2894r6160R1601n0517N4361l0491L6622
1492d39468m2318N63M029M8551N066j4081r0582J4449J27633j50426R3086l6624
1480d80122N5022l4900p7698Q7986L476n5894K6245l1932L8350N341M553k1612
$$ plain form
1468 -481185 -426672 -517255 -492085 -445842 -448781 -514611 -445617 -531383 -404193 -439981 -526510 -509859
1456 -509859 -418341 -484586 -511821 -446549 -442912 -497415 -480807 -490209 -534611 -461964 -528173 -467671
1444 -467671 -504266 -497790 -541670 -493286 -483714 -519362 -432802 -451144 -445565 -415845 -447719 -453563
1432 -453563 -447605 -465758 -452801 -467095 -501889 -470876 -501775 -547039 -505555 -415159 -440576 -515536
1420 -515536 -552146 -461173 -577937 -532392 -429992 -546432 -528306 -522413 -424480 -489652 -504354
1409 -504354 -479787 -459647 -509745 -444448 -494137 -444837 -483911 -507385 -462663 -499934 -511896 -470325
1397 -470325 -544530 -562164 -476820 -433110 -445558 -483111 -427060 -408208 -458986 -451182 -439474 -475475
1385 -475475 -503533 -489264 -567375 -457094 -474851 -450323 -441814 -539974 -497507 -513957 -476796 -529666
$$ packed form
1468d81185N4513r0583K5170M6243k939o5830O8994q5766J27190l5788q6529J6651
1456e09859R1518o6245k7235O5272L637n4503J6608r402m4402P2647o6209O0502
1444d67671l6595O476m3880M8384R572l5648Q6560j8342N579K9720l1874n844
1432d53563N958j8153J2957j4294l4794L1013l0899m5264M1484R0396k5417p4960
1420e15536l6610R0973j16764M5545J02400j16440J8126N893R7933o5172j4702
1409e04354K4567K0140n0098O5297m9689M9300l9074k3474M4722l7271j1962M1571
1397d70325p4205j7634Q5344M3710j2448l7553N6051J8852n0778P804J1708l6001
1385d75475k8058J4269p8111J10281j7757K4528Q509r8160M2467j6450L7161n2870
$$ plain form
1373 -529666 -500723 -424658 -430722 -467527 -428029 -483685 -532067 -469276 -470155 -559042 -506864 -504727
1361 -504727 -494754 -497769 -518270 -510668 -435748 -443267 -483027 -474544 -497808 -446958 -459212 -526579 -518545
1348 -518545 -429742 -443128 -431693 -482606 -474583 -452765 -470980 -480760 -476567 -486539 -508575 -482210
1336 -482210 -469396 -539244 -558108 -489243 -516174 -495081 -533473 -480244 -456079 -433906 -466402 -495020
1324 -495020 -507187 -467009 -487760 -433348 -497147 -504327 -521203 -452622 -463981 -458884 -510736 -568879
1312 -568879 -459056 -466854 -476709 -517955 -469469 -476804 -536333 -566386 -474822 -438275 -475103 -444605
1300 -444605 -443083 -496322 -489361 -445932 -439155 -493830 -451589 -467311 -485490 -484015 -497051 -504560 -462553
1287 -462553 -445330 -473404 -437027 -406235 -526388 -500640 -448074 -483607 -531309 -493407 -460468
$$ packed form
1373e29666K8943P6065o064l6805L9498n5656m8382O2791q79q8887N2178K137
1361e04727R973l015k0501P602P4920p519l9760Q483k3264N0850j2254o7367Q034
1348e18545Q8803j3386J1435n0913Q023K1818j8215r780M193r972k2036K6365
1336d82210J2814o9848j8864O8865k6931K1093l8392N3229K4165K2173l2496k8618
1324d95020j2167M0178k0751N4412o3799p180j6876O8581j1359N097n1852n8143
1312e68879J09823p798r855m1246M8486p335n9529l0053R1564L6547l6828L0498
1300d44605J522n3239O961M3429O777n4675M2241j5722j8179J475j3036p509M2007
1287d62553J7223k8074L6377L0792j20153K5748N2566l5533m7702L7902L2939
$$ plain form
1276 -460468 -370233 -499110 -460740 -578858 -483653 -485927 -476913 -511851 -502288 -445490 -472507 -504487
1264 -504487 -498046 -479595 -461898 -432109 -454033 -528020 -496035 -481929 -524250 -486937 -471189 -521684
1252 -521684 -497747 -422350 -514040 -445334 -485327 -560951 -506218 -435346 -510927 -508006 -412659 -427205
1240 -427205 -484378 -390724 -472827 -511696 -482326 -492782 -518973 -485153 -422447 -506199 -481721 -486857
1228 -486857 -448401 -398644 -425489 -523379 -458474 -459941 -514029 -442749 -512598 -415607 -474631 -476911
1216 -476911 -433572 -481168 -517504 -471032 -434240 -454541 -402895 -480671 -502631 -481119 -435566 -485241
1204 -485241 -568271 -512015 -510583 -477069 -531913 -462083 -476475 -510068 -475049 -475724 -492000 -474219
1192 -474219 -487438 -510784 -435267 -470724 -583176 -492478 -438613 -545845 -514626 -481285 -473043
$$ packed form
1276d60468R0235j28877L8370j18118R5205k274R014l4938R563N6798k7017l1980
1264e04487O441J8451J7697K9789k1924p3987L1985J4106m2321L7313J5748n0495
1252e21684K3937P5397r1690O8706l9993p5624N4733P0872p5581K921R5347j4546
1240d27205n7173R3654q2103l8869K9370j0456k6191L3820O2706q3752K4478n136
1228d86857L8456M9757k6845r7890O4905j467n4088P1280o9849R6991n9024k280
1216d76911M3339m7596l6336M6472L6792k0301N1646p7776k1960K1512M5553m9675
1204d85241q3030N6256J432L3514n4844O9830j4392l3593L5019o75j6276J7781
1192d74219j3219k3346P5517l5457j12452R0698N3865j07232L1219L3341Q242
$$ plain form
1181 -473043 -427795 -508886 -465256 -465178 -503855 -500432 -497382 -446206 -495457 -440458 -431433 -474502 -480989
1168 -480989 -485118 -401584 -537652 -485631 -422486 -492936 -534425 -509117 -473211 -452164 -524039 -561694
1156 -561694 -471445 -497581 -487905 -588349 -542922 -452436 -501947 -456270 -491157 -475521 -515716 -474310
1144 -474310 -460741 -537418 -511007 -520417 -489416 -552012 -536872 -464381 -516344 -473930 -466504 -505385
1132 -505385 -444785 -536685 -427713 -510837 -501195 -453481 -514976 -465963 -403159 -523530 -438776
1121 -438776 -486624 -494165 -455982 -450866 -495317 -482615 -453888 -485211 -552414 -461974 -502870 -476348
1109 -476348 -470601 -452948 -461376 -511263 -442047 -492537 -441887 -439257 -527040 -512260 -510930 -498198
1097 -498198 -472086 -493411 -494953 -512229 -485895 -458961 -466337 -555642 -486940 -512947 -459010 -537780
$$ packed form
1181d73043M5248q1091M3630P8l8677L423L050N1176m9251N4999R025m3069o487
1168d80989m129Q3534j36068N2021O3145p0450m1489K5308L5906K1047p1875l7655
1156e61694R0249k6136R676j00444M5427R0486m9511M5677l4887J5636m0195M1406
1144d74310J3569p6677K6411r410L1001o2596J5140P2491n1963M2414P426l8881
1132e05385O0600r1900J08972q3124R642M7714o1495M9013O2804j20371Q4754
1121d38776m7848p541L8183N116m4451J2702K8727l1323o7203R0440m0896K6522
1109d76348N747J7653q428m9887O9216n0490N0650K630q7783J4780J330J2732
1097d98198K6112k1325j542j7276K6334K6934p376q9305O8702k6007N3937p8770
$$ plain form
1085 -537780 -469942 -544733 -463261 -401932 -485306 -478985 -486822 -468661 -460113 -492233 -462286 -523525
1073 -523525 -476114 -492294 -505853 -443119 -553511 -472377 -552726 -505202 -489347 -535973 -491238
1062 -491238 -497271 -522004 -528800 -462008 -445371 -459335 -476260 -481425 -477912 -508177 -523020 -502837
1050 -502837 -519366 -457386 -502057 -409911 -513690 -430721 -545001 -512882 -479088 -551371 -529096
1039 -529096 -509720 -556277 -495429 -461539 -514042 -483138 -448113 -512662 -505626 -531252 -444078 -521302
1027 -521302 -476494 -440179 -458964 -503944 -483701 -494046 -502819 -429813 -433135 -542923 -528969 -464636
1015 -464636 -492140 -491253 -457639 -499948 -461944 -450031 -466387 -487622 -480451 -552961 -559397 -502221
1003 -502221 -449674 -506308 -549252 -464498 -467074 -484874 -495179 -542857 -482913 -482852 -505018 -442516
$$ packed form
1085e37780O7838p4791Q1472O1329q3374O321p837J8161Q548l2120K9947o1239
1073e23525M7411j6180j3559O2734j10392Q1134q0349M7524J5855m6626M4735
1062d91238o033k4733o796O6792J6637j3964j6925n165L513l0265j4843K0183
1050e02837j6529O1980m4671R2146j03779Q2969j14280L2119L3794p2283K2275
1039e29096J9376m6557O0848L3890n2503L0904L5025o4549P036k5626Q7174p7224
1027e21302M4808L6315j8785m4980K0243j0345q773P3006l322j09788J3954O4333
1015d64636k7504Q87L3614m2309L8004J1913j6356k1235P171p2510o436N7176
1003e02221N2547n6634m2944Q4754k576j7800j0305m7678N9944O1k2166O2502
$$ plain form
991 -442516 -467095 -464571 -499469 -512685 -504731 -490678 -369408 -490267 -490421 -500859 -515476 -514834 -525733
978 -525733 -546772 -492353 -491305 -524370 -497290 -564095 -466289 -427412 -491070 -468813 -474926 -479197
966 -479197 -502185 -545967 -467170 -515748 -448322 -473263 -476627 -532447 -457374 -481991 -412824 -532848
954 -532848 -530659 -509946 -509332 -476819 -415467 -475446 -504394 -442018 -484285 -474974 -439479 -480471 -492677
941 -492677 -519190 -466034 -478182 -555878 -501533 -432067 -483640 -439658 -487302 -484682 -467623 -510916
929 -510916 -461226 -493619 -443101 -458982 -453320 -450366 -451782 -501441 -458675 -483256 -460161 -566821
917 -566821 -458341 -439702 -512453 -494170 -511554 -472136 -424986 -470159 -475950 -422657 -489164 -462183
905 -462183 -501858 -536526 -516624 -501201 -473342 -520204 -443357 -539502 -555459 -494220 -514907 -453522
$$ packed form
991d42516k4579K524l4898j3216P954J4053J21270j20859j54j0438j4617O42j0899
978e25733k1039N4419J048l3065K7080o6805R7806L8877o3658K2257o113m271
966d79197k2988m3782P8797m8578O7426k4941l364n5820P5073k4617O9167j20024
954e32848K189K0713O14L2513O1352n9979k8948O2376m2267R311L5495m0992j2206
941d92677k6513N3156j2148p7696N4345O9466n1573M3982m7644K620J7059m3293
929e10916M9690l2393N0518j5881N662K954j416m9659M2766k4581K3095j06660
917e66821J08480J8639p2751J8283j7384L9418M7150m5173n791N3293o6507K6981
905d62183l9675l4668J9902J5423K7859m6862P6847r6145j5957O1239k0687O1385
$$ plain form
893 -453522 -519656 -537036 -503591 -551064 -477431 -488974 -512686 -538755 -516420 -477272 -549774 -480062
881 -480062 -485455 -449661 -469326 -490164 -496478 -436402 -536693 -481415 -603209 -534202 -554693 -472960
869 -472960 -521014 -480944 -484836 -494861 -446910 -455916 -556171 -519954 -459342 -451574 -526289 -497776
857 -497776 -469563 -479940 -479438 -541402 -474899 -501404 -506080 -455603 -487708 -440645 -398815 -522012
845 -522012 -404697 -432642 -462207 -456258 -509745 -470026 -486226 -430127 -535388 -470803 -475352 -497133
833 -497133 -518388 -455582 -510601 -515065 -501182 -500771 -471687 -450242 -476554 -450669 -519430 -533218
821 -533218 -542613 -501316 -464208 -461467 -513770 -512704 -501321 -505747 -492426 -625791 -472917 -498362
809 -498362 -438882 -525190 -450870 -525236 -457779 -522403 -501273 -504798 -419628 -488697 -527222 -468847
$$ packed form
893d53522o6134j7380L3445m7473P3633j1543k3712k6069K2335L9148p2502O9712
881d80062n393L5794j9665k0838o314O0076j00291N5278j21794O9007k0491Q1733
869d72960m8054M0070l892j0025M7951r006j00255L6217O0612P768p4715K8513
857d97776K8213j0377N02o1964O6503k6505m676N0477l2105M7063M1830j23197
845e22012J17315k7945k9565N949n3487L9719j6200N6099j05261O4585m549k1781
833d97133k1255O2806n5019m464J3883M11K9084K1445k6312K5885o8761j3788
821e33218r395M1297L7108K741n2303J066J1383m426J3321j33365J52874k5445
809d98362N9480q6308P4320p4366O7457o4624K1130l525Q5170o9069l8525N8375
$$ plain form
797 -468847 -483415 -495651 -470132 -462793 -464208 -484421 -450046 -442371 -480910 -515105 -509350 -506367 -483399
784 -483399 -438572 -481244 -498702 -480229 -503890 -546911 -500111 -438448 -484465 -454485 -509643 -494831
772 -494831 -467911 -466695 -458294 -445642 -506831 -497765 -502942 -500904 -416815 -488713 -469151 -467166 -458581
759 -458581 -412624 -460716 -500573 -530463 -451935 -531815 -463557 -462429 -517342 -430358 -496500 -471997
747 -471997 -499796 -483579 -548534 -483344 -499428 -460999 -457617 -500175 -472803 -469659 -453861 -497736
735 -497736 -401012 -404917 -490303 -510278 -500047 -487480 -491798 -530469 -513233 -527436 -505748 -462854
$$ packed form
797d68847j4568j2236K5519P339j415k0213L4375P675l8539l4195N755K983K2968
784d83399M4827m2672j7458J8473k3661m3021M6800O1663m6017K9980n5158J4812
772d94831K6920J216Q401J2652o1189R066n177K038Q4089p1898J9562J985Q585
759d58581M5957m8092l9857k9890P8528p9880O8258J128n4913Q6984o6142K4503
747d71997k7799J6217o4955O5190j6084L8429L382m2558K7372L144J5798m3875
735d97736R6724l905q5386j9975J0231J2567m318l8671J7236j4203K1688M2894
$$ [...]
##END NTUPLES=NMR SPECTRUM
##END=
