##TITLE=abcd
##JCAMPDX= 6.0         $$ Bruker NMR JCAMP-DX V2.0
##DATA TYPE= NMR SPECTRUM
##DATA CLASS= NTUPLES
##ORIGIN= UXNMR, Bruker Analytische Messtechnik GmbH
##OWNER= root
$$ XWIN-NMR		Version 3.5
$$ Sat Feb 15 08:51:15 2025 Russian Standard Time (UT+4h)  servis@DPX200
##.OBSERVE FREQUENCY= 200.131235884673
##.OBSERVE NUCLEUS= ^1H
##.ACQUISITION MODE= SIMULTANEOUS
##.ACQUISITION SCHEME= undefined
##.AVERAGES= 24
##.DIGITISER RES= 18
##SPECTROMETER/DATA SYSTEM= spect
##.PULSE SEQUENCE= zg
##.SOLVENT NAME= DMSO
##.SHIFT REFERENCE= (INTERNAL, DMSO, 0, 16.4885)
##AUDIT TRAIL= $$ (NUMBER, WHEN, WHO, WHERE, WHAT)
$$ ##TITLE= Audit trail, XWIN-NMR		Version 3.5
$$ ##JCAMPDX= 5.01
$$ ##ORIGIN= Bruker BioSpin GmbH
$$ ##OWNER= servis
$$ F:\spectra/data/av/nmr/H1/1/pdata/1/auditp.txt
$$ ##AUDIT TRAIL=  $$ (NUMBER, WHEN, WHO, WHERE, WHAT)
(   1,<2025-02-15 08:50:40.25 +0400>,<servis>,<DPX200>,
      <created by zg, POWCHK disabled, PULCHK disabled
       terminated by command 'halt'
       configuration hash MD5:
       00 E9 B6 7A A2 85 ED C7 34 08 36 98 17 FE 4E 26
       data hash MD5: 32K
       64 C9 6D 74 01 66 73 6E 4D 43 C2 E9 DF BE CC 82>)
(   2,<2025-02-15 08:50:41.96 +0400>,<servis>,<DPX200>,
      <Start of raw data processing
       efp BC_mod = 2 LB = 0.05 FT_mod = 6 PKNL = 1 PHC0 = -261.9254 PHC1 = 1.301534 SI = 16K 
       data hash MD5: 16K
       C5 71 4D 28 86 AB 86 D3 DF A5 08 FE 5A 9A 36 C8>)
$$ ##END=
$$ 
$$ hash MD5
$$ 53 87 2A A3 A0 84 34 CD 61 DF 47 67 08 85 B7 EC
##$RELAX= 
##$RELAX= 
##$RELAX= 
##$RELAX= 
##$RELAX= 
##$RELAX= 
##$RELAX= 
##$RELAX= 
$$ Bruker specific parameters
$$ --------------------------
##$DU= <F:\spectra>
##$EXPNO= 1
##$NAME= <H1>
##$PROCNO= 1
##$TYPE= <nmr>
##$USER= <av>
##$AMP= (0..31)
100 100 100 100 100 100 100 100 100 100 100 100 100 100 100 100 100 100 
100 100 100 100 100 100 100 100 100 100 100 100 100 100 
##$AQSEQ= 0
##$AQ_mod= 1
##$AUNM= <au_zg>
##$AUTOPOS= <>
##$BF1= 200.13
##$BF2= 200.13
##$BF3= 200.13
##$BF4= 200.13
##$BF5= 500.13
##$BF6= 500.13
##$BF7= 500.13
##$BF8= 500.13
##$BYTORDA= 1
##$CFDGTYP= 0
##$CFRGTYP= 5
##$CHEMSTR= <none>
##$CNST= (0..31)
1 1 145 1 1 1 1 1 1 1 1 1 1 1 1 1 1 1 1 1 1 1 1 1 1 1 1 1 1 1 1 1 
##$CPDPRG= <>
##$CPDPRG1= <>
##$CPDPRG2= <>
##$CPDPRG3= <>
##$CPDPRG4= <mlev>
##$CPDPRG5= <mlev>
##$CPDPRG6= <mlev>
##$CPDPRG7= <mlev>
##$CPDPRG8= <mlev>
##$CPDPRGB= <>
##$CPDPRGT= <>
##$D= (0..31)
0 2 0 0 0 0 0 0 0 0.06 0 0 0 0 0 0 0.0002 0 0 0 0 0 0 0 0 0 0 0 0 0 0 
0 
##$DATE= 1739595039
##$DBL= (0..7)
120 120 120 120 120 120 120 120 
##$DBP= (0..7)
150 150 150 150 150 150 150 150 
##$DBP07= 0
##$DBPNAM0= <>
##$DBPNAM1= <>
##$DBPNAM2= <>
##$DBPNAM3= <>
##$DBPNAM4= <>
##$DBPNAM5= <>
##$DBPNAM6= <>
##$DBPNAM7= <>
##$DBPOAL= (0..7)
0.5 0.5 0.5 0.5 0.5 0.5 0.5 0.5 
##$DBPOFFS= (0..7)
0 0 0 0 0 0 0 0 
##$DE= 6
##$DECBNUC= <off>
##$DECIM= 32
##$DECNUC= <off>
##$DECSTAT= 4
##$DIGMOD= 1
##$DIGTYP= 9
##$DL= (0..7)
0 120 120 120 120 120 120 120 
##$DP= (0..7)
$$ [...]
##$SUBNAM4= <"">
##$SUBNAM5= <"">
##$SUBNAM6= <"">
##$SUBNAM7= <"">
##$SUBNAM8= <"">
##$SUBNAM9= <"">
##$SW= 20.6817932712277
##$SWIBOX= (0..15)
0 0 3 0 0 0 0 0 0 0 0 0 0 0 0 0 
##$SW_h= 4139.07284768212
##$TD= 32768
##$TD0= 1
##$TE= 0
##$TE2= 300
##$TE3= 300
##$TEG= 300
##$TL= (0..7)
0 120 120 120 120 120 120 120 
##$TP= (0..7)
150 150 150 150 150 150 150 150 
##$TP07= 0
##$TPNAME0= <>
##$TPNAME1= <>
##$TPNAME2= <>
##$TPNAME3= <>
##$TPNAME4= <>
##$TPNAME5= <>
##$TPNAME6= <>
##$TPNAME7= <>
##$TPOAL= (0..7)
0.5 0.5 0.5 0.5 0.5 0.5 0.5 0.5 
##$TPOFFS= (0..7)
0 0 0 0 0 0 0 0 
##$TUNHIN= 0
##$TUNHOUT= 0
##$TUNXOUT= 0
##$USERA1= <user>
##$USERA2= <user>
##$USERA3= <user>
##$USERA4= <user>
##$USERA5= <user>
##$V9= 5
##$VALIST= <valist>
##$VCLIST= <CCCCCCCCCCCCCCC>
##$VD= 0
##$VDLIST= <DDDDDDDDDDDDDDD>
##$VPLIST= <PPPPPPPPPPPPPPP>
##$VTLIST= <TTTTTTTTTTTTTTT>
##$WBST= 1024
##$WBSW= 30
##$XGAIN= (0..3)
0 0 0 0 
##$XL= 0
##$YL= 0
##$YMAX_a= 744075
##$YMIN_a= -338089
##$ZGOPTNS= <>
##$ZL1= 120
##$ZL2= 120
##$ZL3= 120
##$ZL4= 120
##$ABSF1= 0
##$ABSF2= 0
##$ABSG= 0
##$ABSL= 0
##$ALPHA= 0
##$AQORDER= 0
##$ASSFAC= 0
##$ASSFACI= 0
##$ASSFACX= 0
##$ASSWID= 0
##$AUNMP= <proc_1d>
##$AZFE= 0.1
##$AZFW= 0.1
##$BCFW= 0
##$BC_mod= 2
##$BYTORDP= 0
##$COROFFS= 0
##$CY= 18.4799938201904
##$DATMOD= 1
##$DC= 0
##$DFILT= <>
##$DTYPP= 0
##$F1P= 9.9274215381318
##$F2P= -0.165520771350173
##$FCOR= 1
##$FTSIZE= 16384
##$FT_mod= 6
##$GAMMA= 0
##$GB= 0
##$INTBC= 1
##$INTSCL= 4.127829e-11
##$ISEN= 128
##$LB= 0.05
##$LEV0= 0
##$LPBIN= 0
##$MAXI= 10000
##$MC2= 0
##$MEAN= 0
##$ME_mod= 0
##$MI= 50
##$NCOEF= 0
##$NC_proc= -5
##$NLEV= 6
##$NOISF1= 3.799351
##$NOISF2= 2.8
##$NSP= 0
##$NTH_PI= 0
##$NZP= 0
##$OFFSET= 16.48848
##$PC= 4
##$PHC0= -261.9254
##$PHC1= 1.301534
##$PH_mod= 1
##$PKNL= yes
##$PPARMOD= 0
##$PSCAL= 4
##$PSIGN= 0
##$REVERSE= no
##$SF= 200.130005582386
##$SI= 16384
##$SIGF1= 3
##$SIGF2= 2
##$SINO= 400
##$SIOLD= 16384
##$SREGLST= <1H.CDCl3>
##$SSB= 0
##$STSI= 16384
##$STSR= 0
##$SW_p= 4139.07284768211
##$SYMM= 0
##$S_DEV= 0
##$TDeff= 32768
##$TDoff= 0
##$TI= <>
##$TILT= no
##$TM1= 0
##$TM2= 0
##$TOPLEV= 0
##$USERP1= <user>
##$USERP2= <user>
##$USERP3= <user>
##$USERP4= <user>
##$USERP5= <user>
##$WDW= 1
##$XDIM= 16384
##$YMAX_p= 272569112
##$YMIN_p= -618041
$$ End of Bruker specific parameters
$$ ---------------------------------
##NTUPLES= NMR SPECTRUM
##VAR_NAME=  FREQUENCY,     SPECTRUM/REAL,   SPECTRUM/IMAG
##SYMBOL=    X,             R,               I
##VAR_TYPE=  INDEPENDENT,   DEPENDENT,       DEPENDENT
##VAR_FORM=  AFFN,          ASDF,            ASDF
##VAR_DIM=   16384,         16384,           16384
##UNITS=     HZ,            ARBITRARY UNITS, ARBITRARY UNITS
##FACTOR=    0.252644378177508, 1,           1
##FIRST=     3299.83951724647, 0,            0
##LAST=      -839.233330435636, 0,           0
##MIN=       -839.233330435636, -618041,     0
##MAX=       3299.83951724647, 272569112,    0
$$ Real data points
##PAGE= N=1
##DATA TABLE= (X++(R..R)), XYDATA
$$ [...]
$$ plain form
10922 -457073 -454761 -517146 -420038 -406149 -444458 -424230 -374630 -469291 -378941 -444369 -428928 -390707
10910 -390707 -463897 -380827 -445952 -482814 -445668 -437129 -454062 -372111 -426383 -433985 -434898 -393473
10898 -393473 -440219 -560624 -467865 -545340 -618041 -459807 -478973 -467057 -473515 -432235 -433818
10887 -433818 -481070 -473516 -476383 -459329 -401233 -520930 -464745 -490668 -459423 -409630 -533672
10876 -533672 -489941 -414671 -427229 -445641 -424054 -495611 -400356 -423880 -501303 -456455 -379961
10865 -379961 -465020 -469331 -469756 -412395 -433921 -447378 -447407 -505509 -510617 -479515 -460960 -408696 -404571
10852 -404571 -433498 -443850 -484022 -465343 -427095 -490157 -476205 -468313 -419409 -484353 -498778 -446086
10840 -446086 -449587 -445523 -524416 -516107 -463971 -539552 -391923 -466492 -486140 -463768 -456203 -464468
$$ packed form
10922d57073K312o2385R7108J3889l8309K0228M9600r4661R0350o5428J5441L8221
10910c90707p3190Q3070o5125l6862L7146Q539j6933Q1951n4272p602r13M1425
10898c93473m6746j20405R2759p7475p2701J58234j9166J1916o458M1280j583
10887d33818m7252P554k867J7054N8096j19697N6185k5923L1245M9793j24042
10876e33672M3731P5270j2558j8412K1587p1557R5255k3524p7423M4848P6494
10865c79961q5059m311m25N7361k1526j3457k9n8102n108L1102J8555N2264M125
10852d04571k8927j0352m0172J8679L8248o3062J3952P892M8904o4944j4425N2692
10840d46086l501M064p8893Q309N2136p5581J47629p4569j9648K2372P565q265
$$ plain form
10828 -464468 -499186 -457129 -523977 -479090 -466577 -481596 -404379 -536251 -447214 -476338 -422196
10817 -422196 -435811 -426786 -438459 -445659 -451643 -405814 -425526 -420623 -453989 -423435 -479872 -527687
10805 -527687 -496707 -414210 -438532 -421348 -399055 -411131 -530544 -360598 -474325 -468328 -375667
10794 -375667 -437114 -394001 -463270 -467576 -360903 -329911 -359512 -439410 -419602 -410587 -383666 -456803
10782 -456803 -451969 -382698 -462727 -404851 -471807 -435522 -401148 -475423 -427385 -415948 -499595 -419214
10770 -419214 -381785 -478397 -420379 -525403 -455294 -441457 -470549 -449474 -511723 -510859 -501611 -460085
10758 -460085 -420677 -475485 -435490 -502486 -463783 -481651 -459493 -443784 -467175 -529041 -374125
10747 -374125 -374667 -514338 -452934 -424998 -422058 -408867 -378248 -406303 -399661 -448738 -376771 -408387
$$ packed form
10828d64468l4718M2057o6848M4887J2513j5019P7217j31872Q9037k9124N4142
10817d22196j3615R025j1673p200n984M5829j9712M903l3366L0554n6437m7815
10805e27687L0980Q2497k4322J7184K2293j2076j19413J69946j13727N997R2661
10794c75667o1447M3113o9269m306J06673L0992k9601p9898J9808R015K6921p3137
10782d56803M834O9271q0029N7876o6956L6285L4374p4275M8038J1437q3647Q0381
10770d19214L7429r6612N8018j05024P0109J3837k9092K1075o2249Q64R248M1526
10758d60085L9408n4808L9995o6996L8703j7868K2158J5709k3391o1866J54916
10747c74125n42j39671O1404K7936K940J3191L0619k8055O642m9077P1967l1616
$$ plain form
10735 -408387 -425075 -493530 -470323 -437593 -413151 -468477 -547757 -482967 -492438 -507929 -394197
10724 -394197 -463032 -479481 -519770 -440158 -494018 -484752 -395327 -494302 -458273 -451500 -408229 -460056
10712 -460056 -428672 -439600 -494366 -355320 -422465 -358853 -500837 -453587 -408633 -387981 -426027
10701 -426027 -408526 -395461 -344606 -343376 -404031 -366184 -448527 -458437 -360442 -318032 -430441 -393474
10689 -393474 -320597 -260328 -297498 -303691 -296762 -333095 -380282 -244542 -347717 -331757 -348193
10678 -348193 -280123 -286804 -249418 -292709 -299736 -294065 -174416 -312191 -276287 -288136 -309725 -337219
10666 -337219 -270162 -337956 -383865 -428862 -388097 -379918 -333257 -365845 -360317 -365200 -483974 -346624
10654 -346624 -330929 -455883 -400013 -402384 -368194 -415743 -451612 -431498 -436962 -343542 -406469 -454662
$$ packed form
10735d08387j6688o8455K3207L2730K4442n5326p9280O4790r471j5491J13732
10724c94197o8835j6449m0289P9612n3860R266Q9425r8975L6029O773M3271n1827
10712d60056L1384j0928n4766J39046o7145O3612j41984M7250M4954K0652l8046
10701d26027J7501J3065N0855J230o0655L7847q2343r910R7995M2410j12409L6967
10689c93474P2877O0269l7170o193O929l6333m7187J35740j03175J5960j6436
10678c48193O8070o681L7386m3291p027N671J19649j37775L5904j1849k1589k7494
10666c37219O7057o7794m5909m4997M0765Q179M6661l2588N528m883j18774J37350
10654c46624J5695j24954N5870k371L4190m7549l5869K0114n464R3420o2927m8193
$$ plain form
10642 -454662 -463094 -483936 -474695 -406295 -448311 -436306 -452529 -455276 -462884 -481757 -335690 -472540
10630 -472540 -429058 -432777 -444780 -434521 -381291 -415494 -439489 -426403 -432982 -431560 -341078 -427559
10618 -427559 -375707 -514484 -446753 -507363 -458174 -423099 -405927 -470540 -466166 -447471 -463483
10607 -463483 -463932 -373622 -452405 -466228 -403495 -429975 -470010 -490641 -360987 -497575 -442947
10596 -442947 -440532 -434665 -459009 -434837 -459878 -435998 -466177 -346027 -453797 -430178 -399391
10585 -399391 -403664 -446379 -384614 -455730 -419210 -444333 -442023 -428476 -452144 -453127 -419874 -382696
10573 -382696 -376851 -469891 -363302 -417882 -385489 -391989 -405459 -412956 -392516 -389314 -381961 -368042
10561 -368042 -413707 -471515 -488539 -362487 -408320 -391110 -415686 -392136 -391535 -473158 -397949 -351398
$$ packed form
10642d54662q432k0842R241O8400m2016J2005j6223k747p608j8873J46067j36850
10630d72540M3482l719j2003J0259N3230l4203k3995J3086o579J422R0482q6481
10618d27559N1852j38777O7731o0610M9189L5075J7172o4613M374J8695j6012
10607d63483m49R0310p8783j3823O2733k6480m0035k0631J29654j36588N4628
10596d42947K415N867k4344K4172k5041K3880l0179J20150j07770K3619L0787
10585c99391m273m2715O1765p1116L6520k5123K310J3547k3668r83L3253L7178
10573c82696N845r3040J06589n4580L2393o500j3470p497K0440L202P353J3919
10561c68042m5665n7808j7024J26052m5833J7210k4576K3550O01q1623P5209M6551
$$ plain form
10549 -351398 -471301 -464814 -415539 -454676 -438370 -417381 -438254 -414753 -409592 -368282 -393407 -429803
10537 -429803 -402310 -505601 -373132 -395727 -354716 -362272 -327937 -393245 -448756 -367565 -363063
10526 -363063 -325885 -303046 -362891 -408366 -307665 -309031 -286325 -360315 -300558 -309158 -265885 -346886
10514 -346886 -281887 -286546 -244777 -270297 -344102 -271179 -362547 -387567 -223685 -269993 -232509
10503 -232509 -143052 -181947 -127953 -143306 -109301 -90431 -105936 -79935 -73089 -135076 -58339 -147291
10491 -147291 -32864 -62942 -69834 -165029 -88568 -165093 -117182 -168371 -177016 -221762 -254505 -181416
10479 -181416 -156825 -154930 -159094 -168346 -149651 -197124 -194863 -121376 -140651 -155160 -83240 -190125
10467 -190125 -196952 -60310 -101492 -59404 -14894 -25556 -88347 -103794 -42611 -109383 -115749 -145625
$$ packed form
10549c51398j19903O487M9275l9137J6306K0989k0873K3501N161M1310k5125l6396
10537d29803K7493j03291J32469k2595M1011p556L4335o5308n5511Q1191M502
10526c63063L7178K2839n9845m5475J00701j366K2706p3990N9757q600M3273q1001
10514c46886O4999m659M1769k5520p3805P2923r1368k5020J63882m6308L7484
10503b32509Q9457l8895N3994j5353L4005J8870j5505K6001O846o1987P6737q8952
10491a47291J14427l0078o892r5195P6461p6525M7911n1189q645m4746l2743P3089
10479a81416K4591J895m164r252J8695m7473K261P3487j9275j4509P1920j06885
10467a90125o827J36642m1182M2088M4510j0662o2791j5447O1183o6772o366k9876
$$ plain form
10455 -145625 -84677 -140756 -165390 -114192 -119872 -188166 -253192 -145332 -110856 -115829 -155213 -167406
10443 -167406 -113899 -119831 -109851 -87090 -209807 -135157 -58636 -137155 -102753 -47451 -139894 -98350
10431 -98350 -49342 -113556 -36169 56797 18028 -7835 31584 39794 62214 -8235 96456 209749
10419 209749 129294 127392 254116 198096 239001 254665 276357 152169 245294 211163 178628
10408 178628 245637 161407 196905 213785 249884 166358 239656 199582 143805 193856 137357
10397 137357 239129 256531 226125 228205 279830 276128 321738 316280 299763 395693 346575 466271
10385 466271 460144 537665 524247 510782 546507 625998 601589 643501 662750 748907 631862
10374 631862 786776 788989 827531 849146 841934 864173 860351 959176 957233 907355 997182 1009509
$$ packed form
10455a45625O0948n6079k4634N1198n680o8294o5026J07860L4476m973l9384j2193
10443a67406N3507n932R980K2761j22717P4650P6521p8519L4402N5302r2443M1544
10431i8350M9008o4214P7387R2966l8769k5863L9419Q210K2420p0449J04691J13293
10419B09749q0455j902J26724n6020M0905J5664K1692j24188R3125l4131l2535
10408A78628O7009q4230L5498J6880L6099q3526P3298m0074n5777N0051n6499
10397A37357J01772J7402l0406K080N1625l702M5610n458j6517R5930m9118J19696
10385D66271o127P7521j3418j3465L5725P9491k4409M1912J9249Q6157j17045
10374F31862J54914K213L8542K1615p212K2239l822R8825j943m9878Q9827J2327
$$ plain form
10362 1009509 921283 951715 1022008 1019858 1141682 1108782 1141754 1241445 1296129 1283871 1391010
10351 1391010 1340228 1464539 1615268 1639701 1732206 1747964 1937285 2033565 2124600 2198181 2291011
10340 2291011 2475253 2592440 2689833 2864176 3054307 3207008 3481838 3685143 3864607 4039437
10330 4039437 4381614 4566755 4926249 5172863 5478109 5847710 6271744 6638413 7013687
10321 7013687 7399189 7949251 8422901 9014704 9650574 10261499 11055804 12002236 13051135
10312 13051135 14309384 15829790 17461866 19505860 21612738 23748730 25652122 27085140
10304 27085140 28340535 29455098 30665061 32059076 33404432 34686431 35521493 35868215
10296 35868215 35599105 34950172 33914510 32759670 31509046 30256210 29195920 27872279
$$ packed form
10362A009509q8226L0432P0293k150J21824l2900L2972R9691N4684j2258J07139
10351A391010n0782J24311J50729K4433R2505J5758J89321R6280R1035P3581R2830
10340B291011J84242J17187R7393J74343J90131J52701K74830K03305J79464J74830
10330D039437L42177J85141L59494K46614L05246L69601M24034L66669L75274
10321G013687L85502N50062M73650N91803O35870O10925P94305R46432J048899
10312A3051135J258249J520406J632076K043994K106878K135992J903392J433018
10304B7085140J255395J114563J209963J394015J345356J281999Q35062L46722
10296C5868215k69110o48933j035662j154840j250624j252836j060290j323641
$$ plain form
10288 27872279 26181634 24091665 21800056 19673765 17636321 15775488 14290270 12925912
10280 12925912 11758441 10786300 10001830 9149538 8574285 7906951 7403532 6955020 6598966
10271 6598966 6192575 5840653 5561704 5197254 4918293 4625513 4456933 4339216 4055573
10262 4055573 3872478 3720727 3637399 3422847 3272408 3144536 3071021 2957985 2793407 2681944
10252 2681944 2694325 2563299 2417304 2450955 2356184 2284041 2256628 2213364 2195072 2045365 2040757
10241 2040757 1987723 1837098 1824996 1835374 1676195 1683509 1549971 1547350 1557860 1499671 1563493
10230 1563493 1408002 1443949 1430267 1464618 1324658 1281467 1301562 1377664 1355173 1316158 1270664
10219 1270664 1275618 1288617 1285956 1267817 1313586 1346125 1368023 1270273 1289142 1346667 1228333
$$ packed form
10288B7872279j690645k089969k291609k126291k037444j860833j485218j364358
10280A2925912j167471r72141p84470q52292n75253o67334n03419m48512l56054
10271F598966m06391l51922k78949l64450k78961k92780j68580j17717k83643
10262D055573j83095j51751q3328k14552j50439j27872p3515j13036j64578j11463
10252B681944J2381j31026j45995L3651r4771p2143k7413m3264j8292j49707m608
10241B040757n3034j50625j2102J0378j59179P314j33538k621J0510n8189O3822
10230A563493j55491L5947j3682L4351j39960m3191K0095P6102k2491l9015m5494
10219A270664M954J2999k661j8139M5769L2539K1898r7750J8869N7525j18334
$$ plain form
10208 1228333 1319037 1361607 1350595 1360365 1290037 1390123 1401932 1297398 1365346 1414598 1484504
10197 1484504 1397046 1438078 1431839 1483162 1559447 1484504 1567484 1498379 1618288 1587728 1678568
10186 1678568 1688402 1753098 1792205 1732426 1702844 1784866 1762139 1671314 1716153 1553430 1541365
10175 1541365 1621537 1474676 1518575 1511738 1512043 1490461 1409406 1471386 1380204 1431819 1428262 1350003
10163 1350003 1370728 1424301 1455354 1492244 1544979 1576758 1669799 1606979 1701172 1695182 1757311
10152 1757311 1843156 1843805 1931245 1918928 1986671 2079179 2064994 2081449 2133217 2236734 2253445
10141 2253445 2374941 2376644 2527960 2559716 2725786 2744494 2881145 3003864 3166157 3300052
10131 3300052 3468336 3630476 3755730 4003066 4207119 4431355 4730567 5008952 5329360
$$ packed form
10208A228333R0704M2570j1012R770p0328J00086J1809j04534O7948M9252O9906
10197A484504q7458M1032o239N1323P6285p4943Q2980o9105J19909l0560R0840
10186A678568R834O4696L9107n9779k9582Q2022k2727r0825M4839j62723j2065
10175A541365Q0172j46861M3899o837L05k1582q1055O1980r1182N1615l557p8259
10163A350003K0725N3573L1053L6890N2735L1779R3041o2820R4193n990O2129
10152A757311Q5845O49Q7440j2317O7743R2508j4185J6455N1768J03517J6711
10141B253445J21496J703J51316L1756J66070J8708J36651J22719J62293J33895
10131C300052J68284J62140J25254K47336K04053K24236K99212K78385L20408
$$ plain form
10122 5329360 5613773 5986065 6303033 6742078 7095874 7513708 8003743 8467868 9043037
10113 9043037 9602859 10144089 10789842 11497575 12415753 13261798 14252136 15461145 16798983
10104 16798983 18447835 20454920 22531404 24997243 27729547 30601041 33339296 35888946
10096 35888946 37908058 39499987 40693548 41152897 40890772 40027674 38516760 36299956
10088 36299956 33877630 30972783 28098688 25181394 22589552 20297573 18317802 16615006
10080 16615006 15072495 13763397 12712213 11670658 10902535 10047493 9496636 8793308 8215099
10071 8215099 7824655 7362666 7011941 6473481 6254213 5865164 5643507 5289268 4967555
10062 4967555 4832519 4516580 4258718 4159260 4005437 3786949 3683311 3516328 3345384 3216252
$$ packed form
10122E329360K84413L72292L16968M39045L53796M17834M90035M64125N75169
10113I043037N59822N41230O45753P07733R18178Q46045R90338J209009J337838
10104A6798983J648852K007085K076484K465839K732304K871494K738255K549650
10096C5888946K019112J591929J193561M59349k62125q63098j510914k216804
10088C6299956k422326k904847k874095k917294k591842k291979j979771j702796
10080A6615006j542511j309098j051184j041555p68123q55042n50857p03328n78209
10071H215099l90444m61989l50725n38460k19268l89049k21657l54239l21713
10062D967555j35036l15939k57862r9458j53823k18488j03638j66983j70944j29132
$$ plain form
10052 3216252 3088317 2981340 2863089 2780262 2709917 2720093 2496435 2472437 2417292 2312571
10042 2312571 2218525 2156491 2113062 2039247 1905753 1953151 1881505 1788403 1762150 1686125 1658984
10031 1658984 1579838 1522566 1457928 1516950 1448436 1411574 1349724 1371899 1305215 1332451 1283029
10020 1283029 1202380 1156313 1179306 1209254 1212092 1213733 1198256 1203334 1090509 1131804 1102690 1077856
10008 1077856 1211403 1069821 1048297 1112242 1076653 1040095 1016037 1004884 940668 920306 924302
9997 924302 878410 880918 881446 970085 935300 872118 895134 924499 788414 850607 815534 845815
9985 845815 896612 888976 947616 931174 951828 970776 894116 970302 969869 901241 913293 928937
9973 928937 931531 968917 986869 922910 814138 930729 935303 942555 863498 901068 875012 861915
$$ packed form
10052C216252j27935j06977j18251q2827p0345J0176k23658k3998n5145j04721
10042B312571r4046o2034m3429p3815j33494M7398p1646r3102k6253p6025k7141
10031A658984p9146n7272o4638N9022o8514l6862o1850K2175o6684K7236m9422
10020A283029q0649m6067K2993K9948K838J641j5477N078j12825M1295k9114k4834
10008A077856J33547j41582k1524O3945l5589l6558k4058j1153o4216k0362L996
9997I24302m5892K508N28Q8639l4785o3182K3016K9365j36085O2193l5073L0281
9985H45815N0797p636N8640j6442K0654J8948p6660P6186m33o8628J2052J5644
9973I28937K594L7386J7952o3959j08772J16591M574P252p9057L7570k6056j3097
$$ plain form
9961 861915 812741 816559 889134 733493 809719 817219 809434 832875 805863 804505 834686 721151
9949 721151 752165 743118 681109 794849 781341 775405 721075 722889 781629 797686 823543 679428
9937 679428 735683 818321 738138 644276 791685 777446 733335 736154 754919 773858 755058 868576
9925 868576 713149 832305 759178 796528 837457 819585 847843 785435 917322 842838 871562
9914 871562 868606 881183 846502 842929 898414 964090 889751 1001192 948180 874968 869276 926117
9902 926117 1052612 1008927 955740 1065524 1051285 999523 1073748 1032528 1031106 1190880 1074039
9891 1074039 1134745 1252826 1317788 1349689 1415125 1449411 1498112 1521029 1625361 1720458 1741054
9880 1741054 1788810 1960688 2033737 2111368 2241471 2407507 2524890 2577161 2795743 3012309
$$ packed form
9961H61915m9174L818P2575j55641P6226P500p785K3441k7012j358L0181j13535
9949G21151L1014r047o2009J13740j3508n936n4330J814N8740J6057K5857j44115
9937F79428N6255Q2638q0183r3862J47409j4239m4111K819J8765J8939j8800J13518
9925H68576j55427J19156p3127L7350M0929j7872K8258o2408J31887p4484K8724
9914H71562k956J2577l4681l573N5485O5676p4339J11441n3012p3212n692N6841
9902I26117J26495m3685n3187J09784j4239n1762P4225m1220j422J59774j16841
9891A074039O0706J18081O4962L1901O5436L4286M8701K2917J04332R5097K0596
9880A741054M7756J71878P3049P7631J30103J66036J17383N2271K18582K16566
$$ plain form
9870 3012309 3085484 3261755 3494840 3695824 3853702 4128019 4389082 4727986 5008492 5332963
9860 5332963 5682499 6163025 6682838 7228416 7933602 8558836 9395319 10337999 11410329
9851 11410329 12517897 13536256 14455261 15219834 15940550 16468246 17122673 17513610 17933404
9842 17933404 18145095 18252477 18395935 18330996 18219363 17905781 17472805 17196258 16697690 16086148
9832 16086148 15600680 14754900 13940295 13197357 12602983 12003395 11462193 11060411 10892389
9823 10892389 10603513 10628332 10627595 10864884 11062669 11429021 11953446 12617616 13317928 14134623
9813 14134623 15009940 15805495 16587534 17097023 17608397 17913579 18323764 18585907 18755923
9804 18755923 18698445 18634240 18220130 17795673 17413449 16867042 16343647 15681994 14973156 14173977
$$ packed form
9870C012309P3175J76271K33085K00984J57878K74317K61063L38904K80506L24471
9860E332963L49536M80526N19813N45578P05186O25234Q36483R42680J072330
9851A1410329J107568J018359R19005P64573P20716N27696O54427L90937M19794
9842A7933404K11691J07382J43458o4939j11633l13582m32976k76547m98568o11542
9832A6086148m85468q45780q14605p42938n94374n99588n41202m01782j68022
9823A0892389k88876K4819p37K37289J97785L66352N24425O64170P00312Q16695
9813A4134623Q75317P95555P82039N09489N11374L05182M10185K62143J70016
9804A8755923n7478o4205m14110m24457l82224n46407n23395o61653p08838p99179
$$ plain form
9794 14173977 13251908 12315589 11202662 10206546 9242688 8476186 7775160 7180043 6555246
9785 6555246 6060040 5591755 5219611 4845508 4639636 4328151 4066760 3840193 3668091 3499659
9775 3499659 3255211 3139049 2917916 2815824 2693701 2549695 2521701 2317249 2286946 2234358
9765 2234358 2084415 2066489 1932640 1834080 1752988 1656695 1710228 1615311 1599827 1426474 1529966
9754 1529966 1359011 1362288 1312089 1241759 1228960 1173239 1196642 1194017 1171394 1099229 1093670 1015138
9742 1015138 989777 953541 945470 993889 986848 934820 920538 878023 869147 888145 891654 864844
9730 864844 759004 818184 787586 840156 837469 859149 760948 794833 716898 783141 730332 713434
9718 713434 649555 650367 692488 644867 561101 553475 583013 571419 506952 564032 574703 492925
$$ packed form
9794A4173977r22069r36319j112927r96116r63858p66502p01026n95117o24797
9785F555246m95206m68285l72144l74103k05872l11485k61391k26567j72102j68432
9775C499659k44448j16162k21133j02092j22123j44006k7994k04452l0303n2588
9765B234358j49943j7926j33849r8560q1092r6293N3533r4917j5484j73353J03492
9754A529966j70955L277n0199p0330j2799n5721K3403k625k2623p2165n559p8532
9742A015138k5361l6236q071M8419p041n2028j4282m2515q876J8998L509k6810
9730H64844j05840N9180l0598N2570k687K1680r8201L3885p7935O6243n2809j6898
9718G13434o3879Q12M2121m7621q3766p626K9538j1594o4467N7080J0671q1778
$$ plain form
9706 492925 526123 514635 521107 503417 431359 475028 416544 462438 375311 406615 425648 411208
9694 411208 398278 417893 382757 393639 317806 407562 318377 298466 294527 311011 361775 356067
9682 356067 237349 278495 316395 249913 281861 276563 283985 235112 279762 232331 222638 256237
9670 256237 242694 192419 199723 240462 240247 201541 222295 253999 235714 188270 198759 187000
9658 187000 155349 135413 143451 109635 105432 164922 132047 208034 91626 121757 254446 145301
9646 145301 180480 126366 100633 184583 165596 114842 171324 136713 155505 161298 171034 191205
9634 191205 190894 71650 113885 202908 65813 85645 113707 -16334 32046 -40256 18779
9623 18779 73085 416 34152 -40221 -36501 15012 -51018 44246 -50611 -52646 -9139 -61967
$$ packed form
9706D92925L3198j1488O472j7690p2058M3669n8484M5894q7127L1304J9033j4440
9694D11208j2930J9615l5136J0882p5833Q9756q9185j9911l939J6484N0764n708
9682C56067j18718M1146L7900o6482L1948n298P422m8873M4650m7431r693L3599
9670B56237j3543n0275P304M0739k15l8706K0754L1704j8285m7444J0489j1759
9658A87000l1651j9936Q038l3816m203N9490l2875P5987j16408L0131J32689j09145
9646A45301L5179n4114k5733Q3950j8987n0754N6482l4611J8792N793R736K0171
9634A91205l11j19244M2235Q9023j37095J9832K8062j30041M8380p2302N9035
9623A8779N4306p2669L3736p4373L720N1513o6030R5264r4857k035M3507n2828
$$ plain form
9611 -61967 -21311 -83775 -24799 -109804 32693 -65001 -83550 -1772 -46211 -83816 -5993 -33365
9599 -33365 -70300 10159 -43692 -27102 -43311 7792 -96305 -57077 -48574 -144262 -91431 -95903
9587 -95903 -52717 -88419 -102476 -95138 -24583 -65776 -64980 -113354 -108688 -90526 -172099 -41682
9575 -41682 -82136 -120477 -67414 16215 -63098 29364 -108913 -83725 -49114 -44467 -91323 -62461
9563 -62461 -54606 -45536 6953 -45832 -108272 -30786 -96085 -55623 -78816 -23857 -57839 -74427
9551 -74427 -146725 -91498 -141910 -138154 -141052 -28659 -25090 -161549 -69846 -175149 -149222 -117489
9539 -117489 -88026 -102246 -39375 -72042 -94833 -42441 1601 -122578 -47194 -139495 -35071
9528 -35071 -38124 -88634 -60586 -58112 -7762 -152413 -73760 -55860 26886 -38668 4827 -20224
$$ packed form
9611f1967M0656o2464N8976q5005J42497r7694j8549Q1778m4439l7605P7823k7372
9599c3365l6935Q0459n3851J6590j6209N1103j04097L9228Q503r5688N2831m472
9587i5903M3186l5702j4057P338P0555m1193P96m8374M666J8162q1573J30417
9575d1682m0454l8341N3063Q3629p9313R2462j38277K5188L4611M647m6856K8862
9563f2461P855R070N2489n2785o2440P7486o5299M0462k3193N4959l3982j6588
9551g4427p2298N5227n0412L756k898J12393L569j36459R1703j05303K5927L1733
9539a17489K9463j4220O2871l2667k2791N2392M4042j24179P5384r2301J04424
9528c5071l053n0510K8048K474N0350j44651P8653J7900Q2746o5554M3495k5051
$$ plain form
9516 -20224 -2946 -65225 -66362 -116916 -34272 -95038 -61392 -83572 -111994 -41433 -71235 -20725
9504 -20725 -61025 -32699 -21957 -89336 5465 47048 -76355 -33814 -60476 -80746 -128138 -145467
9492 -145467 -142959 -43495 -139246 69539 -60578 -111809 -175621 -120045 -67876 -127529 -105346
9481 -105346 -50199 -88932 30785 -70535 -60032 -75814 30336 -101924 -24445 -114825 -15077
9470 -15077 -33340 -2596 -30225 -34472 -7075 -125534 -25104 -43759 -4376 5071 20551 31243
9458 31243 49742 -60545 26470 -86010 21434 -76714 -83733 -19180 -25821 -91618 -103208 -78334
9446 -78334 -106151 -2642 -69461 -94307 -130450 -78367 -83894 -77856 -94938 -53587 -65509 -51767
9434 -51767 27400 -51140 -23917 -90676 -70583 -46048 14949 -9093 -23925 -35907 -75093 -77505
$$ packed form
9516b0224J7278o2279j137n0554Q2644o0766L3646k2180k8422P0561k9802N0510
9504b0725m0300K8326J0742o7379R4801M1583j23403M2541k6662k0270m7392j7329
9492a45467K508R9464r5751K08785j30117n1231o3812N5576N2169n9653K2183
9481a05346N5147l8733J19717j01320J0503j5782J06150j32260P7479r0380R9748
9470a5077j8263L0744k7629m247K7397j18459J00430j8655L9383R447J5480J0692
9458C1243J8499j10287Q7015j12480J07444r8148p019O4553o641o5797j1590K4874
9446g8334k7817J03509o6819k4846l6143N2083n527O038j7082M1351j1922J3742
9434e1767P9167p8540K7223o6759K0093K4535O0997k4042j4832j1982l9186k412
$$ plain form
9422 -77505 -15348 -17887 -66754 -45559 -8927 -101859 -123230 -65635 -189645 -66422 -14023 -70397
9410 -70397 -201435 -138317 -209126 -200813 -199238 -130254 -180874 -236912 -202114 -244117 -203226 -170338
9398 -170338 -214384 -199360 -215404 -180402 -136716 -193178 -242833 -189049 -119719 -157745 -154134 -163502
9386 -163502 -210538 -194533 -222470 -192722 -209415 -169639 -192992 -250256 -282959 -224096 -183849 -222230
9374 -222230 -216653 -230509 -232589 -228748 -252950 -183870 -205774 -168823 -126695 -180827 -208707 -216110
9362 -216110 -190405 -187124 -225040 -245842 -172285 -228683 -311402 -191516 -285784 -228236 -216768 -160940
9350 -160940 -263668 -251785 -257369 -322268 -272366 -212822 -192394 -297598 -257514 -253512 -218661 -160889
9338 -160889 -167339 -152493 -268808 -169601 -259790 -265231 -124327 -161935 -190042 -227550 -160966 -233927
$$ packed form
9422g7505O2157k539m8867K1195L6632r2932k1371N7595j24010J23223N2399n6374
9410g0397j31038O3118p0809Q313J575O8984n0620n6038L4798m2003M0891L2888
9398a70338m4046J5024j6044L5002M3686n6462m9655N3784O9330l8026L611r368
9386a63502m7036J6005k7937K9748j6693L9776k3353n7264l2703N8863M0247l8381
9374b22230N577j3856k080L841k4202O9080k1904L6951M2128n4132k7880p403
9362b16110K5705L281l7916k0802P3557n6398q2719J19886r4268N7548J1468N5828
9350a60940j02728J1883n584o4899M9902N9544K0428j05204M0084M002L4851N7772
9338a60889o450J4846j16315R9207r0189n441J40904l7608k8107l7508O6584p2961
$$ plain form
9326 -233927 -194143 -254601 -212967 -249538 -173557 -129829 -202102 -192278 -173596 -201964 -189120 -262073
9314 -262073 -235788 -131749 -125765 -164905 -159543 -221190 -230573 -262336 -148246 -211011 -194158 -138696
9302 -138696 -291202 -226346 -112554 -190684 -218638 -195268 -87577 -195034 -261345 -212676 -160834
9291 -160834 -142426 -127637 -137948 -145028 -172889 -189064 -168532 -62543 -141976 -224294 -160228 -141600
9279 -141600 -164914 -135015 -163538 -64309 -160696 -76521 -90687 -87564 -136962 -25191 13881 -1744
9267 -1744 -63228 -101363 -56444 -97150 -87340 -83689 61068 -10460 -13257 -31490 60007 36942
9255 36942 -42322 -47391 -51543 99536 8851 77137 -62156 971 59198 28995 53 28925
9243 28925 5387 10572 94873 12069 40110 111378 140279 62276 85953 118221 142142 170230
$$ packed form
9326b33927L9784o0458M1634l6571P5981M3728p2273R824J8682k8368J2844p2953
9314b62073K6285J04039N984l9140N362o1647r383l1763J14090o2765J6853N5462
9302a38696j52506O4856J13792p8130k7954K3370J07691j07457o6311M8669N1842
9291a60834J8408J4789j0311p080k7861j6175K0532J05989p9433q2318O4066J8628
9279a41600k3314K9899k8523R9229r6387Q4175j4166L123m9398J11771L9072j5625
9267a744o1484l8135M4919m0706R810L651J44757p1528k797j8233R1497k3065
9255C6942p9264n069m152J51079r0685O8286j39293O3127N8227l0203k8942K8872
9243B8925k3538N185Q4301q2804K8041P1268K8901p8003K3677L2268K3921K8088
$$ plain form
9231 170230 70146 145668 171843 191613 207348 236582 227313 216496 204620 254654 226244 264112
9219 264112 283901 307276 403831 402677 329481 388736 356587 418510 408429 344635 358460 462773
9207 462773 431467 614691 493482 542654 576941 544153 624297 621123 631748 728542 737053 731685
9195 731685 764355 776318 847641 867498 897100 949876 939675 1090939 1095131 1202663 1195598 1258619
9183 1258619 1298828 1425032 1505045 1588719 1720729 1726710 1768704 1882058 1991843 2108840 2313305
9172 2313305 2390777 2550021 2758129 2969587 3163282 3458169 3700621 4042746 4245362 4466584
9162 4466584 4585059 4847987 5148611 5422694 5663572 5876987 6395401 6783308 7205388 7849717
9152 7849717 8360003 9081120 9764471 10799147 11865158 13336617 15015314 16991252 19311594
$$ packed form
9231A70230j00084P5522K6175J9770J5735K9234r269j0817j1876N0034k8410L7868
9219B64112J9789K3375R6555j154p3196N9255l2149O1923j0081o3794J3825J04313
9207D62773l1306J83224j21209M9172L4287l2788Q0144l174J0625R6794Q511n368
9195G31685L2670J1963P1323J9857K9602N2776j0201J51264M192J07532p065O3021
9183A258619M0209J26204Q0013Q3674J32010N981M1994J13354J09785J16997K04465
9172B313305P7472J59244K08108K11458J93695K94887K42452L42125K02616K21222
9162D466584J18475K62928L00624K74083K40878K13415N18414L87907M22080O44329
9152G849717N10286P21117O83351J034676J066011J471459J678697J975938K320342
$$ plain form
9143 19311594 21635174 23640423 24891944 25223383 24518347 22935565 21049256 19095554
9135 19095554 17360328 15787077 14420029 13453892 12508094 11802243 11357510 10980612 10638628
9126 10638628 10442376 10316098 10322071 10271851 10401617 10514580 10695414 10980027 11403189 11808410
9116 11808410 12425198 13015244 13840178 14939863 16207991 17892079 19816102 22208254 24547875
9107 24547875 26765986 28252054 28649157 27960161 26110042 23803697 21319244 18800877
9099 18800877 16710917 14791767 13261773 11850951 10613490 9814929 8849942 8236421 7650969
9090 7650969 7184896 6679260 6346954 6033093 5711827 5377101 5179815 4891295 4620068 4515726
9080 4515726 4440379 4333823 4099137 3974173 3765936 3615359 3462615 3325422 3103006 2925610
$$ packed form
9143A9311594K323580K005249J251521L31439p05036j582782j886309j953702
9135A9095554j735226j573251j367048r66137r45798p05851m44733l76898l41984
9126A0638628j96252j26278N973n0220J29766J12963J80834K84613M23162M05221
9116A1808410O16788N90046Q24934J099685J268128J684088J924023K392152K339621
9107B4547875K218111J486068L97103o88996j850119k306345k484453k518367
9099A8800877k089960j919150j529994j410822j237461p98561r64987o13521n85452
9090G650969m66073n05636l32306l13861l21266l34726j97286k88520k71227j04342
9080D515726p5347j06556k34686j24964k08237j50577j52744j37193k22416j77396
$$ plain form
9070 2925610 2870779 2641106 2579534 2447788 2345818 2242347 2183518 2079597 1987993 1889126
9060 1889126 1840832 1812128 1809722 1739773 1645585 1617368 1585792 1499355 1513434 1491735 1479586 1360042
9048 1360042 1418540 1384088 1347351 1435620 1383500 1290966 1308095 1323047 1156868 1186475 1063160
9037 1063160 1019429 941793 1015872 1021022 933976 931389 881824 833984 852062 837007 737791 724978
9025 724978 827240 817128 819952 749558 746013 726917 732740 800471 831660 780012 816968 749267
9013 749267 801301 781718 889227 849905 727403 805651 729586 732242 766850 746780 625752
9002 625752 661360 656591 655581 574271 572610 636872 546455 661538 587505 661470 681773 676001
8990 676001 603344 602425 653460 580336 570410 609198 533003 550210 570835 524387 597378 560248
$$ packed form
9070B925610n4831k29673o1572j31746j01970j03471n8829j03921r1604r8867
9060A889126m8294k8704k406o9949r4188k8217l1576q6437J4079k1699j2149j19544
9048A360042N8498l4452l6737Q8269n2120r2534J7129J4952j66179K9607j23315
9037A063160m3731p7636P4079N150q7046k587m9565m7840J8078j5055r9216j2813
9025G24978J02262j0112K824p0394l545j9096N823O7731L1189n1648L6956o7701
9013G49267N2034j9583J07509l9322j22502P8248p6065K656L4608k0070j21028
9002F25752L5608m769j010q1310j661O4262r0417J15083p4033P3965K0303n772
8990F76001p2657r19N1035p3124r926L8788p6195J7207K0625m6448P2991l7130
$$ plain form
8978 560248 556138 548493 598261 540102 654653 653430 656336 589970 650393 631307 648646 680925
8966 680925 646880 715889 711468 692304 783307 687207 731580 782222 825440 633256 764241
8955 764241 657288 651706 669809 686867 671244 702207 693147 661083 650219 627071 602143 682346
8943 682346 734411 568589 604599 606801 627885 621206 676236 624560 590320 684346 667507 665987
8931 665987 561292 664110 613209 591356 589919 635445 644612 644381 656585 789250 720409 687821
8919 687821 698334 660991 690228 703296 685776 745130 722875 758161 795273 745857 857455
8908 857455 899748 931360 953908 1005173 1066595 1113170 1025081 1089625 1224089 1253703 1241312
8897 1241312 1258403 1306382 1304953 1209737 1227657 1319118 1316491 1375930 1320208 1348689 1385623 1352963
$$ packed form
8978E60248m110p645M9768n8159J14551j223K906o6366O0423j9086J7339L2279
8966F80925l4045O9009m421j9164R1003r6100M4373N0642M3218j92184J30985
8955G64241j06953n582J8103J7058j5623L0963r060l2064j0864k3148k4928Q0203
8943F82346N2065j65822L6010K202K1084o679N5030n1676l4240R4026j6839j520
8931F65987j04695J02818n0901k1853j437M5526R167k31J2204J32665o8841l2588
8919F87821J0513l7343K9237J3068j7520N9354k2255L5286L7112m9416J11598
8908H57455M2293L1612K2548N1265O1422M6575q8089O4544J34464K9614j2391
8897A241312J7091M7979j429r5216J7920R1461k627N9439n5722K8481L6934l2660
$$ plain form
8885 1352963 1417589 1404279 1257538 1441446 1448815 1389690 1352413 1431622 1477265 1483219 1530786
8874 1530786 1529897 1454965 1569836 1642748 1662730 1793478 1839704 1948502 1871371 2048456 2145887
8863 2145887 2176611 2278621 2449729 2437397 2585110 2703028 2886879 2992222 3035745 3288785
8853 3288785 3416449 3593126 3806731 3989065 4177794 4513250 4769363 5058503 5445522 5752925
8843 5752925 6088737 6370733 6783516 7116966 7620588 8268187 8769877 9330021 9979081 10639975
8833 10639975 11458393 12214976 13065547 14206348 15515059 16992564 18877246 21117952 23798243
8824 23798243 26698371 29851492 32537829 34554758 35766029 35929941 35443222 35000174 34930051
8815 34930051 35311769 36143511 37006237 37264066 36963452 35469423 32995393 29858548 26756253
$$ packed form
8885A352963O4626j3310j46741J83908P369n9125l7277P9209M5643N954M7567
8874A530786q89p4932J14871P2912J9982J30748M6226J08798p7131J77085R7431
8863B145887L0724J02010J71108j2332J47713J17918J83851J05343M3523K53040
8853C288785J27664J76677K13605J82334J88729L35456K56113K89140L87019L07403
8843E752925L35812K81996M12783L33450N03622O47599N01690N60144O49060O60894
8833A0639975Q18418P56583Q50571J140801J308711J477505J884682K240706K680291
8824B3798243K900128L153121K686337K016929J211271J63912m86719m43048p0123
8815C4930051L81718Q31742Q62726K57829l00614j494029k474030l136845l102295
$$ plain form
8806 26756253 23859780 21234683 18949162 17051971 15310390 13981663 12807606 11778244
8798 11778244 10948250 10223727 9570078 9027108 8485685 8025168 7613548 7160015 6897389
8789 6897389 6436740 6179616 5955608 5657247 5160374 4981974 4623635 4393497 4255389 4149800
8779 4149800 3929675 3733416 3555478 3461330 3342804 3198236 3138932 2976589 2874689 2747959
8769 2747959 2698263 2616919 2590659 2485365 2424830 2292897 2251949 2221188 2279547 2083997 2057622
8758 2057622 2029757 2059052 1956399 1958564 1908800 1887285 1838193 1762026 1693642 1720137 1711920 1629514
8746 1629514 1661336 1712918 1570936 1516007 1460114 1484318 1410159 1453002 1364832 1346267 1385238
8735 1385238 1420846 1390930 1354401 1389763 1390168 1382661 1352793 1383829 1298606 1290978 1295928 1299917 1331940
$$ packed form
8806B6756253k896473k625097k285521j897191j741581j328727j174057j029362
8798A1778244q29994p24523o53649n42970n41423m60517m11620m53533k62626
8789F897389m60649k57124k24008k98361m96873j78400l58339k30138j38108j05589
8779D149800k20125j96259j77938r4148j18526j44568n9304j62343j01900j26730
8769B747959m9696q1344k6260j05294o0535j31933m0948l0761N8359j95550k6375
8758B057622k7865K9295j02653K165m9764k1515m9092p6167o8384K6495q217q2406
8746A629514L1822N1582j41982n4929n5893K4204p4159M2843q8170j8565L8971
8735A385238L5608k9916l6529L5362M05p507k9868L1036q5223p628M950L989L2023
$$ plain form
8722 1331940 1238136 1268826 1246487 1261785 1202145 1149108 1218529 1165296 1104290 1114000 1148148 1115529
8710 1115529 1182395 1163798 1210016 1140539 1154199 1140071 1147868 1223958 1220349 1108592 1203610 1207353
8698 1207353 1252000 1309707 1344099 1368961 1301571 1379800 1447350 1491305 1469136 1417858 1560140
8687 1560140 1612539 1626182 1600599 1673585 1632286 1730284 1792872 1748143 1784807 1775244 1865820 1929915
8675 1929915 1885042 2004490 2083837 2141263 2093235 2283606 2380951 2508054 2653622 2749915 2940774
8664 2940774 3069298 3251410 3537804 3678577 3898238 4148016 4372371 4630422 4798160 5041558
8654 5041558 5350193 5750506 6094955 6500279 6874924 7392533 7947159 8479531 9274844 9993697
8644 9993697 10975692 12176099 13623151 15391456 17202643 19086653 20468269 21377422 21465149
$$ packed form
8722A331940r3804L0690k2339J5298n9640n3037O9421n3233o1006R710L4148l2619
8710A115529O6866j8597M6218o9477J3660j4128P797P6090l609j11757R5018L743
8698A207353M4647N7707L4392K4862o7390P8229O7550M3955k2169n1278J42282
8687A560140N2399J3643k5583P2986m1299R7998O2588m4729L6664r563R0576O4095
8675A929915m4873J19448P9347N7426m8028J90371R7345J27103J45568R6293J90859
8664B940774J28524J82112K86394J40773K19661K49778K24355K58051J67738K43398
8654E041558L08635M00313L44449M05324L74645N17609N54626N32372P95313P18853
8644I993697R81995J200407J447052J768305J811187J884010J381616R09153Q7727
$$ plain form
8635 21465149 21116032 20629545 20435917 20459295 20809578 21102994 21473627 21482580 20878185 19826963
8625 19826963 18369477 16957699 15626728 14548850 13637212 12881002 12215821 11832283 11495005
8616 11495005 11207635 11093733 10964316 11208375 11374276 11573849 12058363 12579741 13393241
8607 13393241 14354503 15637675 17005486 18335093 19339898 19916606 19923612 19426548 18821338
8598 18821338 18453990 18174452 18254461 18482547 18610865 18490371 17864556 16713316 15144903
8589 15144903 13596671 12082615 10911046 9804903 8771871 8059873 7210842 6649156 6232500
8580 6232500 5729105 5418974 5024232 4731274 4392435 4266792 3999508 3816917 3585994 3418311
8570 3418311 3314528 3078447 2938816 2828845 2650673 2605074 2454814 2200405 2226132 2043345
$$ packed form
8635B1465149l49117m86487j93628K3378L50283K93416L70633Q953o04395j051222
8625A9826963j457486j411778j330971j077878r11638p56210o65181l83538l37278
8616A1495005k87370j13902j29417K44059J65901J99573M84514N21378Q13500
8607A3393241R61262J283172J367811J329607J004805N76708P006m97064o05210
8598A8821338l67348k79538Q0009K28086J28318j20494o25815j151240j568413
8589A5144903j548232j514056j171569j106143j033032p11998q49031n61686m16656
8580F232500n03395l10131l94742k92958l38839j25643k67284j82591k30923j67683
8570C418311j03783k36081j39631j09971j78172m5599j50260k54409K5727j82787
$$ plain form
8560 2043345 2090623 1944915 1805431 1687665 1720228 1735141 1727939 1528668 1600524 1444840 1426949
8549 1426949 1452523 1315368 1273870 1306011 1245354 1161600 1189015 1074489 1059649 1123361 1022367
8538 1022367 918088 967384 948055 931574 907874 880963 897413 952254 859111 593151 671459
8527 671459 758013 691190 757701 619523 730686 720070 704657 732488 636342 691734 646476
8516 646476 669265 620505 546966 638076 586934 574040 555371 612477 523933 500273 586984 581939
8504 581939 598896 461960 559538 548713 488083 416551 499228 594185 426909 489675 465315
8493 465315 495387 478053 318377 461296 371451 360641 411422 358842 342545 300377 229063
8482 229063 233386 252600 286399 237393 234702 273405 316210 144444 249375 223658 137536 284647
$$ packed form
8560B043345M7278j45708j39484j17766L2563J4913p202j99271P1856j55684j7891
8549A426949K5574j37155m1498L2141o0657q3754K7415j14526j4840O3712j00994
8538A022367j04279M9296j9329j6481k3700k6911J6450N4841r3143k65960P8308
8527F71459Q6554o6823O6511j38178J11163j0616j5413K7831r6146N5392m5258
8516F46476K2789m8760p3539R1110n1142j2894j8669N7106q8544k3660Q6711n045
8504E81939J6957j36936R7578j0825o0630p1532Q2677R4957j67276O2766k4360
8493D65315L0072j7334j59676J42919q9845j0810N0781n2580j6297m2168p1314
8482B29063M323J9214L3799m9006k691L8703M2805j71766J04931k5717q6122J47111
$$ plain form
8470 284647 163150 207253 286780 148434 246357 256587 165157 154990 75814 154744 124449
8459 124449 114165 57703 119311 149701 132731 114464 136081 136305 121440 48027 79982 97327
8447 97327 68946 94371 75602 114156 109103 22014 101062 106955 161039 118807 100286 104335
8435 104335 202716 217313 173774 143880 150982 152522 110240 117609 46418 185405 108691 117959
8423 117959 94472 39694 138616 75415 140407 126208 153990 113051 50900 33605 41245 33381
8411 33381 127963 83643 131707 94252 160360 96882 117871 97260 93946 204957 181069 18389
8399 18389 85049 95284 83299 71157 133641 203589 222329 226051 183247 176192 186911 191055
8387 191055 171709 114703 60613 156958 139496 160404 32448 125294 82846 57524 118191
$$ packed form
8470B84647j21497M4103P9527j38346R7923J0230r1430j0167p9176P8930l0295
8459A24449j0284n6462O1608L0390j6970j8267K1617K24j4865p3413L1955J7345
8447I7327k8381K5425j8769L8554n053q7089P9048N893N4084m2232j8521M049
8435A04335R8381J4597m3539k9894P102J540m2282P369p1191J38987p6714R268
8423A17959k3487n4778R8922o3201O4992j4199K7782m0939o2151j7295P640p864
8411C3381R4582m4320M8064l7455O6108o3478K0989k0611l314J11011k3888j62680
8399A8389O6660J0235j1985j2142O2484O9948J8740L722m2804p055J0719M144
8387A91055j9346n7006n4090R6345j7462K0908j27956R2846m2448k5322O0667
$$ plain form
8376 118191 157414 166947 69665 117881 148404 115684 125322 83147 66028 58134 44213 137572
8364 137572 51158 95083 198122 149823 208814 73549 104995 139568 104683 119917 164638
8353 164638 195478 215287 149901 134855 39745 192724 128064 133236 155673 224652 169264 109946
8341 109946 85940 195607 71380 73916 57307 54522 130470 144212 193041 121677 70484 172939
8329 172939 40727 63053 140938 144219 165491 164686 211107 289769 232602 279414 240318 247020
8317 247020 221158 251130 222972 287012 230336 247190 234142 234411 201492 200881 233600 284796
8305 284796 169332 184233 181450 155597 281605 148617 207553 191148 228180 231870 150479
8294 150479 179293 105621 209800 184398 251210 257018 219964 194591 210439 194070 180530 249237
$$ packed form
8376A18191L9223R533r7282M8216L0523l2720R638m2175j7119p894j3921R3359
8364A37572q6414M3925J03039m8299N8991j35265L1446L4573l4885J5234M4721
8353A64638L0840J9809o5386j5046r5110J52979o4660N172K2437O8979n5388n9318
8341A09946k4006J09667j24227K536j6609k785P5948J3742M8829p1364n1193J02455
8329A72939j32212K2326P7885L281K1272q05M6421P8662n7167M6812l9096O702
8317B47020k5862K9972k8158O4040n6676J6854j3048K69l2919o11L2719N1196
8305B84796j15464J4901k783k5853J26008j32988N8936j6405L7032L690q1391
8294A50479K8814p3672J04179k5402O6812N808l7054k5373J5848j6369j3540O8707
$$ plain form
8282 249237 168157 230308 225352 184782 152920 163751 202172 177045 109907 168493 300139 151112
8270 151112 89236 116939 134075 77556 102366 130410 136078 84837 173315 34427 138124
8259 138124 102691 129450 104332 85273 63589 100465 79313 97832 117110 139137 123024 191830
8247 191830 93438 189730 114473 178109 145183 154950 135316 120996 176484 195720 208637 134412
8235 134412 219556 196494 204440 151846 152472 161677 23706 295544 74914 124061 180786 134777
8223 134777 142595 140013 98401 240317 199968 214702 238590 162984 190091 177830 253478 227092
8211 227092 178569 63416 195426 252951 227610 227670 284000 229798 160055 192286 221320 246076
8199 246076 244472 222589 307785 215638 211694 81410 286509 574115 65554 154283 398931
$$ packed form
8282B49237q1080O2151m956m0570l1862J0831L8421k5127o7138N8586J31646j49027
8270A51112o1876K7703J7136n6519K4810K8044N668n1241Q8478j38888J03697
8259A38124l5433K6759k5118j9059k1684L6876k1152J8519J9278K2027j6113O8806
8247A91830r8392R6292p5257O3636l2926R767j9634j4320N5488J9236J2917p4225
8235A34412Q5144k3062P946n2594O26R205j37971K71838k20630M9147N6725m6009
8223A34777P818k582m1612J41916m0349J4734K3888p5606K7107j2261P5648k6386
8211B27092m8523j15153J32010N7525k5341O0N6330n4202o9743L2231K9034K4756
8199B46076j604k1883Q5196r2147l944j30284K05099K87606n08561Q8729K44648
$$ plain form
8188 398931 285941 260454 226266 303551 328300 288322 339912 325386 302757 357923 410444
8177 410444 445403 329884 309743 397779 343513 447278 286625 489267 407487 344397 417448
8166 417448 460248 375090 387574 488384 361512 359071 366843 403907 531958 354715 439389
8155 439389 488673 530652 534960 416401 506666 543363 560276 463448 476504 483320 573855 572949
8143 572949 593504 571130 593438 513608 590547 538231 487640 600367 635661 691964 699723 582807
8131 582807 747030 650788 648613 742588 709341 678267 724831 784067 667412 730592 750305
8120 750305 804517 809418 759784 823156 947191 865433 887162 911313 857739 904528 880708 835174
8108 835174 866766 916052 987134 1059397 935017 1001289 1030714 987405 1011830 1045346 1084112
$$ packed form
8188C98931j12990k5487l4188P7285K4749l9978N1590j4526k2629N5166N2521
8177D10444L4959j15519k0141Q8036n4266J03765j60653K02642q1780o3090P3051
8166D17448M2800q5158J2484J00810j26872k441P772L7064J28051j77243Q4674
8155D39389M9284M1979M308j18559R0265L6697J6913r6828J3056O816R0535r06
8143E72949K0555k2374K2308p9830P6939n2316n0591J12727L5294N6303P759j16916
8131E82807J64223r6242k175R3975l3247l1074M6564N9236j16655O3180J9713
8120G50305N4212M901m9634O3372J24035q1758K1729K4151n3574M6789k3820m5534
8108H35174L1592M9286P1082P2263j24380O6272K9425m3309K4425L3516L8766
$$ plain form
8097 1084112 953549 1120481 1020466 1100535 1079570 1206058 1122547 1115399 1082811 1319635 1139817
8086 1139817 1094471 1236730 1226372 1244805 1335319 1321480 1330307 1310131 1427576 1356622 1431998
8075 1431998 1417136 1421292 1469038 1518558 1468909 1589669 1528562 1538089 1510487 1566305 1572517 1605199
8063 1605199 1637866 1630128 1642822 1601095 1644460 1684302 1779461 1775578 1823268 1791693 1905894 1886715
8051 1886715 1851596 1892824 1917413 2045721 1929531 1935696 2029607 2040837 2046497 2088858 2076798
8040 2076798 2191355 2204212 2140893 2356306 2243261 2293034 2356484 2454424 2359371 2443132 2439936
8029 2439936 2503029 2541533 2618546 2567417 2694486 2776054 2690956 2816406 2877993 2801503 2904089
8018 2904089 2853407 2938404 3099301 3094003 3160886 3185479 3232611 3215690 3326171 3410299 3490516
$$ packed form
8097A084112j30563J66932j00015Q0069k0965J26488q3511p148l2588K36824j79818
8086A139817m5346J42259j0358J8433R0514j3839Q827k0176J17445p0954P5376
8075A431998j4862M156M7746M9520m9649J20760o1107R527k7602N5818O212L2682
8063A605199L2667p738J2694m1727M3365L9842R5159l883M7690l1575J14201j9179
8051A886715l5119M1228K4589J28308j16190O165R3911J1230N660M2361j2060
8040B076798J14557J2857o3319K15413j13045M9773O3450R7940r5053Q3761l196
8029B439936O3093L8504P7013n1129J27069Q1568q5098J25450O1587p6490J02586
8018B904089n0682Q4997J60897n298O6883K4593M7132j6921J10481Q4128Q0217
$$ plain form
8007 3490516 3496974 3565056 3629704 3704627 3753040 3836750 3881404 4036803 4060133 4095945 4088589 4337134
7995 4337134 4284730 4402861 4453463 4613061 4633710 4627659 4830619 4885222 4978400 5102191 5193240
7984 5193240 5166073 5300345 5354714 5616255 5574047 5637180 5888064 5938737 6005359 6165996 6264707
7973 6264707 6374606 6527505 6645979 6806446 6811899 6952108 7090154 7265832 7359038 7422659
7963 7422659 7556980 7675618 7862094 8010195 8109547 8292196 8432433 8536135 8768550 8890833
7953 8890833 9050602 9205425 9410014 9483564 9701858 9902306 10020748 10395106 10498405 10637934
7943 10637934 10903181 11051051 11365129 11593430 11847348 12160984 12475713 12772454 12934981
7934 12934981 13294213 13637151 13936406 14272113 14535593 15072569 15387004 15685845 16136251
$$ packed form
8007C490516O458O8082O4648P4923M8413Q3710M4654J55399K3330L5812p356K48545
7995D337134n2404J18131N0602J59598K0649o051K02960N4603R3178J23791R1049
7984E193240k7167J34272N4369K61541m2208O3133K50884N0673O6622J60637R8711
7973F264707J09899J52899J18474J60467N453J40209J38046J75678R3206O3621
7963G422659J34321J18638J86476J48101R9352J82649J40237J03702K32415J22283
7953H890833J59769J54823K04589P3550K18294K00448J18442L74358J03299J39529
7943A0637934K65247J47870L14078K28301K53918L13636L14729K96741J62527
7934A2934981L59232L42938K99255L35707K63480N36976L14435K98841M50406
$$ plain form
7925 16136251 16568527 17049996 17445836 17944925 18307311 18900978 19474039 20066213 20563608
7916 20563608 21181786 21833371 22425985 23166612 23871003 24565653 25302254 26218355 26972268
7907 26972268 27783165 28770446 29687863 30687324 31779807 32848424 33921314 35100232 36366799
7898 36366799 37682443 39057338 40479541 42055579 43617037 45316613 47055383 49013416
7890 49013416 50881148 53033469 55226054 57436197 60080252 62545492 65235659 68092029
7882 68092029 71225808 74443174 77800154 81384536 85176540 89045546 93243606 97523873
7874 97523873 102104014 106990782 112011078 117241725 122881488 128913724 135051089 141575775
7866 141575775 148423210 155685615 163345800 171313395 179636512 188240408 197192612 206419972
$$ packed form
7925A6136251M32276M81469L95840M99089L62386N93667N73061N92174M97395
7916B0563608O18178O51585N92614P40627P04391O94650P36601R16101P53913
7907B6972268Q10897R87281R17417R99461J092483J068617J072890J178918J266567
7898C6366799J315644J374895J422203J576038J561458J699576J738770J958033
7890D9013416J867732K152321K192585K210143K644055K465240K690167K856370
7882F8092029L133779L217366L356980L584382L792004L869006M198060M280267
7874I7523873M580141M886768N020296N230647N639763O032236O137365O524686
7866A41575775O847435P262405P660185P967595Q323117Q603896Q952204R227360
$$ plain form
7858 206419972 215624692 224943561 234067069 242890013 251462723 257523002 263719996 268355073
7850 268355073 271297856 272569112 272018108 269650119 265528118 259977298 253107844 245152357
7842 245152357 236468068 227206537 217783678 208168127 198785500 189334026 180326214 171618383
7834 171618383 163352977 155521325 147996321 140821999 134177837 127920114 121918800 116384871
7826 116384871 111097043 106132212 101355221 96943003 92731035 88825945 85087355 81459512
7818 81459512 78184859 74992403 72008281 69205300 66596347 64033316 61577305 59407770
7810 59407770 57248206 55155876 53276113 51393948 49704624 48002267 46377073 44890681
7802 44890681 43459105 42007659 40727234 39509978 38279675 37153374 36223877 34965600
$$ packed form
7858B06419972R204720R318869R123508Q822944Q572710O060279O196994M635077
7850B68355073K942783J271256n51004k367989m122001n550820o869454p955487
7842B45152357q684289r261531r422859r615551r382627r451474r007812q707831
7834A71618383q265406p831652p525004p174322o644162o257723o001314n533929
7826A16384871n287828m964831m776991m412218m211968l905090l738590l627843
7818H1459512l274653l192456k984122k802981k608953k563031k456011k169535
7810E9407770k159564k092330j879763j882165j689324j702357j625194j486392
7802D4890681j431576j451446j280425j217256j230303j126301r29497j258277
$$ plain form
7794 34965600 34051195 33131475 32254698 31388513 30545507 29692230 28962541 28240145 27515760
7785 27515760 26788341 26147104 25471242 24834603 24219949 23620413 23111253 22464461 22013951
7776 22013951 21519675 21083542 20602062 20168236 19708508 19317698 18902040 18444355 18084056
7767 18084056 17680669 17386783 17040354 16664821 16344353 16084817 15789634 15504102 15210153
7758 15210153 14905313 14660444 14348070 14135987 13891437 13652014 13304142 13144144 12856908
7749 12856908 12712744 12409576 12266036 11932753 11785791 11580450 11390667 11270823 11029500
7740 11029500 10855570 10638170 10486597 10339750 10110258 9956656 9879567 9620308 9535370 9408187
7730 9408187 9277309 9093022 9040842 8936810 8704447 8608371 8435403 8365708 8262097 8207785
$$ packed form
7794C4965600r14405r19720q76777q66185q43006q53277p29689p22396p24385
7785B7515760p27419o41237o75862o36639o14654n99536n09160o46792m50510
7776B2013951m94276m36133m81480m33826m59728l90810m15658m57685l60299
7767A8084056m03387k93886l46429l75533l20468k59536k95183k85532k93949
7758A5210153l04840k44869l12374k12083k44550k39423l47872j59998k87236
7749A2856908j44164l03168j43540l33283j46962k05341j89783j19844k41323
7740A1029500j73930k17400j51573j46847k29492j53602p7089k59259q4938j27183
7730I408187j30878j84287n2180j04032k32363r6076j72968o9695j03611n4312
$$ plain form
7720 8207785 8066257 7920002 7771113 7735246 7622260 7478144 7394428 7288331 7113135 7044374
7710 7044374 6961447 6855022 6803186 6805644 6666616 6550406 6513852 6411396 6305128 6320430 6215828
7699 6215828 6116824 6182822 6057114 5890439 5861118 5799176 5761294 5658033 5642184 5553608 5497583
7688 5497583 5495792 5400646 5283160 5259538 5197552 5155672 5040375 4949341 4987478 4918267 4795952
7677 4795952 4873608 4747348 4593816 4663152 4544218 4468340 4474451 4479074 4439647 4325245 4332943
7666 4332943 4295076 4230449 4217733 4224835 4121417 4138936 3985527 3932947 3949951 3920315 3851297
7655 3851297 3745208 3811206 3765532 3713052 3627132 3723740 3557568 3640852 3616713 3539553 3429976
7644 3429976 3426010 3400086 3423420 3309871 3308676 3367637 3243905 3229617 3132234 3169055 3088886
$$ packed form
7720H207785j41528j46255j48889l5867j12986j44116q3716j06097j75196o8761
7710G044374q2927j06425n1836K458j39028j16210l6554j02456j06268J5302j04602
7699F215828r9004O5998j25708j66675k9321o1942l7882j03261j5849q8576n6025
7688E497583j791r5146j17486k3622o1986m1880j15297r1034L8137o9211j22315
7677D795952P7656j26260j53532O9336j18934p5878O111M623l9427j14402P698
7666D332943l7867o4627j2716P102j03418J7519j53409n2580J7004k9636o9018
7655C851297j06089O5998m5674n2480q5920R6608j66172Q3284k4139p7160j09577
7644C429976l966k5924K3334j13549j195N8961j23732j4288r7383L6821q0169
$$ plain form
7633 3088886 3104095 3121480 3099572 3068570 3034257 2847136 2935146 2986111 2824979 2864901 2787848
7622 2787848 2874777 2680100 2766604 2702890 2746064 2639596 2711701 2733279 2639586 2594304 2638499
7611 2638499 2474985 2542941 2571439 2510614 2486522 2512001 2462710 2338591 2499383 2364426 2390104
7600 2390104 2278532 2341859 2478528 2310693 2276054 2301247 2241477 2223692 2224298 2225147 2227583 2181537
7588 2181537 2178659 2144102 2068588 2161677 2046880 2073493 2004276 2080415 2052186 1971087 1968661 1968078
7576 1968078 1972526 1960887 1991936 1920325 1869110 1929077 1919758 1957663 1951639 1871584 1845270 1895504
7564 1895504 1894473 1850029 1820874 1862955 1734601 1872953 1723544 1773654 1673823 1666547 1754912
7553 1754912 1721912 1693414 1797955 1727153 1653246 1713425 1722911 1625875 1580128 1650531 1565626
$$ packed form
7633C088886J5209J7385k1908l1002l4313j87121Q8010N0965j61132L9922p7053
7622B787848Q6929j94677Q6504o3714M3174j06468P2105K1578r3693m5282M4195
7611B638499j63514O7956K8498o0825k4092K5479m9291j24119J60792j34957K5678
7600B390104j11572O3327J36669j67835l4639K5193n9770j7785O06Q49K436m6046
7588B181537k878l4557p5514R3089j14797K6613o9217P6139k8229q1099k426n83
7576A968078M448j1639L1049p1611n1215N9967r319L7905o024q0055k6314N0234
7564A895504j031m4444k9155M2081j28354J38352j49409N0110r9831p276Q8365
7553A754912l3000k8498J04541p0802p3907O0179R486r7036m5747P0403q4905
$$ plain form
7542 1565626 1583398 1582015 1640827 1579508 1571893 1647977 1712480 1558803 1527699 1485532 1565871 1492828
7530 1492828 1534299 1523786 1523217 1435353 1514588 1429356 1382913 1394369 1449088 1402875 1420106 1395371
7518 1395371 1416768 1409165 1425414 1343458 1321769 1446360 1376145 1413002 1445152 1378571 1307418
7507 1307418 1331008 1297091 1306652 1327163 1212600 1243846 1288150 1290710 1219998 1262399 1272490 1161650
7495 1161650 1267023 1231611 1204271 1303097 1178459 1176259 1175440 1101937 1183169 1096795 1196906
7484 1196906 1128301 1119065 1027391 1051665 1092795 1089504 1126585 1103446 1128189 1146273 1118357 1063472
7472 1063472 1178695 1073174 1112017 1033636 1131940 1025416 1015498 1030657 1076514 1059985 1067519
7461 1067519 1045507 1007404 1019504 1041150 935802 954920 967000 1018577 999959 989346 1006187
$$ packed form
7542A565626J7772j383N8812o1319p615P6084O4503j53677l1104m2167Q0339p3043
7530A492828M1471j0513n69q7864P9235q5232m6443J1456N4719m6213J7231k4735
7518A395371K1397p603J6249q1956k1689J24591p0215L6857L2150o6581p1153
7507A307418K3590l3917R561K0511j14563L1246M4304K560p0712M2401J0091j10840
7495A161650J05373l5412k7340R8826j24638k200q19p3503Q1232q6374J00111
7484A196906o8605r236r1674K4274M1130l291L7081k3139K4743J8084k7916n4885
7472A063472J15223j05521L8843p8381R8304j06524r918J5159M5857j6529P534
7461A067519k2012l8103J2100K1646j05348J9118J2080N1577j8618j0613J6841
$$ plain form
7450 1006187 993121 989271 920438 1038205 979344 926315 924413 919364 964283 916088 872573 831471
7438 831471 1021277 904739 828132 892256 943684 898721 963011 870044 783228 788131 794439 851727
7426 851727 869518 877147 708662 860004 771817 815613 887292 893229 850228 744931 786980
7415 786980 778506 878682 758667 831000 859747 732009 724537 746609 815669 762839 795902
7404 795902 729690 783283 740699 738694 791811 712117 755233 755617 674451 701786 719960 745379
7392 745379 681975 632547 730144 660210 702048 704894 720883 748806 724460 736069 651166 749745
7380 749745 728808 656962 629114 629288 728769 654623 605120 686939 654611 681007 658856 665654
7368 665654 584163 676482 605147 622299 615942 679599 591383 693575 708647 674937 593874 663080
$$ packed form
7450A006187j3066l850o8833J17767n8861n3029j902n049M4919m8195m3515m1102
7438H31471J89806j16538p6607O4124N1428m4963O4290r2967q6816M903O308N7288
7426H51727J7791P629j68485J51342q8187M3796P1679N937m3001j05297M2049
7415G86980q474J00176j20015P2333K8747j27738p472K2072O9060n2830L3063
7404G95902o6212N3593m2584k005N3117p9694M3116L84q1166K7335J8174K5419
7392G45379o3404m9428R7597o9934M1838K846J5989K7923k4346J1609q4903R8579
7380G49745k0937p1846k7848J74R9481p4146m9503Q1819l2328K6396k2151O798
7368F65654q1491R2319p1335J7152o357O3657q8216J02192J5072l3710q1063O9206
$$ plain form
7356 663080 615169 693541 653970 648452 567633 545771 548768 663384 634844 609739 452546 560272
7344 560272 621353 593565 572038 603348 569142 593785 604900 623533 556353 527444 531826 584828
7332 584828 561146 571120 534070 535759 523728 518944 553804 542719 580804 609594 583291 619930
7320 619930 628163 608701 571487 561561 578920 595152 552332 507506 615219 586389 569014 561145
7308 561145 463529 504139 542380 586657 487634 510642 476588 403050 465298 410877 541832
7297 541832 472219 525199 445688 449265 538991 442310 450321 497526 459223 465021 483522 549272
7285 549272 578537 444454 500398 511734 430718 492165 436608 459142 438771 498976 590274
7274 590274 456324 469322 465985 409528 442531 357946 408344 417546 432959 440635 358430 393089
$$ packed form
7356F63080m7911P8372l9571n518q0819k1862K997J14616k8540k5105j57193J07726
7344E60272O1081k7788k1527L1310l4206K4643J1115J8633o7180k8909M382N3002
7332E84828k3682R974l7050J689j2031m784L4860j1085L8085K8790k6303L6639
7320F19930Q233j9462l7214r926J7359J6232m2820m4826J07713k8830j7375p869
7308E61145r7616M0610L8241M4277r9023K3008l4054p3538O2248n4421J30955
7297E41832o9613N2980p9511L577Q9726r6681Q011M7205l8303N798J8501O5750
7285E49272K9265j34083N5944J1336q1016O1447n5557K2534k0371O0205R1298
7274E90274j33950J2998l337n6457L3003q4585N0398R202J5413P676q2205L4659
$$ plain form
7262 393089 394084 448710 451382 438349 372265 488682 450528 451623 445797 475538 404795 422839
7250 422839 571894 426145 422734 417992 393821 386829 383406 431620 380454 389092 377866 388405
7238 388405 325792 382347 387450 389324 374897 368125 355102 414765 397767 404514 385711 365803
7226 365803 350657 450151 455230 330937 420920 387449 473646 435075 388007 347040 364440 388308
7214 388308 428694 441564 417041 456117 359946 454576 387734 467869 382544 460612 396844 364162
7202 364162 488655 517210 459006 461565 413628 448330 436487 478238 398145 461719 488714 382671
7190 382671 544171 355275 461579 468832 446320 492248 439110 385830 385927 397188 369114 367013
7178 367013 408752 315348 408314 416778 482937 399901 399584 321631 336397 345501 542936 428536
$$ packed form
7262C93089R95N4626K672j3033o6084J16417l8154J095n826K9741p0743J8044
7250D22839J49055j45749l411m742k4171o992l423M8214n1166Q638j1226J0539
7238C88405o2613N6555N103J874j4427o772j3023N9663j6998O747j8803j9908
7226C65803j5146R9494N079j24293Q9983l3471Q6197l8571m7068m0967J7400K3868
7214C88308M0386J2870k4523L9076r6171R4630o6842Q0135q5325P8068o3768l2682
7202C64162J24493K8555n8204K559m7937L4702j1843M1751q0093O3574K6995j06043
7190C82671J61500j88896J06304P253k2512M5928n3138n3280R7J1261k8074k101
7178C67013M1739r3404R2966Q464O6159q3036l17p7953J4766R104J97435j14400
$$ plain form
7166 428536 406064 522998 445828 421940 356454 331323 441807 372934 359067 386287 410211
7155 410211 361714 412692 417982 411186 338997 398835 495989 416760 396879 479748 396097 466704
7143 466704 504972 448858 438132 447583 351223 502352 470849 443224 399919 401994 402572 466738
7131 466738 421797 413530 387222 356873 440464 365247 448573 476436 435619 475086 473285 488982
7119 488982 440702 412746 478742 432383 520062 416988 412295 474051 387357 404694 454154 461139
7107 461139 367478 445427 414954 482644 428801 485891 492034 479139 443686 543188 503070 517474
7095 517474 435354 389032 480340 528843 554928 467544 568187 510561 524714 577826 494304
7084 494304 505417 495807 487656 598069 537428 527512 563106 545632 632392 569507 628775 697761
$$ packed form
7166D28536k2472J16934p7170k3888o5486k5131J10484o8873j3867K7220K3924
7155D10211m8497N0978N290o796p2189N9838R7154p9229j9881Q2869q3651P0607
7143D66704L8268n6114j0726R451r6360J51129l1503k7625m3305K075N78O4166
7131D66738m4941q267k6308l0349Q3591p5217Q3326K7863m0817L9467j801J5697
7119D88982m8280k7956O5996m6359Q7679j03074m693O1756q6694J7337M9460O985
7107D61139r3661P7949l0473O7690n3843N7090O143j2895l5453R9502m0118J4404
7095E17474q2120m6322R1308M8503K6085q7384J00643n7626J4153N3112q3522
7084D94304J1113r610q151J10413o0641r916L5594j7474Q6760o2885N9268O8986
$$ plain form
7072 697761 571856 698970 561659 640175 711552 641767 621641 703718 620356 727471 667459
7061 667459 748305 748653 654407 692944 692531 695009 621268 606250 662419 680890 625857 641074 695422
7048 695422 682470 690085 697858 688194 741968 755047 679325 742606 707359 773820 737084 745769
7036 745769 739216 738955 657307 762169 614282 716152 677704 713599 711539 778619 731241 729526
7024 729526 760174 724161 744432 750376 727419 742902 702143 744328 797036 854109 864087 791022
7012 791022 784308 884414 795755 795945 854018 826371 867767 789154 858277 829235 906549 959347
7000 959347 931346 937712 989851 901580 1022739 986532 1105387 995853 1020190 948039 1027669
6989 1027669 1082921 1116674 1112485 1176706 1021489 1269359 1176648 1147078 1349212 1178044 1270134
$$ packed form
7072F97761j25905J27114j37311P8516P1377o9785k0126Q2077q3362J07115o0012
7061F67459Q0846L48r4246L8537m13K478p3741j5018N6169J8471n5033J5217N4348
7048F95422j2952P615P773r664N3774J3079p5722O3281l5247O6461l6736Q685
7036G45769o553k61q1648J04862j47887J01870l8448L5895k060O7080m7378j715
7024G29526L0648l6013K0271N944k2957J5483m0759M2185N2708N7073R978p3065
7012G91022o714J00106q8659J90N8073k7647M1396p8613O9123k9042P7314N2798
7000I59347k8001O366N2139q8271J21159l6207J18855j09534K4337p2151P9630
6989A027669N5252L3753m189O4221j55217K47870r2711k9570K02134j71168R2090
$$ plain form
6978 1270134 1186525 1311113 1286167 1342152 1323572 1390808 1373260 1397026 1459794 1481375 1540320
6967 1540320 1511172 1596958 1674979 1637957 1604687 1786251 1781674 1820304 1853772 1813436 1988138
6956 1988138 2012347 2074714 2048621 2191913 2294297 2295187 2319647 2486272 2553550 2634522 2650902
6945 2650902 2816552 2871501 3039460 3048763 3190636 3301560 3356536 3516279 3736598 3828531
6935 3828531 3949015 4100227 4373536 4576619 4713589 4883448 5183976 5306652 5628783 5893729
6925 5893729 6125884 6433688 6760591 7283459 7584344 8028807 8414514 8808053 9107032 9550988
6915 9550988 10061875 10473212 10689565 11040553 11357891 11553999 11743728 11915228 11955770 12164024
6905 12164024 12211220 12241908 12428251 12401113 12435827 12351951 12200873 12011941 11723048 11516260
$$ packed form
6978A270134q3609J24588k4946N5985j8580O7236j7548K3766O2768K1581N8945
6967A540320k9148Q5786P8021l7022l3270J81564m577L8630L3468m0336J74702
6956A988138K4209O2367k6093J43292J02384Q90K4460J66625O7278Q0972J6380
6945B650902J65650N4949J67959R303J41873J10924N4976J59743K20319R1933
6935C828531J20484J51212K73309K03083J36970J69859L00528J22676L22131K64946
6925E893729K32155L07804L26903N22868L00885M44463L85707L93539K98979M43956
6915I550988N10887M11337K16353L50988L17338J96108J89729J71500M0542K08254
6905A2164024M7196L0688J86343k7138L4714q3876j51078j88932k88893k06788
$$ plain form
6895 11516260 11136647 10896326 10590748 10228744 9866027 9615863 9351129 9286015 9076980 8980546
6885 8980546 8819033 8801075 8686692 8851820 8798737 8975977 8921306 9161713 9330402 9533661
6875 9533661 9733539 9964169 10211444 10668704 10938973 11334814 11738398 12306727 12705204 13268667
6865 13268667 13847625 14355497 15104352 15731076 16438177 17138825 17794295 18373613 19002208
6856 19002208 19574107 19933722 20325063 20572198 20828481 20976797 21127496 21227949 21290655 21227489
6846 21227489 21248808 21112092 21028296 20774224 20508916 20107098 19884895 19391136 18982368 18589943
6836 18589943 18146381 17646224 17225071 16961174 16626803 16402385 16253197 16094175 16055752 16025295
6826 16025295 16059692 16200254 16399435 16581003 16802043 17235717 17542129 17975892 18429929 18894833
$$ packed form
6895A1516260l79613k40321l05578l62004l62717k50164k64734o5114k09035r6434
6885H980546j61513j7958j14383J65128n3083J77240n4671K40407J68689K03259
6875I533661J99878K30630K47275M57260K70269L95841M03584N68329L98477N63463
6865A3268667N78958N07872P48855O26724P07101P00648O55470N79318O28595
6856A9002208N71899L59615L91341K47135K56283J48316J50699J00453O2706o3166
6846B1227489K1319j36716q3796k54072k65308m01818k22203m93759m08768l92425
6836A8589943m43562n00157m21153k63897l34371k24418j49188j59022l8423l0457
6826A6025295L4397J40562J99181J81568K21040M33674L06412M33763M54037M64904
$$ plain form
6816 18894833 19348536 19824362 20343823 20728645 21156359 21464592 21795212 22039081 22353615
6807 22353615 22541441 22723446 22906475 23223609 23290069 23538072 23814544 23959254 24183483 24466905
6797 24466905 24734505 25167811 25627917 26016750 26508445 27054788 27658039 28170188 28933737
6788 28933737 29462631 30101412 30666105 31231226 31552623 31989980 32191767 32410280 32588778
6779 32588778 32526022 32499049 32273960 31897150 31544603 30973813 30489558 29823393 29119527 28515006
6769 28515006 27738202 27159411 26542673 25797555 25426491 24977512 24479876 24086425 23850235
6760 23850235 23505325 23244088 23024614 22782361 22424697 22226233 22004102 21711356 21448371
6751 21448371 21109608 20735249 20464841 19972515 19529363 18992469 18606973 17926718 17377352
$$ packed form
6816A8894833M53703M75826N19461L84822M27714L08233L30620K43869L14534
6807B2353615J87826J82005J83029L17134O6460K48003K76472J44710K24229K83422
6797B4466905K67600M33306M60106L88833M91695N46343O03251N12149P63549
6788B8933737N28894O38781N64693N65121L21397M37357K01787K18513J78498
6779C2588778o2756k6973k25089l76810l52547n70790m84255o66165p03866o04521
6769B8515006p76804n78791o16738p45118l71064m48979m97636l93451k36190
6760B3850235l44910k61237k19474k42253l57664j98464k22131k92746k62985
6751B1448371l38763l74359k70408m92326m43152n36894l85496o80255n49366
$$ plain form
6742 17377352 16703157 16073125 15638946 14995115 14428169 13859466 13440625 12977489 12606943
6733 12606943 12236281 11958998 11594314 11356752 11181845 10948983 10749819 10724762 10439320 10477604
6723 10477604 10460530 10512522 10419614 10399794 10430684 10410665 10390972 10537685 10618820 10533431 10579356
6712 10579356 10795364 10808844 10946649 11161967 11369562 11606626 11881230 12275753 12483648 12859825
6702 12859825 13233479 13510865 13838154 14255471 14494174 14777964 14875419 15065975 15151346 15159421
6692 15159421 15179134 15124693 14880158 14694913 14448777 14267730 14072244 13871599 13683477 13525229
6682 13525229 13356392 13253474 13136658 13197308 13105142 13120443 13159099 13304405 13462512 13558237
6672 13558237 13722670 13878362 14051947 14251336 14382506 14422462 14466725 14400458 14380694 14167740
$$ packed form
6742A7377352o74195o30032m34179o43831n66946n68703m18841m63136l70546
6733A2606943l70662k77283l64684k37562j74907k32862j99164k5057k85442L8284
6723A0477604j7074N1992r2908j9820L0890k0019j9693J46713Q1135q5389M5925
6712A0579356K16008J3480J37805K15318K07595K37064K74604L94523K07895L76177
6702A2859825L73654K77386L27289M17317K38703K83790R7455J90556Q5371Q075
6692A5159421J9713n4441k44535j85245k46136j81047j95486k00645j88122j58248
6682A3525229j68837j02918j16816O0650r2166J5301L8656J45306J58107R5725
6672A3558237J64433J55692J73585J99389J31170L9956M4263o6267j9764k12954
$$ plain form
6662 14167740 14026392 13786023 13535391 13257277 12886104 12648511 12358564 12111814 11802293
6653 11802293 11587806 11402837 11234842 11176272 11126226 10952014 10938694 10949677 10987221 11081165
6643 11081165 11169199 11114936 11174160 11272030 11238146 11139615 11005734 10910046 10684857 10523321 10252390
6632 10252390 10130625 9834934 9723956 9586345 9288127 9112929 8956462 8904960 8754543 8672676
6622 8672676 8659449 8595393 8561161 8593431 8632732 8733491 8787436 8869012 9008261 9055867 9164241
6611 9164241 9116928 9098912 9114647 9035086 8929751 8701020 8425117 8210583 7959005 7743946
6601 7743946 7345692 6984425 6742570 6388070 6060817 5741994 5570533 5308724 5118981 4871553
6591 4871553 4801982 4532588 4370236 4176332 3977228 3946560 3794307 3659457 3579639 3450918
$$ packed form
6662A4167740j41348k40369k50632k78114l71173k37593k89947k46750l09521
6653A1802293k14487j84969j67995n8570n0046j74212j3320J0983L7544R3944
6643A1081165Q8034n4263N9224R7870l3884r8531j33881r5688k25189j61536k70931
6632A0252390j21765k95691j10978j37611k98218j75198j56467n1502j50417q1867
6622H672676j3227o4056l4232L2270L9301J00759N3945Q1576J39249M7606J08374
6611I164241m7313j8016J5735p9561j05335k28731k75903k14534k51578k15059
6601G743946l98254l61267k41855l54500l27253l18823j71461k61809j89743k47428
6591D871553o9571k69394j62352j93904j99104l0668j52253j34850p9818j28721
$$ plain form
6581 3450918 3386917 3404897 3205250 3176718 3102072 2951222 2952676 2930219 2851639 2817952 2774380
6570 2774380 2775065 2745785 2640566 2640812 2538268 2493683 2534538 2413449 2465049 2354848 2410507
6559 2410507 2464405 2393892 2356452 2470042 2402755 2402562 2457351 2535127 2554474 2685809 2596611
6548 2596611 2596598 2566747 2572720 2527515 2271891 2234957 2159885 2137278 2039079 2039745 1909775 1946145
6536 1946145 1823497 1904963 1808343 1793100 1819562 1750069 1777341 1734232 1730600 1727399 1647242 1679757
6524 1679757 1622007 1636607 1599662 1579985 1590372 1596129 1633442 1546038 1554709 1475385 1568476 1576325
6512 1576325 1552612 1505680 1421948 1511165 1463471 1481522 1463235 1429722 1496625 1402584 1427864
6501 1427864 1492446 1335163 1465619 1420801 1378859 1294267 1376055 1363129 1459916 1411792 1351539
$$ packed form
6581C450918o4001J7980j99647k8532p4646j50850J454k2457p8580l3687m3572
6570B774380O85k9280j05219K46j02544m4585M0855j21089N1600j10201N5659
6559B410507N3898p0513l7440J13590o7287j93N4789P7776J9347J31335q9198
6548B596611j3k9851N973m5205k55624l6934p5072k2607r8199O66j29970L6370
6536A946145j22648Q1466r6620j5243K6462o9493K7272m3109l632l201q0157L2515
6524A679757n7750J4600l6945j9677J0387N757L7313q7404Q671p9324R3091P849
6512A576325k3713m6932q3732Q9217m7694J8051j8287l3513O6903r4041K5280
6501A427864O4582j57283J30456m4818m1942q4592Q1788j2926R6787m8124o0253
$$ plain form
6490 1351539 1320322 1326682 1360412 1273945 1270344 1301847 1309523 1435175 1289356 1301505 1242284 1271684
6478 1271684 1290726 1274762 1243311 1227029 1183868 1232265 1241640 1196905 1208530 1229864 1203803 1217780
6466 1217780 1199266 1103278 1151785 1122692 1187322 1216790 1162969 1166459 1140197 1231659 1232438 1192145
6454 1192145 1287284 1167934 1281172 1256349 1278320 1218536 1227151 1225488 1218354 1194670 1197519 1246797
6442 1246797 1226471 1278020 1216257 1277596 1222779 1297398 1291111 1304484 1277135 1256615 1327171 1253994
6430 1253994 1313662 1370081 1367468 1364789 1396404 1400283 1430482 1372198 1436289 1425952 1453829 1456413
6418 1456413 1482527 1512403 1527246 1487646 1570747 1590559 1639367 1642099 1673191 1647986 1677740 1762831
6406 1762831 1740017 1752741 1758811 1818632 1819378 1910577 1928508 1925531 1981346 1907387 2006593 2033688
$$ packed form
6490A351539l1217O360L3730q6467l601L1503P676J25652j45819J2149n9221K9400
6478A271684J9042j5964l1451j6282m3161M8397R375m4735J1625K1334k6061J3977
6466A217780j8514r5988M8507k9093O4630K9468n3821L490k6262R1462P79m0293
6454A192145R5139j19350J13238k4823K1971n9784Q615j663p134k3684K849M9278
6442A246797k0326N1549o1763O1339n4817P4619o287J3373k7349k0520P0556p3177
6430A253994N9668N6419k613k679L1615L879L0199n8284O4091j0337K7877K584
6418A456413K6114K9876J4843l9600Q3101J9812M8808K732L1092k5205K9754Q5091
6406A762831k2814J2724O070N9821P46R1199J7931k977N5815p3959R9206K7095
$$ plain form
6394 2033688 2022282 2120300 2176263 2169876 2193898 2143561 2166322 2211717 2258679 2233971 2192810 2214245
6382 2214245 2319427 2280243 2249285 2321204 2474489 2353462 2419856 2404701 2478736 2490524 2442519
6371 2442519 2512453 2458010 2487119 2526087 2501330 2558102 2610564 2616297 2609058 2719559 2694224 2759580
6359 2759580 2737870 2839734 2840425 2919421 2955340 3054065 3043606 3204835 3229967 3302679 3352259
6348 3352259 3406114 3483115 3468944 3585350 3706855 3765046 3898637 3947158 4191517 4199351 4271214
6337 4271214 4328730 4549764 4606127 4747942 4835102 5091564 5143130 5381748 5462296 5675479
6327 5675479 5772580 5961820 6228376 6389893 6648134 6790459 7122019 7416722 7663981 7879316
6317 7879316 8251930 8529364 8907203 9304850 9711518 10244433 10534093 10946911 11257831 11583272
$$ packed form
6394B033688j1406R8018N5963o387K4022n0337K2761M5395M6962k4708m1161K1435
6382B214245J05182l9184l0958P1919J53285j21027O6394j5155P4035J1788m8005
6371B442519O9934n4443K9109L8968k4757N6772N2462N733p239J10501k5335O5356
6359B759580k1710J01864O91P8996L5919R8725j0459J61229K5132P2712M9580
6348C352259N3855P7001j4171J16406J21505N8191J33591M8521K44359P834P1863
6337D271214N7516K21034N6363J41815Q7160K56462N1566K38618Q0548K13183
6327E675479R7101J89240K66556J61517K58241J42325L31560K94703K47259K15335
6317G879316L72614K77434L77839L97647M06668N32915K89660M12818L10920L25441
$$ plain form
6307 11583272 11948016 12353799 12770809 13335732 13878144 14397590 15242455 15990761 16921330
6298 16921330 17891697 18914580 20205371 21391633 22962445 24588122 26413233 28071754
6290 28071754 29597480 31054650 32459807 33848498 35233283 36712058 38602987 40604179
6282 40604179 42962021 45477199 48418832 51717804 55492175 59791368 64872832 70736612
6274 70736612 77728269 86067649 96562501 109602443 124975564 141692017 157302525
6267 157302525 168334734 171723361 165839659 152679851 137204213 121798570 108224438
6260 108224438 96386130 86041081 77158103 69687747 63529440 58476603 54307245 50947463
6252 50947463 48024053 45572337 43388135 41461361 39838096 38261433 36821204 35529036
$$ packed form
6307A1583272L64744M05783M17010N64923N42412N19446Q44865P48306R30569
6298A6921330R70367J022883J290791J186262J570812J625677J825111J658521
6290B8071754J525726J457170J405157J388691J384785J478775J890929K001192
6282D0604179K357842K515178K941633L298972L774371M299193N081464N863780
6274G0736612O991657Q339380J0494852J3039942J5373121J6716453J5610508
6267A57302525J1032209L388627n883702j3159808j5475638j5405643j3574132
6260A08224438j1838308j0345049q882978p470356o158307n052837m169358l359782
6252E0947463k923410k451716k184202j926774j623265j576663j440229j292168
$$ plain form
6244 35529036 34289848 33235722 32173400 31188301 30375986 29514601 28742261 28056090 27542173
6235 27542173 27005511 26458583 26045965 25607836 25168169 24861601 24475821 24132933 23819632
6226 23819632 23485347 23183045 22864849 22647951 22352782 22005757 21744852 21408683 21076073
6217 21076073 20687767 20358126 19992639 19534190 19244095 18829619 18470675 18145996 17779225
6208 17779225 17329015 16881428 16544720 16119519 15690077 15263389 14795984 14404126 13967497
6199 13967497 13609342 12994602 12585442 12176809 11730496 11318532 10928607 10613133 10321604
6190 10321604 9891446 9551439 9234883 8874365 8606116 8317547 8037257 7839879 7634075
6181 7634075 7520338 7265294 7062053 6905483 6804994 6599788 6445803 6288456 6112428 6023065
$$ packed form
6244C5529036j239188j054126j062322r85099q12315q61385p72340o86171n13917
6235B7542173n36662n46928m12618m38129m39667l06568l85780l42888l13301
6226B3819632l34285l02302l18196k16898k95169l47025k60905l36169l32610
6217B1076073l88306l29641l65487m58449k90095m14476l58944l24679l66771
6208A7779225m50210m47587l36708m25201m29442m26688m67405l91858m36629
6199A3967497l58155o14740m09160m08633m46313m11964l89925l15474k91529
6190A0321604m30158l40007l16556l60518k68249k88569k80290j97378k05804
6181G634075j13737k55044k03241j56570j00489k05206j53985j57347j76028q9363
$$ plain form
6171 6023065 5897860 5784730 5653023 5495828 5419454 5304306 5197874 5200896 5109548 4994888
6161 4994888 4955099 4911597 4795852 4725127 4636955 4574201 4484404 4485988 4359912 4350671 4306343
6150 4306343 4297920 4198863 4117540 4098297 4014661 4036657 4073351 4061049 4000672 4031303 3934672 3936774
6138 3936774 3953764 4002935 3942892 4010554 4022181 3948017 4007026 4080122 4075745 3940770 4035935
6127 4035935 4106241 4056082 4144337 4237596 4221045 4277672 4257793 4336934 4391744 4467449 4530462
6116 4530462 4538298 4670422 4771198 4873292 4854914 5120969 5076538 5172566 5278962 5453710
6106 5453710 5460653 5691915 5676732 5832424 5885186 5895069 6069159 6213680 6179390 6363627 6439780
6095 6439780 6526106 6584067 6707798 6850415 6966457 7147869 7232245 7413850 7623420 7736986
$$ packed form
6171F023065j25205j13130j31707j57195p6374j15148j06432L022r1348j14660
6161D994888l9789m3502j15745p0725q8172o2754q9797J584j26076r241m4328
6150D306343q423r9057q1323j9243q3636K1996L6694j2302o0377L0631r6631K102
6138C936774J6990M9171o0043O7662J1627p4164N9009P3096m377j34975R5165
6127D035935P0306n0159Q8255R3259j6551N6627j9879P9141N4810P5705O3013
6116D530462P836J32124J00776J02094j8378K66055m4431R6028J06396J74748
6106E453710O943K31262j5183J55692N2762R883J74090J44521l4290J84237P6153
6095F439780Q6326N7961J23731J42617J16042J81412Q4376J81605K09570J13566
$$ plain form
6085 7736986 7890738 8088007 8332940 8456608 8514672 8712230 8790689 9053511 9105642 9303438
6075 9303438 9391359 9467709 9605672 9619293 9847953 9878091 10081662 10146873 10268546 10398697
6065 10398697 10425908 10558472 10728672 10703287 10799354 10898690 11019966 11190248 11301752 11370324
6055 11370324 11580887 11701322 11893953 11910577 12133537 12106257 12369295 12332047 12420844 12518404
6045 12518404 12511469 12397414 12395580 12433986 12425296 12353870 12395574 12400999 12329404 12243041 12154398 12229456
6033 12229456 12157850 12032506 12020523 11961727 11955655 11831391 11789394 11853541 11713507 11645877 11650229
6022 11650229 11740686 11704702 11716832 11722037 11722625 11711699 11679539 11669707 11666229 11637194 11504028 11589501
6010 11589501 11383724 11308268 11175108 11102946 10997710 10847853 10717038 10610265 10454214 10296743
$$ packed form
6085G736986J53752J97269K44933J23668N8064J97558P8459K62822N2131J97796
6075I303438Q7921P6350J37963J3621K28660L0138K03571O5211J21673J30151
6065A0398697K7211J32564J70200k5385R6067R9336J21276J70282J11504O8572
6055A1370324K10563J20435J92631J6624K22960k7280K63038l7248Q8797R7560
6045A2518404o935j14055j834L8406q690p1426M1704N425p1595q6363q8643P5058
6033A2229456p1606j25344j1983n8796o072j24264m1997O4147j40034o7630M352
6022A1650229R0457l5984J2130N205N88j0926l2160r832l478k9035j33166Q5473
6010A1589501k05777p5456j33160p2162j05236j49857j30815j06773j56051j57471
$$ plain form
6000 10296743 10264515 10089255 10034227 9850722 9729012 9677021 9540873 9440634 9333082 9234955
5990 9234955 9158206 9058582 8911148 8937450 8805463 8822281 8842401 8763045 8628721 8609275 8508052
5979 8508052 8435934 8235501 8032544 7995764 7706263 7734427 7545857 7394740 7362317 7300509
5969 7300509 7167792 7228663 7103481 7086046 6944274 7011828 6886874 6769947 6702619 6500361
5959 6500361 6520491 6357473 6290365 6202390 6201579 6165584 6026020 6032296 5850737 5846574 5938026 5835727
5947 5835727 5923487 5916668 5931011 5951814 5990666 6020246 6083172 6116058 6269948 6376694 6457795
5936 6457795 6553648 6622298 6806907 6907855 7073174 7218905 7369296 7360640 7488724 7668995
5926 7668995 7651424 7803184 7876759 7807626 7802964 7971653 7929751 8034523 7936558 8055949 8052248
$$ packed form
6000A0296743l2228j75260n5028j83505j21710n1991j36148j00239j07552r8127
5990I234955p6749r9624j47434K6302j31987J6818K0120p9356j34324j9446j01223
5979H508052p2118k00433k02957l6780k89501K8164j88570j51117l2423o1808
5969G300509j32717O0871j25182j7435j41772O7554j24954j16927o7328k02258
5959F500361K0130j63018o7108q7975q11l5995j39564O276j81559m163R1452j02299
5947E835727Q7760o819J4343K0803L8852K9580O2926L2886J53890J06746Q1101
5936F457795R5853O8650J84609J00948J65319J45731J50391q656J28084J80271
5926G668995j7571J51760P3575o9133m662J68689m1902J04772r7965J19391l701
$$ plain form
5915 8052248 8047569 8204316 8188948 8239105 8305925 8354778 8397820 8467300 8454259 8581102 8592580
5904 8592580 8642242 8540346 8712143 8701488 8683355 8709999 8627400 8690529 8729740 8833756 8654550
5893 8654550 8746483 8885175 8862135 8906623 8912493 9059670 8987491 9108315 9177000 9192991 9352636
5882 9352636 9493913 9595925 9746360 9911775 10054706 10366961 10567000 10813256 11175342 11500942
5872 11500942 11713806 12143484 12398153 12792008 13191492 13495994 13837329 14175550 14491202
5863 14491202 14826019 15144518 15336093 15585566 15852649 15878249 16143829 16163493 16306844 16519142
5853 16519142 16645677 16713401 16829011 17080550 17261548 17453072 17693070 17947599 18219271 18508748
5843 18508748 18877242 19127222 19508187 19786786 20136237 20506064 20635093 20982615 21161242
$$ packed form
5915H052248m679J56747j5368N0157O6820M8853M3042O9480j3041J26843J1478
5904H592580M9662j01896J71797j0655j8133K6644q2599O3129L9211J04016j79206
5893H654550R1933J38692k3040M4488N870J47177p2179J20824O8685J5991J59645
5882I352636J41277J02012J50435J65415J42931L12255K00039K46256L62086L25600
5872A1500942K12864M29678K54669L93855L99484L04502L41335L38221L15652
5863A4491202L34817L18499J91575K49473K67083K5600K65580J9664J43351K12298
5853A6519142J26535O7724J15610K51539J80998J91524K39998K54529K71672K89477
5843A8508748L68494K49980L80965K78599L49451L69827J29029L47522J78627
$$ plain form
5834 21161242 21429952 21663929 21889919 22082194 22278648 22552382 22922945 23250104 23528728
5825 23528728 23868160 24131008 24593977 25011122 25375873 25863635 26321226 26848237 27381569
5816 27381569 27932246 28482911 28955018 29442445 30067784 30473566 30948941 31467268 31874128
5807 31874128 32132654 32559546 32930270 33352992 33519522 33931937 34262714 34673247 35019086
5798 35019086 35322044 35783906 36132785 36636812 37142841 37588412 38195351 38799130 39501738
5789 39501738 40061608 40793010 41601914 42217345 42738024 43417677 43942518 44453685 44809108
5780 44809108 45310501 45625819 45947155 46093602 46360650 46455748 46526953 46388055 46429237 46159232
5770 46159232 45949265 45598832 45140473 44737315 44183555 43729436 43010557 42407641 41701102
$$ packed form
5834B1161242K68710K33977K25990J92275J96454K73734L70563L27159K78624
5825B3528728L39432K62848M62969M17145L64751M87762M57591N27011N33332
5816B7381569N50677N50665M72107M87427O25339M05782M75375N18327M06860
5807C1874128K58526M26892L70724M22722J66530M12415L30777M10533L45839
5798C5019086L02958M61862L48879N04027N06029M45571O06939O03779P02608
5789C9501738N59870P31402Q08904O15431N20679O79653N24841N11167L55423
5780D4809108N01393L15318L21336J46447K67048R5098P1205j38898M1182k70005
5770D6159232k09967l50433m58359m03158n53760m54119p18879o02916p06539
$$ plain form
5761 41701102 41015122 40259797 39571373 38924374 38218970 37461482 36677949 36043182 35312595
5752 35312595 34557828 33933338 33169174 32615791 31989499 31186930 30670141 29907505 29303921
5743 29303921 28604049 27830906 27072714 26281754 25515011 24686513 23967249 23138188 22365379
5734 22365379 21710672 20956372 20398269 19809630 19358722 18906539 18530823 18233246 17896027
5725 17896027 17715140 17480570 17420170 17298790 17153712 17060166 16995596 16884393 16808359 16734700
5715 16734700 16661474 16642791 16457596 16394673 16293735 16223194 16130504 16086073 15992770 15886796 15949237
5704 15949237 15939378 15935008 15864378 15894389 15866315 15843469 15715598 15765099 15751940 15643715 15564863
5693 15564863 15650589 15537277 15413108 15365555 15302093 15208446 15146991 15140659 15047289 14905827 14911638
$$ packed form
5761D1701102o85980p55325o88424o46999p05404p57488p83533o34767p30587
5752C5312595p54767o24490p64164n53383o26292q02569n16789p62636o03584
5743B9303921o99872p73143p58192p90960p66743q28498p19264q29061p72809
5734B2365379o54707p54300n58103n88639m50908m52183l75716k97577l37219
5725A7896027j80887k34570o0400j21380j45078r3546o4570j11203p6034p3659
5715A6734700p3226j8683j85195o2923j00938p0541r2690m4431r3303j05974O2441
5704A5949237r859m370p0630L0011k8074k2846j27871M9501j3159j08225p8852
5693A5564863Q5726j13312j24169m7553o3462r3647o1455o332r3370j41462N811
$$ plain form
5682 14911638 14816159 14838363 14865510 14756316 14896098 14845593 14863383 14952479 15037794 15154448 15269277
5671 15269277 15495396 15604511 15786189 16009204 16291405 16627604 16946831 17275836 17781072
5662 17781072 18121098 18748606 19283025 20003902 20600145 21360827 22238219 22945135 23871293
5653 23871293 24973723 26036414 27095899 28354013 29719224 31171310 32763035 34502814
5645 34502814 36352633 38355058 40700245 43119114 45759905 48594576 51738732 55115271
5637 55115271 58681447 62254274 65522264 68724312 71351470 73161882 74145638 74476538
5629 74476538 74170019 73518650 72556299 71602852 70839669 70081196 69684081 69369407 69531116
5620 69531116 69990539 70465777 71236379 72061792 72544076 72803197 72469662 71198031 69329453
$$ packed form
5682A4911638r5479K2204K7147j09194J39782n0505J7790Q9096Q5315J16654J14829
5671A5269277K26119J09115J81678K23015K82201L36199L19227L29005N05236
5662A7781072L40026O27508N34419P20877N96243P60682Q77392P06916R26158
5653B3871293J102430J062691J059485J258114J365211J452086J591725J739779
5645C4502814J849819K002425K345187K418869K640791K834671L144156L376539
5637E5115271L566176L572827L267990L202048K627158J810412R83756L30900
5629G4476538l06519o51369r62351r53447p63183p58473l97115l14674J61709
5620F9531116M59423M75238P70602Q25413M82284K59121l33535j271631j868578
$$ plain form
5611 69329453 66690658 63451635 59979041 56239084 52552283 48994979 45656804 42539587
5603 42539587 39735986 37113274 34807319 32644198 30714430 28924553 27413483 26033309
5595 26033309 24716280 23419046 22259739 21221460 20261851 19285804 18478207 17739102 17002936
5586 17002936 16296882 15737202 15022604 14528008 14027288 13527948 13026982 12600420 12178149
5577 12178149 11802877 11522505 11155588 10780811 10482941 10230700 9822916 9730667 9385162 9157814
5567 9157814 8968582 8765698 8553757 8379883 8110365 7967087 7761727 7608897 7409716 7239165
5557 7239165 7156474 6940788 6814338 6640329 6553728 6438505 6315190 6152161 6058258 5867717
5547 5867717 5828697 5678654 5604974 5480133 5386088 5292326 5237754 5234867 5127032 5084966 4926507
$$ packed form
5611F9329453k638795l239023l472594l739957l686801l557304l338175l117217
5603D2539587k803601k622712k305955k163121j929768j789877j511070j380174
5595B6033309j317029j297234j159307j038279r59609r76047q07597p39105p36166
5586A7002936p06054n59680p14598m94596n00720m99340n00966m26562m22271
5577A2178149l75272k80372l66917l74777k97870k52241m07784r2249l45505k27348
5567I157814j89232k02884k11941j73874k69518j43278k05360j52830j99181j70551
5557G239165q2691k15686j26450j74009q6601j15223j23315j63029r3903j90541
5547E867717l9020j50043p3680j24841r4045r3762n4572k887j07835m2066j58459
$$ plain form
5536 4926507 4931747 4789119 4862783 4764760 4682236 4610466 4625852 4536895 4449299 4371848 4382868
5525 4382868 4302377 4315354 4274478 4161990 4123653 4166559 4061815 3981944 3964482 3857582 3890628
5514 3890628 3770094 3787416 3751643 3723439 3646341 3580180 3626592 3575394 3518394 3475113 3468859
5503 3468859 3292297 3399255 3325597 3215382 3297313 3119562 3143373 3152526 3121152 3103867 3085699
5492 3085699 3010895 2960273 2906703 2938838 2887884 2787679 2793989 2826180 2799964 2792075 2672750
5481 2672750 2715545 2708813 2667977 2672257 2587585 2681274 2594415 2613333 2538469 2482256 2547020 2516180
5469 2516180 2513743 2487372 2438510 2466350 2328288 2354048 2305147 2341689 2378365 2200602 2347809
5458 2347809 2366472 2264271 2291817 2185415 2210150 2140948 2185295 2187410 2208807 2142967 2196872
$$ packed form
5536D926507N240j42628P3664r8023q2524p1770J5386q8957q7596p7451J1020
5525D382868q0491J2977m0876j12488l8337M2906j04744p9871j7462j06900L3046
5514C890628j20534J7322l5773k8204p7098o6161M6412n1198n7000m3281o254
5503C468859j76562J06958p3658j10215Q1931j77751K3811R153l1374j7285j8168
5492C085699p4804n0622n3570L2135n0954j00205O310L2191k6216p889j19325
5481B672750M2795o732m0836M280q4672R3689q6859J8918p4864n6213O4764l0840
5469B516180k437k6371m8862K7840j38062K5760m8901L6542L6676j77763J47207
5458B347809J8663j02201K7546j06402K4735o9202M4347K115K1397o5840N3905
$$ plain form
5447 2196872 2226073 2090211 2125857 2158606 2143651 2056872 2135006 2126971 2127341 2131647 2137213 2071536
5435 2071536 2080450 2164974 2124792 2068987 2126573 2108556 2094143 2104145 2056586 2031596 2014342 2071624
5423 2071624 2138397 2064436 2097538 2074754 2078060 2163016 2041862 2036546 2051919 2044758 2099183 2057874
5411 2057874 2070079 2062419 2090393 2022917 2121258 2046473 2127924 2081754 2029151 2104721 1978893
5400 1978893 2038783 2073991 2051563 2235235 2040384 2051682 2131258 2113253 2123049 2170978 2173802
5389 2173802 2106780 2142954 2210537 2130042 2221159 2169623 2208368 2212506 2230966 2211939 2272391 2303137
5377 2303137 2232779 2280389 2276547 2349989 2347462 2408269 2494148 2464439 2464033 2536714 2529327 2660511
5365 2660511 2629539 2658877 2826229 2873827 2858386 2861666 2995468 3024294 2999950 3210284 3201111
$$ packed form
5447B196872K9201j35862L5646L2749j4955q6779P8134q035L70M306N566o5677
5435B071536Q914Q4524m0182n5805N7586j8017j4413J0002m7559k4990j7254N7282
5423B071624O6773p3961L3102k2784L306Q4956j21154n316J5373p161N4425m1309
5411B057874J2205p660K7974o7476R8341p4785Q1451m6170n2603P5570j25828
5400A978893N9890L5208k2428J83672j94851J1298P9576j8005R796M7929K824
5389B173802o7022L6174O7583q0495R1117n1536L8745M138J8460j9027O0452L0746
5377B303137p0358M7610l842P3442k527O0807Q5879k9709m06P2681p387J31184
5365B660511l0972K9338J67352M7598j5441L280J33802K8826k4344K10334r173
$$ plain form
5354 3201111 3326005 3340872 3526866 3608269 3630202 3734244 3869535 3897236 3978971 4159241
5344 4159241 4280997 4344260 4601333 4672246 4885975 5023145 5216890 5363575 5658482 5857885
5334 5857885 6214518 6470536 6802735 7086148 7550849 7852433 8309275 8690952 9166496 9634769
5324 9634769 10189234 10893138 11513204 12319467 13031609 13944560 15013603 16299462 17714633
5315 17714633 19325653 21029628 22966790 24751134 26391419 28004759 29725546 31696400
5307 31696400 33841819 36157152 38211916 39728937 40781113 41593530 42505298 43817382
5299 43817382 45244461 46351176 46729868 46302636 44940823 43504595 42379488 41443574 40581160
5290 40581160 39368407 37609944 35369666 33050451 30751979 28978900 27130814 25545163
$$ packed form
5354C201111J24894J4867J85994Q1403K1933J04042J35291K7701Q1735J80270
5344D159241J21756O3263K57073P0913K13729J37170J93745J46685K94907J99403
5334E857885L56633K56018L32199K83413M64701L01584M56842L81677M75544M68273
5324I634769N54465P03904O20066Q06263P12142R12951J069043J285859J415171
5315A7714633J611020J703975J937162J784344J640285J613340J720787J970854
5307C1696400K145419K315333K054764J517021J052176Q12417R11768J312084
5299D3817382J427079J106715L78692m27232j361813j436228j125107r35914q62414
5290D0581160j212753j758463k240278k319215k298472j773079j848086j585651
$$ plain form
5282 25545163 23765435 21882880 20007445 18064217 16463805 15068243 13799168 12839672
5274 12839672 11859005 11059187 10382847 9735745 9183291 8648956 8226541 7766734 7400849
5265 7400849 6987081 6794071 6469182 6177666 5867384 5656339 5450863 5204944 5043240 4806430
5255 4806430 4636688 4482769 4379397 4225528 3986901 3875428 3872716 3653785 3580945 3490207
5245 3490207 3399268 3275440 3237134 3107325 3143659 2927944 3020344 2899964 2778092 2696709
5235 2696709 2702821 2668330 2549290 2506795 2481785 2473724 2368679 2317900 2291702 2271413 2253605
5224 2253605 2151006 2186033 2152534 2117907 2087970 1980898 2031816 2034338 2001003 1928523 1971269
5213 1971269 1899623 1884411 1912927 1864189 1734264 1776819 1829476 1752201 1715945 1786275 1752062
$$ packed form
5282B5545163j779728j882555j875435j943228j600412j395562j269075r59496
5274A2839672r80667p99818o76340o47102n52454n34335m22415m59807l65885
5265G400849m13768j93010l24889k91516l10282k11045k05476k45919j61704k36810
5255D806430j69742j53919j03372j53869k38627j11473k712k18931p2840r0738
5245C490207r0939j23828l8306j29809L6334k15715R2400j20380j21872q1383
5235B696709O112l4491j19040m2495k5010q061j05045n0779k6198k0289j7808
5224B253605j02599L5027l3499l4627k9937j07072N0918K522l3335p2480M2746
5213A971269p1646j5212K8516m8738j29925M2555N2657p7275l6256P0330l4213
$$ plain form
5202 1752062 1756233 1593613 1602531 1607597 1637776 1570437 1554436 1458009 1556421 1551440 1471046 1490458
5190 1490458 1462583 1472080 1440190 1419481 1347486 1364820 1331759 1371392 1371356 1320370 1402077 1380910
5178 1380910 1263321 1302165 1249640 1213607 1222100 1275246 1261397 1216339 1187707 1195578 1164085 1210685
5166 1210685 1099133 1113808 1163741 1131017 1161758 1115343 1094029 1082274 1112010 1006866 1105288
5155 1105288 1104025 1154552 1038305 981640 1005045 1078874 1030008 1078326 1048122 1107480 1075078
5144 1075078 1068677 927849 933353 963169 1012775 993356 948577 1026942 1032324 977564 1019978 908518
5132 908518 890438 958491 980465 967630 966784 897029 946584 892530 835059 898293 908413 938597
5120 938597 946996 915795 880389 856223 827184 726834 809352 888878 820438 838319 792516 801947
$$ packed form
5202A752062M171j62620Q918N066L0179o7339j6001r6427R8412m981q0394J9412
5190A490458k7875R497l1890k0709p1995J7334l3061L9633l6n0986Q1707k1167
5178A380910j17589L8844n2525l6033Q493N3146j3849m5058k8632P871l1493M6600
5166A210685j11552J4675M9933l2724L0741m6415k1314j1755K9736j05144R8422
5155A105288j263N0527j16247n6665K3405P3829m8866M8318l0204N9358l2402
5144A075078o401j40828N504K9816M9606j9419m4779P8365N382n4760M2414j11460
5132I08518j8080O8053K1974j2835q46o9755M9555n4054n7471O3234J0120L0184
5120I38597Q399l1201l5406k4166k9039j00350Q2518P9526o8440J7881m5803R431
$$ plain form
5108 801947 957659 894296 801899 891004 918930 790979 865458 839403 782706 796640 909329
5097 909329 815142 758700 770784 852926 808021 843185 842342 807713 821191 817445 804171 838339
5085 838339 768046 795804 760781 841278 774922 817513 853749 806805 761616 763969 794599 829905
5073 829905 768004 739953 810966 838629 794553 865370 752611 783633 752693 763787 739686
5062 739686 717634 800952 802217 742994 702677 787335 789586 771377 806451 808233 781168 798114
5050 798114 841322 862831 799553 815172 873127 796766 781008 865822 786096 898939 872971
5039 872971 871327 891013 883640 884206 947041 994567 887789 954145 938380 1006225 986646 1071070
5027 1071070 999671 927065 1043155 1004605 1012175 1040934 997023 972308 953859 1032737 936036
$$ packed form
5108H01947J55712o3363r2397Q9105K7926j27951P4479k6055n6697J3934J12689
5097I09329r4187n6442J2084Q2142m4905L5164q43l4629J3478l746j3274L4168
5085H38339p0293K7758l5023Q0497o6356M2591L6236m6944m5189K353L0630L5306
5073H29905o1901k8051P1013K7663m4076P0817j12759L1022l0940J1094k4101
5062G39686k2052Q3318J265n9223m0317Q4658K251j8209L5074J782k7065J6946
5050G98114M3208K1509o3278J5619N7955p6361j5758Q4814p9726J12843k5968
5039H72971j644J9686p373N66O2835M7526j06778O6356j5765O7845j9579Q4424
5027A071070p1399p2606J16090l8550P570K8759m3911k4715j8449P8878r6701
$$ plain form
5016 936036 958741 1004331 969756 1001948 824037 983448 980268 874749 897480 914236 945294
5005 945294 901255 853356 878250 882439 895602 822684 862437 783370 852892 825022 826278 882318
4993 882318 864433 848450 939373 870877 973003 910349 942467 1035388 1034891 1029215 1115688 1134865
4981 1134865 1176498 1184604 1154237 1232472 1270501 1284760 1217512 1292124 1373579 1353307 1453159 1521838
4969 1521838 1576545 1664494 1687774 1877099 1941896 2129012 2229719 2589879 2959964 3559351
4959 3559351 4183337 4751897 5549658 5640308 5382137 4510589 3835988 3310864 2905043 2580840
4949 2580840 2271180 2101980 1910035 1729051 1595200 1516429 1420163 1334879 1285198 1185105
4939 1185105 1131685 1165440 1162718 1072476 1073073 1061837 931833 994015 852762 924997 779824
$$ packed form
5016I36036K2705M5590l4575L2192j77911J59411l180j05519K2731J6756L1058
5005I45294m4039m7899K4894M189J3163p2918L9753p9067O9522k7870J256N6040
4993H82318j7885j5983R0923o8496J02126o2654L2118R2921m97n676Q6473J9177
4981A134865M1633Q106l0367P8235L8029J4259o7248P4612Q1455k0272R9852O8679
4969A521838N4707Q7949K3280J89325O4797J87116J00707L60160L70085N99387
4959C559351O23986N68560P97761R0650k58171q71548o74601n25124m05821l24203
4949B580840l09660j69200j91945j80984j33851p8771r6266q5284m9681j00093
4939A185105n3420L3755k722r0242N97j1236j30004O2182j41253P2235j45173
$$ plain form
4928 779824 862437 912107 806829 809861 825562 777572 742280 740415 746720 772133 718856 629371
4916 629371 784284 775099 673407 672963 748942 664768 712228 657388 620358 670967 600332 620775
4904 620775 662398 630627 683229 632674 629908 596155 603339 652951 639439 516980 614393 614014
$$ packed form
4928G79824Q2613M9670j05278L032J5701m7990l5292j865O305K5413n3277q9485
4916F29371J54913r185j01692m44P5979q4174M7460n4840l7030N0609p0635K0443
4904F20775M1623l1771N2602n0555k766l3753P184M9612j3512j22459R7413l79
$$ [...]
##END NTUPLES=NMR SPECTRUM
##END=
