##TITLE=abcd
##JCAMPDX= 6.0         $$ Bruker NMR JCAMP-DX V2.0
##DATA TYPE= NMR SPECTRUM
##DATA CLASS= NTUPLES
##ORIGIN= UXNMR, Bruker Analytische Messtechnik GmbH
##OWNER= root
$$ XWIN-NMR		Version 3.5
$$ Sat Mar 25 09:47:48 2023 Russian Standard Time (UT+4h)  servis@DPX200
##.OBSERVE FREQUENCY= 200.131235884673
##.OBSERVE NUCLEUS= ^1H
##.ACQUISITION MODE= SIMULTANEOUS
##.ACQUISITION SCHEME= undefined
##.AVERAGES= 8
##.DIGITISER RES= 18
##SPECTROMETER/DATA SYSTEM= spect
##.PULSE SEQUENCE= zg
##.SOLVENT NAME= CDCl3
##.SHIFT REFERENCE= (INTERNAL, CDCl3, 0, 16.4885)
##AUDIT TRAIL= $$ (NUMBER, WHEN, WHO, WHERE, WHAT)
$$ ##TITLE= Audit trail, XWIN-NMR		Version 3.5
$$ ##JCAMPDX= 5.01
$$ ##ORIGIN= Bruker BioSpin GmbH
$$ ##OWNER= servis
$$ F:\spectra/data/av/nmr/H1/1/pdata/1/auditp.txt
$$ ##AUDIT TRAIL=  $$ (NUMBER, WHEN, WHO, WHERE, WHAT)
(   1,<2023-03-25 09:47:19.59 +0400>,<servis>,<DPX200>,
      <created by zg, POWCHK disabled, PULCHK disabled
       terminated by command 'halt'
       configuration hash MD5:
       00 E9 B6 7A A2 85 ED C7 34 08 36 98 17 FE 4E 26
       data hash MD5: 32K
       73 63 E4 B8 D3 21 F9 9E 1A D2 F1 4B B7 9C C1 E7>)
(   2,<2023-03-25 09:47:23.75 +0400>,<servis>,<DPX200>,
      <Start of raw data processing
       efp BC_mod = 2 LB = 0.05 FT_mod = 6 PKNL = 1 PHC0 = -175.4473 PHC1 = -2.89851 SI = 16K 
       data hash MD5: 16K
       8E C7 47 D3 54 2C DB 8D 48 F1 14 25 27 B0 B0 0F>)
$$ ##END=
$$ 
$$ hash MD5
$$ 3E 84 A7 C8 18 5A 15 D1 BF E8 22 73 59 2C 80 2B
##$RELAX= 
##$RELAX= 
##$RELAX= 
##$RELAX= 
##$RELAX= 
##$RELAX= 
##$RELAX= 
##$RELAX= 
$$ Bruker specific parameters
$$ --------------------------
##$DU= <F:\spectra>
##$EXPNO= 1
##$NAME= <H1>
##$PROCNO= 1
##$TYPE= <nmr>
##$USER= <av>
##$AMP= (0..31)
100 100 100 100 100 100 100 100 100 100 100 100 100 100 100 100 100 100 
100 100 100 100 100 100 100 100 100 100 100 100 100 100 
##$AQSEQ= 0
##$AQ_mod= 1
##$AUNM= <au_zg>
##$AUTOPOS= <>
##$BF1= 200.13
##$BF2= 200.13
##$BF3= 200.13
##$BF4= 200.13
##$BF5= 500.13
##$BF6= 500.13
##$BF7= 500.13
##$BF8= 500.13
##$BYTORDA= 1
##$CFDGTYP= 0
##$CFRGTYP= 5
##$CHEMSTR= <none>
##$CNST= (0..31)
1 1 145 1 1 1 1 1 1 1 1 1 1 1 1 1 1 1 1 1 1 1 1 1 1 1 1 1 1 1 1 1 
##$CPDPRG= <>
##$CPDPRG1= <>
##$CPDPRG2= <>
##$CPDPRG3= <>
##$CPDPRG4= <mlev>
##$CPDPRG5= <mlev>
##$CPDPRG6= <mlev>
##$CPDPRG7= <mlev>
##$CPDPRG8= <mlev>
##$CPDPRGB= <>
##$CPDPRGT= <>
##$D= (0..31)
0 2 0 0 0 0 0 0 0 0.06 0 0 0 0 0 0 0.0002 0 0 0 0 0 0 0 0 0 0 0 0 0 0 
0 
##$DATE= 1679723239
##$DBL= (0..7)
120 120 120 120 120 120 120 120 
##$DBP= (0..7)
150 150 150 150 150 150 150 150 
##$DBP07= 0
##$DBPNAM0= <>
##$DBPNAM1= <>
##$DBPNAM2= <>
##$DBPNAM3= <>
##$DBPNAM4= <>
##$DBPNAM5= <>
##$DBPNAM6= <>
##$DBPNAM7= <>
##$DBPOAL= (0..7)
0.5 0.5 0.5 0.5 0.5 0.5 0.5 0.5 
##$DBPOFFS= (0..7)
0 0 0 0 0 0 0 0 
##$DE= 6
##$DECBNUC= <off>
##$DECIM= 32
##$DECNUC= <off>
##$DECSTAT= 4
##$DIGMOD= 1
##$DIGTYP= 9
##$DL= (0..7)
0 120 120 120 120 120 120 120 
##$DP= (0..7)
$$ [...]
##$SUBNAM4= <"">
##$SUBNAM5= <"">
##$SUBNAM6= <"">
##$SUBNAM7= <"">
##$SUBNAM8= <"">
##$SUBNAM9= <"">
##$SW= 20.6817932712277
##$SWIBOX= (0..15)
0 0 3 0 0 0 0 0 0 0 0 0 0 0 0 0 
##$SW_h= 4139.07284768212
##$TD= 32768
##$TD0= 1
##$TE= 0
##$TE2= 300
##$TE3= 300
##$TEG= 300
##$TL= (0..7)
0 120 120 120 120 120 120 120 
##$TP= (0..7)
150 150 150 150 150 150 150 150 
##$TP07= 0
##$TPNAME0= <>
##$TPNAME1= <>
##$TPNAME2= <>
##$TPNAME3= <>
##$TPNAME4= <>
##$TPNAME5= <>
##$TPNAME6= <>
##$TPNAME7= <>
##$TPOAL= (0..7)
0.5 0.5 0.5 0.5 0.5 0.5 0.5 0.5 
##$TPOFFS= (0..7)
0 0 0 0 0 0 0 0 
##$TUNHIN= 0
##$TUNHOUT= 0
##$TUNXOUT= 0
##$USERA1= <user>
##$USERA2= <user>
##$USERA3= <user>
##$USERA4= <user>
##$USERA5= <user>
##$V9= 5
##$VALIST= <valist>
##$VCLIST= <CCCCCCCCCCCCCCC>
##$VD= 0
##$VDLIST= <DDDDDDDDDDDDDDD>
##$VPLIST= <PPPPPPPPPPPPPPP>
##$VTLIST= <TTTTTTTTTTTTTTT>
##$WBST= 1024
##$WBSW= 30
##$XGAIN= (0..3)
0 0 0 0 
##$XL= 0
##$YL= 0
##$YMAX_a= 287039
##$YMIN_a= -256017
##$ZGOPTNS= <>
##$ZL1= 120
##$ZL2= 120
##$ZL3= 120
##$ZL4= 120
##$ABSF1= 0
##$ABSF2= 0
##$ABSG= 0
##$ABSL= 0
##$ALPHA= 0
##$AQORDER= 0
##$ASSFAC= 0
##$ASSFACI= 0
##$ASSFACX= 0
##$ASSWID= 0
##$AUNMP= <proc_1d>
##$AZFE= 0.1
##$AZFW= 0.1
##$BCFW= 0
##$BC_mod= 2
##$BYTORDP= 0
##$COROFFS= 0
##$CY= 18.4799938201904
##$DATMOD= 1
##$DC= 0
##$DFILT= <>
##$DTYPP= 0
##$F1P= 9.9274215381318
##$F2P= -0.165520771350173
##$FCOR= 1
##$FTSIZE= 16384
##$FT_mod= 6
##$GAMMA= 0
##$GB= 0
##$INTBC= 1
##$INTSCL= 4.127829e-11
##$ISEN= 128
##$LB= 0.05
##$LEV0= 0
##$LPBIN= 0
##$MAXI= 10000
##$MC2= 0
##$MEAN= 0
##$ME_mod= 0
##$MI= 50
##$NCOEF= 0
##$NC_proc= -6
##$NLEV= 6
##$NOISF1= 3.799351
##$NOISF2= 2.8
##$NSP= 0
##$NTH_PI= 0
##$NZP= 0
##$OFFSET= 16.48848
##$PC= 4
##$PHC0= -175.4473
##$PHC1= -2.89851
##$PH_mod= 1
##$PKNL= yes
##$PPARMOD= 0
##$PSCAL= 4
##$PSIGN= 0
##$REVERSE= no
##$SF= 200.130005582386
##$SI= 16384
##$SIGF1= 3
##$SIGF2= 2
##$SINO= 400
##$SIOLD= 16384
##$SREGLST= <1H.CDCl3>
##$SSB= 0
##$STSI= 16384
##$STSR= 0
##$SW_p= 4139.07284768211
##$SYMM= 0
##$S_DEV= 0
##$TDeff= 32768
##$TDoff= 0
##$TI= <>
##$TILT= no
##$TM1= 0
##$TM2= 0
##$TOPLEV= 0
##$USERP1= <user>
##$USERP2= <user>
##$USERP3= <user>
##$USERP4= <user>
##$USERP5= <user>
##$WDW= 1
##$XDIM= 16384
##$YMAX_p= 365023277
##$YMIN_p= -537559
$$ End of Bruker specific parameters
$$ ---------------------------------
##NTUPLES= NMR SPECTRUM
##VAR_NAME=  FREQUENCY,     SPECTRUM/REAL,   SPECTRUM/IMAG
##SYMBOL=    X,             R,               I
##VAR_TYPE=  INDEPENDENT,   DEPENDENT,       DEPENDENT
##VAR_FORM=  AFFN,          ASDF,            ASDF
##VAR_DIM=   16384,         16384,           16384
##UNITS=     HZ,            ARBITRARY UNITS, ARBITRARY UNITS
##FACTOR=    0.252644378177508, 1,           1
##FIRST=     3299.83951724647, 0,            0
##LAST=      -839.233330435636, 0,           0
##MIN=       -839.233330435636, -537559,     0
##MAX=       3299.83951724647, 365023277,    0
$$ Real data points
##PAGE= N=1
##DATA TABLE= (X++(R..R)), XYDATA
$$ [...]
9557 -292198 -363793 -228489 -280645 -279138 -176059 -225416 -266802 -266947 -278095 -176369 -273347 -233983
9545 -233983 -195166 -185433 -224367 -264230 -247618 -321605 -252571 -196986 -244931 -203310 -210013 -188229
9533 -188229 -201287 -236639 -366916 -245854 -190121 -198232 -283623 -306483 -336083 -287771 -312764
9522 -312764 -400505 -278114 -297055 -307552 -310008 -256280 -253831 -250236 -276064 -243824 -221865 -339396
9510 -339396 -274854 -327012 -189709 -323408 -123332 -255159 -274895 -180309 -194113 -261150 -234884
9499 -234884 -123833 -294010 -195972 -201542 -237874 -308504 -225401 -262161 -238034 -298385 -269982
9488 -269982 -266988 -324444 -226912 -239696 -261680 -273733 -247460 -285701 -240073 -250518 -269703 -187160
9476 -187160 -263509 -288430 -251422 -213297 -290885 -302779 -248055 -247722 -287603 -369143 -393504 -250585
9464 -250585 -228751 -224540 -294802 -246953 -227013 -261089 -306430 -273459 -201069 -337445 -233079
9453 -233079 -241663 -217546 -232870 -333674 -313872 -228382 -212773 -244615 -223931 -261977 -198901 -290363
9441 -290363 -296207 -318208 -232876 -263438 -324929 -349164 -341437 -316844 -260783 -251905 -285652 -293461
9429 -293461 -322561 -232517 -243971 -295395 -318936 -305017 -276656 -357566 -236958 -288333 -272881
9418 -272881 -330292 -275897 -278726 -273827 -230066 -268960 -252360 -259707 -318857 -333709 -275722 -262775
9406 -262775 -168841 -226305 -218634 -307158 -248952 -169699 -152608 -294831 -200310 -256004 -271932 -291238
9394 -291238 -226317 -268003 -301330 -344237 -273271 -189189 -235108 -247061 -235723 -198609 -167314 -284623
9382 -284623 -267865 -270546 -241364 -262573 -318648 -329768 -197890 -269254 -303340 -314291 -183273
9371 -183273 -223133 -232680 -265125 -330867 -242526 -230231 -297293 -299135 -298702 -209122 -262195 -221527
9359 -221527 -323953 -261557 -245624 -233474 -203397 -228000 -333930 -295022 -204662 -320673 -276086
9348 -276086 -295459 -171198 -303641 -277486 -302792 -260306 -167513 -243958 -208196 -217998 -175512
9337 -175512 -237885 -343128 -301270 -290389 -323282 -293139 -273030 -350656 -179554 -274246 -234007
9326 -234007 -259418 -227069 -303523 -204435 -267722 -193571 -202468 -238844 -298676 -246362 -157656 -170522
9314 -170522 -202529 -385963 -169706 -311074 -228223 -299453 -275314 -327454 -184145 -213685 -307033
9303 -307033 -308893 -217752 -317291 -300243 -213940 -238090 -330982 -213401 -336578 -274499 -264660 -292651
9291 -292651 -257516 -306445 -151693 -228186 -241844 -344548 -242450 -266710 -275022 -394779 -176619
9280 -176619 -297334 -218768 -237917 -194407 -311371 -307759 -244863 -200073 -175707 -327475 -178053
9269 -178053 -183916 -218954 -236632 -329914 -192026 -279315 -282529 -294590 -291474 -259816 -237789 -285636
9257 -285636 -295201 -251494 -243809 -282754 -251030 -316830 -215234 -155392 -177167 -183030 -146332 -313211
9245 -313211 -245097 -272082 -248233 -277273 -220299 -317622 -274962 -235448 -212709 -226360 -236699 -212294
9233 -212294 -225820 -247712 -202943 -233044 -193030 -229296 -226521 -204927 -241786 -107545 -239216
9222 -239216 -221956 -266650 -215579 -306771 -274753 -229026 -258089 -218655 -174988 -100440 -288379
9211 -288379 -180479 -183612 -166410 -204087 -202581 -223062 -177184 -178925 -97676 -247581 -212815 -193507
9199 -193507 -187218 -167914 -157794 -206479 -115132 -201977 -221926 -154450 -190996 -199821 -223985 -274655
9187 -274655 -220292 -33824 -149215 -53737 -197932 -170512 -185650 -171214 -170245 -143364 -205488
9176 -205488 -218658 -157802 -123386 -190614 -247221 -99725 -153535 -71345 -131329 -73604 -185853
9165 -185853 -169085 -126847 -133066 -119663 -107732 -67257 -97818 -24373 -80852 -94558 -37391 61699
9153 61699 35402 47993 -32929 -70507 -112123 -93740 -38266 -23281 -41789 92885 -13093
9142 -13093 -21800 17330 34954 -27966 42197 36914 22415 37662 53918 44630 54920 73296
9130 73296 97528 76155 180471 173981 202690 282095 223443 142724 293529 248284 376850
9119 376850 346580 336744 379077 401511 339781 446053 356011 484138 477963 549615 641592 636331
9107 636331 699273 786221 875424 936468 977720 1273289 1278843 1447209 1646088 1856322 2145655
9096 2145655 2411424 2894174 3321822 3687569 4031001 4463181 4423576 4229647 3713199 3424310
9086 3424310 2902496 2533624 2234471 1932938 1651262 1502836 1289422 1217451 1092396 910746
9076 910746 832881 708803 663339 617723 403350 455326 497101 355414 340250 299019 287176
9065 287176 337624 238319 157137 171997 190056 154270 100943 127953 139560 121700 56476 144147
9053 144147 -23980 -8314 28284 14532 -15816 82 -3330 15326 762 -67889 -41319 -79335
9041 -79335 18701 -62989 11231 -30360 -116742 -90144 -38207 -76895 -181039 -154027 -96376 -168106
9029 -168106 -174404 -203668 -127640 -106973 -143170 -172447 -125213 -194360 -82571 -138194 -183805 -226144
9017 -226144 -203779 -196728 -199174 -227848 -233144 -128335 -139824 -229341 -234195 -186129 -192234 -256009
9005 -256009 -154865 -143210 -136668 -250006 -191934 -184280 -173908 -259217 -184234 -201254 -191480 -160727
8993 -160727 -209449 -240195 -103917 -242270 -216196 -238355 -231377 -226481 -158275 -182393 -206172 -154142
8981 -154142 -171160 -195189 -224296 -264925 -233361 -290331 -201362 -189659 -231396 -244250 -165855 -226248
8969 -226248 -177747 -159904 -211674 -173773 -252137 -186936 -133507 -228154 -205044 -235133 -212520 -218781
8957 -218781 -256018 -169078 -220710 -252870 -285892 -167697 -224740 -237441 -188956 -246460 -255330 -329130
8945 -329130 -266812 -185509 -187211 -173823 -222074 -250197 -206077 -279602 -266724 -211917 -305327 -247378
8933 -247378 -283431 -243420 -216561 -157223 -180219 -269648 -289440 -288837 -274498 -229970 -234042 -261023
8921 -261023 -333345 -231942 -230028 -232043 -231645 -275392 -250556 -293735 -217578 -314521 -313991 -317784 -258655
8908 -258655 -296138 -318873 -260153 -315140 -282819 -251060 -226616 -240526 -220683 -229719 -286034 -277866
8896 -277866 -216900 -328044 -188076 -171389 -228872 -284627 -268444 -264964 -246722 -204701 -235604
8885 -235604 -309969 -268117 -283677 -291213 -338432 -309761 -279817 -267105 -353906 -242920 -251054 -257130
8873 -257130 -271280 -299473 -215030 -269688 -276889 -299921 -177578 -248017 -275557 -310612 -305418 -185516
8861 -185516 -274057 -221559 -302292 -326566 -240103 -263084 -264457 -367374 -330576 -277690 -314799 -209950
8849 -209950 -311648 -301757 -297650 -295136 -296518 -228770 -289782 -280690 -277136 -311259 -248210 -259213 -290861
8836 -290861 -261402 -329216 -267892 -281163 -313564 -289548 -230150 -276048 -241383 -352571 -296449
8825 -296449 -180987 -164683 -253904 -269919 -289771 -420406 -315183 -229956 -261538 -316345 -312826
8814 -312826 -232466 -226024 -265199 -200929 -256408 -324013 -301976 -286463 -274652 -259556 -333636 -251775
8802 -251775 -293341 -188797 -278256 -308434 -225331 -214508 -328827 -242218 -249038 -280455 -287576 -212388
8790 -212388 -288197 -237501 -269304 -303979 -375576 -347410 -305288 -236081 -343463 -234040 -249661
8779 -249661 -262730 -256676 -289588 -282823 -335631 -218853 -322507 -301716 -294628 -281922 -268860 -264264
8767 -264264 -386715 -236574 -167809 -316931 -249363 -217872 -254748 -316450 -258415 -189207 -260646
8756 -260646 -239227 -303892 -251216 -241695 -312008 -244429 -247313 -308197 -240377 -227009 -367262 -262478
8744 -262478 -321595 -250905 -311053 -220011 -277195 -264832 -280147 -295642 -290616 -329977 -337914 -242440
8732 -242440 -406930 -217238 -280731 -353391 -341569 -385258 -309651 -247651 -257181 -202538 -261732
8721 -261732 -194176 -253928 -325788 -226691 -250803 -294924 -283481 -257714 -232760 -251001 -304578 -283504
8709 -283504 -329157 -248637 -271476 -340727 -353336 -279672 -297170 -347287 -239169 -242355 -282185 -240638
8697 -240638 -230182 -246441 -387530 -286928 -302867 -335461 -316677 -312202 -281055 -225847 -254152
8686 -254152 -348108 -238343 -232105 -263910 -291489 -213569 -345097 -234892 -250076 -183962 -210117
8675 -210117 -166128 -251037 -262138 -224556 -223032 -224370 -299469 -311217 -246052 -303620 -258200 -311780
8663 -311780 -300451 -185628 -254497 -341382 -357101 -289557 -336168 -274584 -267893 -325214 -301561 -322107
8651 -322107 -221977 -203790 -276191 -329563 -320614 -263208 -328163 -264194 -312482 -311296 -233095 -254403
8639 -254403 -288601 -357367 -287845 -363191 -395163 -278238 -300778 -343200 -356902 -368316 -275874
8628 -275874 -300089 -286927 -356475 -310736 -304804 -266576 -302668 -252869 -166157 -262678 -300774 -241151
8616 -241151 -300934 -288860 -289426 -404444 -304673 -300683 -362497 -272754 -302096 -300602 -267453 -289152
8604 -289152 -409671 -284529 -250206 -250994 -235052 -192452 -260660 -336594 -315507 -263484 -204821 -249675
8592 -249675 -266738 -250597 -325749 -293035 -205270 -322145 -318084 -273046 -227387 -266504 -295104 -245110
8580 -245110 -349806 -291532 -263514 -341561 -299944 -288793 -291408 -376429 -269188 -221170 -243079
8569 -243079 -324666 -340156 -227074 -243736 -303564 -212371 -249488 -320619 -198211 -286830 -319648
8558 -319648 -312609 -233859 -297602 -299533 -286039 -338801 -229038 -306962 -397154 -234701 -272129 -328829
8546 -328829 -301219 -253639 -192392 -318597 -276810 -267685 -342221 -278972 -278937 -316032 -297923 -257966
8534 -257966 -201786 -205458 -16265 -480224 -450464 -440457 -366316 -285052 -302763 -354544 -291740
8523 -291740 -348295 -325965 -346158 -270767 -408105 -363713 -309882 -291988 -222251 -266472 -318023
8512 -318023 -416901 -240808 -286914 -306405 -225527 -364906 -337543 -244390 -284760 -354804 -293247
8501 -293247 -330019 -264661 -332811 -239694 -336781 -237088 -341463 -352840 -306937 -334731 -285870
8490 -285870 -259442 -343529 -342755 -311859 -317661 -281706 -332397 -397369 -389871 -306253 -262628 -254178 -283229
8477 -283229 -287097 -322485 -230377 -318999 -359502 -196924 -240324 -232049 -319831 -306454 -291250 -345151
8465 -345151 -271501 -216588 -304624 -251164 -305360 -284615 -298246 -324160 -179670 -345410 -279354
8454 -279354 -275958 -269717 -368667 -215811 -261937 -291866 -307785 -296163 -204887 -259114 -261699 -262539
8442 -262539 -323674 -239808 -359140 -267567 -308700 -354086 -366639 -345142 -259589 -291295 -310481
8431 -310481 -309910 -240127 -224984 -248409 -229805 -209787 -367300 -370389 -216305 -296416 -300046 -270813
8419 -270813 -318221 -318267 -202964 -377971 -255600 -296902 -208042 -254838 -329571 -316456 -272632 -295172
8407 -295172 -332792 -237222 -286584 -195449 -293385 -316955 -340837 -291283 -233358 -230612 -240655 -212326
8395 -212326 -337957 -332951 -260006 -278244 -264800 -202315 -298138 -313760 -239373 -310537 -309292 -304811
8383 -304811 -250824 -299726 -223408 -262597 -280288 -280659 -349922 -357660 -305180 -304525 -393185 -165491
8371 -165491 -200301 -325381 -228036 -363228 -317510 -129616 -279669 -223879 -369595 -312656 -290206
8360 -290206 -300334 -211724 -297904 -309051 -212920 -253255 -353339 -265007 -332850 -344613 -230243
8349 -230243 -302847 -329301 -272193 -299732 -241185 -273888 -267700 -187582 -282795 -313362 -347661 -314617
8337 -314617 -216238 -218324 -308653 -178059 -275400 -304213 -228817 -253161 -232759 -319966 -274839 -230626
8325 -230626 -283701 -278353 -243087 -192142 -223164 -299735 -133828 -223721 -386290 -271969 -263147
8314 -263147 -259089 -293906 -229478 -252917 -231446 -278293 -307152 -194836 -236602 -241418 -224474 -292133
8302 -292133 -350271 -314806 -190408 -370626 -212886 -250104 -255374 -354726 -240640 -196658 -233358
8291 -233358 -273362 -322829 -215428 -185498 -263708 -256128 -197157 -185936 -230422 -331019 -274490
8280 -274490 -270416 -349958 -250636 -229573 -222349 -194419 -303986 -264819 -313217 -310778 -316713 -205495
8268 -205495 -223093 -189429 -248431 -206895 -259062 -262816 -193168 -258002 -227195 -178806 -273867 -211877
8256 -211877 -263496 -224955 -176826 -160848 -232677 -202492 -184267 -242571 -190523 -222388 -147269 -293571
8244 -293571 -235401 -149272 -181279 -247071 -181178 -210437 -195831 -321563 -164759 -191980 -190030
8233 -190030 -258108 -197606 -264502 -201298 -267741 -212288 -216012 -116767 -169239 -251041 -134602 -214447
8221 -214447 -174436 -271561 -145902 -262656 -181391 -116017 -276441 -276029 -214462 -134169 -190833
8210 -190833 -177228 -191971 -154759 -191116 -101823 -187753 -218657 -230121 -237777 -219649 -34768 -164353
8198 -164353 -203425 -212245 -111622 -148832 -176349 -268421 -107770 -129115 -41110 -202715 -198026
8187 -198026 -134138 -172778 -115431 -134605 -155139 -101756 -186743 -197507 -127975 -110246 -117865 -141365
8175 -141365 -174547 -92007 -70263 -46918 -8869 -117269 -46972 -140527 -857 -134035 43081
8164 43081 68813 -110510 11282 -11071 -14512 -56213 -38916 -24546 -24253 -126383 -12223 -49320
8152 -49320 9856 16372 -29057 -19531 -8152 -60971 -3438 51166 -68032 -17881 55592 75850
8140 75850 10620 32257 12938 40686 104067 32319 107578 187087 77144 42373 106897 67198
8128 67198 104658 224929 187856 122552 144860 255265 177364 188552 168232 156897 166669 234449
8116 234449 229728 204763 194267 338827 347745 291357 231818 410274 329610 426086 358894 351243
8104 351243 411326 414641 421780 492981 509343 446230 425767 601534 597584 533024 652574 556403
8092 556403 622195 681010 621595 710055 710223 718878 775664 694375 841872 822114 850029 872023
8080 872023 887428 958404 1008399 1063258 1130175 1130293 1106412 1201963 1260021 1424326 1301764 1341779
8068 1341779 1437316 1497609 1532568 1606242 1702024 1735454 1799429 1932991 1999596 2047055 2188458
8057 2188458 2294182 2391032 2407671 2565605 2612788 2796239 2823669 3060376 3111419 3234288
8047 3234288 3410870 3547197 3661465 3870266 3948894 4101150 4262103 4388653 4520435 4501807
8037 4501807 4731542 4816785 4944906 5070834 5059179 5165694 5174178 5197374 5193276 5209748 5224305
8026 5224305 5216688 5244807 5189091 5137806 5238569 5201091 5103766 5276175 5175204 5094205 5157765
8015 5157765 5103653 5161333 5195366 5123279 5112686 5082670 4954816 5030184 5044604 4941685 4746757
8004 4746757 4643376 4579154 4380939 4327360 4181937 3951720 3824549 3781144 3570516 3394221
7994 3394221 3304388 3124245 3039441 2843246 2723147 2628549 2434537 2370455 2217928 2166241
7984 2166241 2114696 1974107 1873027 1789342 1747301 1633522 1571130 1574123 1396905 1318289 1305034
7973 1305034 1274638 1223442 1192651 1211569 1135279 1140744 1020101 919322 1015550 899557 900642
7962 900642 889103 866466 755403 762246 678104 706148 674155 629762 603581 545243 589199 527136
7950 527136 462289 519462 515138 408529 377316 486352 327732 355480 391612 405671 381912
7939 381912 336697 347725 278844 308316 232282 269999 231755 210900 111841 166350 195974 192332
7927 192332 250869 180276 127445 141134 191746 77002 113711 132928 123675 40794 71846 191431
7915 191431 66834 59045 182862 105374 96409 -19097 -671 64603 48049 30735 52573
7904 52573 -13533 26555 5691 13184 -6813 -39805 -21477 -48257 50648 -6848 -84762 -48822
7892 -48822 -80899 -53991 -51514 -74631 -24048 -69072 -116996 -107446 28022 -59526 -118191 -34254
7880 -34254 -76926 -116014 -120054 -103792 -91255 -66348 -151102 -38119 -22001 -212662 -52077
7869 -52077 -189327 -119434 -50637 -61371 -141883 50655 -69722 -137964 -76898 -174328 -117965
7858 -117965 -11587 -45296 -100941 -97781 -139919 571623 -506062 -289906 -228586 -230256 -192529
7847 -192529 -239775 -221699 -233574 -178594 -229706 -172270 -49350 -182456 -151713 -209299 -152921
7836 -152921 -253727 -160645 -122969 -268734 -196080 -131108 -144773 -123424 -214495 -94918 -105886
7825 -105886 -195712 -151685 -203858 -209109 -199575 -142282 -159248 -231510 -112952 -132862 -182010 -225107
7813 -225107 -291080 -236389 -241522 -300823 -92772 -168764 -243022 -221128 -207301 -220881 -220180 -256243
7801 -256243 -286416 -256428 -239782 -184295 -196119 -207850 -185386 -225987 -241420 -121498 -203629
7790 -203629 -205587 -286755 -218337 -219737 -192154 -304683 -181103 -204536 -231104 -177158 -220525 -218024
7778 -218024 -239370 -240542 -297981 -254410 -146737 -195695 -258398 -222266 -253721 -200497 -251171 -249190
7766 -249190 -279918 -265607 -161541 -248609 -352852 -190847 -221363 -255146 -201381 -302763 -206025
7755 -206025 -206017 -209140 -283867 -219529 -304874 -108262 -185735 -250451 -245941 -281234 -194462 -281049 -267114
7742 -267114 -305189 -252943 -304210 -262516 -279263 -275168 -145734 -162913 -247503 -258985 -250668 -239314
7730 -239314 -241607 -326924 -255060 -342728 -172888 -232522 -261500 -172956 -182451 -252583 -249665 -251627
7718 -251627 -286262 -252474 -255132 -217109 -205905 -343507 -240245 -207089 -252702 -242479 -279821
7707 -279821 -156126 -318863 -299948 -232750 -137802 -189303 -250342 -303704 -243356 -303419 -226588
7696 -226588 -271335 -250883 -261814 -314637 -212528 -267174 -254143 -298184 -234836 -183702 -241700
7685 -241700 -296955 -298548 -198824 -243383 -354835 -263945 -225080 -232046 -227886 -204811 -270620 -222621
7673 -222621 -295576 -233137 -303847 -219173 -267731 -266745 -276737 -213972 -159807 -233946 -205291 -197162
7661 -197162 -221991 -293333 -259188 -271263 -276877 -284733 -339028 -237756 -244285 -260644 -276845 -293455
7649 -293455 -249402 -248496 -320881 -215965 -291746 -233571 -256469 -273943 -280887 -283807 -192845 -209060
7637 -209060 -281596 -232447 -299794 -282425 -262721 -278183 -307672 -291039 -321249 -295242 -271867 -253504
7625 -253504 -260372 -275858 -295859 -270825 -318549 -309042 -252971 -314976 -269361 -215595 -257880 -176500
7613 -176500 -289565 -239306 -266507 -208249 -231166 -243060 -163805 -260281 -351536 -259211 -310988
7602 -310988 -243684 -313382 -328839 -297551 -402983 -296354 -336176 -266908 -253275 -227706 -273201
7591 -273201 -255897 -348915 -307889 -281081 -188241 -273241 -194264 -219354 -228352 -221359 -346132 -288332
7579 -288332 -270835 -219404 -309184 -270974 -204044 -250280 -251198 -293922 -249937 -305936 -318773 -177663
7567 -177663 -303891 -246775 -243525 -257091 -225460 -265492 -262397 -250756 -286336 -265415 -175387 -323478
7555 -323478 -312898 -286170 -254291 -136094 -326434 -323545 -239614 -207384 -267679 -284648 -191296
7544 -191296 -330746 -285394 -358941 -256633 -312714 -166030 -223419 -244977 -308280 -234361 -217560
7533 -217560 -160433 -305941 -329448 -235999 -236541 -283816 -283647 -244707 -254583 -251036 -269514 -231113 -195303
7520 -195303 -248019 -264170 -273847 -292398 -224367 -297038 -235836 -345975 -330295 -239537 -215306 -222450
7508 -222450 -269298 -273523 -288170 -268942 -280497 -209711 -313189 -265687 -197096 -273174 -290845 -253011
7496 -253011 -278086 -323024 -290374 -240879 -171397 -300821 -297823 -282103 -207549 -351748 -287967
7485 -287967 -314236 -213237 -261995 -160087 -248500 -261872 -180738 -246856 -231087 -238491 -280356
7474 -280356 -245247 -185519 -234466 -250066 -224682 -159462 -185654 -224052 -226645 -198523 -190544 -279489
7462 -279489 -232744 -253773 -304780 -281549 -365925 -301940 -251217 -269753 -283761 -249798 -258410 -287714
7450 -287714 -304760 -308595 -298930 -237134 -286417 -298221 -270549 -277103 -256351 -187553 -247493 -203900
7438 -203900 -230845 -298720 -317280 -274896 -293071 -247254 -317377 -302714 -230055 -330279 -323547 -278503
7426 -278503 -292725 -232093 -181493 -273104 -218147 -182414 -300033 -193583 -271192 -167866 -321108
7415 -321108 -273348 -238536 -216838 -272763 -309636 -298151 -124995 -242734 -236964 -202621 -210820 -222861
7403 -222861 -230409 -145609 -230842 -173207 -276925 -210728 -223487 -296744 -217010 -147813 -226052 -230003
7391 -230003 -185480 -247200 -207758 -186104 -174809 -232205 -213966 -187883 -271330 -183301 -319628
7380 -319628 -163225 -237678 -253500 -229689 -174437 -252181 -256213 -173197 -166257 -259766 -181577 -289004
7368 -289004 -201410 -201310 -235849 -165351 -222670 -297681 -178103 -159972 -246389 -202906 -167991 -136977
7356 -136977 -266595 -205929 -184823 -147386 -271846 -293545 -260796 -253616 -182391 -210406 -305072
7345 -305072 -272153 -195200 -238393 -228245 -302497 -180736 -200784 -227499 -153138 -204355 -257029
7334 -257029 -178725 -168266 -225516 -231391 -200784 -220713 -194361 -192373 -241278 -221849 -213739 -302432
7322 -302432 -193962 -293602 -251891 -221667 -255985 -188021 -159223 -237513 -289238 -165787 -215549
7311 -215549 -221054 -268517 -134883 -206943 -189264 -194601 -164940 -266647 -223720 -200003 -196570 -260900
7299 -260900 -203120 -282265 -264736 -196464 -213637 -236431 -184920 -209514 -327861 -161419 -186098
7288 -186098 -170483 -221055 -221975 -137852 -185382 -211026 -174077 -227758 -159112 -235849 -76082 -169939
7276 -169939 -194551 -153741 -125595 -220856 -117632 -195598 -204546 -262061 -193749 -170008 -214508 -184884
7264 -184884 -122901 -243086 -191595 -183247 -179919 -143996 -148013 -277331 -92290 -226063 -207764
7253 -207764 -131504 -260592 -187240 -142657 -144422 -111185 -225848 -189643 -214329 -124399 -280871
7242 -280871 -67967 -171390 -185875 -134879 -172539 -155103 -181105 -97916 -146246 -100198 -97439
7231 -97439 -173533 -78818 -131865 -123132 -128744 -78673 -136502 -80501 -112319 -81183 -114687 -126269
7219 -126269 -79383 -44679 -153020 -133135 -187406 -127440 -121102 -102558 -224213 -102985 -130752
7208 -130752 -70359 -98777 -186388 -110282 -117842 -46086 -100965 -151736 -28431 -32928 -90753 -120087
7196 -120087 -40781 9774 -125571 -33129 -82822 26399 -30075 -18986 -74743 58552 25406
7185 25406 -6340 -96699 -101303 71044 -20989 31636 -23352 68561 76169 9478 26838 66115
7173 66115 -18644 34141 42862 68771 55262 20869 25006 87667 86996 44976 33169 51777 201706
7160 201706 221821 119760 293885 165907 254390 214291 246344 158150 274193 249818 346723
7149 346723 263970 242388 267673 275515 311306 307241 357018 383920 368107 354956 372108 412880
7137 412880 456079 434956 460155 514766 548960 577686 569149 574338 603569 638666 677547 653184
7125 653184 657818 700791 734049 817907 886722 877331 882934 846599 1012045 992984 979316 964331
7113 964331 1072555 1184344 1205760 1179069 1242037 1316298 1318027 1373076 1405200 1516442 1570672
7102 1570672 1544703 1610526 1637773 1774080 1716333 1733469 1832876 1859344 1978955 1904389 1940197
7091 1940197 2072810 2109989 2222598 2263782 2307975 2412609 2451697 2505806 2566403 2600244 2715433
7080 2715433 2740096 2789957 2823401 2880926 2844184 2959587 3108773 3090112 3202214 3282187 3285371
7069 3285371 3392784 3276233 3376208 3450578 3420869 3555092 3589298 3636387 3641431 3762276 3763070
7058 3763070 3730113 3801359 3748550 3875364 3832335 3978135 3906156 3913713 3936000 3970502 3948752
7047 3948752 3940427 3902825 4034997 3969654 3933531 4008646 3991124 3957697 3930737 3905918 3899177 3846151
7035 3846151 3915642 3892171 3954871 3779344 3821978 3640480 3644095 3587295 3587488 3509108 3542902 3395551
7023 3395551 3399912 3325920 3281393 3260247 3174649 3251973 3186099 3011279 2995694 2863706 2898334
7012 2898334 2896431 2806413 2782213 2703726 2640576 2520626 2529003 2531175 2299953 2314220 2208794
7001 2208794 2230289 2083494 2074913 2066488 1911496 1952535 1860552 1736829 1676473 1683375 1584323
6990 1584323 1627146 1551329 1519899 1509791 1386840 1366092 1182958 1246110 1230841 1179321 1111086
6979 1111086 1076622 1089763 922682 1013443 930999 880689 856809 805025 738226 812576 820937
6968 820937 772476 697204 619111 672073 633441 554395 662936 560513 592689 603067 492944
6957 492944 517798 430899 416401 362374 435278 302733 468055 379253 365217 338317 309387
6946 309387 223872 294174 312610 238103 215445 178643 191221 264526 177190 131151 206543 141708
6934 141708 250314 288387 148314 224575 112793 151499 151945 110019 77869 122172 134499
6923 134499 222011 120055 79104 27934 54850 532 86849 57874 33267 58590 101407
6912 101407 123303 64699 43062 34010 -4021 75399 -29371 11022 -30519 4254 -45794 -88352
6900 -88352 -86033 66360 -43349 11263 9292 -40416 -47310 65449 -109198 -53066 -40062 8183
6888 8183 -21993 -45447 -25659 -44186 -32339 -61435 11834 -101475 -9752 -76426 4907 -39135
6876 -39135 38633 -32388 -17461 -18902 29981 -115657 -41520 5497 14551 -29518 -43011 7260
6864 7260 -71182 -142873 -70630 -82281 -73326 897 -71218 -161948 -39679 -52474 5403 -56062
6852 -56062 -64048 -32329 -7214 -66103 -59015 72237 -24345 6069 -64041 -81180 -161 -103086
6840 -103086 -92342 54579 -76405 30007 -72064 -46701 -19190 44426 -9428 -31754 -132486
6829 -132486 -21447 -59011 -101658 -51879 -111218 -36500 -40971 -56124 -70355 11438 -51996 -28988
6817 -28988 -13740 -69828 1561 38725 -30281 -103385 -36872 -22880 -68731 -107071 -72568 -59391
6805 -59391 -37256 -95088 89720 -34388 75018 5619 -59004 -33136 27393 32325 32404 -26332
6793 -26332 -63280 -63128 69099 -25008 -28138 26029 -113680 -4048 -3158 -29472 19462 -3327
6781 -3327 -85605 -32760 79013 -31131 -29243 -77452 -26656 -55189 10296 -52783 -22397 -79292
6769 -79292 -88742 -79711 -55692 -56086 -118409 -36840 -44981 -83976 -14403 -78644 10872 -173251 52281
6756 52281 -25054 16501 40283 7506 -58613 -53933 26322 -100292 -105060 16532 -35753 -31122
6744 -31122 27601 -12930 -96676 -47481 25520 -61049 10462 34633 33522 -11099 -2508 -66915
6732 -66915 -33084 -29270 -53014 -113027 -89151 -44661 -22583 -35713 45083 72443 2358 -14214
6720 -14214 63559 -72519 -45849 -82828 5204 -42878 41656 52063 98619 3399 -41111 72216
6708 72216 33363 19744 129858 13628 -7480 14608 6683 103995 53928 15507 2854 140225
6696 140225 49152 86473 78741 89954 65393 58237 58480 90688 44373 59476 51503 81816 92576
6683 92576 198650 110119 122086 34647 163080 41649 107007 51847 84477 149379 136413
6672 136413 85508 212070 144299 127741 220756 109591 111402 195253 207292 142381 224164
6661 224164 174211 207904 292387 212643 309291 241068 235706 198322 225888 266046 238317 132557
6649 132557 188648 194731 205418 186713 213520 210356 264276 382208 236788 336481 302561 348478
6637 348478 267987 400316 272368 191333 297249 337230 354154 343059 440651 368792 384022
6626 384022 412274 398648 378204 404397 421811 405594 396111 516511 481908 430764 521773 511981
6614 511981 503422 445307 551338 546692 539588 608993 551552 650014 528068 631919 675663 711569
6602 711569 745889 696197 768274 622842 715858 745524 723685 701074 838019 845640 851220 881124
6590 881124 944079 938437 900828 954477 993408 953718 1016868 1104913 1109461 1121560 1181585 1159613
6578 1159613 1310273 1241785 1301775 1327761 1313938 1394796 1507019 1514231 1510214 1620639 1692787
6567 1692787 1705718 1789610 1871045 1842850 1934804 2031959 2164764 2172720 2267880 2311693 2456696
6556 2456696 2524837 2601512 2705248 2849606 2818308 3074771 3216363 3386675 3571842 3658514
6546 3658514 3899631 4099903 4293455 4493990 4763534 4988438 5245487 5400453 5771030 6043681
6536 6043681 6246277 6321787 6577787 6677115 6816601 6770446 6960096 7020901 6989139 6976017 7043944
6525 7043944 7031411 6971358 6941513 6879524 7048551 7101658 7187474 7340595 7384014 7662620 7843964
6514 7843964 7986365 8236645 8511248 8768029 9096733 9317661 9605743 9972681 10196665 10422074
6504 10422074 10721084 10924646 11215712 11355042 11587476 11643269 11765792 11983323 12058627 12186470
6494 12186470 12044446 11982393 11950174 11849664 11770220 11555557 11246916 10948754 10656126 10442911
6484 10442911 10191820 9920592 9788867 9560097 9442804 9288434 9280736 9296954 9287742 9405384
6474 9405384 9463667 9448863 9605874 9634780 9615699 9707497 9667529 9644229 9486965 9409913 9341015
6463 9341015 9149987 8833861 8549963 8107990 7811371 7585005 7209105 6783160 6483409 6374491
6453 6374491 5921757 5568263 5349313 5136768 4890626 4810066 4525460 4406334 4320848 4248054
6443 4248054 4149771 4092097 3980617 3848174 3877385 3745665 3820709 3794094 3816240 3832796 3716685
6432 3716685 3689470 3791554 3718402 3765169 3834820 3794788 3914530 3860698 4037465 4033168 4129351
6421 4129351 4201773 4282646 4389233 4511784 4646121 4834519 5028552 5239511 5443167 5650751
6411 5650751 5786292 6184394 6280840 6682481 7062922 7484534 7881978 8193028 8780222 9136160
6401 9136160 9628538 9913492 10217224 10539397 10629426 10661732 10771152 10628042 10692300 10549337
6391 10549337 10538841 10454615 10264157 10172645 10025308 9955102 9982297 9925543 9869904 9967883 10087145
6380 10087145 10267214 10425415 10610013 10883312 11072678 11430409 11503759 11777756 11805173 11940259
6370 11940259 12018258 12017877 11805703 11774384 11718415 11586264 11442235 11252888 11103992 10869442
6360 10869442 10636002 10543781 10196446 10066422 9841378 9638446 9264340 9014889 8777142 8372873
6350 8372873 8045199 7823758 7593808 7300368 6950034 6814142 6757234 6677414 6545924 6590686
6340 6590686 6488397 6462420 6442702 6427745 6423235 6468551 6396447 6408578 6287498 6238523 6183991
6329 6183991 5858422 5787935 5448805 5346521 5026947 4728519 4452116 4195368 3905947 3682933
6319 3682933 3474924 3206380 3066770 2901556 2877088 2669232 2348079 2372468 2138582 2175572
6309 2175572 2015572 1900117 1815193 1734344 1771413 1612329 1610808 1616161 1499558 1522839 1459562
6298 1459562 1303663 1290118 1263224 1179267 1140039 1130874 1159682 1093622 1048004 1029601 928661
6287 928661 1017696 921712 904281 864795 819541 873675 863631 764515 687736 714238 684755 774927
6275 774927 686301 680482 720316 713410 641762 674331 586664 573829 548505 572857 520636 629782
6263 629782 497679 437347 453127 364866 481585 368377 454577 408377 376838 426047 360096
6252 360096 375951 344857 416973 328553 366261 400171 413781 371768 323117 344329 304415 404738
6240 404738 351196 402096 418893 318777 380256 329919 349317 343151 253319 287353 314881 282190
6228 282190 335837 319146 274530 250411 289872 319393 306141 296000 227302 276196 194300 151558
6216 151558 249312 251483 289451 260373 315668 288516 260456 251017 263031 140547 319309 235537
6204 235537 224433 172145 223119 219581 256670 133950 225106 258331 285766 282919 296216 230416
6192 230416 208113 238133 266466 222742 304544 278549 312781 258825 235633 218243 230309 280524
6180 280524 273253 186084 269458 201378 269078 301274 266520 316312 308664 220600 276884 374791
6168 374791 337205 306308 375660 274093 345926 328733 289963 406230 350116 365581 383991
6157 383991 359337 292637 277363 297465 282174 246991 390181 332567 313789 307856 337959 267116
6145 267116 239081 291309 303305 389896 356852 202227 286615 309672 273338 304135 327456
6134 327456 286157 212323 218219 288074 287858 224003 337336 373394 292653 413408 347864 432546
6122 432546 351735 256317 356009 272643 365524 306173 279576 336391 308164 322274 356781 433550
6110 433550 363225 221026 318144 386941 328334 317161 375904 443899 420912 367321 400466
6099 400466 414442 481925 514218 401876 311952 451756 448348 403549 485311 456596 434756
6088 434756 550405 533980 469855 511642 554921 609779 516218 553862 516675 541407 526167
6077 526167 612517 633926 614614 715231 622739 679731 661081 712461 667607 707370 732765
6066 732765 807487 829526 755864 892259 782080 781000 836602 755490 777066 776564 771274 823750
6054 823750 815276 784256 807003 877223 820018 858547 869793 932342 910401 982528 1019427 1040846
6042 1040846 1138645 1191878 1350110 1306049 1372520 1377722 1421178 1354375 1372839 1235037 1222145
6031 1222145 1165194 1177468 1121221 1121315 1050045 1065178 1015936 979585 1026916 1077816 1010463 1089105
6019 1089105 1056838 1057956 979829 1093402 1112324 1306235 1283696 1389250 1470330 1517790 1590165
6008 1590165 1622134 1547471 1507448 1460984 1476012 1354571 1258313 1350992 1280546 1254316 1227517
5997 1227517 1274580 1134787 1082557 1130306 1126502 1126211 1086842 1113508 1125126 1146249 1133804 1100344
5985 1100344 1073430 1170564 1179428 1281482 1269703 1227191 1326289 1307007 1293311 1312899 1323088
5974 1323088 1260623 1322488 1271809 1340892 1264230 1247315 1338849 1226181 1270902 1232905 1219194
5963 1219194 1220711 1254652 1282505 1340804 1316586 1333599 1375904 1411281 1379900 1413349 1405183 1554087
5951 1554087 1425716 1469771 1547137 1565353 1606347 1645783 1612063 1626855 1614420 1689803 1670590
5940 1670590 1810991 1745585 1733218 1752576 1623340 1735099 1771629 1839193 1836068 1895347 1927401
5929 1927401 1987530 1935855 2011563 2016081 1987603 2102398 2100994 2042555 2248511 2100696 2218272
5918 2218272 2274228 2396996 2371518 2455881 2439319 2491448 2631912 2603399 2697652 2742043 2821632
5907 2821632 2849768 2873146 2948972 2949327 3063003 2968585 2974716 3084750 3087860 3127823 3133573 3256490
5895 3256490 3224003 3326078 3357819 3404979 3481378 3573306 3569413 3704601 3821069 3915324 3989846
5884 3989846 4083747 4182860 4259263 4363397 4407651 4446728 4574291 4704804 4721504 4796237 4851722
5873 4851722 4794384 4926813 5038136 5170267 5263407 5384691 5491239 5640725 5750751 5869146
5863 5869146 5971568 6079474 6253990 6359065 6528301 6680364 6828941 7094299 7142036 7433126
5853 7433126 7532279 7685723 7889781 7985547 8187716 8248551 8515961 8644743 8785081 8963681
5843 8963681 9015214 9275196 9583102 9730263 10085003 10267937 10549715 10861932 11128567 11592490
5833 11592490 11889968 12215965 12573148 12976359 13230065 13669546 13995680 14423140 14761182
5824 14761182 15269462 15604306 16077544 16428600 16927583 17346432 17869974 18396891 18955962
5815 18955962 19608421 20007085 20642598 21314224 22030397 22786914 23587977 24450711 25446405
5806 25446405 26465196 27595898 28693334 29971186 31363426 32791205 34601133 36496942
5798 36496942 38814684 41237830 43899808 46831806 50022851 53763584 57813628 62244823
5790 62244823 66871788 71233220 74824572 77343496 78297126 78026327 76558399 74695066
5782 74695066 72619338 70791623 69225279 67865612 67021132 66682345 66807705 67431789 68584299
5773 68584299 70407297 72768876 75761946 79515164 84234714 89427377 95424860 102458772
5765 102458772 110574658 119866539 130447347 142249341 154505154 166294321 175880004
5758 175880004 181578568 182212685 177639793 169323343 159283180 148714139 138552563 129237073
5750 129237073 120959977 113851530 108159738 103672173 100191115 97754540 96215156 95730389
5742 95730389 96170694 97801575 100352826 103951414 108372432 113840270 120697563 128727871
5734 128727871 138319258 149103360 160533315 171339566 179928862 184612263 184169122 178078949
5726 178078949 167934379 156018372 143362846 131219619 119901594 109782155 100716735
5719 100716735 93111291 86656369 81185760 76583545 72728301 69494091 67166140 65356634
5711 65356634 64095866 63385350 63302756 63701344 64543590 66000292 67976942 70511631 73237631
5702 73237631 75664283 77437730 77885597 76766066 73771012 69788202 64931884 59993122
5694 59993122 55126549 50636795 46542465 42814977 39513027 36664600 34020750 31977001
5686 31977001 29810127 28061870 26613805 25061640 23814063 22619791 21572658 20663874
5678 20663874 19765862 18914255 18260451 17398936 16805861 16137841 15486249 14948454 14393573
5669 14393573 13875508 13294382 12800082 12316009 11956334 11456797 10997553 10737618 10397713
5660 10397713 10055988 9811381 9590280 9257147 9068278 8788600 8734903 8465712 8273679 8170642
5650 8170642 7795282 7723002 7523400 7333859 7168051 6911946 6752011 6559970 6364863 6236977
5640 6236977 6045026 5888107 5699472 5434432 5381066 5255083 5216207 5114364 5026806 4841901
5630 4841901 4798781 4687975 4717063 4525710 4487543 4489945 4361284 4265105 4159725 4085440 4096692
5619 4096692 3940224 3926983 3826443 3649707 3623703 3495264 3490704 3454709 3237021 3332678 3164302
5608 3164302 3032037 3019999 2981282 2962661 2974873 2854373 2939995 2913863 2771603 2736793 2727174
5597 2727174 2720408 2593257 2667144 2609873 2601674 2482264 2475826 2473899 2418765 2304673 2299004 2308317
5585 2308317 2218096 2328988 2172611 2116432 2134597 1975489 1982222 1845136 1907937 1946478 1931588
5574 1931588 1820985 1807187 1729648 1846553 1838306 1818534 1709085 1786890 1781500 1747379 1744958
5563 1744958 1704408 1731840 1678574 1648099 1632772 1561243 1547601 1500001 1540550 1470332 1385940
5552 1385940 1535239 1397506 1421382 1450341 1437605 1390270 1323594 1351614 1249388 1296523 1257062
5541 1257062 1302526 1224147 1175305 1289030 1325316 1270044 1199141 1241579 1211871 1222562 1229870
5530 1229870 1259034 1191395 1122391 1152723 1240901 1182361 1175600 1136110 1067495 1095920 1109550 1081276
5518 1081276 994687 1097571 1135607 1115125 1158179 1119051 1103817 1092840 1109277 1203395 1075906
5507 1075906 1161894 1177143 1215741 1173542 1233220 1251416 1151734 1123266 1137603 1225782 1257590
5496 1257590 1170529 1058115 952382 1123509 1113125 1137914 1070456 1198075 1070917 1116301
5486 1116301 1180625 1095914 1172170 1238716 1249267 1363721 1434586 1492353 1505612 1517323 1644257
5475 1644257 1541652 1642233 1511117 1508831 1416055 1576570 1411955 1391545 1285244 1288692 1266000
5464 1266000 1165057 1266210 1222206 1183170 1238747 1244251 1221963 1266902 1341444 1372487 1470243
5453 1470243 1515123 1514723 1552684 1528597 1598491 1691699 1624670 1628733 1573269 1516730 1419636 1346792
5441 1346792 1247139 1180882 1180650 1022393 1020090 868883 932468 780056 825117 702256 741612
5430 741612 737788 748780 661538 690212 687378 672756 686536 698725 707155 608666 627369 785215
5418 785215 678567 648106 689539 667390 659147 586982 597336 560224 503129 458284 451775 440372
5406 440372 469615 389050 523093 442326 389573 388277 348384 287460 405707 347086 466567
5395 466567 385847 288200 376366 328773 316882 208324 324262 278832 391942 360432 259436
5384 259436 236141 360531 392898 365138 233238 235070 351854 247509 245040 306200 341862
5373 341862 208484 167398 136526 266792 244761 264298 302174 304689 247317 292057 300588 215716
5361 215716 235654 191102 232647 228952 259146 184171 170392 259391 264728 298922 268128 319957
5349 319957 292502 229694 321891 264681 322857 301270 236495 286197 232727 272702 165743
5338 165743 234335 231938 202022 231032 230281 268859 257461 259095 270502 173917 202961 249067
5326 249067 203449 237307 272842 236967 256071 243748 286635 331116 196133 303747 194043
5315 194043 189359 282138 164962 161387 164490 141087 202995 185236 177164 140713 163883 183978
5303 183978 214845 271096 177388 70001 110157 176562 209068 100722 126938 111174 82189
5292 82189 247521 289840 162622 110240 153957 128652 99937 179473 105738 164415 192763
5281 192763 183806 156520 147090 138655 116193 94657 171806 155130 83407 107623 100250 203589
5269 203589 171743 143104 242747 198083 71040 202086 100478 181472 197430 260700 154324
5258 154324 201788 172903 148382 57022 151321 173355 172914 205759 106250 134430 121095 94112
5246 94112 147535 146515 124928 166906 144216 164208 177268 250906 146995 249282 133031
5235 133031 230120 147200 204483 229069 206903 154690 120834 158308 215115 220800 256731 188406
5223 188406 268411 175855 158973 209384 172032 281780 160621 185129 229187 224634 169679
5212 169679 220430 220293 140746 307128 178151 208305 339563 255449 280222 179864 196174
5201 196174 242187 181172 273313 161014 268036 261386 200697 254324 193585 202095 259483 337469
5189 337469 330207 222459 327946 262159 317108 262912 278539 314608 345772 400382 360766
5178 360766 361400 374512 333803 333041 402813 405883 342239 399456 429866 385875 422493 394383 390087
5165 390087 438826 391449 452448 473288 407960 419055 511353 437273 526097 480220 567819 646192
5153 646192 507923 608182 667149 611422 603613 591157 601612 710995 724094 647211 645870
5142 645870 772893 734122 852792 813155 767239 721255 892925 896874 844229 848044 937876
5131 937876 1008703 1024910 1024814 1021637 1128729 1194472 1221563 1145804 1234590 1324162 1329086 1438687
5119 1438687 1356532 1418677 1570034 1650731 1741968 1783784 1827741 2010960 2001969 2112407 2176411
5108 2176411 2303933 2429925 2473654 2672259 2797575 2956096 3066679 3200918 3480339 3594244
5098 3594244 3757802 3945983 4105867 4348790 4480789 4555564 4870407 5018933 5213850 5352381
5088 5352381 5553699 5916070 6147630 6309106 6598388 6642762 6811279 7038370 7165693 7225949
5078 7225949 7330002 7447762 7571939 7747370 7801902 7961905 7940016 8095514 7946901 8020772
5068 8020772 7946001 7861119 7710627 7477464 7454033 7300360 7205639 7131916 7025847 6867114
5058 6867114 6782093 6526526 6345166 6121373 5843145 5621949 5493481 5217383 4994788 4848867
5048 4848867 4708512 4418981 4243634 4053548 3872008 3744292 3540359 3335093 3180717 2977283
5038 2977283 2808255 2790055 2597253 2452846 2297902 2244068 2118944 2021761 1853688 1844162
5028 1844162 1692564 1668496 1556958 1425310 1377282 1318524 1370159 1296994 1180161 1167092 1177430
5017 1177430 1163010 1083085 982625 1032677 1051027 960862 867425 865252 913257 888479 793732
5006 793732 787236 772168 719836 833225 682406 753531 719634 617791 585604 583491 669423
4995 669423 626806 635257 643283 659923 571854 507811 452727 582724 515294 584050 595571 500727
4983 500727 452902 468010 499532 393746 442077 553873 408016 393194 449130 420516 434464
4972 434464 386411 419181 369448 379257 419484 300687 321080 374210 359466 463120 343806
4961 343806 344802 370901 394649 418709 371454 406504 370945 312438 275936 317117 314557 406998
4949 406998 346169 320044 386183 348606 297132 279916 289127 322392 321841 273554 240714 328371
4937 328371 340231 285392 282740 339155 344914 312097 272950 313561 284958 271366 276844 241401
4925 241401 334385 323058 316893 262690 318092 252635 345511 376238 342450 397373 348430 317387
4913 317387 359220 349814 351676 333160 288964 350571 409099 335125 434420 335789 358083 422582
4901 422582 356685 334414 484286 369392 310584 448213 401112 422943 542516 392234 425923
4890 425923 515037 367467 406382 517324 563558 507317 546640 655148 629757 601297 718903
4879 718903 649276 788411 701781 745552 784318 799410 915011 926194 1041132 1134944 1155690
4868 1155690 1182205 1157568 1160159 1114163 1006531 896240 874252 886925 849994 728826 727063
4857 727063 674868 733120 607209 670491 564219 599302 510098 551844 517529 563318 670189
4846 670189 534331 443277 478465 505233 543415 427276 553915 543713 465945 598088 553375
4835 553375 604186 642904 582845 603756 643960 559198 592369 552786 580474 670005 602138 568387
4823 568387 578507 637177 598871 668650 742022 556975 605760 631282 676609 646001 622275
4812 622275 553340 579446 616009 614771 627358 588732 747869 665699 630903 627978 653153 687785
4800 687785 760970 819143 793798 720841 668715 726047 722651 717573 804560 775753 806245 750729
4788 750729 784342 743135 783647 850672 802264 816897 814388 815521 879686 795376 790600 772850
4776 772850 782624 846094 892062 839526 887461 943425 873648 932377 852665 845446 791855 905885
4764 905885 770006 865736 855631 844564 837078 793723 877273 796102 911519 960451 893151
4753 893151 792218 878079 908762 915178 881612 976256 1054834 1001316 1030148 1003076 1090012 1117324
4741 1117324 1003937 1071975 1167840 1168339 1077213 1258198 1211393 1276563 1274007 1305001 1286585 1297213
4729 1297213 1339602 1343030 1370154 1357126 1399136 1467425 1461433 1464822 1439932 1536796 1567983 1599825
4717 1599825 1576440 1625485 1581492 1774804 1738510 1785434 1849505 1860897 1871642 1865011 1998362
4706 1998362 1913658 2030250 2002550 2161104 2133699 2252536 2315857 2300053 2325237 2467997 2453706
4695 2453706 2555513 2540666 2633716 2642399 2731625 2873346 2815740 2989660 3072588 3066002 3239718
4684 3239718 3251496 3272319 3219499 3443722 3502740 3523136 3644410 3790329 3809379 3900913 3916653
4673 3916653 4075340 4191928 4195083 4356741 4469227 4517341 4700409 4792136 4992795 5216091
4663 5216091 5362127 5483398 5722386 5867615 6028772 6108238 6287478 6328938 6475731 6633029
4653 6633029 6717290 6857113 7023778 7217007 7492373 7820331 7929862 8262558 8607687 8974775
4643 8974775 9387693 9787238 10251500 10856832 11384559 12062547 12877522 13702971 14533634 15579691
4633 15579691 16540329 17576793 18637334 19501983 20418855 21063865 21663997 22172406 22553086
4624 22553086 22831763 22882665 23089113 23079137 23026596 22981927 22903571 22754592 22649669 22456668
4614 22456668 22105157 21728936 21315735 20739080 20017571 19278970 18513136 17632994 16843847
4605 16843847 16060709 15225493 14521642 13690301 13048585 12399475 11782733 11269899 10617350
4596 10617350 10181201 9816976 9368454 9078327 8773363 8535894 8248157 7994796 7803831
4587 7803831 7570235 7425074 7352044 7050554 6920444 6862315 6801074 6747822 6660642 6696399 6623856
4576 6623856 6507409 6442774 6472705 6457431 6334904 6289172 6397722 6384754 6276279 6304231 6323357
4565 6323357 6258655 6381439 6322341 6307432 6321348 6370269 6336846 6419032 6436512 6416895 6410137
4554 6410137 6442024 6435459 6476625 6526427 6439508 6568019 6553430 6566169 6592150 6599653 6771496
4543 6771496 6852622 6873272 6925451 7140668 7036047 7241983 7300776 7407562 7477253 7692936
4533 7692936 7736991 7973603 8099473 8292838 8246891 8409864 8590587 8630181 8739347 8802349
4523 8802349 8978255 8991344 9117169 9233402 9416272 9506504 9658827 9754039 10015776 10152437
4513 10152437 10340574 10496800 10748745 10859103 11196501 11402386 11684904 11907491 12205952
4504 12205952 12443488 12677206 13049714 13371361 13670926 13840048 14168953 14406162 14725996
4495 14725996 14978297 15269600 15562759 15846318 16270186 16724816 17105582 17415266 17811030
4486 17811030 18253097 18789496 19168678 19674852 20187894 20548269 21002794 21470982 21947663
4477 21947663 22403762 22876197 23345693 23903189 24514392 25018171 25781494 26295959 26889673
4468 26889673 27689003 28286167 29192728 29900116 30663636 31608932 32582868 33476019 34594255
4459 34594255 35912798 37235714 38769359 40408760 42229982 44125739 46127070 48386910
4451 48386910 50841730 53349361 56140445 59158210 62223895 65538110 68812735 72144716
4443 72144716 75390580 78625448 81333502 83882765 85936210 87468865 88618592 89158322
4435 89158322 89292199 89096328 88733833 88240696 87729711 87303433 87070050 86807869 86921544
4426 86921544 87278896 87973065 89067067 90638471 92848691 95769165 99308852 103703498
4418 103703498 108913368 115057912 121846023 129777478 138868447 149588060 161825173 175546535
4410 175546535 189841844 203785381 215292553 222496082 224028656 219908932 211844712 202030910
4402 202030910 191883540 182237607 173722322 166279584 160396159 156017497 153149644 151619451
4394 151619451 151345444 152674075 155278967 159467959 165573512 173217580 182254745 193086234
4386 193086234 205881296 221166360 239255165 260694832 284791584 310427374 334852519
4379 334852519 354228369 365023277 363786302 350779468 329950713 305863559 280725808
4372 280725808 257010441 235339707 215982481 199486991 185732850 174251648 164768444
4365 164768444 157119908 151006025 146235941 143022534 141373136 140802141 141702356 143577869
4357 143577869 146789360 151626620 157806884 165584930 174969895 185024642 194399491 201904143
4349 201904143 205725020 204375295 197921370 187628923 175923516 163876510 152309531
4342 152309531 141945349 132810836 125029124 118779699 113330682 108990801 105190009 101854102
4334 101854102 98873054 96035450 93315409 90804920 88389815 86085978 83830121 81761869
4326 81761869 79742121 77799974 75793368 73935414 71738367 69385848 66933597 64302577
4318 64302577 61551423 58610549 55694978 52665425 49865924 47143408 44587100 42257631
4310 42257631 40065621 38004439 36221580 34471895 32969296 31614896 30359440 29202557
4302 29202557 28102839 27016634 26184046 25290475 24367056 23639815 22952169 22269843 21563351
4293 21563351 20862477 20252026 19622791 19114926 18474335 18066787 17519981 17090565 16663937
4284 16663937 16239656 15843785 15448523 15099834 14834717 14593320 14337255 14039136 13921235
4275 13921235 13671485 13539771 13231402 13141064 12844790 12800497 12397252 12247764 12073285 11933417
4265 11933417 11767451 11601810 11423419 11292767 11076472 10983845 10895723 10716492 10649105 10622798
4255 10622798 10531156 10515839 10500867 10559557 10518569 10521741 10433823 10286455 10229834 10244646 10198277
4244 10198277 10101034 9912299 9939139 9786198 9780712 9711463 9580459 9429478 9494697 9417595 9382280
4233 9382280 9240287 9321004 9246326 9340695 9372803 9431665 9501065 9637251 9790653 9953797 10108627
4222 10108627 10304456 10611960 10690994 10865293 11205792 11345585 11731888 12016324 12531455 12933625
4212 12933625 13368349 13942950 14558313 15254639 15925243 16842263 17749164 18654403 19770580
4203 19770580 20844142 21980770 22943451 24052662 24905569 25764006 26419696 26777964 27026147
4194 27026147 26905949 26660030 26170295 25401170 24560264 23468672 22316558 21061450 19751504
4185 19751504 18617641 17441983 16371353 15278507 14303309 13438903 12559446 11840980 11187800
4176 11187800 10591664 10010665 9555517 9198553 8777443 8315898 7965258 7726947 7524381
4167 7524381 7212421 7015147 6746788 6572078 6445424 6276829 6290253 6149239 6054266 6013621
4157 6013621 5994651 5844431 5838207 5940603 5823356 5832667 5908498 5778083 5786748 5671730 5613899
4146 5613899 5456801 5341611 5264646 5226897 5135377 5053606 4981713 4922558 4824372 4784919 4629699
4135 4629699 4652522 4569710 4563478 4549229 4486031 4598126 4550273 4614804 4640632 4790687 4854475
4124 4854475 4967611 5073559 5035116 4987888 4948717 4728284 4569517 4445785 4247350 4166693
4114 4166693 3978835 3814527 3646095 3720832 3505953 3562604 3467647 3551457 3386572 3496394
4104 3496394 3341871 3385595 3361702 3471763 3550529 3473901 3590283 3527790 3746700 3782985 3805559
4093 3805559 3846179 3873704 3827704 3773501 3644612 3728225 3538003 3547198 3539325 3534460 3533740 3441969
4081 3441969 3383840 3478021 3434176 3430140 3486793 3449051 3476088 3335255 3482731 3470131 3486935
4070 3486935 3597538 3561933 3573840 3552641 3680175 3633633 3739325 3652222 3769279 3736312 3787926
4059 3787926 3879434 3945626 4005344 4018101 4102687 4268950 4272452 4400048 4449242 4600964 4690134
4048 4690134 4841057 4889654 5125605 5133553 5268448 5344018 5489164 5578869 5754611 5833087 5874347
4037 5874347 6108283 6131805 6324281 6399133 6552128 6643143 6813260 7014411 7068999 7200066
4027 7200066 7427735 7556263 7778198 7929779 8133591 8386496 8635786 8816082 9028299 9370447
4017 9370447 9593230 9978383 10245253 10680156 11065481 11432706 11910046 12307644 12722824 13288662
4007 13288662 13783835 14303048 15007862 15560645 16347266 17154456 17915105 18802425 19650899
3998 19650899 20591331 21692494 22716001 24058753 25322262 26854625 28460572 30501313
3990 30501313 32657757 35151794 38003408 41208636 44664332 48621000 53090467 57832477
3982 57832477 63118263 68981015 74897554 80539369 85388251 88761019 90188725 89277827
3974 89277827 86271328 81641303 76123054 70235319 64265320 58725800 53573895 48945994
3966 48945994 44790254 40946363 37767464 34851281 32086995 29777338 27645583 25727434
3958 25727434 23994227 22405572 21006638 19836698 18650039 17655833 16740828 15914646 15135295
3949 15135295 14434505 13799922 13188852 12634109 12129245 11584852 11217610 10715797 10433272
3940 10433272 10002870 9629714 9214039 8874752 8539643 8212346 7952653 7535754 7375721
3931 7375721 7055584 6821932 6547927 6278143 6140509 6000495 5766166 5614865 5492017 5131601
3921 5131601 5016928 4861881 4679341 4550264 4388794 4165180 4105949 3911638 3845802 3653472
3911 3653472 3530332 3423056 3215050 3201948 2963939 2895604 2844159 2844533 2735190 2607766 2604771
3900 2604771 2480863 2422017 2349663 2360117 2241956 2239104 2191191 2066827 1969161 2035839 1919779
3889 1919779 1929051 1850619 1772823 1697283 1753317 1690180 1532152 1596029 1523327 1425690 1425480 1360171
3877 1360171 1260440 1345252 1287137 1270254 1224511 1257554 1237858 1174878 1171003 1129066 1068429 1096789
3865 1096789 1002144 1067338 1023869 1032639 968024 1059550 860053 943393 883506 950209 899700
3854 899700 787212 766099 778254 837045 776246 835742 813338 649935 776924 861434 760190
3843 760190 723635 695185 624943 559329 630973 627773 631675 632826 620717 531748 586603 566276
3831 566276 589275 510568 429553 365420 440454 428348 372725 431193 394368 433141 323832
3820 323832 402800 462681 480829 455954 337855 367653 390262 274459 318317 371058 390315
3809 390315 328148 303443 257200 378932 274755 283700 333328 300293 363909 239950 299430
3798 299430 252069 229645 243352 226549 262795 339444 150432 248691 243086 275310 162172
3787 162172 214643 199263 196268 197427 184665 124131 119286 124395 131604 94843 196081 134065
3775 134065 202697 173889 100356 124098 162143 166233 153160 100663 47217 66474 105586 162322
3763 162322 18224 67448 93841 28411 50758 73658 148994 59274 200659 59972 194525
3752 194525 90829 98922 94455 129023 143237 152921 137152 133911 202483 136013 222746 170913
3740 170913 181476 225513 221242 178450 199037 283483 212421 190322 371785 425534 318507
3729 318507 418293 429522 409476 345478 399206 262445 332251 268249 341770 260158 236146
3718 236146 334641 258592 192947 134100 147311 60395 66147 171642 24871 45659 90610
3707 90610 47304 77603 19486 48508 -32772 42165 -6971 80189 56963 -33169 -70614 56623
3695 56623 -57401 -68156 -22165 -27280 -44391 -12814 -97702 -33246 -21362 -4146 -129989 -164013
3683 -164013 -86649 -167114 -147157 -95049 -78411 -133783 -98703 -113505 -68316 -47549 -100914 -118663
3671 -118663 -113890 12022 -35117 -117685 -165642 -95512 -111521 -120070 -169954 -166997 -133702 -180321
3659 -180321 -137942 -159681 -214754 -174167 -205922 -132668 -105798 -105634 -196010 -129094 -140235 -83406
3647 -83406 -183426 -236492 -149386 -132550 -110564 -176187 -219042 -204471 -175437 -176971 -220913 -195991
3635 -195991 -253988 -207975 -213216 -197418 -152138 -189852 -144776 -156937 -162996 -152905 -125211 -302860
3623 -302860 -214471 -192139 -150861 -201447 -251754 -176929 -329049 -262166 -90700 -247882 -184743
3612 -184743 -151865 -201678 -194931 -258185 -238705 -230086 -248039 -182852 -190694 -188953 -145552 -249509
3600 -249509 -255068 -169911 -263169 -225881 -165207 -311640 -196623 -250079 -219202 -164573 -221846
3589 -221846 -251491 -223016 -199145 -188192 -183478 -180871 -276809 -169102 -172380 -279492 -230725 -217415
3577 -217415 -183463 -98381 -157128 -212734 -232356 -176233 -232535 -109917 -197974 -155956 -187760
3566 -187760 -174877 -247253 -184197 -188502 -193219 -207798 -292997 -170170 -172604 -206353 -261432 -212550
3554 -212550 -268671 -282235 -290515 -194560 -277399 -249168 -251298 -356234 -255728 -317428 -282190 -185704
3542 -185704 -154570 -192065 -257744 -345330 -215305 -238445 -240908 -197958 -190967 -136655 -325501 -294889
3530 -294889 -216287 -199108 -252571 -266413 -186031 -273048 -265630 -239611 -140802 -200654 -184801 -145104
3518 -145104 -254601 -226557 -211253 -248532 -274025 -116619 -139726 -138165 -230278 -199919 -216300
3507 -216300 -223669 -222934 -239388 -197395 -133390 -235188 -127330 -153042 -236618 -203529 -203847 -241873
3495 -241873 -135826 -169494 -225652 -197589 -169725 -181301 -170107 -135636 -168492 -94960 -218225
3484 -218225 -115435 -107893 -134764 -138207 -79593 -44574 -60078 -140783 -100485 -98936 -143989 -95340
3472 -95340 -153632 -176728 -181014 -135757 -177333 -252534 -200297 -278845 -179911 -169887 -319757 -183026
3460 -183026 -234768 -212668 -240462 -87241 -177475 -236530 -214444 -45659 -103580 -117992 -52265
3449 -52265 -158711 -160986 -45700 -147336 -109309 -171377 -85741 -126911 -235078 -196607 -168187
3438 -168187 -187504 -244731 -188430 -68963 -251403 -115183 -262023 -185174 -162107 -176246 -134058
3427 -134058 -160945 -149119 -169402 -179340 -212437 -211965 -128353 -36759 -147780 -192801 -184425 -160172
3415 -160172 -187821 -138745 -66123 -75493 -184057 -177605 -57038 -170088 -139463 -136821 -188266 -178520
3403 -178520 -127151 -201745 -93459 -79348 -16822 -47108 -59808 -53674 -58215 -99007 -70463 -64500
3391 -64500 -50112 -40403 -30063 -128729 -127503 -125179 -126598 -52557 -47165 -13365 -23936 -53734 -101566
3378 -101566 34718 9428 -38197 -34342 35800 14671 -33612 24164 -7282 38674 91601 54829
3366 54829 -45870 42342 -7914 31683 40493 127253 103619 78067 38199 55001 52610 108846
3354 108846 107515 106434 112452 115670 60768 167242 136216 177347 74866 109126 209794 244406
3342 244406 204355 147413 188258 214774 219593 156454 203447 199560 208777 348086 199049 306185
3330 306185 317187 237822 305797 381658 423021 394154 448384 510449 474559 544283 532329 574363
3318 574363 685164 565309 659082 693677 757992 680151 746062 703846 796986 816121 849178
3307 849178 805304 852252 833263 936583 939049 823011 979965 1107335 1125833 1125532 1151323
3296 1151323 1104795 1194019 1216434 1204580 1214330 1392778 1395791 1504577 1501547 1597674 1654362 1807474
3284 1807474 1802920 1895130 1923091 2100116 2205101 2315083 2415520 2551171 2722163 2865322
3274 2865322 3013020 3212278 3359378 3573348 3765503 3985109 4145249 4460366 4706246 5207798
3264 5207798 5574461 5974538 6496552 6987256 7723552 8333170 9309150 10301480 11379843
3255 11379843 12834334 14539799 16437335 18257418 19723768 20697332 20797053 19690224 17966156
3246 17966156 16282671 14401765 12651938 11247811 9856010 8831073 7923434 7185349
3238 7185349 6461405 5975949 5390294 4939706 4430084 4105981 3757311 3437601 3229842 2899181
3228 2899181 2739248 2467619 2352385 2294411 2098380 1995545 1856008 1781599 1736213 1621916
3218 1621916 1484291 1379979 1296336 1253579 1275389 1111920 1088119 1057056 949903 877571 747084
3207 747084 802791 779333 767584 685676 668816 636431 570507 616474 565792 491523 490621 598325
3195 598325 476587 481854 406671 508113 327585 345814 367988 282762 276199 219584 155010
3184 155010 238189 214020 163095 208732 79335 82841 141179 90110 180965 46193 57260
3173 57260 33635 118319 124917 69331 59410 30775 -16137 -18043 76346 -25529 50389 -52963
3161 -52963 78673 -47680 -4754 -19415 -37253 -110839 -83650 -140421 -119593 -86974 -40896
3150 -40896 9850 -32705 -82239 -84063 -166189 -150070 -149988 -100876 -116514 -129571 -145894 -115977 -157819
3137 -157819 -232005 -125401 -182999 -166018 -132279 -164604 -130894 -115364 -213142 -162002 -235981
3126 -235981 -176596 -196714 -100806 -201056 -211737 -166032 -201584 -241770 -176723 -227696 -251814
3115 -251814 -67851 -242347 -213333 -211432 -160502 -218620 -207298 -108747 -249937 -164314 -205244
3104 -205244 -157873 -283353 -192827 -288692 -177525 -172824 -167844 -257149 -193326 -244747 -256681 -247401
3092 -247401 -258940 -290578 -250745 -259079 -216088 -110124 -164201 -326790 -232090 -247845 -240814 -333125
3080 -333125 -174125 -311587 -382112 -273701 -278515 -241435 -110999 -320261 -241612 -245498 -211841
3069 -211841 -207846 -274196 -300224 -304588 -249457 -274208 -263346 -319472 -209758 -298651 -192841 -283452
3057 -283452 -215767 -226229 -251693 -278847 -234078 -227439 -270879 -213882 -414232 -306985 -257481
3046 -257481 -272252 -285922 -304815 -332867 -307549 -320425 -314603 -210699 -234230 -253835 -268802 -321631
3034 -321631 -238188 -197828 -242510 -235862 -270733 -205613 -289393 -249426 -247370 -237988 -112098 -152317
3022 -152317 -126930 -167049 -173901 -147244 -129682 -223043 -314131 -262443 -241571 -205751 -356179 -270611
3010 -270611 -211766 -161538 -185945 -204868 -183647 -195133 -261550 -266900 -230363 -209571 -277720 -252611
2998 -252611 -203988 -265295 -287816 -278470 -201890 -313402 -150242 -291913 -203436 -112006 -284431
2987 -284431 -325830 -266778 -290483 -241093 -311945 -332573 -371232 -359399 -326712 -402961 -364368 -250884
2975 -250884 -258905 -329981 -232126 -317941 -339168 -323957 -376036 -282563 -240503 -221454 -293370 -287464
2963 -287464 -303136 -281581 -215960 -305361 -348608 -334411 -271215 -266565 -312854 -317438 -360700 -250827
2951 -250827 -350056 -294256 -313106 -226088 -370201 -352982 -282178 -291573 -352655 -239878 -329461
2940 -329461 -326204 -231921 -415369 -352607 -319620 -283553 -337415 -261583 -335557 -269188 -299212 -317301
2928 -317301 -372720 -322799 -251334 -280536 -300454 -347003 -372196 -448105 -299306 -390869 -394064 -272397
2916 -272397 -269610 -250711 -223844 -325547 -308127 -355603 -275522 -308323 -267446 -270581 -298878 -257294
2904 -257294 -289044 -356813 -349698 -336421 -424506 -244153 -312291 -305644 -233908 -264076 -302815 -282244
2892 -282244 -378035 -290708 -239419 -383292 -335799 -288647 -349938 -313264 -370216 -366541 -263159
2881 -263159 -347074 -283842 -262770 -335253 -280351 -391960 -265102 -361644 -329604 -229573 -289873
2870 -289873 -353576 -332550 -264734 -268475 -240936 -403553 -346824 -284658 -209930 -296109 -306674 -241769
2858 -241769 -232023 -288856 -352956 -298394 -217323 -386994 -381812 -400448 -345583 -316720 -393174 -371124
2846 -371124 -355589 -237303 -318180 -350027 -289210 -231552 -387134 -306613 -384640 -291618 -380962
2835 -380962 -317557 -245696 -271683 -361895 -308333 -293780 -326392 -366104 -284354 -367180 -286741 -285387
2823 -285387 -321968 -366615 -393152 -297105 -343670 -378201 -300273 -378837 -333620 -326045 -349976 -359341
2811 -359341 -344050 -401198 -375985 -266160 -318896 -294193 -310427 -375402 -294074 -362774 -322714
2800 -322714 -298283 -327152 -331554 -385372 -281433 -355710 -230941 -317078 -362420 -404065 -303854
2789 -303854 -379747 -347560 -313179 -317310 -299795 -296424 -342085 -363141 -325756 -332234 -309348 -412723
2777 -412723 -454723 -339260 -393862 -265563 -363114 -209311 -233701 -387301 -305503 -273360 -335258
2766 -335258 -318863 -291591 -381641 -297142 -314132 -378485 -365319 -323193 -298508 -315465 -370201 -325005
2754 -325005 -394116 -340036 -295917 -389771 -291512 -239647 -318216 -316125 -295497 -402412 -276104
2743 -276104 -327229 -328827 -327484 -325523 -378242 -336532 -326778 -350858 -416376 -330269 -382496 -319118
2731 -319118 -304025 -322475 -369105 -330634 -323766 -357498 -351693 -248360 -382025 -300467 -280360 -325054
2719 -325054 -282745 -337773 -283292 -227514 -292945 -329314 -392767 -364234 -319273 -327598 -314371 -332314
2707 -332314 -377790 -349909 -279311 -252333 -285295 -215554 -397377 -335582 -303080 -324204 -304427
2696 -304427 -397858 -304151 -341303 -314244 -322591 -360986 -391973 -459848 -378113 -369089 -351517 -268347
2684 -268347 -392984 -379442 -355577 -322996 -447774 -333168 -267902 -274631 -322548 -243651 -346282
2673 -346282 -323097 -252331 -318317 -335979 -240563 -386443 -367762 -353131 -241445 -376107 -289905
2662 -289905 -301467 -306858 -390850 -285300 -300633 -357704 -277635 -253608 -345182 -247671 -392598
2651 -392598 -365862 -424666 -448996 -322472 -332064 -303538 -322071 -358998 -328769 -358856 -318615 -408663
2639 -408663 -383524 -373410 -208729 -363045 -315217 -403109 -333043 -272806 -412773 -264200 -281271
2628 -281271 -349583 -339566 -354605 -318719 -291985 -277175 -319090 -305034 -270844 -340425 -287330 -321364
2616 -321364 -343448 -302606 -368833 -246028 -309394 -261507 -355714 -349774 -316237 -370141 -337391 -342681
2604 -342681 -265735 -334213 -267789 -306027 -266790 -315374 -322415 -352530 -329715 -314531 -381204 -333075
2592 -333075 -247623 -278621 -282361 -335707 -287525 -282411 -362983 -306675 -423396 -353934 -286168 -343067
2580 -343067 -247381 -307647 -320008 -303615 -366275 -410566 -303387 -374422 -325284 -363486 -355550 -357310
2568 -357310 -381771 -338702 -365397 -330972 -222959 -333269 -444299 -477126 -330990 -307228 -345954
2557 -345954 -291193 -220871 -303753 -324339 -367629 -335932 -401132 -374760 -352060 -324832 -312031 -302041
2545 -302041 -354771 -325355 -329756 -265568 -334066 -416322 -393344 -294104 -278081 -343270 -326357 -324761
2533 -324761 -352999 -332790 -293378 -327543 -314269 -224354 -319343 -329883 -297586 -348043 -370728 -244697
2521 -244697 -306114 -351084 -308523 -362701 -380598 -248287 -304868 -289577 -272062 -279373 -257727 -335643
2509 -335643 -331373 -325536 -295882 -373002 -357640 -430471 -340207 -288082 -341953 -422760 -260209 -265208
2497 -265208 -332500 -278809 -314305 -279622 -265527 -263770 -367254 -415870 -373841 -328855 -216212
2486 -216212 -273057 -331552 -321937 -266826 -289564 -334379 -293786 -383140 -295892 -264969 -313970 -360820
2474 -360820 -364492 -334762 -293157 -340412 -344937 -394359 -356265 -328147 -335134 -301521 -382984 -317272
2462 -317272 -433123 -325121 -335007 -292719 -261129 -365143 -333930 -283032 -392461 -369414 -348462
2451 -348462 -335647 -388194 -379528 -385246 -410624 -314038 -419088 -326170 -364393 -339091 -382247 -295473
2439 -295473 -416223 -243512 -418087 -363174 -405712 -340575 -307652 -285318 -375670 -350788 -342873
2428 -342873 -349568 -349454 -313454 -284034 -390505 -404322 -250816 -286160 -326028 -401262 -256251 -386848
2416 -386848 -418473 -337502 -321221 -364847 -329258 -316212 -290364 -320869 -302995 -252023 -334310 -303106
2404 -303106 -332520 -367685 -305108 -305268 -327981 -401350 -292839 -359343 -329580 -332349 -429010 -364129
2392 -364129 -364780 -383930 -343544 -314139 -325448 -288773 -252722 -317463 -318472 -319157 -281746 -300823 -238865
2379 -238865 -307839 -380777 -300639 -268293 -319570 -354860 -310437 -365166 -376993 -302775 -389802 -342587
2367 -342587 -336400 -395457 -336373 -389335 -316425 -256786 -380047 -425130 -349405 -276763 -259601 -330631
2355 -330631 -294379 -357132 -361426 -289271 -333952 -305851 -378799 -376549 -385948 -306626 -328262 -363752
2343 -363752 -206782 -313152 -357992 -276243 -272591 -301152 -340331 -344614 -339072 -320914 -261397 -284251
2331 -284251 -375393 -318882 -315073 -274751 -216135 -362572 -355632 -298364 -343499 -330747 -280838 -270564
2319 -270564 -294293 -335607 -372094 -271938 -331561 -321457 -314165 -377399 -332063 -430398 -340708 -368769
2307 -368769 -318003 -251618 -350780 -297037 -318595 -346909 -254809 -480728 -366310 -434266 -385808
2296 -385808 -293355 -318450 -361177 -350085 -398263 -300992 -313077 -328062 -273743 -390335 -377708
2285 -377708 -326858 -407893 -348403 -316444 -282000 -268421 -318924 -313404 -342025 -341294 -289851 -322186
2273 -322186 -348882 -326838 -320548 -309702 -394592 -261210 -356358 -359363 -353094 -218577 -362036 -339846
2261 -339846 -375384 -324664 -311338 -325354 -345460 -384938 -370545 -273711 -363188 -419910 -343253 -310394
2249 -310394 -332417 -323919 -305820 -343927 -275755 -269911 -381670 -344537 -376782 -405226 -347295 -390274
2237 -390274 -318985 -337451 -270622 -373841 -333950 -340788 -374485 -345804 -349785 -322230 -244807 -401633
2225 -401633 -377672 -305529 -325723 -381262 -281529 -399318 -364345 -271421 -464856 -326680 -311594
2214 -311594 -369618 -333185 -297063 -307415 -330409 -289903 -319254 -373238 -456056 -311904 -309923 -258352
2202 -258352 -321864 -264947 -354586 -336689 -335415 -309353 -329270 -323195 -315456 -235829 -349088 -347007
2190 -347007 -403628 -304984 -349504 -394742 -288828 -385859 -325105 -277885 -387445 -327788 -363155
2179 -363155 -311376 -272730 -293905 -375644 -356471 -293399 -340069 -329928 -294808 -355326 -297412 -285354
2167 -285354 -313453 -359216 -309681 -332487 -319107 -346591 -350866 -317921 -402325 -245364 -329955 -386625
2155 -386625 -236938 -332255 -326179 -461524 -368887 -401492 -304665 -339417 -310251 -283116 -216434
2144 -216434 -310657 -434690 -313297 -348002 -401325 -327873 -347303 -398438 -308479 -330271 -390947
2133 -390947 -348597 -292051 -307867 -304720 -347783 -285671 -313531 -296385 -306741 -238418 -365040 -372693
2121 -372693 -336942 -381482 -301356 -310609 -256364 -396614 -381592 -349961 -334132 -422404 -279289
2110 -279289 -377835 -297758 -286606 -360916 -322443 -366466 -347464 -325962 -382301 -218207 -427113
2099 -427113 -339643 -390104 -271157 -401455 -332293 -327346 -347713 -321469 -389857 -331491 -248005
2088 -248005 -316225 -289431 -307455 -273554 -229239 -400888 -409307 -348767 -391171 -335599 -276634 -364972
2076 -364972 -343657 -327656 -370362 -356689 -391150 -301992 -266028 -319709 -314627 -316357 -325185 -326627
2064 -326627 -397611 -347373 -415689 -336227 -290984 -299703 -320511 -325273 -341023 -359883 -313643 -326874
2052 -326874 -368712 -298991 -310764 -302001 -295473 -283925 -340812 -214573 -381182 -318182 -342815 -257399
2040 -257399 -273583 -253359 -310150 -282332 -287479 -427633 -364908 -362232 -383406 -347338 -276760 -359352
2028 -359352 -338302 -374126 -290623 -276850 -293468 -274083 -258416 -379360 -439074 -251805 -347129
2017 -347129 -266485 -278119 -255760 -345426 -274292 -268876 -347004 -343974 -379283 -367596 -420216 -382825
2005 -382825 -366139 -367670 -318534 -301121 -210562 -328021 -339376 -313273 -294504 -401416 -305128
1994 -305128 -316837 -350809 -355679 -393591 -339400 -275477 -342434 -341144 -348276 -278872 -272872 -305457
1982 -305457 -314034 -307994 -357114 -323389 -306599 -345252 -390887 -350564 -232292 -297086 -333567 -323564
1970 -323564 -316503 -278776 -321696 -344828 -250039 -334919 -307609 -324006 -256567 -324646 -448177 -266601
1958 -266601 -237646 -328881 -216400 -253071 -335207 -372302 -298254 -385013 -338542 -370247 -395728
1947 -395728 -303094 -356460 -341151 -282498 -304957 -257084 -360903 -323109 -278799 -326242 -298764
1936 -298764 -281078 -286983 -324314 -404751 -412219 -324802 -383307 -334783 -352627 -371705 -318526 -298856
1924 -298856 -374447 -381399 -333664 -423262 -393434 -375440 -415311 -356466 -305305 -331034 -333746 -411633
1912 -411633 -385388 -347955 -361428 -274451 -291853 -311436 -369120 -295028 -309509 -288376 -281336 -291314
1900 -291314 -356594 -273126 -330808 -252177 -190668 -289115 -380135 -346978 -299759 -300228 -430073 -324564
1888 -324564 -413871 -335629 -317362 -374329 -364564 -278626 -360639 -380985 -387635 -406908 -392830 -314245
1876 -314245 -371313 -253051 -360196 -360144 -402091 -387883 -409483 -335516 -310264 -362913 -312629 -332628
1864 -332628 -290026 -293961 -252162 -384355 -308301 -289234 -355451 -251255 -334119 -410747 -379455
1853 -379455 -310529 -361619 -300213 -293771 -288822 -330588 -304355 -276121 -379952 -282558 -301898 -277266
1841 -277266 -320576 -379724 -341885 -410142 -458369 -316270 -377475 -306757 -305785 -283505 -414870 -376026
1829 -376026 -339395 -350317 -271865 -356660 -348000 -308564 -370297 -328815 -301128 -322172 -393366 -358417
1817 -358417 -316246 -392345 -293131 -407405 -309147 -292187 -293666 -316141 -372107 -317871 -313645 -254232
1805 -254232 -317593 -313557 -389458 -346628 -369241 -322895 -274573 -327403 -296376 -326935 -355789 -333496
1793 -333496 -304599 -319010 -260417 -261027 -349055 -334351 -313565 -300965 -366920 -373149 -395419 -287427
1781 -287427 -334250 -356991 -262828 -347469 -339360 -307542 -322206 -219468 -289368 -292118 -356761 -358456
1769 -358456 -301287 -378736 -331908 -355093 -312851 -401196 -305489 -339778 -353722 -352922 -355255 -343206
1757 -343206 -281822 -310747 -305985 -302755 -320393 -234691 -320906 -373945 -335808 -367045 -322889 -340359
1745 -340359 -331175 -362762 -391775 -309655 -310034 -351310 -269218 -385444 -291626 -273517 -249974 -342300
1733 -342300 -344812 -324841 -302231 -306483 -337285 -404954 -389924 -280533 -309957 -215110 -353069 -368358
1721 -368358 -277661 -330104 -199613 -317939 -332297 -395720 -335155 -323759 -340122 -305455 -264552
1710 -264552 -293133 -349940 -226371 -308828 -336382 -311063 -250298 -331237 -265425 -289988 -362106
1699 -362106 -360352 -338954 -368668 -295614 -314185 -252696 -254558 -283564 -311297 -289915 -353899 -304062
1687 -304062 -355316 -391015 -288243 -346845 -389202 -343468 -330253 -386506 -335795 -325916 -314689 -394856
1675 -394856 -341839 -317559 -233265 -307648 -374841 -314115 -384950 -232204 -391335 -305527 -278912
1664 -278912 -245621 -225255 -255113 -258869 -297631 -255896 -372592 -339205 -432249 -345224 -369708 -419276
1652 -419276 -360393 -281083 -360812 -378857 -379661 -457201 -290675 -321188 -290280 -346592 -318070 -356639
1640 -356639 -391919 -342405 -347397 -244107 -367661 -342121 -285945 -283557 -260044 -357762 -315729 -269531
1628 -269531 -348079 -295360 -355599 -338808 -298499 -268002 -326758 -295644 -373221 -359781 -296464 -251685
1616 -251685 -254488 -317616 -389332 -390807 -254624 -392188 -358024 -396164 -323987 -366943 -331931 -285401
1604 -285401 -318946 -259383 -230748 -320965 -315831 -304314 -397346 -341146 -368629 -342834 -288426 -394457
1592 -394457 -332100 -411836 -305153 -376780 -381872 -299100 -277340 -333672 -259573 -218629 -411251
1581 -411251 -353767 -328892 -372869 -361056 -303522 -251741 -283093 -247352 -277603 -318044 -264325 -293924
1569 -293924 -252992 -283109 -335097 -447924 -352261 -281128 -348715 -325285 -347240 -278521 -307325
1558 -307325 -353750 -301927 -369353 -335403 -389158 -342593 -384823 -263325 -344354 -301540 -282954
1547 -282954 -299208 -361501 -371516 -357130 -313276 -272291 -355835 -366589 -317513 -341949 -272934 -283279
1535 -283279 -394500 -307356 -325097 -341825 -359063 -382558 -317136 -306515 -365810 -344870 -400572
1524 -400572 -235863 -289992 -289814 -339956 -339537 -379045 -410795 -275263 -316328 -346472 -246656 -279993
1512 -279993 -269159 -314865 -279323 -356207 -276729 -348041 -403500 -271646 -336064 -297910 -284652
1501 -284652 -279508 -333821 -312775 -314544 -297649 -404103 -352135 -373471 -389398 -279539 -319952 -328427
1489 -328427 -433952 -223050 -364843 -329846 -293203 -304169 -370766 -378597 -381796 -374857 -368963 -344473
1477 -344473 -217580 -285818 -284324 -455682 -351443 -327388 -339688 -419549 -227609 -338244 -286027
1466 -286027 -327827 -313744 -271561 -410940 -307031 -295525 -392038 -377615 -305995 -368269 -455532
1455 -455532 -383554 -290218 -324051 -282203 -307260 -313339 -331966 -351569 -334410 -290078 -384632 -403634
1443 -403634 -314554 -314287 -422490 -359665 -347852 -338331 -366695 -290474 -299224 -340480 -364337 -271346
1431 -271346 -381894 -321747 -333409 -338500 -331814 -338493 -366946 -452639 -321237 -318876 -380537 -301274
1419 -301274 -378193 -331397 -322736 -286431 -370860 -292556 -376031 -280734 -323357 -271958 -263496 -240601
1407 -240601 -316752 -270199 -294436 -307818 -407855 -353467 -400819 -272878 -449494 -342937 -368531
1396 -368531 -356968 -342409 -295015 -317871 -248814 -266938 -356046 -349500 -309326 -338715 -448388 -320065
1384 -320065 -289722 -298022 -346515 -271213 -311518 -347501 -397614 -309962 -391267 -315160 -366480 -340288
1372 -340288 -328529 -299351 -386308 -300211 -295035 -296414 -443434 -331798 -304973 -315595 -346429 -270280
1360 -270280 -366709 -325655 -382999 -265799 -298439 -321120 -374898 -383498 -264580 -285921 -365480
1349 -365480 -254756 -218402 -219875 -296020 -340016 -363203 -389099 -328620 -251061 -430375 -372804
1338 -372804 -383664 -311072 -318350 -352449 -388018 -342062 -332101 -237748 -335047 -308784 -342128 -340267
1326 -340267 -335352 -281954 -386596 -417048 -337523 -307127 -316886 -319538 -311343 -310490 -260027 -331119 -253777
1313 -253777 -301682 -309677 -355626 -315237 -353473 -302487 -336213 -396741 -375309 -393842 -356190 -292898
1301 -292898 -301354 -454674 -289090 -336180 -371890 -302214 -315081 -311986 -317299 -329829 -258972 -275025
1289 -275025 -324061 -307961 -404128 -288955 -303436 -311603 -348564 -319996 -397384 -266894 -337470
1278 -337470 -396222 -401442 -318472 -307069 -301590 -439607 -282060 -319303 -278016 -423151 -297326
1267 -297326 -317105 -428100 -343267 -335573 -314625 -300644 -344615 -315183 -365232 -364547 -354347 -287544
1255 -287544 -278049 -315984 -299555 -331762 -401059 -306160 -353385 -307143 -441463 -415840 -381152 -326576
1243 -326576 -361697 -347249 -315489 -285246 -356961 -378369 -307260 -347727 -276319 -200995 -266344 -334490
1231 -334490 -361246 -347806 -359507 -346087 -347093 -277088 -294263 -380650 -371640 -384159 -347698 -289446
1219 -289446 -444671 -351216 -369790 -319494 -307402 -289070 -339152 -313416 -349099 -346356 -267705 -359865
1207 -359865 -409996 -363623 -319401 -358222 -309481 -310614 -344058 -355467 -291383 -291969 -310045 -309630 -286861
1194 -286861 -261762 -334711 -339657 -392156 -368712 -348338 -212587 -441896 -295859 -398800 -340079
1183 -340079 -326942 -333054 -380029 -358886 -347405 -345355 -358094 -353805 -359360 -340778 -329310 -356698
1171 -356698 -276778 -348795 -373803 -390662 -321466 -373018 -364166 -339649 -296793 -333690 -383288 -365563
1159 -365563 -354515 -424967 -354790 -376425 -319439 -359186 -295035 -297346 -399329 -384695 -338144 -280258
1147 -280258 -249992 -283469 -383858 -346349 -306220 -378748 -367521 -360218 -315073 -273838 -348432 -304102
1135 -304102 -293946 -335302 -386640 -307566 -316587 -403399 -454152 -414607 -331162 -367267 -286311 -310458
1123 -310458 -325200 -315735 -317401 -314135 -395834 -269814 -336916 -322173 -423260 -405172 -380779 -387343
1111 -387343 -338673 -321940 -355216 -321043 -372415 -322019 -392894 -335720 -374870 -355355 -338402 -263431
1099 -263431 -349088 -355847 -243075 -357302 -352817 -306482 -181990 -285917 -276149 -281022 -296680 -292731
1087 -292731 -359390 -347705 -373792 -406906 -347052 -327915 -340734 -387633 -310566 -334000 -343238 -320717
1075 -320717 -303391 -321851 -340580 -396815 -301774 -364489 -338364 -372989 -315948 -352208 -293758 -373859
1063 -373859 -332877 -316655 -335820 -300253 -391313 -384062 -287118 -354722 -386690 -390014 -361242 -280103
1051 -280103 -327344 -319331 -483903 -400373 -237890 -337083 -410173 -311086 -279316 -328375 -352373
1040 -352373 -281502 -360374 -391400 -367473 -352460 -429167 -256767 -351943 -325373 -377495 -349516
1029 -349516 -289963 -342311 -339791 -385460 -268168 -367365 -345349 -364095 -262491 -369521 -390458
1018 -390458 -360816 -341522 -380317 -274027 -377120 -372456 -309916 -333198 -316394 -322374 -346449 -315070
1006 -315070 -259101 -274486 -376880 -366906 -329942 -299213 -309913 -291749 -333457 -281447 -358897 -303250
994 -303250 -314980 -291764 -332634 -329702 -361642 -243368 -398754 -271850 -284396 -346484 -404844
983 -404844 -285176 -340169 -385279 -294243 -382306 -277774 -287399 -277868 -231998 -265237 -313747 -298973
971 -298973 -349499 -383857 -324163 -343449 -356896 -217757 -415969 -230541 -320190 -374373 -271963
960 -271963 -391342 -310933 -373501 -395422 -285984 -343092 -304113 -364391 -360137 -275148 -292859 -347836
948 -347836 -339930 -313623 -246695 -363610 -314186 -234683 -336717 -215259 -270268 -411341 -368357
937 -368357 -371480 -282745 -276535 -258233 -317661 -331704 -332022 -284659 -280415 -359174 -335657 -273462 -330143
924 -330143 -418335 -399836 -391833 -412697 -309397 -264357 -294645 -355835 -373354 -271669 -321934 -288668
912 -288668 -297274 -396159 -365638 -315753 -320728 -291357 -380305 -386975 -343744 -412707 -348476 -319067
900 -319067 -408376 -304893 -320829 -307926 -314615 -364552 -380298 -285213 -328435 -355450 -335329 -421575
888 -421575 -321475 -297934 -304926 -414534 -348187 -352494 -310756 -390880 -326436 -317270 -379918 -386114
876 -386114 -342689 -320975 -323170 -305338 -286485 -285993 -335539 -249529 -361661 -285635 -293333 -351770
864 -351770 -305902 -374643 -314907 -372814 -368895 -304283 -365830 -360695 -377042 -273372 -369675 -278487
852 -278487 -221006 -317163 -297842 -304414 -354872 -290477 -332789 -324254 -277200 -277803 -286769 -354496 -332665
839 -332665 -247632 -202583 -330030 -388775 -350200 -343454 -362649 -440155 -358018 -362131 -382634 -376214
827 -376214 -449126 -425232 -434749 -296666 -295958 -321583 -275585 -395696 -257115 -403195 -398072 -284001
815 -284001 -281366 -295780 -249707 -324546 -356603 -332249 -404136 -331895 -420576 -296062 -358374 -316008
803 -316008 -404327 -388873 -359147 -332409 -278536 -356165 -318587 -256185 -208945 -337918 -296101 -314689
791 -314689 -244828 -309601 -399217 -244955 -318990 -388428 -339867 -298910 -288149 -334203 -431362 -371863
779 -371863 -369060 -266890 -253473 -310859 -261928 -274131 -309827 -324310 -364262 -422288 -310039 -340251
767 -340251 -321330 -315161 -315376 -278650 -311365 -256020 -383286 -294990 -319148 -308873 -286762 -330682
755 -330682 -329865 -302543 -335349 -297795 -303003 -244230 -306267 -305053 -314491 -318462 -234008 -345161 -360132
742 -360132 -283593 -336617 -351961 -335698 -273252 -392764 -338202 -334801 -356435 -289085 -341691 -365769
730 -365769 -375109 -209820 -337371 -416303 -410323 -338168 -318608 -318067 -309731 -347775 -361581 -346047
718 -346047 -196553 -329248 -229869 -364546 -309193 -242681 -399696 -386977 -306470 -308576 -330102
707 -330102 -260203 -345452 -343101 -382565 -354195 -352183 -294087 -363932 -307743 -370500 -349974 -351488
695 -351488 -373271 -352309 -333952 -332470 -295542 -416548 -324308 -279902 -377667 -357643 -376458 -372781
683 -372781 -400196 -372138 -312966 -428401 -387514 -381396 -249016 -353904 -380000 -299364 -337545
672 -337545 -380873 -364863 -259529 -404059 -330699 -330820 -336435 -292840 -396715 -299188 -349751 -274721
660 -274721 -369070 -306600 -347878 -363490 -270692 -265294 -384332 -286310 -367768 -357631 -320678 -291616
648 -291616 -232822 -299064 -322588 -306068 -381622 -347803 -291396 -355753 -258437 -277852 -312715 -317612
636 -317612 -379624 -342306 -362396 -385847 -421632 -362524 -354726 -343295 -312049 -289828 -288902 -260037
624 -260037 -356248 -414606 -262003 -323265 -308994 -367602 -389079 -260387 -418709 -433300 -392201
613 -392201 -292517 -324117 -268591 -293669 -392611 -331878 -277348 -324613 -297393 -293233 -442784 -431512
601 -431512 -326029 -263040 -234023 -309136 -442716 -406439 -369663 -321354 -370154 -370801 -338519 -276067
589 -276067 -356290 -232090 -304503 -309284 -289583 -403226 -258477 -308985 -247032 -336244 -326412 -304370
577 -304370 -321407 -310969 -304556 -319609 -369087 -224098 -361821 -359568 -332411 -272587 -258761 -302589
565 -302589 -372797 -230721 -388644 -405284 -314564 -293885 -293760 -405717 -307558 -377993 -277930
554 -277930 -305871 -311270 -301744 -277467 -376243 -249937 -328985 -233762 -343758 -371741 -368575 -385470
542 -385470 -350700 -338064 -256561 -316264 -315100 -320094 -330388 -340442 -368107 -284086 -316942 -269080
530 -269080 -381105 -328064 -341514 -324267 -299212 -321475 -324157 -350496 -317679 -337816 -303932 -301517
518 -301517 -324920 -322103 -345066 -315670 -357761 -307495 -352646 -290077 -221113 -344836 -361168 -401471
506 -401471 -280668 -318594 -264721 -378289 -324365 -265321 -335304 -362477 -388766 -384736 -333660 -372749
494 -372749 -336063 -273827 -327934 -382840 -284694 -383919 -340108 -412375 -341859 -376009 -391145 -418364
482 -418364 -298657 -384850 -428098 -345277 -295768 -297428 -343547 -331810 -378052 -265084 -234707 -247392
470 -247392 -315570 -402506 -331866 -375558 -300718 -346451 -339643 -304921 -347068 -435039 -366756 -351001
458 -351001 -386494 -353356 -359840 -342499 -285716 -366719 -327662 -334769 -313098 -269561 -371388 -288062
446 -288062 -226648 -412149 -305576 -356545 -305124 -273219 -336024 -215422 -266125 -300708 -380732
435 -380732 -296571 -297047 -462989 -297713 -335710 -422670 -338964 -373160 -391811 -265399 -436907
424 -436907 -292365 -308052 -326559 -371177 -413873 -336444 -396737 -342761 -334960 -380997 -377767 -365707
412 -365707 -319478 -323615 -345190 -263570 -251969 -363228 -291327 -375009 -328524 -212961 -329990
401 -329990 -350750 -324204 -467737 -256883 -292419 -347283 -311316 -391923 -353631 -316480 -319621 -328279
389 -328279 -346650 -398526 -342598 -391004 -315189 -361755 -303403 -293881 -301768 -255980 -386961 -334360
377 -334360 -300110 -317044 -220320 -341883 -301786 -398283 -358365 -372186 -312223 -268461 -301638 -299788
365 -299788 -287059 -318704 -444413 -327300 -290387 -313329 -342533 -280559 -349261 -281546 -347310
354 -347310 -397518 -378509 -366847 -370025 -274901 -262418 -344358 -271702 -335601 -440134 -334549 -296904
342 -296904 -237299 -257672 -320934 -289554 -342157 -256926 -299284 -335979 -339910 -380066 -317766 -298554
330 -298554 -316571 -335712 -415232 -329172 -207072 -312340 -275238 -346910 -364275 -310841 -341208
319 -341208 -338253 -378002 -367510 -359982 -359426 -381535 -376939 -401526 -306973 -373563 -415859 -362254 -354696
306 -354696 -329219 -256586 -347337 -312351 -302967 -336537 -302938 -327674 -293911 -387762 -357524 -359554
294 -359554 -255766 -325532 -328220 -297438 -269242 -388772 -256906 -229399 -334069 -375811 -359969
283 -359969 -363285 -343341 -356862 -332345 -338464 -300070 -320569 -309323 -361153 -360999 -401926 -278047
271 -278047 -307551 -332953 -328653 -380021 -261222 -339666 -354676 -416037 -210601 -315918 -271159
260 -271159 -337333 -358951 -217147 -347830 -287920 -376375 -355821 -258772 -332118 -310620 -329170
249 -329170 -375488 -411777 -374810 -308551 -316548 -294061 -385417 -322675 -367917 -407154 -328500 -383244
237 -383244 -264922 -320535 -315181 -320881 -300923 -319539 -325897 -274529 -363264 -407330 -264349 -334977
225 -334977 -259414 -338983 -336978 -416578 -281547 -291449 -421603 -402853 -356672 -316095 -384406 -355908
213 -355908 -372141 -341561 -311809 -391129 -359798 -390710 -412208 -412616 -292744 -194130 -304891 -371305
201 -371305 -390084 -281740 -344571 -339690 -385026 -333001 -293236 -321816 -359516 -271943 -395217 -321806
189 -321806 -393844 -266108 -353852 -326960 -369441 -309364 -387473 -311260 -349258 -363005 -357576 -403929
177 -403929 -329514 -344792 -358763 -325211 -343104 -310436 -304480 -332926 -343916 -274760 -291615 -376077
165 -376077 -303716 -331792 -334504 -316955 -309579 -367761 -319057 -381915 -372427 -344610 -391669 -309423
153 -309423 -363243 -350623 -322932 -358627 -358044 -284469 -386758 -382285 -363387 -348743 -366820 -268845
141 -268845 -363489 -378343 -382112 -377107 -344592 -344115 -358907 -351867 -388623 -319234 -331186 -345720 -374677
128 -374677 -332454 -382091 -418899 -392042 -354798 -306115 -389187 -343716 -328153 -404501 -390087 -416156
116 -416156 -303918 -302092 -356035 -267964 -389761 -412176 -285942 -295579 -281049 -265707 -362561 -335175
104 -335175 -411474 -423687 -390438 -331569 -327431 -284498 -371926 -362592 -395531 -315199 -285952 -385306
92 -385306 -304469 -390820 -417148 -396002 -336495 -337698 -437812 -343897 -415440 -335108 -365375 -402979
80 -402979 -411752 -368836 -391029 -391269 -363652 -393303 -425769 -391712 -374746 -377704 -369066 -352462 -291975
67 -291975 -374433 -404347 -386589 -416797 -379328 -437979 -372505 -290463 -423369 -390175 -329118 -388571
55 -388571 -390326 -347241 -355424 -370842 -357326 -370698 -358792 -372360 -392968 -355733 -347041 -312179 -441773
42 -441773 -314596 -415460 -391099 -435088 -379712 -399894 -348801 -404350 -399704 -355720 -368597 -427358
30 -427358 -407366 -412855 -393850 -379073 -368015 -353479 -421208 -432006 -386970 -423029 -405986 -394285
18 -394285 -352424 -394201 -382235 -366984 -374428 -337380 -400052 -385833 -355787 -351361 -387811 -421662
6 -421662 -346010 -363759 -391484 -424092 -373765 -438917
0 -438917
$$ Imaginary data points
##PAGE= N=2
##DATA TABLE= (X++(I..I)), XYDATA
16383 -844139 -854204 -842288 -883064 -841969 -765215 -790152 -735773 -721316 -804826 -727114 -731789 -703445
16371 -703445 -689026 -619176 -621433 -662119 -637013 -582002 -533416 -488629 -571900 -544174 -474748 -438841
16359 -438841 -392358 -460326 -484536 -427954 -409835 -406070 -371581 -456565 -405876 -358803 -342074 -309083
16347 -309083 -187494 -302308 -292919 -253600 -281276 -179780 -260425 -191475 -130589 -169901 -120374
16336 -120374 -95676 -107398 -103052 -16280 -40546 -51595 -65251 -79400 -8742 9225 47111 31205
16324 31205 -9923 104929 21871 52468 79130 79308 84250 127790 97799 153052 161461 168219
16312 168219 185004 168604 203667 221715 244708 204045 225372 391688 265443 308476 345995
16301 345995 306809 333252 330822 360180 343128 386238 412673 447174 508866 508696 463242 461867
16289 461867 515567 547061 602489 480787 486186 484226 557289 594510 525108 572129 578615 576557
16277 576557 622888 606910 625983 593431 640387 647140 634767 626943 702154 668415 700531 661299
16265 661299 748991 750721 732030 736558 797476 751385 792759 774890 875200 788183 802005 785996
16253 785996 807302 847117 904139 928306 877247 916770 959308 885776 918761 937126 953301
16242 953301 962243 965389 977527 1013464 969370 971291 991291 1048960 1070684 1013060 1011183 1001833
16230 1001833 993491 1077774 1008581 1042664 1067371 1011258 1095001 1172429 1160694 1177477 1015430
16219 1015430 1120348 1179531 1078489 1173042 1141537 1037543 1210145 1180670 1178535 1112312 1106864
16208 1106864 1156412 1154829 1235126 1270381 1218047 1265656 1233679 1216864 1185554 1247158 1210661
16197 1210661 1154905 1277625 1284740 1252053 1302099 1299457 1280032 1287474 1334007 1295810 1328519 1267538
16185 1267538 1293799 1339261 1327640 1361037 1361915 1291971 1390286 1323074 1349181 1278553 1354593 1435038
16173 1435038 1412238 1432636 1431683 1404772 1413881 1404444 1436767 1489446 1359076 1373959 1360067 1440873
16161 1440873 1375435 1359619 1369088 1405365 1459757 1474608 1401333 1375628 1441338 1443094 1493070 1517896
16149 1517896 1446331 1435435 1528760 1474963 1390642 1520201 1494865 1509111 1445797 1539999 1491378
16138 1491378 1499465 1435080 1419811 1448128 1471787 1494311 1475081 1427227 1526857 1489341 1559253
16127 1559253 1538203 1495494 1566974 1510659 1539128 1619515 1458372 1517092 1611182 1476454 1520117
16116 1520117 1488125 1536056 1483864 1502833 1605772 1647245 1557687 1600332 1593296 1462749 1606445
16105 1606445 1492331 1461320 1435198 1458127 1554612 1489567 1639799 1547711 1585257 1609742 1625731
16094 1625731 1649761 1596793 1557724 1621349 1558813 1576341 1616314 1608408 1599376 1602666 1582447 1657443
16082 1657443 1593183 1559460 1634576 1612131 1555790 1514334 1602493 1576334 1542537 1411286 1590762
16071 1590762 1522127 1621823 1591545 1579463 1597995 1605488 1571203 1564643 1540561 1652564 1615626
16060 1615626 1585743 1616404 1555026 1550207 1522186 1690487 1603017 1624952 1579442 1638483 1544825
16049 1544825 1514077 1622773 1635540 1566084 1608056 1522836 1560999 1597757 1575676 1557933 1532578
16038 1532578 1508259 1577388 1589385 1497136 1596644 1624447 1575377 1630919 1575205 1582676 1549421
16027 1549421 1559832 1614478 1731615 1591444 1647237 1629288 1594600 1614231 1557400 1559880 1641064
16016 1641064 1625903 1546528 1629483 1626203 1664706 1687814 1609416 1586484 1642581 1535517 1506229
16005 1506229 1577090 1610756 1594505 1664821 1617291 1609074 1565059 1615346 1536405 1640923 1542476
15994 1542476 1634509 1608518 1649999 1628130 1525367 1581962 1614683 1624166 1644229 1660767 1538191
15983 1538191 1700814 1645440 1578008 1647985 1607645 1717717 1526882 1594287 1681364 1627281 1567504
15972 1567504 1608276 1618450 1650369 1590306 1630767 1594884 1615566 1631705 1625365 1635719 1613241
15961 1613241 1653254 1612572 1633273 1644436 1633374 1621051 1555728 1560699 1617862 1621949 1651893 1639218
15949 1639218 1615394 1654321 1611401 1630770 1534379 1619468 1702171 1636960 1679275 1596183 1700297
15938 1700297 1604063 1644920 1637549 1641788 1515396 1642120 1566016 1618904 1543982 1635325 1611961
15927 1611961 1565946 1631107 1530573 1714044 1613599 1641066 1609914 1607894 1688498 1635682 1690748
15916 1690748 1635174 1674190 1558823 1575916 1714816 1576197 1612330 1601372 1649813 1613081 1634259
15905 1634259 1597565 1570180 1749077 1653970 1583193 1607216 1665858 1646004 1592804 1605684 1607552
15894 1607552 1613549 1657278 1592495 1554777 1626702 1583668 1609109 1621571 1648322 1558429 1576952
15883 1576952 1582341 1651794 1593339 1715861 1638217 1672471 1588447 1520291 1629609 1586810 1645405
15872 1645405 1617057 1505935 1549004 1602898 1653537 1551724 1626916 1707877 1585150 1666765 1596482
15861 1596482 1699352 1638571 1680270 1612774 1550097 1658739 1674040 1693811 1680574 1591637 1577971
15850 1577971 1678952 1576405 1620954 1653769 1632419 1547168 1608544 1671177 1730007 1625202 1656459
15839 1656459 1634632 1637022 1639622 1620660 1545246 1730202 1708869 1688563 1591315 1689349 1652223
15828 1652223 1634474 1558964 1567409 1667151 1680607 1583301 1596243 1588577 1650713 1672130 1588407 1618701
15816 1618701 1673018 1690865 1616303 1614172 1586302 1586072 1708793 1663116 1653388 1677036 1654803 1606185
15804 1606185 1593749 1710647 1665843 1678612 1663721 1651948 1691525 1592602 1685454 1563042 1694728
15793 1694728 1610503 1623024 1681969 1721712 1660125 1713622 1677701 1619428 1605599 1709995 1622846
15782 1622846 1678897 1636219 1701619 1658879 1648327 1646390 1623050 1691904 1671531 1571036 1753787
15771 1753787 1564823 1768306 1611800 1627502 1664791 1690498 1668423 1706690 1699251 1726007 1616906
15760 1616906 1628272 1589117 1571960 1761136 1634038 1602027 1720885 1659138 1620728 1629013 1695328
15749 1695328 1593753 1535383 1630787 1618415 1684719 1673959 1650377 1560942 1722466 1649007 1773386
15738 1773386 1594368 1728482 1609811 1634006 1608294 1631912 1665379 1694224 1664385 1708445 1587179
15727 1587179 1643270 1666368 1650471 1708211 1603580 1759167 1728301 1710751 1697748 1619376 1576780
15716 1576780 1676688 1586427 1629126 1661040 1585993 1525663 1653377 1674490 1610475 1661907 1652779
15705 1652779 1624660 1725430 1740672 1628933 1609658 1606639 1685717 1694607 1634746 1634338 1652958 1596354
15693 1596354 1629655 1613863 1613263 1620596 1665678 1732113 1636903 1757025 1695273 1672482 1634829 1702184
15681 1702184 1656276 1746233 1648496 1621011 1668432 1707312 1590049 1728063 1676187 1685911 1679824
15670 1679824 1574820 1649745 1695152 1682244 1677434 1691555 1589046 1629866 1559808 1642196 1701977
15659 1701977 1648305 1702960 1668025 1610612 1676973 1775376 1643365 1628620 1664297 1610721 1693657
15648 1693657 1726785 1604367 1747568 1730301 1755016 1688221 1669190 1780074 1705002 1702866 1649455
15637 1649455 1654587 1728087 1632438 1743697 1793820 1702363 1824260 1747071 1755567 1704393 1658660
15626 1658660 1594962 1773965 1660745 1680423 1649064 1677035 1778902 1726225 1753445 1683061 1584793
15615 1584793 1638107 1636810 1714155 1673790 1709773 1702499 1722443 1716253 1602666 1654836 1761044
15604 1761044 1732040 1613809 1759185 1749625 1700412 1772189 1644091 1589928 1619686 1767024 1702714
15593 1702714 1604035 1683892 1717412 1655095 1690670 1683409 1704190 1761535 1692921 1644119 1678524
15582 1678524 1771500 1763539 1666051 1804338 1785135 1704736 1712818 1640303 1643501 1675528 1624014 1689426
15570 1689426 1657386 1684517 1779406 1687206 1694373 1720657 1709399 1791455 1619299 1681271 1651441
15559 1651441 1649374 1745220 1658202 1695594 1694025 1686208 1708702 1671544 1778358 1716305 1657771 1742426
15547 1742426 1725541 1639019 1625318 1757380 1683232 1657457 1602425 1726691 1682783 1664227 1661886
15536 1661886 1715506 1722534 1795739 1788540 1723242 1674055 1733557 1653860 1694550 1748465 1694938 1592604
15524 1592604 1704117 1692095 1727529 1683586 1787148 1763953 1688644 1656085 1748387 1693558 1681893
15513 1681893 1654928 1666550 1695793 1709413 1719158 1749532 1716973 1704284 1705444 1719732 1724733 1708681
$$ [...]
##END NTUPLES=NMR SPECTRUM
##END=
