##TITLE=abcd
##JCAMPDX= 6.0         $$ Bruker NMR JCAMP-DX V2.0
##DATA TYPE= NMR SPECTRUM
##DATA CLASS= NTUPLES
##ORIGIN= UXNMR, Bruker Analytische Messtechnik GmbH
##OWNER= root
$$ XWIN-NMR		Version 3.5
$$ Sat Feb 25 11:22:23 2023 Russian Standard Time (UT+4h)  servis@DPX200
##.OBSERVE FREQUENCY= 200.131235884673
##.OBSERVE NUCLEUS= ^1H
##.ACQUISITION MODE= SIMULTANEOUS
##.ACQUISITION SCHEME= undefined
##.AVERAGES= 16
##.DIGITISER RES= 18
##SPECTROMETER/DATA SYSTEM= spect
##.PULSE SEQUENCE= zg
##.SOLVENT NAME= CDCl3
##.SHIFT REFERENCE= (INTERNAL, CDCl3, 0, 16.4885)
##AUDIT TRAIL= $$ (NUMBER, WHEN, WHO, WHERE, WHAT)
$$ ##TITLE= Audit trail, XWIN-NMR		Version 3.5
$$ ##JCAMPDX= 5.01
$$ ##ORIGIN= Bruker BioSpin GmbH
$$ ##OWNER= servis
$$ F:\spectra/data/av/nmr/H1/1/pdata/1/auditp.txt
$$ ##AUDIT TRAIL=  $$ (NUMBER, WHEN, WHO, WHERE, WHAT)
(   1,<2023-02-25 11:21:04.98 +0400>,<servis>,<DPX200>,
      <created by zg, POWCHK disabled, PULCHK disabled
       terminated by command 'halt'
       configuration hash MD5:
       00 E9 B6 7A A2 85 ED C7 34 08 36 98 17 FE 4E 26
       data hash MD5: 32K
       E9 A8 C7 40 B7 13 72 BB 37 BC 8E 23 9D DB 47 0D>)
(   2,<2023-02-25 11:21:07.95 +0400>,<servis>,<DPX200>,
      <Start of raw data processing
       efp BC_mod = 2 LB = 0.05 FT_mod = 6 PKNL = 1 PHC0 = -186.0208 PHC1 = -2.89851 SI = 16K 
       data hash MD5: 16K
       B3 8C 1D 82 39 E8 79 58 80 83 78 9B F7 75 61 5F>)
(   3,<2023-02-25 11:21:18.29 +0400>,<servis>,<DPX200>,
      <pk PHC0 = 4.573497 PHC1 = 0 
       data hash MD5: 16K
       B1 AD 66 B1 21 E6 0A 55 E9 E0 AA EC 31 6E 9C DE>)
$$ ##END=
$$ 
$$ hash MD5
$$ 0E 97 65 0D 83 17 0C 4B A8 13 46 04 42 0D 7C D1
##$RELAX= 
##$RELAX= 
##$RELAX= 
##$RELAX= 
##$RELAX= 
##$RELAX= 
##$RELAX= 
##$RELAX= 
$$ Bruker specific parameters
$$ --------------------------
##$DU= <F:\spectra>
##$EXPNO= 1
##$NAME= <H1>
##$PROCNO= 1
##$TYPE= <nmr>
##$USER= <av>
##$AMP= (0..31)
100 100 100 100 100 100 100 100 100 100 100 100 100 100 100 100 100 100 
100 100 100 100 100 100 100 100 100 100 100 100 100 100 
##$AQSEQ= 0
##$AQ_mod= 1
##$AUNM= <au_zg>
##$AUTOPOS= <>
##$BF1= 200.13
##$BF2= 200.13
##$BF3= 200.13
##$BF4= 200.13
##$BF5= 500.13
##$BF6= 500.13
##$BF7= 500.13
##$BF8= 500.13
##$BYTORDA= 1
##$CFDGTYP= 0
##$CFRGTYP= 5
##$CHEMSTR= <none>
##$CNST= (0..31)
1 1 145 1 1 1 1 1 1 1 1 1 1 1 1 1 1 1 1 1 1 1 1 1 1 1 1 1 1 1 1 1 
##$CPDPRG= <>
##$CPDPRG1= <>
##$CPDPRG2= <>
##$CPDPRG3= <>
##$CPDPRG4= <mlev>
##$CPDPRG5= <mlev>
##$CPDPRG6= <mlev>
##$CPDPRG7= <mlev>
##$CPDPRG8= <mlev>
##$CPDPRGB= <>
##$CPDPRGT= <>
##$D= (0..31)
0 2 0 0 0 0 0 0 0 0.06 0 0 0 0 0 0 0.0002 0 0 0 0 0 0 0 0 0 0 0 0 0 0 
0 
##$DATE= 1677309664
##$DBL= (0..7)
120 120 120 120 120 120 120 120 
##$DBP= (0..7)
150 150 150 150 150 150 150 150 
##$DBP07= 0
##$DBPNAM0= <>
##$DBPNAM1= <>
##$DBPNAM2= <>
##$DBPNAM3= <>
##$DBPNAM4= <>
##$DBPNAM5= <>
##$DBPNAM6= <>
##$DBPNAM7= <>
##$DBPOAL= (0..7)
0.5 0.5 0.5 0.5 0.5 0.5 0.5 0.5 
##$DBPOFFS= (0..7)
0 0 0 0 0 0 0 0 
$$ [...]
##$SUBNAM4= <"">
##$SUBNAM5= <"">
##$SUBNAM6= <"">
##$SUBNAM7= <"">
##$SUBNAM8= <"">
##$SUBNAM9= <"">
##$SW= 20.6817932712277
##$SWIBOX= (0..15)
0 0 3 0 0 0 0 0 0 0 0 0 0 0 0 0 
##$SW_h= 4139.07284768212
##$TD= 32768
##$TD0= 1
##$TE= 0
##$TE2= 300
##$TE3= 300
##$TEG= 300
##$TL= (0..7)
0 120 120 120 120 120 120 120 
##$TP= (0..7)
150 150 150 150 150 150 150 150 
##$TP07= 0
##$TPNAME0= <>
##$TPNAME1= <>
##$TPNAME2= <>
##$TPNAME3= <>
##$TPNAME4= <>
##$TPNAME5= <>
##$TPNAME6= <>
##$TPNAME7= <>
##$TPOAL= (0..7)
0.5 0.5 0.5 0.5 0.5 0.5 0.5 0.5 
##$TPOFFS= (0..7)
0 0 0 0 0 0 0 0 
##$TUNHIN= 0
##$TUNHOUT= 0
##$TUNXOUT= 0
##$USERA1= <user>
##$USERA2= <user>
##$USERA3= <user>
##$USERA4= <user>
##$USERA5= <user>
##$V9= 5
##$VALIST= <valist>
##$VCLIST= <CCCCCCCCCCCCCCC>
##$VD= 0
##$VDLIST= <DDDDDDDDDDDDDDD>
##$VPLIST= <PPPPPPPPPPPPPPP>
##$VTLIST= <TTTTTTTTTTTTTTT>
##$WBST= 1024
##$WBSW= 30
##$XGAIN= (0..3)
0 0 0 0 
##$XL= 0
##$YL= 0
##$YMAX_a= 803285
##$YMIN_a= -1616086
##$ZGOPTNS= <>
##$ZL1= 120
##$ZL2= 120
##$ZL3= 120
##$ZL4= 120
##$ABSF1= 0
##$ABSF2= 0
##$ABSG= 0
##$ABSL= 0
##$ALPHA= 0
##$AQORDER= 0
##$ASSFAC= 0
##$ASSFACI= 0
##$ASSFACX= 0
##$ASSWID= 0
##$AUNMP= <proc_1d>
##$AZFE= 0.1
##$AZFW= 0.1
##$BCFW= 0
##$BC_mod= 2
##$BYTORDP= 0
##$COROFFS= 0
##$CY= 18.4799938201904
##$DATMOD= 1
##$DC= 0
##$DFILT= <>
##$DTYPP= 0
##$F1P= 9.9274215381318
##$F2P= -0.165520771350173
##$FCOR= 1
##$FTSIZE= 16384
##$FT_mod= 6
##$GAMMA= 0
##$GB= 0
##$INTBC= 1
##$INTSCL= 4.127829e-11
##$ISEN= 128
##$LB= 0.05
##$LEV0= 0
##$LPBIN= 0
##$MAXI= 10000
##$MC2= 0
##$MEAN= 0
##$ME_mod= 0
##$MI= 50
##$NCOEF= 0
##$NC_proc= -5
##$NLEV= 6
##$NOISF1= 3.799351
##$NOISF2= 2.8
##$NSP= 0
##$NTH_PI= 0
##$NZP= 0
##$OFFSET= 16.48848
##$PC= 4
##$PHC0= -181.4473
##$PHC1= -2.89851
##$PH_mod= 1
##$PKNL= yes
##$PPARMOD= 0
##$PSCAL= 4
##$PSIGN= 0
##$REVERSE= no
##$SF= 200.130005582386
##$SI= 16384
##$SIGF1= 3
##$SIGF2= 2
##$SINO= 400
##$SIOLD= 16384
##$SREGLST= <1H.CDCl3>
##$SSB= 0
##$STSI= 16384
##$STSR= 0
##$SW_p= 4139.07284768211
##$SYMM= 0
##$S_DEV= 0
##$TDeff= 32768
##$TDoff= 0
##$TI= <>
##$TILT= no
##$TM1= 0
##$TM2= 0
##$TOPLEV= 0
##$USERP1= <user>
##$USERP2= <user>
##$USERP3= <user>
##$USERP4= <user>
##$USERP5= <user>
##$WDW= 1
##$XDIM= 16384
##$YMAX_p= 334901342
##$YMIN_p= -1035774
$$ End of Bruker specific parameters
$$ ---------------------------------
##NTUPLES= NMR SPECTRUM
##VAR_NAME=  FREQUENCY,     SPECTRUM/REAL,   SPECTRUM/IMAG
##SYMBOL=    X,             R,               I
##VAR_TYPE=  INDEPENDENT,   DEPENDENT,       DEPENDENT
##VAR_FORM=  AFFN,          ASDF,            ASDF
##VAR_DIM=   16384,         16384,           16384
##UNITS=     HZ,            ARBITRARY UNITS, ARBITRARY UNITS
##FACTOR=    0.252644378177508, 1,           1
##FIRST=     3299.83951724647, 0,            0
##LAST=      -839.233330435636, 0,           0
##MIN=       -839.233330435636, -1035774,    0
##MAX=       3299.83951724647, 334901342,    0
$$ Real data points
##PAGE= N=1
##DATA TABLE= (X++(R..R)), XYDATA
$$ [...]
$$ plain form
12292 -713106 -747997 -707442 -815088 -768333 -729890 -758160 -738588 -708094 -776664 -765607 -762399
12281 -762399 -714026 -795980 -738097 -665172 -716148 -668457 -794776 -754471 -696280 -730738 -767367
12270 -767367 -695623 -714761 -700850 -705009 -782999 -743599 -716819 -679388 -702853 -738583 -697074 -758411
12258 -758411 -728531 -642583 -675473 -697913 -720817 -762652 -730191 -734630 -763636 -652143 -719210
12247 -719210 -697768 -717759 -734116 -748456 -721801 -712446 -733688 -720660 -714115 -761714 -701695 -715600
12235 -715600 -747425 -690952 -702915 -736186 -729245 -708410 -657984 -718025 -681252 -688053 -714901 -771817
12223 -771817 -686712 -677682 -739788 -732089 -702384 -699051 -730382 -676156 -714549 -738899 -738033 -769475
12211 -769475 -757791 -742178 -695022 -701668 -762678 -688464 -744505 -694671 -708057 -746488 -683704 -680032
$$ packed form
12292g13106l4891M0555j07646M6755L8443k8270J9572L0494o8570J1057L208
12281g62399M8373q1954N7883P2925n0976M7691j26319M0305N8191l4458l6629
12270g67367P1744j9138J3911m159p7990L9400K6780L7431k3465l5730M1509o1337
12258g58411K9880Q5948l2890k2440k2904m1835L2461m439k9006J11493o7067
12247g19210K1442j9991j6357j4340K6655R355k1242J3028O545m7599O0019j3905
12235g15600l1825N6473j1963l3271O941K0835N0426o0041L6773o801k6848n6916
12223g71817Q5105R030o2106P699K9705L333l1331N4226l8393k4350Q66l1442
12211g69475J1684J5613M7156o646o1010P4214n6041M9834j3386l8431O2784L672
$$ plain form
12199 -680032 -675941 -706565 -704308 -663524 -668445 -692685 -664348 -737872 -732340 -752347 -689596 -772041
12187 -772041 -773808 -703198 -763519 -678733 -743687 -656616 -713920 -676797 -720319 -745119 -771328 -741807
12175 -741807 -689528 -698837 -734412 -688397 -713930 -702843 -728727 -738868 -736646 -729574 -765088 -726053
12163 -726053 -726466 -691843 -645719 -732989 -694735 -684759 -699597 -675779 -734761 -749021 -707228 -712662
12151 -712662 -701219 -727757 -734783 -759613 -847920 -737408 -714181 -707006 -684742 -736199 -714576 -714294
12139 -714294 -720239 -712948 -712186 -692016 -695596 -689400 -694155 -819618 -731579 -793726 -670366 -744755
12127 -744755 -766249 -734649 -713787 -673495 -706923 -780086 -690711 -636763 -720077 -697060 -716454
12116 -716454 -756265 -696197 -712304 -768624 -723641 -633172 -712802 -755241 -716607 -729444 -699936
$$ packed form
12199f80032M091l0624K257M0784m921k4240K8337p3524N532k0007O2751q2445
12187g72041j767P0610o0321Q4786o4954Q7071n7304L7123m3522k4800k6209K9521
12175g41807N2279r309l5575M6015k5533J1087k5884j0141K222P072l5514L9035
12163g26053m13L4623M6124q7270L8254R976j4838K3818n8982j4260M1793n434
12151g12662J1443k6538p026k4830q8307J10512K3227P175K2264n1457K1623K82
12139g14294n945P291P62K0170l580O196m755j25463Q8039o2147J23360p4389
12127g44755k1494L1600K0862M0292l3428p3163Q9375N3948q3314K3017j9394
12116g16454l9811O0068j6107n6320M4983R0469p9630m2439L8634j2837K9508
$$ plain form
12105 -699936 -720247 -761223 -739437 -682038 -741350 -736811 -719931 -757972 -740691 -730968 -660707 -714027
12093 -714027 -757508 -702626 -693444 -721529 -700112 -707984 -771489 -664476 -692350 -741275 -771884 -713932
12081 -713932 -727022 -692798 -674399 -710190 -668494 -735660 -741249 -688435 -725362 -753162 -719592 -623906
12069 -623906 -646883 -743877 -714896 -737711 -663642 -648006 -686957 -676554 -657568 -713700 -750087
12058 -750087 -701660 -716383 -729162 -638175 -734222 -722395 -761152 -626465 -709627 -809919 -738661
12047 -738661 -693203 -736844 -709700 -761204 -697611 -694112 -677715 -688236 -759112 -744598 -695858 -756966
12035 -756966 -669956 -728215 -731383 -771399 -769857 -755240 -727390 -693757 -714056 -701399 -676958 -664395
12023 -664395 -723830 -711447 -683517 -633615 -681955 -678521 -697631 -735893 -650464 -703262 -722030 -767801
$$ packed form
12105f99936k0311m0976K1786N7399n9312M539J6880l8041J7281R723P0261n3320
12093g14027m3481N4882R182k8085K1417p872o3505J07013k7874m8925l0609N7952
12081g13932j3090L4224J8399l5791M1696o7166n589N2814l6927k7800L3570R5686
12069f23906k2977r6994K8981k2815P4069J5636l8951J0403J8986n6132l6387
12058g50087M8427j4723j2779R0987r6047J1827l8757J34687q3162j00292P1258
12047g38661M5458m3641K7144n1504O3593L499J6397j0521p0876J4514M8740o1108
12035g56966Q7010n8259l168m0016J542J4617K7850L3633k0299J2657K4441J2563
12023f64395n9435J2383K7930M9902m8340L434j9110l8262Q5429n2798j8768m5771
$$ plain form
12011 -767801 -698119 -685798 -763768 -675685 -704541 -712190 -712264 -691123 -753894 -733839 -732201 -705197
11999 -705197 -687438 -669829 -733612 -713916 -736129 -759175 -776524 -768677 -747260 -764649 -686278 -738823
11987 -738823 -700704 -678742 -668320 -748028 -723820 -638848 -745724 -734118 -681918 -675786 -682570 -727832
11975 -727832 -685849 -686005 -727862 -678954 -719745 -750744 -697573 -625712 -752445 -670969 -673402 -739142
11963 -739142 -687551 -779932 -713759 -775210 -755101 -750731 -651939 -692359 -687744 -712288 -751812 -734754
11951 -734754 -730134 -721319 -759552 -681527 -715461 -709268 -672632 -721926 -696540 -698687 -734440 -663084
11939 -663084 -685455 -691585 -723115 -700403 -666870 -690124 -705612 -750812 -730071 -724378 -688468 -745607
11927 -745607 -720925 -676201 -686930 -755406 -710121 -676899 -687163 -665529 -714084 -748409 -697912
$$ packed form
12011g67801O9682J2321p7970Q8083k8856p649p4K1141o2771K0055J638K7004
11999g05197J7759J7609o3783J9696k2213k3046j7349P847K1417j7389P8371n2545
11987g38823L8119K1962J0422p9708K4208Q4972j06876J1606N2200O132o784m5262
11975g27832M1983j56m1857M8908m0791l0999N3171P1861j26733Q1476k433o5740
11963g39142N1591r2381O6173o1451K0109M370R8792m0420M615k4544l9524J7058
11951g34754M620Q815l8233P8025l3934O193L6636m9294K5386k147l5753P1356
11939f63084k2371o130l1530K2712L3533k3254j5488m5200K0741N693L5910n7139
11927g45607K4682M4724j0729o8476M5285L3222j0264K1634m8555l4325N0497
$$ plain form
11916 -697912 -730934 -699004 -613983 -692031 -690577 -720141 -722246 -738483 -643345 -657368 -664610 -700378
11904 -700378 -667486 -677592 -709675 -740984 -634073 -692862 -628661 -747681 -701559 -721268 -698547
11893 -698547 -729403 -655027 -658531 -688868 -683164 -695233 -684818 -718889 -705130 -759501 -653046 -686057
11881 -686057 -709596 -669081 -707630 -681785 -666791 -640760 -686404 -697171 -714977 -653211 -725481
11870 -725481 -724110 -670033 -703181 -717464 -674780 -653227 -756756 -660112 -720314 -596731 -671370
11859 -671370 -715214 -729798 -665846 -753068 -653500 -706870 -710422 -739921 -694642 -677050 -683686 -770927
11847 -770927 -664957 -694489 -715797 -699658 -582705 -661856 -704385 -704480 -690939 -677729 -686238 -754999
11835 -754999 -703304 -755080 -771771 -723908 -707549 -691182 -691021 -652979 -666923 -679023 -717112 -626454
$$ packed form
11916f97912l3022L1930Q5021p8048J454k9564k105j6237R5138j4023p242l5768
11904g00378L2892j0106l2083l1309J06911n8789O4201j19020M6122j9709K2721
11893f98547l0856P4376l504l0337N704j2069J0415l4071J3759n4371J06455l3011
11881f86057k3539M0515l8549K5845J4994K6031m5644j0767j7806O1766p2270
11870g25481J371N4077l3148j4283M2684K1553j03529R6644o0202J23583p4639
11859f71370m3844j4584O3952q7222R9568n3370l552k9499M5279J7592o636q7241
11847g70927J05970k9532k1308J6139J16953p9151m2529r5J3541J3210q509o8761
11835g54999N1695n1776j6691M7863J6359J6367J61L8042j3944j2100l8089R0658
$$ plain form
11823 -626454 -715394 -713574 -799281 -749558 -682062 -735630 -690333 -674347 -708206 -642080 -596369 -699289
11811 -699289 -709941 -743822 -658873 -699941 -683862 -643839 -689134 -665931 -672925 -705426 -718466 -662252
11799 -662252 -722808 -735459 -726641 -691632 -696086 -717658 -692025 -724490 -688020 -758490 -713123 -661675
11787 -661675 -739013 -614637 -628456 -664867 -659023 -713804 -629423 -736443 -736721 -693512 -739279 -728373
11775 -728373 -666174 -677646 -704327 -723334 -649314 -686460 -793123 -708460 -672793 -693513 -724267
11764 -724267 -723297 -625892 -678153 -654959 -708535 -682076 -669689 -638627 -685038 -627490 -731191 -695503
11752 -695503 -674796 -712599 -709343 -719865 -644085 -694243 -684506 -727275 -722939 -681987 -680909 -700283
11740 -700283 -728156 -666659 -712623 -635460 -623341 -638593 -723227 -750785 -683143 -656791 -762351
$$ packed form
11823f26454q8940J820q5707M9723O7496n3568M5297J5986l3859O6126M5711j02920
11811f99289j0652l3881Q4949m1068J6079M0023m5295K3203o994l2501j3040N6214
11799f62252o0556j2651Q818L5009m454k1572K5633l2465L6470p0470M5367N1448
11787f61675p7338J24376j3819l6411N844n4781Q4381j07020k78M3209m5767J0906
11775g28373O2199j1472k6681j9007P4020l7146j06663Q4663L5667k0720l0754
11764g24267R70R7405n2261K3194n3576K6459J2387L1062m6411N7548j03701L5688
11752f95503K0707l7803L256j0522P5780n0158R737m2769M336M0952J078j9374
11740g00283k7873O1497m5964P7163J2119j5252q4634k7558O7642K6352j05560
$$ plain form
11729 -762351 -715208 -684366 -637109 -732239 -677091 -701291 -717914 -698498 -650541 -647794 -684890 -673425
11717 -673425 -720362 -698293 -612251 -671069 -702333 -690253 -639576 -671583 -662100 -693947 -662730 -642409
11705 -642409 -706555 -669862 -718492 -722546 -697433 -674000 -718901 -668642 -687494 -701847 -689285 -690292
11693 -690292 -650735 -705413 -677290 -629347 -662819 -740437 -659334 -664368 -703363 -714556 -712377 -676594
11681 -676594 -664866 -662621 -754172 -648816 -773449 -662897 -676879 -683047 -740873 -686137 -742450
11670 -742450 -691768 -701359 -675553 -692352 -660816 -733053 -661173 -675565 -703601 -652247 -717402 -746600
11658 -746600 -689599 -666654 -668898 -667153 -734393 -687952 -745452 -745958 -716254 -727563 -696342 -696955 -676249
11645 -676249 -736108 -687937 -674933 -615433 -621812 -669603 -634311 -630509 -663093 -654619 -731115 -609400
$$ packed form
11729g62351M7143L0842M7257r5130N5148k4200j6623J9416M7957K747l7096J1465
11717f73425m6937K2069Q6042n8818l1264J2080N0677l2007R483l1847L1217K0321
11705f42409o4146L6693m8630m054K5113K3433m4901N0259j8852j4353J2562j007
11693f90292L9557n4678K8123M7943l3472p7618Q1103n034l8995j1193K179L5783
11681f76594J1728K245r1551J05356j24633J10552j3982o168n7826N4736n6313
11670g42450N0682r591K5806j6799L1536p2237P1880j4392k8036N1354o5155k9198
11658g46600N7001K2945k244J745o7240M6441n7500n06K9704j1309L1221o13K0706
11645f76249n9859M8171J3004N9500o379m7791L5292L802l2584Q474p6496J21715
$$ plain form
11633 -609400 -715708 -646603 -632018 -614338 -703225 -633858 -691415 -633765 -695392 -671358 -708261
11622 -708261 -663588 -649741 -701394 -665373 -612462 -679455 -666754 -734331 -654502 -617657 -667002
11611 -667002 -697285 -692300 -631040 -640124 -710528 -720082 -631451 -676932 -621518 -714193 -633678 -626528
11599 -626528 -698759 -613238 -636537 -648132 -657545 -653535 -657701 -691075 -635482 -726030 -665460 -673497
11587 -673497 -613504 -652315 -687578 -676289 -684916 -712455 -696716 -663067 -724218 -642785 -664156 -688358
11575 -688358 -722958 -705754 -666262 -671810 -634215 -625387 -679682 -639714 -663044 -720895 -624770 -629348
11563 -629348 -674037 -663946 -704425 -683570 -647648 -647900 -687074 -698395 -638645 -697335 -690430 -675953
11551 -675953 -635261 -645093 -662732 -592787 -656491 -584059 -608719 -681345 -650591 -665507 -678464 -673466
$$ packed form
11633f09400j06308O9105J4585J7680q8887O9367n7557N7650o1627K4034l6903
11622g08261M4673J3847n1653L6021N2911o6993J2701o7577P9829L6845m9345
11611f67002l0283M985O1260r084p0404r554Q8631m5481N5414r2675Q0515P150
11599f26528p2231Q5521k3299j1595r413M010m166l3374N5593r0548O0570q037
11587f73497N9993l8811l5263J1289q627k7539J5739L3649o1151Q1433k1371k4202
11575f88358l4600J7204L9492n548L7595Q828n4295L9968k3330n7851R6125m578
11563f29348m4689J0091m0479K0855L5922k52l9174j1321N9750n8690O905J4477
11551f75953M0692r832j7639O9945o3704P2432k4660p2626L0754j4916j2957M998
$$ plain form
11539 -673466 -694767 -695661 -662448 -692189 -633272 -652985 -679155 -674581 -667706 -665444 -687824 -682735 -665118
11526 -665118 -730925 -635246 -590525 -661154 -650614 -664643 -683461 -658618 -713965 -717368 -754547 -668390
11514 -668390 -674347 -681055 -727159 -661346 -687789 -686418 -621573 -648145 -669236 -695952 -675026 -616822
11502 -616822 -623845 -599207 -632714 -637872 -633224 -637977 -695998 -622944 -669846 -676338 -639126 -633521 -677591
11489 -677591 -630079 -681165 -627861 -612630 -601938 -694160 -647630 -660599 -641954 -690157 -659537
11478 -659537 -638122 -655908 -606467 -618468 -629700 -633211 -626479 -604101 -681280 -590453 -613914 -640010
11466 -640010 -694505 -679810 -605878 -645570 -639588 -627387 -613518 -608951 -643617 -574980 -588894 -592528
11454 -592528 -685564 -715802 -696524 -654704 -650587 -706897 -682537 -641120 -637065 -676348 -675539 -632797
$$ packed form
11539f73466k1301q94L3213k9741N8917j9713k6170M574O875K262k2380N089J7617
11526f65118o5807R5679M4721p0629J0540j4029j8818K4843n5347l403l7179Q6157
11514f68390n957o708m6104O5813k6443J371O4845k6572k1091k6716K0926N8204
11502f16822p023K4638l3507n158M648m753n8021P3054m6902o492L7212N605m4070
11489f77591M7512n1086N3304J5231J0692r2222M6530j2969J8645m8203L0620
11478f59537K1415j7786M9441j2001j1232l511O732K2378p7179R0827k3461k6096
11466f40010n4495J4695P3932l9692N982J2201J3869M567l4666O8637j3914l634
11454e92528r3036l0238J9278M1820M117n6310K4360M1417M055l9283Q09M2742
$$ plain form
11442 -632797 -651905 -641180 -615192 -602451 -700069 -620398 -604968 -692863 -659271 -694903 -670950
11431 -670950 -626511 -692393 -581876 -669023 -664530 -653399 -666190 -632324 -635426 -588727 -648480 -637815
11419 -637815 -675416 -657113 -612616 -664314 -644460 -658125 -618850 -533105 -605371 -641310 -598730
11408 -598730 -594249 -631517 -676217 -618820 -617979 -582214 -612651 -737889 -648476 -689500 -604739 -645779
11396 -645779 -595524 -652581 -634184 -612231 -703750 -636444 -681505 -673910 -722379 -652516 -678685 -655078
11384 -655078 -601432 -704997 -574270 -680114 -649311 -627879 -551721 -615012 -643485 -596843 -664187
11373 -664187 -650800 -691724 -647854 -692748 -628695 -647629 -696096 -599591 -692253 -665550 -637507
11362 -637507 -620480 -592540 -633587 -628041 -595372 -625837 -625035 -632627 -656343 -611060 -594898 -641241
$$ packed form
11442f32797j9108J0725K5988J2741r7618P9671J5430q7895L3592l5632K3953
11431f70950M4439o5882J10517q7147M493J1131j2791L3866l102M6699n9753J0665
11419f37815l7601J8303M4497n1698J9854j3665L9275Q5745p2266l5939M2580
11408e98730M481l7268m4700N7397Q41L5765l0437j25238Q9413m1024Q4761m1040
11396f45779N0255n7057J8397K1953r1519O7306m5061P595m8469O9863k6169K3607
11384f55078N3646j03565J30727j05844L0803K1432P6158o3291k8473M6642o7344
11373f64187J3387m0924M3870m4894O4053j8934m8467R6505r2662K6703K8043
11362f37507J7027K7940m1047N546L2669l0465Q02p592k3716M5283J6162m6343
$$ plain form
11350 -641241 -653685 -730492 -635443 -677499 -608768 -691848 -681696 -624411 -619919 -665387 -658476 -648605
11338 -648605 -735991 -563967 -639460 -670891 -639312 -669012 -575392 -709172 -643532 -550900 -607211
11327 -607211 -667422 -644031 -543722 -599553 -600055 -673166 -633645 -720607 -626055 -592819 -633038 -601668
11315 -601668 -627621 -647707 -631977 -634165 -619170 -638139 -675178 -608786 -593027 -614022 -671636 -628145
11303 -628145 -603335 -590104 -646474 -624801 -635132 -623766 -588421 -639922 -653279 -674813 -615501
11292 -615501 -665976 -641043 -641139 -588435 -600557 -652967 -665529 -591535 -632867 -671892 -550428 -653339
11280 -653339 -689553 -618739 -602717 -680652 -653521 -604162 -671606 -585972 -552332 -576840 -587724
11269 -587724 -555017 -538404 -555097 -618657 -607844 -549580 -614460 -609807 -579286 -586373 -640211 -604143
$$ packed form
11350f41241j2444p6807R5049m2056O8731q3080J0152N7285M492m5468O911R871
11338f48605q7386J72024p5493l1431L1579k9700R3620j33780O5640R2632n6311
11327f07211o0211K3391J00309n5831n02p3111L9521q6962R4552L3236m0219L1370
11315f01668k5953k0086J5730k188J4995j8969l7039O6392J5759k0995n7614M3491
11303f28145K4810J3231n6370K1673j0331J1366L5345n1501j3357k1534N9312
11292f15501n0475K4933r6N2704j2122n2410j2562P3994m1332l9025J21464j02911
11280f53339l6214P0814J6022p7935K7131M9359o7444Q5634L3640k4508j0884
11269e87724L2707J6613j6693o3560J0813N8264o4880M653L0521p087n3838L6068
$$ plain form
11257 -604143 -601335 -673597 -636050 -625783 -625291 -583712 -589032 -575104 -638496 -550333 -624302 -622735
11245 -622735 -629337 -576583 -637240 -699967 -567976 -610479 -672371 -557932 -602144 -595321 -596866 -615911
11233 -615911 -567114 -594852 -561074 -606289 -579036 -591520 -619869 -636415 -638145 -665394 -638425 -592139
11221 -592139 -643527 -595683 -592611 -613581 -658815 -638741 -705788 -646779 -617733 -636708 -672562 -575223
11209 -575223 -688743 -643190 -650807 -655128 -663162 -642728 -702244 -593885 -636188 -620304 -658268 -674085
11197 -674085 -662367 -634463 -662214 -611842 -626999 -637765 -633400 -551605 -593998 -617117 -649681 -617960
11185 -617960 -606690 -604704 -631651 -631991 -592090 -631508 -650357 -640113 -599404 -642709 -588785 -549141
11173 -549141 -613090 -647569 -674457 -638075 -649044 -718610 -593801 -638043 -633113 -619842 -643898
$$ packed form
11257f04143K808p2262L7547J0267M92M1579n320J3928o3392Q8163p3969J567
11245f22735o602N2754o0657o2727J31991m2503o1892J14439m4212O823j545j9045
11233f15911M8797k7738L3778m5215K7253j2484k8349j6546j730k7249K6969M6286
11221e92139n1388M7844L072k0970m5234K0074o7047N9009K9046j8975l5854R7339
11209e75223j13520M5553p617m321q034K0434n9516J08359m2303J5884l7964j5817
11197f74085J1718K7904k7751N0372j5157j0766M365Q1795m2393k3119l2564L1721
11185f17960J1270J986k6947l40L9901l9418j8849J0244M0709m3305N3924L9644
11173e49141o3949l4479k6888L6382j0969o9566J24809m4242M930J3271k4056
$$ plain form
11162 -643898 -558052 -662817 -588758 -633507 -673459 -619884 -671746 -639274 -646848 -639624 -605749 -563925
11150 -563925 -698524 -686255 -605646 -597241 -610448 -675057 -683036 -552069 -571897 -588544 -596066 -622706
11138 -622706 -577685 -629384 -563518 -661771 -611697 -577620 -629859 -634379 -646965 -577860 -627508 -593049
11126 -593049 -629957 -627008 -632931 -629775 -621915 -590478 -584022 -607252 -638986 -625066 -580721 -615794
11114 -615794 -588035 -560165 -554123 -580139 -564784 -621362 -598385 -619289 -608281 -573624 -629908 -594010
11102 -594010 -579474 -682696 -615553 -655943 -588128 -579993 -609810 -584298 -585480 -685307 -654960 -598854
11090 -598854 -592969 -648865 -604792 -633892 -570897 -625923 -667399 -591994 -668403 -615833 -608391 -603028
11078 -603028 -619976 -558198 -650645 -654480 -654797 -584191 -542773 -601804 -598875 -622476 -636698 -644696
$$ packed form
11162f43898Q5846j04765P4059m4749l9952N3575n1862L2472p574P224L3875M1824
11150e63925j34599J2269Q0609Q405j3207o4609p979J30967j9828j6647p522k6640
11138f22706M5021n1699O5866r8253N0074L4077n2239m520j2586O9105m9648L4459
11126e93049l6908K949n923L156P860L1437O456k3230l1734J3920M4345l5073
11114f15794K7759K7870O042k6016J5355n6578K2977k0904J1008L4657n6284L5898
11102e94010J4536j03222O7143m0390O7815Q135k9817K5512j182r9827L0347N6106
11090e98854N885n5896M4073k9100O2995n5026m1476P5405p6409N2570P442N363
11078f03028j6948O1778r2447l835l17P0606M1418n9031K929k3601j4222p998
$$ plain form
11066 -644696 -590317 -612670 -632690 -599600 -618953 -683499 -644304 -591693 -638833 -625242 -569651
11055 -569651 -574540 -635018 -580786 -604765 -669563 -608840 -562819 -541089 -515271 -579060 -520523 -568218
11043 -568218 -598080 -595729 -615804 -584565 -556079 -632859 -563324 -660135 -573856 -628348 -581199 -580576
11031 -580576 -544392 -566550 -628965 -636675 -689598 -611971 -662340 -637175 -563278 -601332 -511730 -609901
11019 -609901 -616518 -598384 -601743 -646812 -570493 -620933 -591332 -651663 -603482 -564057 -601560 -577841
11007 -577841 -553406 -597561 -601018 -542516 -575224 -555308 -607397 -540170 -550013 -556911 -554368 -602058
10995 -602058 -610087 -602754 -591767 -648988 -607169 -638536 -557233 -579446 -577501 -625619 -630099 -644412
10983 -644412 -540395 -606082 -519773 -544676 -644997 -582121 -585383 -583330 -559512 -588853 -623865
$$ packed form
11066f44696N4379k2353k0020L3090j9353o4546L9195N2611m7140J3591N5591
11055e69651m889o0478N4232k3979o4798O0723M6021K1730K5818o3789N8537m7695
11043e68218k9862K351k0075L1239K8486p6780O9535r6811Q6279n4492M7149O23
11031e80576L6184k2158o2415p710n2923P7627n0369K5165P3897l8054Q9602r8171
11019f09901o617J8134l359m5069P6319n0440K9601o0331M8181L9425l7503K3719
11007e77841K4435m4155l457N8502l2708J9916n2089O7227r843o898K543m7690
10995f02058q029P333J0987n7221M1819l1367Q1303k2213J945m8118m480j4313
10983f44412J04017o5687Q6309k4903j00321O2876l262K053K3818k9341l5012
$$ plain form
10972 -623865 -607521 -605525 -607639 -592152 -620018 -576411 -643716 -610538 -579847 -633031 -559138 -588293
10960 -588293 -586452 -568558 -630220 -576008 -575386 -559943 -587080 -650346 -586962 -599055 -589559 -575963
10948 -575963 -532911 -621392 -617327 -592671 -617444 -568818 -564240 -606469 -637016 -596568 -555384 -574154
10936 -574154 -606822 -528292 -549914 -591523 -538627 -596373 -627329 -569211 -547486 -575326 -611762
10925 -611762 -575019 -584367 -629159 -662764 -573311 -587726 -558674 -582188 -603709 -581432 -531972 -582179
10913 -582179 -567961 -581083 -555701 -605715 -603501 -607442 -580240 -606339 -545557 -581774 -579710 -594838
10901 -594838 -574264 -578282 -566739 -533648 -598135 -580635 -613796 -593923 -618321 -569415 -548661 -578141
10889 -578141 -537475 -580221 -564801 -600904 -548906 -542794 -570264 -536053 -522061 -587644 -531899 -558181
$$ packed form
10972f23865J6344J996k114J5487k7866M3607o7305L3178L0691n3184P3893k9155
10960e88293J841J7894o1662N4212O22J5443k7137o3266O3384j2093R496J3596
10948e75963M3052q8481M065K4656k4773M8626M578m2229l0547M0448M1184j8770
10936e74154l2668P8530k1622m1609N2896n7746l0956N8118K1725k7840l6436
10925f11762L6743r348m4792l3605Q9453j4415K9052k3514k1521K2277M9460n0207
10913e82179J4218j3122K5382n0014K214l941K7202k6099O0782l6217K064j5128
10901e94838K0574m018J1543L3091o4487J7500l3161J9873k4398M8906K0754k9480
10889e78141M0666m2746J5420l6103N1998O112k7470L4211J3992o5583N5745k6282
$$ plain form
10877 -558181 -596077 -557439 -590273 -606788 -595370 -594369 -614899 -555872 -608411 -541924 -614316 -587291
10865 -587291 -526102 -610230 -573256 -576135 -525737 -532603 -529765 -575751 -615508 -583964 -604333 -552622
10853 -552622 -647608 -510861 -574868 -533692 -508370 -559010 -573118 -549189 -580196 -533826 -559258
10842 -559258 -616494 -612188 -600343 -551403 -537708 -559008 -568553 -564268 -609835 -562695 -574749 -603763
10830 -603763 -585736 -608429 -544885 -569500 -604070 -589418 -604326 -587813 -538122 -548288 -534499
10819 -534499 -584076 -546660 -467976 -463176 -508792 -506082 -521933 -543071 -555728 -596262 -525650 -571177
10807 -571177 -560219 -570527 -562034 -599464 -664044 -542957 -512771 -531088 -533416 -555670 -555848 -578148
10795 -578148 -499570 -545791 -540450 -628649 -533098 -551985 -563764 -590805 -533475 -543698 -543099 -564096
$$ packed form
10877e58181l7896L8638l2834j6515J1418J001k0530N9027n2539O6487p2392K7025
10865e87291O1189q4128L6974k879N0398o866K838m5986l9757L1544k0369N1711
10853e52622r4986J36747o4007M1176K5322n0640j4108K3929l1007M6370k5432
10842e59258n7236M306J1845M8940J3695k1300r545M285m5567M7140j2054k9014
10830f03763J8027k2693O3544k4615l4570J4652j4908J6513M9691j0166J3789
10819e34499m9577L7416P8684M800m5616K710j5851k1138j2657m0534P0612m5527
10807e71177J0958j0308Q493l7430o4580J21087L0186j8317k328k2254j78k2300
10795e78148P8578m6221N341q8199R5551j8887j1779k7041N7330j0223N99k0997
$$ plain form
10783 -564096 -524426 -585945 -515270 -545619 -607409 -545958 -592477 -517237 -569359 -482724 -506262
10772 -506262 -506408 -506577 -532176 -561668 -602428 -549882 -558698 -595919 -498340 -547124 -530495 -547836
10760 -547836 -502218 -527555 -555084 -562592 -540368 -559867 -557496 -473061 -502614 -507055 -558451 -446661
10748 -446661 -545962 -448856 -551959 -523193 -634274 -573869 -528054 -508695 -433448 -551220 -504758
10737 -504758 -497792 -548101 -532894 -511336 -555683 -524943 -534763 -512822 -545913 -550191 -494243 -513382
10725 -513382 -535788 -569116 -509360 -513252 -553880 -522442 -563532 -534836 -544567 -514082 -457268 -608537
10713 -608537 -574998 -536840 -466551 -497619 -508370 -547976 -555324 -521325 -558338 -568051 -508788 -514287
10701 -514287 -459897 -536342 -535793 -511448 -530188 -490232 -498860 -544009 -508097 -467347 -577697 -547521
$$ packed form
10783e64096L9670o1519P0675l0349o1790O1451m6519P5240n2122Q6635k3538
10772e06262j46j69k5599k9492m0760N2546q816l7221R7579m8784J6629j7341
10760e47836M5618k5337k7529p508K2224j9499K371Q4435k9553m441n1396J11790
10748d46661r9301R7106j03103K8766j11081O0405M5815J9359P5247j17772M6462
10737e04758O966n0309J5207K1558m4347L0740r820K1941l3091m278N5948j9139
10725e13382k2406l3328N9756l892m0628L1438m1090K8696r731L0485N6814j51269
10713f08537L3539L8158P0289l1068j0751l9606p348L3999l7013r713N9263n499
10701e14287N4390p6445N49K4345j8740L9956q628m5149L5912M0750j10350L0176
$$ plain form
10689 -547521 -572982 -534030 -507229 -490064 -527983 -543065 -529675 -483340 -566712 -512379 -579240
10678 -579240 -499735 -556269 -508492 -463846 -533249 -551742 -515801 -487355 -516431 -518988 -485117 -506335
10666 -506335 -492256 -514069 -427388 -474659 -524539 -552165 -527152 -498156 -531387 -531036 -507397 -477035
10654 -477035 -485427 -536322 -507430 -575304 -492813 -540381 -476546 -562991 -542141 -551731 -527548 -529596
10642 -529596 -537725 -569321 -558815 -510613 -481020 -542865 -568290 -474742 -492805 -463629 -542186 -431315
10630 -431315 -521259 -487773 -493504 -541087 -492165 -528971 -538672 -508972 -487300 -434655 -498740 -469531
10618 -469531 -546504 -508482 -432462 -572770 -502899 -470360 -482074 -494707 -543172 -439023 -542243
10607 -542243 -490652 -428487 -458230 -493849 -495815 -487949 -560685 -482189 -508348 -506919 -477543 -528800
$$ packed form
10689e47521k5461L8952K6801J7165l7919j5082J3390M6335q3372N4333o6861
10678e79240P9505n6534M7777M4646o9403j8493L5941K8446k9076k557L3871k1218
10666e06335J4079k1813Q6681m7271m9880k7626K5013K8996l3231L51K3639L0362
10654d77035q392n0895K8892o7874Q2491m7568O3835q6445K0850r590K4183k048
10642e29596q129l1596J0506M8202K9593o1845k5425R3548j8063K9176p8557J10871
10630d31315q9944L3486n731m7583M8922l6806r701K9700K1672N2645o4085K9209
10618d69531p6973L8022P6020j40308O9871L2539j1714j2633m8465J04149j03220
10607e42243N1591O2165k9743l5619j966P866p2736P8496k6159J429K9376n1257
$$ plain form
10595 -528800 -515754 -508190 -538155 -475558 -503896 -460071 -466893 -509179 -488440 -510446 -458570 -399836
10583 -399836 -430824 -456836 -441275 -502088 -487764 -452628 -429012 -494781 -435056 -449505 -443578 -455580
10571 -455580 -493841 -480630 -430344 -404435 -431124 -431895 -420811 -401564 -485186 -390853 -376589 -491804
10559 -491804 -469917 -400572 -457091 -455563 -428416 -480965 -452165 -432111 -458947 -440479 -463734 -467609
10547 -467609 -413612 -479955 -461381 -485184 -468081 -423010 -432174 -406098 -400397 -420319 -477320 -507687
10535 -507687 -513299 -434215 -442790 -492516 -489767 -452224 -466410 -484090 -499502 -488282 -468707 -485582
10523 -485582 -452794 -482634 -486639 -507291 -468634 -478017 -490206 -520765 -553026 -486911 -473787 -488076
10511 -488076 -481402 -424470 -460220 -478254 -480859 -443658 -457237 -512462 -437485 -509305 -415911 -477384
$$ packed form
10595e28800J3046P564k9965O2597k8338M3825o822m2286K0739k2006N1876N8734
10583c99836l0988k6012J5561o0813J4324L5136K3616o5769N9725j4449N927j2002
10571d55580l8261J3211N0286K5909k6689p71J1084J9247q3622R4333J4264j15215
10559d91804K1887O9345n6519J528K7147n2549K8800K0054k6836J8468k3255l875
10547d67609N3997o6343J8574k3803J7103M5071r164K6076N701j9922n7001l0367
10535e07687n612P9084q575m9726K749L7543j4186j7680j5412J1220J9575j6875
10523d85582L2788k9840m005k0652L8657r383j2189l0559l2261O6115J3124j4289
10511d88076O674N6932l5750j8034k605L7201j3579n5225P4977p1820R3394o1473
$$ plain form
10499 -477384 -478277 -458118 -524604 -489407 -512542 -527592 -531029 -476179 -506412 -459996 -461623 -477827
10487 -477827 -467964 -435188 -436758 -498630 -450265 -471534 -500192 -484044 -522492 -449493 -465014 -490742
10475 -490742 -445663 -495368 -525619 -455996 -467554 -482660 -460801 -462208 -482881 -499678 -490675 -495598
10463 -495598 -426856 -507756 -433646 -457721 -450989 -534378 -460570 -453757 -392265 -458669 -506431 -451536
10451 -451536 -504588 -509086 -426149 -480322 -481475 -504034 -476848 -499817 -461803 -453802 -471455 -476040
10439 -476040 -430025 -548279 -443602 -454095 -412630 -419036 -432034 -451630 -498468 -413313 -487683
10428 -487683 -437177 -491515 -467462 -410628 -433798 -467190 -431173 -456035 -416191 -419264 -463209 -486062
10416 -486062 -400167 -411033 -472450 -428908 -489297 -426868 -476777 -402637 -398307 -466877 -441586 -388494
$$ packed form
10499d77384q93K0159o6486L5197k3135j5050l437N4850l0233M6416j627j6204
10487d77827R863L2776j570o1872M8365k1269k8658J6148l8448P2999j5521k5728
10475d90742M5079m9705l0251O9623j1558j5106K1859j407k0673j6797R003m923
10463d95598O8742q0900P4110k4075O732q3389P3808O813O1492o6404m7762N4895
10451d51536n3052m498Q2937n4173j153k2559K7186k2969L8014Q001j7653m585
10439d76040M6015j18254J04677j0493M1465o406j2998j9596m6838Q5155p4370
10428d87683N0506n4338K4053N6834k3170l3392L6017k4862L9844l073m3945k2853
10416d86062Q5895j0866o1417M3542o0389O2429m9909P4140M330o8570K5291N3092
$$ plain form
10404 -388494 -421301 -404192 -376964 -457093 -399890 -369081 -413735 -400306 -422155 -479728 -437152
10393 -437152 -384944 -416098 -398776 -423513 -408213 -415861 -435773 -396908 -431670 -439985 -466015 -398714
10381 -398714 -413323 -354319 -442955 -517577 -436726 -505288 -437146 -406278 -449763 -459753 -429317 -435159
10369 -435159 -363207 -411125 -438858 -395346 -407884 -424232 -493638 -447523 -407657 -425690 -485415
10358 -485415 -463864 -428347 -377365 -403095 -439458 -420524 -385735 -496990 -417409 -389703 -429685
10347 -429685 -422893 -377103 -444472 -420801 -441239 -439564 -410110 -371074 -433467 -383696 -437838 -424175
10335 -424175 -430934 -441295 -399807 -414243 -386385 -482100 -390575 -387016 -407940 -393711 -403936 -413255
10323 -413255 -437732 -405829 -471391 -382277 -412185 -476164 -398000 -420303 -379719 -418621 -420915 -432943
$$ packed form
10404c88494l2807J7109K7228q0129N7203L0809m4654J3429k1849n7573M2576
10393d37152N2208l1154J7322k4737J5300p648j9912L8865l4762q315k6030O7301
10381c98714j4609N9004q8636p4622Q0851o8562O8142L0868m3485r990L0436n842
10369d35159P1952m7918k7733M3512j2538j6348o9406M6115L9866j8033n9725
10358d85415K1551L5517N0982k5730l6363J8934L4789j11255P9581K7706l9982
10347d29685O792M5790o7369K3671k0438J675K9454L9036o2393M9771n4142J3663
10335d24175o759j0361M1488j4436K7858r5715R1525L559k0924J4229j0225r319
10323d13255k4477L1903o5562Q9114k9908o3979P8164k2303M0584l8902k294j2028
$$ plain form
10311 -432943 -422221 -403613 -398962 -457693 -416693 -410782 -447411 -412707 -389327 -382909 -305041 -300349
10299 -300349 -331258 -373012 -399568 -339649 -349864 -316218 -398594 -310555 -413323 -366343 -409548
10288 -409548 -422673 -363332 -354646 -318512 -398632 -392776 -397450 -330581 -395594 -327909 -389895 -351430
10276 -351430 -378925 -288950 -315969 -351984 -336927 -326167 -330869 -365174 -445867 -364316 -361836 -363061
10264 -363061 -414771 -339316 -416345 -455300 -348131 -367985 -325749 -403384 -344336 -401537 -404061
10253 -404061 -348727 -362771 -391902 -401691 -398558 -395166 -419758 -364898 -392075 -377064 -386848 -403707
10241 -403707 -366530 -350611 -325756 -390528 -393248 -369868 -361704 -358675 -381054 -354719 -377335 -395960
10229 -395960 -417654 -360784 -358076 -340573 -322823 -422967 -343075 -296565 -291031 -401460 -333900
$$ packed form
10311d32943J0722J8608M651n8731M1000N911l6629L4704K3380O418P7868M692
10299c00349l0909m1754k6556N9919j0215L3646q2376Q8039j02768M6980m3205
10288d09548j3125N9341Q686L6134q0120N856m674O6869o5013O7685o1986L8465
10276c51430k7495Q9975k7019l6015J5057J0760m702l4305q0693Q1551K480j225
10264c63061n1710P5455p7029l8955J07169j9854M2236p7635N9048n7201k524
10253d04061N5334j4044k9131r789L133L392k4592N4860k7177J5011r784j6859
10241d03707L7177J5919K4855o4772k720K3380Q164L029k2379K6335k2616j8625
10229c95960k1694N6870K708J7503J7750j00144P9892M6510N534j10429O7560
$$ plain form
10218 -333900 -364747 -352031 -295380 -361481 -314099 -404403 -363027 -414157 -343002 -356636 -357857 -380061
10206 -380061 -329904 -408540 -308370 -348090 -307888 -342190 -323628 -345177 -380173 -369351 -313430
10195 -313430 -337292 -373679 -343433 -315309 -338113 -409953 -381655 -384733 -393509 -448486 -345343 -325450
10183 -325450 -352195 -349886 -376013 -351193 -349853 -347515 -387419 -335429 -377789 -320505 -391489 -376349
10171 -376349 -342118 -417366 -341808 -324220 -378311 -315275 -353315 -397110 -376892 -345395 -359945
10160 -359945 -331112 -297689 -336370 -355397 -319232 -314838 -381022 -424488 -393165 -283730 -362941
10149 -362941 -330647 -322770 -263973 -371560 -337179 -363441 -346049 -350072 -327616 -322792 -340422 -342642
10137 -342642 -420614 -275128 -355957 -359880 -302550 -331830 -309337 -326053 -312873 -344132 -328987
$$ packed form
10218c33900l0847J2716N6651o6101M7382r0304M1376n1130P1155j3634j221k2204
10206c80061N0157p8636J00170l9720M0202l4302J8562k1549l4996J0822N5921
10195c13430k3862l6387L0246K8124k2804p1840K8298l078q776n4977J03143J9893
10183c25450k6745K309k6127K4820J340K338l9904N1990m2360N7284p0984J5140
10171c76349L4231p5248P5558J7588n4091O3036l8040m3795K0218L1497j4550
10160c59945K8833L3423l8681j9027L6165M394o6184m3466L1323J09435p9211
10149c62941L2294P877N8797j07587L4381k6262J7392m023K2456M824j7630k220
10137c42642p7972J45486q0829l923N7330k9280K2493j6716J3180l1259J5145
$$ plain form
10126 -328987 -311984 -241894 -385460 -350774 -339116 -329013 -304174 -309804 -371924 -312574 -333428
10115 -333428 -329683 -324262 -270998 -333522 -341837 -302073 -354820 -381175 -338247 -265850 -251867 -334227
10103 -334227 -251243 -335709 -337756 -277929 -270620 -360180 -305661 -352985 -304396 -303338 -267024 -301620
10091 -301620 -252618 -253058 -293373 -316793 -267756 -305402 -290706 -283096 -370884 -282804 -309394 -305152
10079 -305152 -314071 -380835 -333504 -279837 -240437 -253352 -297943 -243639 -255046 -209147 -244688 -314587
10067 -314587 -305035 -256661 -246679 -314807 -269020 -271311 -312012 -333345 -251494 -292834 -321383 -308020
10055 -308020 -283312 -286513 -269607 -284597 -271682 -235637 -261795 -264590 -271820 -218356 -290235 -231133
10043 -231133 -255231 -251389 -311723 -295560 -296335 -299226 -295961 -257513 -288743 -296951 -279123 -216561 -193649
$$ packed form
10126c28987J7003P0090j43566L4686J1658J0103K4839n630o2120N9350k0854
10115c33428L745N421N3264o2524q315L9764n2747k6355M2928P2397J3983q2360
10103c34227Q2984q4466k047N9827P309q9560N4519m7324M8589J058L6314l4596
10091c01620M9002m40m0315k3420M9037l7646J4696P610q7788Q8080k6590M242
10079c05152q919o6764M7331N3667L9400j2915m4591N4304j1407M5899l5541o9899
10067c14587R552M8374R982o8128M5787k291m0701k1333Q1851m1340k8549J3363
10055c08020K4708l201J6906j4990J2915L6045k6158k795p230N3464p1879N9102
10043b31133k4098L842o0334J6163p75k891L265L8448l1230q208J7828O2562K2912
$$ plain form
10030 -193649 -253972 -229055 -306101 -220102 -241494 -228497 -200393 -206629 -230738 -205194 -181083 -223336
10018 -223336 -200029 -212909 -210205 -193067 -248202 -252674 -188652 -153403 -207343 -200049 -283149 -258117
10006 -258117 -164711 -248714 -193386 -227039 -269613 -262479 -244514 -176077 -198152 -205742 -237183 -189109
9994 -189109 -283165 -194870 -208998 -187839 -194134 -208939 -221273 -202767 -207925 -228940 -278177 -285466
9982 -285466 -255652 -194935 -175530 -221407 -221424 -205021 -214645 -138352 -264172 -266830 -190777 -145554
9970 -145554 -203369 -218477 -258142 -194460 -208647 -267982 -192361 -233639 -182629 -273713 -227931 -174087
9958 -174087 -316297 -220140 -209605 -186631 -182471 -239247 -199406 -229269 -256789 -166411 -217157 -246901
9946 -246901 -262797 -210411 -254321 -249018 -229028 -224028 -190130 -182216 -230350 -234370 -177274 -197767
$$ packed form
10030a93649o0323K4917p7046Q5999k1392J2997K8104o236k4109K5544K4111m2253
10018b23336K3307j2880K704J7138n5135m472O4022L5249n3940P294q3100K5032
10006b58117R3406q4003N5328l3653m2574P134J7965O8437k2075p590l1441M8074
9994a89109r4056Q8295j4128K1159o295j4805j2334J8506n158k1015m9237p289
9982b85466K9814O0717J9405m5877j7J6403r624P6293j25820k658P6053M5223
9970a45554n7815j5108l9665O3682j4187n9335P5621m1278N1010r1084M5782N3844
9958a74087j42210R6157J0535K2974M160n6776L9841k9863k7520R0378n0746k9744
9946b46901j5896N2386m3910N303J9990N000L3898P914m8134m020N7096k0493
$$ plain form
9934 -197767 -196939 -173530 -212905 -144066 -232046 -184208 -231703 -182300 -169812 -175562 -170215 -227639
9922 -227639 -178052 -169753 -171264 -143699 -200790 -165994 -259715 -135289 -172879 -120665 -142223 -148116
9910 -148116 -142160 -170857 -109594 -117643 -145879 -125390 -153588 -162227 -118623 -195050 -185227 -155258
9898 -155258 -145612 -91304 -191480 -132576 -119674 -156411 -119785 -148766 -74310 -168440 -121519 -141050
9886 -141050 -133993 -128897 -78430 -100218 -168300 -138525 -98644 -170147 -98831 -167142 -93816 -82545
9874 -82545 -130913 -118529 -148981 -167001 -110094 -158401 -101829 -100274 -124787 -63078 -140774 -141378
9862 -141378 -147029 -102177 -131010 -110572 -111944 -91206 -106320 -51275 -135167 -92892 -74662 -165742
9850 -165742 -129207 -145552 -145088 -143238 -145537 -119793 -173862 -85120 -106573 -138073 -108689 -121177
$$ packed form
9934a97767Q28K3409l9375O8839q7980M7838m7495M9403J2488n750N347n7424
9922b27639M9587Q299j511K7565n7091L4796r3721J24426l7590N2214k1558n893
9910a48116N956k8697O1263q049k8236K0489k8198q639M3604p6427R823K9969
9898a55258R646N4308j00176N8904J2902l6737L6626k8981P4456r4130M6921j9531
9886a41050P057N096N0467k1788o8082K9775L9881p1503P1316o8311P3326J1271
9874h2545m8368J2384l0452j8020N6907m8307N6572J555k4513O1709p7696o04
9862a41378n651M4852k8833K0438j372K0738j5114N5045q3892M2275J8230r1080
9850a65742L6535j6345M64J850k299K5744n4069Q8742k1453l1500K9384j2488
$$ plain form
9838 -121177 -77160 -47252 -84732 -85574 -112992 -33799 -62541 -65335 -76540 -98049 -45471 -51834
9826 -51834 -80807 -77592 -99521 -19435 -156041 25691 -58177 -14838 -47189 -40121 -87101 -35172
9814 -35172 -32652 -59177 -64450 3814 -31511 7190 -23853 -12027 -60935 -21286 34530 -36088
9802 -36088 20715 -33390 -8156 -14585 -38801 -6399 -13084 -6078 8333 39205 53895 50371 -808
9789 -808 1842 -24647 18846 -1762 928 17995 60449 22818 1216 28535 37302 36096 54493
9776 54493 42897 25032 120264 79752 92301 41564 81736 54280 62375 49640 48222 54097
9764 54097 112282 33496 73706 71015 110200 188301 145843 184988 160746 193613 206925 146534
9752 146534 167502 261155 200777 152283 163383 117687 110307 110023 147557 72578 175772 109840
$$ packed form
9838a21177M4017K9908l7480q42k7418P9193k8742k794j1205k1509N2578o363
9826e1834k8973L215k1929Q0086j36606J81732q3868M3339l2351P068m6980N1929
9814c5172K520k6525n273O8264l5325L8701l1043J1826m8908L9649N5816p0618
9802c6088N6803n4105K5234o429k4216L2402o685P006J4411L0872J4690l524n1179
9789h08K650k6489M3493k0608K690J7067M2454l7631k1602K7319Q767j206J8397
9776E4493j1596j7865R5232m0512J2549n0737M0172k7456Q095j2735j418N875
9764E4097N8185p8786M0210k691L9185P8101m2458L9145k4242L2867J3312o0391
9752A46534K0968R3653o0378m8494J1100m5696p380k84L7534p4979J03194o5932
$$ plain form
9740 109840 140723 139091 159026 184377 196443 203421 90947 128449 198235 193732 153874 228126
9728 228126 261037 267195 190193 263968 243917 259950 269263 312390 305502 213690 221210 173767
9716 173767 214415 179786 170971 98292 144155 124885 79647 98695 172645 120755 177032 119746
9704 119746 44059 122174 135121 120813 98374 108118 80017 122254 82626 162008 88028 112036
9692 112036 35806 120504 136795 78438 99443 57744 168482 111384 73222 131863 53708
9681 53708 135655 124363 130601 155793 93050 190875 141536 138290 138859 160897 139654 189994 134079
9668 134079 114620 176403 183391 80781 148142 135549 144241 116476 108243 125201 173687 147926
9656 147926 143129 201176 233255 183999 183304 157666 198191 140819 186651 166736 181373 131663
$$ packed form
9740A09840L0883j632J9935K5351J2066O978j12474L7502O9786m503l9858P4252
9728B28126L2911O158p7002P3775k0051J6033R313M3127o888r1812P520m7443
9716A73767M0648l4629q815p2679M5863j9270m5238J9048P3950n1890N6277n7286
9704A19746p5687P8115J2947j4308k2439R744k8101M2237l9628P9382p3980K4008
9692A12036p6230Q4698J6291n8357K1005m1699J10738n7098l8162N8641p8155
9681E3708Q1947j1292O238K5192o2743R7825m9339l246N69K2038k1243N0340n5915
9668A34079j9459O1783O988j02610O7361j2593Q692k7765q233J6958M8486k5761
9656A47926m797N8047L2079m9256o95k5638M0525n7372M5832j9915J4637m9710
$$ plain form
9644 131663 208941 207321 233103 223664 256521 231869 269235 265932 191811 257081 222596 257707
9632 257707 228371 259945 306472 301435 331679 205667 250462 286943 235502 284953 260641 328313
9620 328313 280839 356330 304586 335844 336613 337646 371841 275065 360528 379796 385629 349126
9608 349126 402005 372773 452501 450864 446766 518733 428282 445259 471587 505772 436497 518811
9596 518811 479400 464414 536138 501422 506291 503858 538059 508757 523179 537308 523924 555085
9584 555085 589877 640947 653031 571229 594500 617087 585428 661875 608528 675163 670143 668519
9572 668519 716122 707076 621950 746698 731652 696919 725749 782212 780299 761092 711659 724544
9560 724544 689908 729885 773868 763523 774369 793890 797100 791966 810929 791470 795534 885328
$$ packed form
9644A31663P7278j620K5782r439L2857k4652L7366l303p4121O5270l4485L5111
9632B57707k9336L1574M6527n037L0244j26012M4795L6481n1441M9451k4312O7672
9620C28313m7474P5491n1744L1258P69J033L4195r6776Q5463J9268N833l6503
9608C49126N2879k9232P9728j637m098P1967r0451J6977K6328L4185o9275Q2314
9596E18811l9411j4986P1724l4716M869k433L4201k9302J4422J4129j3384L1161
9584E55085L4792N1070J2084q1802K3271K2587l1659P6447n3347O6635n020j624
9572F68519M7603r046q5126J24748j5046l4733K8830N6463j913j9207m9433J2885
9560G24544l4636L9977M3983j0345J0846J9521L210n134J8963j9459M064Q9794
$$ plain form
9548 885328 824944 796597 888166 945120 976853 943760 974498 971219 995791 1067462 1069654 1019091
9536 1019091 1063172 1104921 1094254 1125441 1143471 1194526 1207544 1225592 1204790 1261244 1269505 1325961
9524 1325961 1304722 1351262 1357676 1355011 1375413 1416273 1415165 1456200 1513557 1506489 1563532 1527565
9512 1527565 1570884 1545942 1626398 1660620 1671750 1803496 1793152 1876378 1903231 1992795 1951716
9501 1951716 2016965 2123909 2016476 2054965 2129934 2189505 2082795 2178331 2244851 2324521 2267002
9490 2267002 2316042 2345818 2368528 2451447 2420233 2440911 2507514 2558788 2538105 2581674 2648661
9479 2648661 2592161 2657466 2764585 2792603 2815147 2880531 2943499 3041567 2975378 3063652 3084449
9468 3084449 2994425 3055176 3045067 3109202 3093842 3077562 3067155 3033573 3110658 3082829 3095148
$$ packed form
9548H85328o0384k8347R1569N6954L1733l3093L0738l279K4572P1671K192n0563
9536A019091M4081M1749j0667L1187J8030N1055J3018J8048k0802N6454Q261N6456
9524A325961k1239M6540O414k665K0402M0860j108M1035N7357p068N7043l5967
9512A527565M3319k4942Q0456L4222J1130J31746j0344Q3226K6853Q9564m1079
9501A951716O5249J06944j07433L8489P4969N9571j06710R5536O6520P9670n7519
9490B267002M9040K9776K2710Q2919l1214K0678O6603N1274k0683M3569O6987
9479B648661n6500O5305J07119K8018K2544O5384O2968R8068o6189Q8274K0797
9468C084449r0024O0751j0109O4135j5360j6280j0407l3582P7085k7829J2319
$$ plain form
9457 3095148 3197515 3162349 3247419 3236478 3261296 3287398 3322021 3458381 3414264 3445188 3519337
9446 3519337 3468712 3546915 3490485 3584381 3576366 3585188 3602658 3622345 3673523 3624172 3673711 3668410
9434 3668410 3626383 3762888 3719337 3752739 3793620 3733230 3783198 3776742 3845286 3806704 3836659
9423 3836659 3871953 3850002 3862400 3915753 3970446 3965152 3942108 3998894 4074452 4102874 4108251 4072117
9411 4072117 4042402 4071716 4121696 4107582 4149788 4134182 4100670 4160843 4177092 4246989 4220093
9400 4220093 4192894 4210705 4340694 4301042 4395275 4482228 4412379 4483603 4484667 4496338 4554286
9389 4554286 4590567 4595105 4645106 4627660 4646849 4688446 4719147 4754816 4744922 4767366 4776364 4824875
9377 4824875 4835296 4879829 5000731 5026927 5015854 5122018 5146402 5205964 5251740 5290167 5332494
$$ packed form
9457C095148J02367l5166Q5070j0941K4818K6102L4623J36360m4117L0924P4149
9446C519337n0625P8203n6430R3896q015Q822J7470J9687N1178m9351M9539n301
9434C668410m2027J36505m3551L3402M0881o0390M9968o456O8544l8582K9955
9423C836659L5294k1951J2398N3353N4693n294k3044N6786P5558K8422N377l6134
9411D072117k9715K9314M9980j4114M2206j5606l3512O0173J6249O9897k6896
9400D220093k7199J7811J29989l9652R4233Q6953o9849P1224J064J1671N7948
9389D554286L6281M538N0001j7446J9189M1597L0701L5669r894K2444Q998M8511
9377D824875J0421M4533J20902K6196j1073J06164K4384N9562M5776L8427M2327
$$ plain form
9366 5332494 5393010 5407200 5434259 5517646 5549952 5630348 5676433 5760665 5747880 5905087 5955643
9355 5955643 5985729 6073409 6074119 6195742 6307265 6301396 6466022 6538588 6622863 6674717 6719485
9344 6719485 6783395 6887295 7044530 7155772 7091614 7271351 7386444 7415733 7557619 7666456
9334 7666456 7778812 7818575 7954130 8067497 8128807 8254326 8343720 8543442 8629656 8734569
9324 8734569 8798857 8938310 9044984 9276318 9324873 9431866 9651147 9822759 9971952 10071080
9314 10071080 10351060 10505058 10623245 10827250 11048944 11252178 11498814 11675193 11885846
9305 11885846 12221269 12448043 12622505 12925587 13116029 13307322 13459497 13640598 13823072
9296 13823072 14026273 14351129 14519240 14739571 15010519 15236089 15389880 15639881 15749681
$$ packed form
9366E332494O0516J4190K7059Q3387L2306Q0396M6085Q4232j2785J57207N0556
9355E955643L0086Q7680P10J21623J11523n869J64626P2566Q4275N1854M4768
9344F719485O3910J03900J57235J11242o4158J79737J15093K9289J41886J08837
9334G666456J12356L9763J35555J13367O1310J25519Q9394J99722Q6214J04913
9324H734569O4288J39453J06674K31334M8555J06993K19281J71612J49193R9128
9314A0071080K79980J53998J18187K04005K21694K03234K46636J76379K10653
9305A1885846L35423K26774J74462L03082J90442J91293J52175J81101J82474
9296A3823072K03201L24856J68111K20331K70948K25570J53791K50001J09800
$$ plain form
9287 15749681 16026062 16220343 16426588 16709670 16950028 17272266 17506538 17848335 18116787
9278 18116787 18445171 18812531 19136317 19575866 19979346 20368329 20705314 21051143 21413312
9269 21413312 21687277 21992387 22285575 22601633 22978183 23267442 23539507 23866365 24213478
9260 24213478 24369762 24772915 25151356 25712187 26174689 26725932 27297890 27881324 28536718
9251 28536718 29158312 29876003 30504850 31242320 31930690 32622449 33256483 33958116 34705689
9242 34705689 35444907 36213560 37034447 37778085 38615771 39539311 40384068 41271690 42236301
9233 42236301 43283502 44348458 45492633 46756994 48156780 49684442 51332841 52982251
9225 52982251 54660742 56383074 57995472 59539710 61261567 63030778 64858354 66762229
$$ packed form
9287A5749681K76381J94281K06245K83082K40358L22238K34272L41797K68452
9278A8116787L28384L67360L23786M39549M03480L88983L36985L45829L62169
9269B1413312K73965L05110K93188L16058L76550K89259K72065L26858L47113
9260B4213478J56284M03153L78441N60831M62502N51243N71958N83434O55394
9251B8536718O21594P17691O28847P37470O88370O91759O34034P01633P47573
9242C4705689P39218P68653Q20887P43638Q37686R23540Q44757Q87622R64611
9233D2236301J047201J064956J144175J264361J399786J527662J648399J649410
9225E2982251J678491J722332J612398J544238J721857J769211J827576J903875
$$ plain form
9217 66762229 68615634 70407677 72013054 73402200 74800980 76149710 77552499 78999194
9209 78999194 80611194 82421701 84382857 86445127 88823052 91428889 94212791 97510722
9201 97510722 101224829 105330318 109917181 114942308 120471295 126394668 132845733 139742973
9193 139742973 147079676 154750683 162817602 171123171 179406358 187754508 195953492 203951680
9185 203951680 211466583 218906861 226476128 234374467 243129461 253000404 263055008 271633137
9177 271633137 276274365 275611640 270513750 263581765 257290154 252859549 250511880 250047954
9169 250047954 250616530 251494641 252078195 252154717 252128347 252330917 252719972 253367153 254919059
9160 254919059 257442021 261112230 265797507 271566376 278176613 285652253 294126607 303174516
$$ packed form
9217F6762229J853405J792043J605377J389146J398780J348730J402789J446695
9209G8999194J612000J810507J961156K062270K377925K605837K783902L297931
9201I7510722L714107M105489M586863N025127N528987N923373O451065O897240
9193A39742973P336703P671007Q066919Q305569Q283187Q348150Q198984P998188
9185B03951680P514903P440278P569267P898339Q754994R870943J0054604Q578129
9177B71633137M641228o62725n097890o931985o291611m430605k347669m63926
9169B50047954N68576Q78111N83554P6522k6370K02570L89055O47181J551906
9160B54919059K522962L670209M685277N768869O610237P475640Q474354R047909
$$ plain form
9152 303174516 311521149 317519833 320402586 319407294 315454574 310424922 305568841 301646693
9144 301646693 299225521 298201693 298878297 301430960 305972601 312072163 319052776 325748492
9136 325748492 330944532 333936754 334901342 334569964 333933135 333479148 332858132 331428075 328556533
9127 328556533 323871515 317656975 310267212 302262096 294053695 286760515 280890246 276973483
9119 276973483 275134606 275226598 276560427 278468804 280009189 280829605 280945265 280497761 279268046
9110 279268046 276976244 273948808 270031490 265680613 261481129 257540843 254025488 250994882
9102 250994882 248649732 246782573 244775649 242060041 237899620 232095049 224557377 215666127
9094 215666127 206145241 196404961 187242494 179042556 171946615 165840491 160138069 154256230
$$ packed form
9152C03174516Q346633N998684K882753r95292l952720n029652m856081l922148
9144C01646693k421172j023828O76604K552663M541641O099562O980613O695716
9136C25748492N196040K992222R64588l31378o36829m53987o21016j430057k871542
9127C28556533m685018o214540p389763q005116q208401p293180n870269l916763
9119B76973483j838877R1992J333829J908377J540385Q20416J15660m47504j229715
9110B79268046k291802l027436l917318m350877m199484l940286l515355l030606
9102B50994882k345150j867159k006924k715608m160421n804571p537672q891250
9094B15666127r520886r740280r162467q199938p095941o106124n702422n881839
$$ plain form
9086 154256230 148593072 143436395 138812211 134844864 131336575 128170349 125279438 122568175
9078 122568175 119937544 117404476 114990006 112834822 110723562 108611016 106374686 103908821
9070 103908821 101285439 98522452 95776202 93127864 90793028 88696763 86746578 85056053
9062 85056053 83534327 82406602 81613647 81037089 80634057 80127154 79469373 78405916 76923064
9053 76923064 75310472 73627401 72074812 70689282 69292436 67662240 65684308 63399148
9045 63399148 60920658 58397139 55943796 53765039 51725676 50004059 48308011 46828132
9037 46828132 45449314 44296457 43226516 42367823 41582362 40786852 40038967 39432058 38868367
9028 38868367 38381262 37935344 37521299 37002827 36223174 35379628 34341246 33299844 32324195
$$ packed form
9086A54256230n663158n156677m624184l967347l508289l166226k890911k711263
9078A22568175k630631k533068k414470k155184k111260k112546k236330k465865
9070A03908821k623382k762987k746250k648338k334836k096265j950185j690525
9062H5056053j521726j127725p92955n76558m03032n06903o57781j063457j482852
9053G6923064j612592j683071j552589j385530j396846j630196j977932k285160
9045F3399148k478490k523519k453343k178757k039363j721617j696048j479879
9037D6828132j378818j152857j069941q58693p85461p95510p47885o06909n63691
9028C8868367m87105m45918m14045n18472p79653q43546j038382j041402r75649
$$ plain form
9019 32324195 31324640 30224988 29040796 27786798 26469907 25054699 23880569 22800611
9011 22800611 21866251 21058185 20277112 19645273 18957273 18475114 17865956 17387802 16884857
9002 16884857 16444901 16036172 15663504 15324438 14914878 14571397 14213171 13879311 13532537
8993 13532537 13276691 13029695 12749774 12486551 12236322 11952620 11745789 11472964 11195030
8984 11195030 10936184 10753190 10502032 10304906 10075869 9853847 9781165 9535466 9410136 9227197
8974 9227197 9055943 8864221 8687663 8602589 8422917 8221801 8117780 8000804 7772733 7667957
8964 7667957 7567923 7496860 7279001 7182770 7119078 6992041 6854098 6755234 6636126 6522387
8954 6522387 6454979 6475103 6334081 6183860 6163645 6071770 5985514 5839844 5810114 5722508 5624346
$$ packed form
9019C2324195r99555j099652j184192j253998j316891j415208j174130j079958
9011B2800611r34360q08066p81073o31839o88000m82159o09158m78154n02945
9002A6884857m39956m08729l72668l39066m09560l43481l58226l33860l46774
8993A3532537k55846k46996k79921k63223k50229k83702k06831k72825k77934
8984A1195030k58846j82994k51158j97126k29037k22022p2682k45699j25330j82939
8974I227197j71254j91722j76558q5074j79672k01116j04021j16976k28071j04776
8964G667957j00034p1063k17859r6231o3692j27037j37943r8864j19108j13739
8954F522387o7408K0124j41022j50221k0215r1875q6256j45670k9730q7606r8162
$$ plain form
8943 5624346 5591174 5467298 5455356 5307314 5287527 5251594 5149422 5086761 5021240 4943984 4980630
8932 4980630 4868367 4782801 4679430 4681518 4577841 4520950 4486146 4421200 4368196 4330986 4238032
8921 4238032 4262582 4187078 4139999 4117800 4050584 4045221 4043930 3977972 3964918 3902266 3931764 3907163
8909 3907163 3829743 3825911 3753251 3741050 3690013 3685908 3630464 3658877 3565762 3542158 3645162 3542149
8897 3542149 3564198 3507630 3450980 3478391 3454698 3380828 3292203 3397816 3316479 3326837 3255331
8886 3255331 3291117 3373466 3297997 3258255 3321954 3292622 3352318 3305503 3430444 3487260 3453885
8875 3453885 3560596 3521367 3631096 3656033 3652775 3672590 3683186 3731654 3743000 3716213 3686548
8864 3686548 3682759 3669436 3656639 3681901 3715128 3623926 3587326 3607893 3560597 3498648 3547639 3506599
$$ packed form
8943E624346l3172j23876j1942j48042j9787l5933j02172o2661o5521p7256L6646
8932D980630j12263q5566j03371K088j03677n6891l4804o4946n3004l7210r2954
8921D238032K4550p5504m7079k2199o7216n363j291o5958j3054o2652K9498k4601
8909C907163p7420l832p2660j2201n1037m105n5444K8413r3115k3604J03004j03013
8897C542149K2049n6568n6650K7411k3693p3870q8625J05613q1337J0358p1506
8886C255331L5786Q2349p5469l9742O3699k9332N9696m6815J24941N6816l3375
8875C453885J06711l9229J09729K4937l258J9815J0596M8468J1346k6787k9665
8864C686548l789j3323j2797K5262L3227r1202l6600K0567m7296o1949M8991m1040
$$ plain form
8852 3506599 3473087 3506900 3491603 3548930 3500756 3451012 3507783 3492697 3507597 3423096 3446299
8841 3446299 3456283 3433706 3450411 3397162 3362853 3356840 3285438 3249051 3238899 3094780 3084280 3085545
8829 3085545 3050559 2934946 2936305 2853484 2799243 2815646 2745772 2771710 2707776 2669397 2637605
8818 2637605 2507270 2541570 2497576 2478303 2506336 2379120 2403281 2384012 2346410 2264966 2267519
8807 2267519 2251972 2267172 2232770 2200045 2189318 2173205 2268150 2169858 2131436 1984584 2142223
8796 2142223 2048245 2016593 1995872 2034799 1949656 1961207 1932177 1836779 1849560 1790912 1714093
8785 1714093 1792289 1755156 1693378 1655724 1592264 1618152 1618208 1465403 1553288 1468937 1461822 1399056
8773 1399056 1349219 1339241 1331538 1320090 1273990 1318835 1258311 1306903 1280686 1192722 1183971 1256279
$$ packed form
8852C506599l3512L3813j5297N7327m8174m9744N6771j5086J4900q4501K3203
8841C446299R984k2577J6705n3249l4309o013p1402l6387j0152j44119j0500J265
8829C085545l4986j15613J359q2821n4241J6403o9874K5938o3934l8379l1792
8818B637605j30335L4300m3994j9273K8033j27216K4161j9269l7602q1444K553
8807B267519j5547J5200l4402l2725j0727j6113R4945r8292l8422j46852J57639
8796B142223r3978l1652k0721L8927q5143J1551k9030r5398J2781n8648p6819
8785A714093P8196l7133o1778l7654o3460K5888N6j52805Q7885q4351p115o2766
8773A399056m9837r978p703j1448m6100M4845o0524M8592k6217q7964q751P2308
$$ plain form
8761 1256279 1153843 1149685 1167664 1083138 1090914 1021777 1053076 998627 1003387 937458 965886 953793
8749 953793 920336 839037 819662 817147 944924 807678 867874 812837 807994 843832 782584 900531
8737 900531 944911 878007 846357 833299 749411 687916 623453 634615 503557 544575 506204
8726 506204 491884 468957 449079 391675 415318 381461 393017 359903 420534 340294 288182 349952
8714 349952 295734 337625 285579 205776 269876 253033 288677 236819 185788 195646 180871 92815
8702 92815 141673 152669 167821 151208 132218 189632 90543 81761 125823 123525 46738 96439
8690 96439 104556 23403 93465 122525 76543 65305 39247 142682 37260 94092 95727 -6002
8678 -6002 6590 39481 72422 48540 53562 62644 41112 64950 63557 98342 911 -50541 45939
$$ packed form
8761A256279j02436m158J7979q4526P776o9137L1299n4449M760o5929K8428j2093
8749I53793l3457q1299j9375k515J27777j37246O0196n5037m843L5838o1248J17947
8737I00531M4380o6904l1650j3058q3888o1495o4463J1162j31058M1018l8371
8726E06204j4320k2927j9878n7404K3643l3857J1556l3114O0631q0240n2112O1770
8714C49952n4218M1891n2046p9803O4100j6843L5644n1858n1031R858j4775q8056
8702I2815M8858J0996J5152j6613j8990N7414r9089q782M4062k298p6787M9701
8690I6439Q117q1153P0062K9060m5982j1238k6058J03435j05422N6832J635j01729
8678f002J2592L2891L2941k3882N022R082k1532K3838j393L4785r7431n1452R6480
$$ plain form
8665 45939 -5338 -5182 3055 -37064 -22190 -15273 -7918 -51378 -25146 -64514 -44687 -97837 -198
8652 -198 -25336 -26319 -36913 32081 17405 17870 -63393 10712 -16789 -42648 -7800 35259 -6075
8639 -6075 -21142 -32122 16355 -47938 -109410 -63114 -89791 -92556 2808 -58888 -70697 -88838
8627 -88838 -47462 -94686 -25839 -77637 -72315 -50875 -84592 -32773 -66435 -47427 -103645 -74099
8615 -74099 -60893 -50767 -79577 -53840 -103813 -86061 -75244 -67833 -101829 -51229 -126382 -110645
8603 -110645 -92216 -88220 -164585 -121024 -83488 -129618 -99081 -95802 -105419 -107878 -106227 -51759 -75964
8590 -75964 -46216 -46638 -75450 -117567 -131414 -139408 -78542 -108060 -113303 -120721 -92725 -102898 -83820
8577 -83820 -83267 -142924 -97496 -59813 -173849 -102014 -160292 -164157 -11391 -132001 -151095 -138180
$$ packed form
8665D5939n1277J56Q237m0119J4874O917P355m3460K6232l9368J9827n3150R7639
8652a98k5138r83j0594O8994j4676M65q1263P4105k7501k5859L4848M3059m1334
8639f075j5067j0980M8477o4293o1472M6296k6677k765R5364o1696j1809j8141
8627h8838M1376m7224O8847n1798N322K1440l3717N1819l3662J9008n6218K9546
8615g4099J3206J0126k8810K5737m9973J7752J0817P411l3996N0600p5153J5737
8603a10645J8429L996p6365M3561L7536m6130L0537L279r617k459J651N4468k4205
8590g5964K9748m22k8812m2117j3847p994O0866k9518n243p418K7996j0173J9078
8577h3820N53n9657M5428L7683j14036P1835n8278l865J52766j20610j9094J2915
$$ plain form
8565 -138180 -103510 -82336 -86342 -103445 -135520 -113358 -132065 -85709 -127027 -123393 -116094 -71537
8553 -71537 -140679 -117127 -92269 -157218 -139076 -115810 -88204 -78498 -179359 -93744 -113798 -143086
8541 -143086 -142961 -161165 -178285 -148382 -98047 -113043 -167448 -153903 -130820 -138753 -184889 -215247
8529 -215247 41773 -123121 -197516 -129916 -101459 -113722 -130370 -101700 -191042 -105749 -52315
8518 -52315 -143409 -34778 -137725 -104964 -115283 -131447 -109226 -59963 -101365 -122096 -139907
8507 -139907 -57337 -68773 -83572 -163805 -65110 -79902 -95101 -57213 -71040 -131720 -22687
8496 -22687 -21750 -94219 -82396 -44879 -93587 -37591 -85925 -106989 -56493 -63315 -117173 -24658
8484 -24658 -101974 -102853 -43114 -104394 -69014 -25904 -58501 -84393 -56407 -75259 -22328 -27869
$$ packed form
8565a38180L4670K1174m006j7103l2075K2162j8707M6356m1318L634P299M4557
8553g1537o9142K3552K4858o4949J8142K3266K7606R706j00861Q5615k0054k9288
8541a43086J25j8204j7120K9903N0335j4996n4405J3545K3083p933m6136l0358
8529b15247K57020j64894p4395O7600K8457j2263j6648K8670q9342Q5293N3434
8518e2315r1094J08631j02947L2761j0319j6164K2221M9263m1402k0731j7811
8507a39907Q2570j1436j4799q0233R8695j4792j5199L7888j3827o0680J09033
8496b2687R37p2469J1823L7517m8708N5996m8334k1064N0496o822n3858R2515
8484b4658p7316q79N9739o1280L5380M3110l2597k5892K7986j8852N2931n541
$$ plain form
8472 -27869 -2191 -54589 9559 4665 -43797 31693 18047 13755 -65048 -61050 23700 11305
8460 11305 12975 51302 -12184 18928 18647 600 78294 91661 21232 29109 -77978 26621
8448 26621 40573 15597 -29042 -7285 44447 -12306 65175 37310 27639 36359 59132 58681 49403
8435 49403 1632 16943 29819 53919 58754 18865 49835 64448 -29875 26973 54278 82600
8423 82600 95921 23286 96506 105836 62027 87822 72237 87650 131022 142667 187708 122576
8411 122576 129277 161414 142677 122231 99252 174310 125085 120151 122897 109830 191493 97899
8399 97899 107410 118004 78113 137800 108699 122296 143917 117598 197066 160835 216551 189442
8387 189442 182440 185901 224348 201724 198251 138359 279147 226550 192783 205649 202877 180232
$$ packed form
8472b7869K5678n2398O4148m894m8462P5490j3646m292p8803L998Q4750j2395
8460A1305J670L8327o3486L1112k81j8047P7694J3367p0429P877j07087J04599
8448B6621J3952k4976m4639K1757N1732n6753P7481k7865r671Q720K2773m51r278
8435D9403m7771J5311J2876K4100M835l9889L0970J4613r4323N6848K7305K8322
8423H2600J3321p2635P3220R330m3809K5795j5585J5413M3372J1645M5041o5132
8411A22576O701L2137j8737k0446k2979P5058m9225m934K746j3067Q1663r3594
8399I7899R511J0594l9891N9687k9101J3597K1621k6319P9468l6231N5716k7109
8387A89442p002L461L8447k2624l473n9892J40788n2597l3767J2866k772k2645
$$ plain form
8375 180232 138002 177873 204259 230121 254886 225564 245419 281643 224166 242475 252180 218738
8363 218738 267545 240378 259980 334063 313662 323657 339708 337171 305852 349934 298409 305670
8351 305670 271344 332154 339466 347871 342818 314268 314346 368797 322622 300924 376956 466164 376124
8338 376124 359370 401649 378816 460312 362733 389493 446470 409993 467982 475411 420891 461266
8326 461266 505715 507832 521406 507705 537640 532904 486859 549204 540617 556131 458349 528773
8314 528773 505985 510111 522120 523135 537429 579706 533685 557925 629559 640455 652200 633567
8302 633567 666157 744743 720363 761138 712070 745346 743011 716668 713338 723133 712008 791098
8290 791098 755228 741967 737685 721846 815825 791718 863880 922968 892998 920687 897446 936143
$$ packed form
8375A80232m2230L9871K6386K5862K4765k9322J9855L6224n7477J8309R705l3442
8363B18738M8807k7167J9602P4083k0401R995J6051k537l1319M4082n1525P261
8351C05670l4326O0810P312Q405n053k8550P8N4451m6175k1698P6032Q9208r0040
8338C76124j6754M2279k2833Q1496r7579K6760N6977l6477N7989P429n4520M0375
8326D61266M4449K117J3574j3701K9935m736m6045O2345q587J5514r7782P0424
8314E28773k2788M126J2009J015J4294M2277m6021K4240P1634J0896J1745j8633
8302F33567L2590P8586k4380M0775m9068L3276k335k6343l330R795j1125P9090
8290G91098l5870j3261m282j5839R3979k4107P2162N9088k9970K7689k3241L8697
$$ plain form
8278 936143 1005357 969306 979490 974874 948726 1011250 966583 1052974 1055493 1056917 1063546 1085028
8266 1085028 1082725 1102477 1147648 1241318 1178537 1235870 1201030 1191972 1226956 1301990 1300324 1361924
8254 1361924 1378177 1333038 1353094 1408640 1397476 1452681 1407294 1501577 1521748 1620373 1629793 1691823
8242 1691823 1749988 1775901 1751074 1896256 1902586 1940940 1981887 2074904 2118913 2247807 2294898
8231 2294898 2420727 2546761 2678754 2850161 2984878 3217164 3327896 3507898 3513415 3442024
8221 3442024 3441593 3381559 3337001 3382294 3455954 3488783 3537764 3629440 3845801 4047612 4272188
8210 4272188 4598545 4886241 5309076 5460848 5615030 5615388 5348486 5073337 4822242 4657781
8200 4657781 4639143 4512823 4530380 4664969 4607547 4719660 4849520 5081950 5310126 5283719
$$ packed form
8278I36143O9214l6051J0184m616k6148O2524m4667Q6391K519J424O629K1482
8266A085028k303J9752M5171R3670o2781N7333l4840r058L4984P5034j666O1600
8254A361924J6253m5139K0056N5546j1164N5205m5387R4283K0171R8625R420O2030
8242A691823N8165K5913k4827J45182O330L8354M0947R3017M4009J28894M7091
8231B294898J25829J26034J31993J71407J34717K32286J10732J80002N517p1391
8221C442024m31o0034m4558M5293P3660L2829M8981R1676K16361K01811K24576
8210D272188L26357K87696M22835J51772J54182L58k66902k75149k51095j64461
8200D657781j8638j26320J7557J34589n7422J12113J29860K32430K28176k6407
$$ plain form
8190 5283719 5525361 5905860 6019023 6111533 6243140 6306468 6430758 6390044 6313388 6206711
8180 6206711 6159116 6024264 5877805 5882663 5961128 6061438 6175555 6482834 6631651 6996867
8170 6996867 7355576 7843855 8280185 8913914 9342377 9731300 9858604 9670247 9527574 9316226
8160 9316226 9279135 9244631 9280629 9364144 9379440 9294828 9238280 9171294 9227991 9359688 9528861
8149 9528861 9822700 10150403 10454458 10747759 11207843 11698774 12242775 12666126 12980069 13077242
8139 13077242 12941749 12699183 12233574 11553095 10986492 10500672 10184959 10064892 10001887 10092151
8129 10092151 10266929 10496921 10777031 11197003 11690591 12291582 12745204 13230843 13427479
8120 13427479 13515213 13421350 13244185 13043597 12844175 12638950 12351008 12204774 12046885 11934435
$$ packed form
8190E283719K41642L80499J13163R2510J31607O3328J24290m0714p6656j06677
8180F206711m7595j34852j46459M858P8465J00310J14117L07279J48817L65216
8170F996867L58709M88279M36330O33729M28463L88923J27304j88357j42673k11348
8160I316226l7091l4504L5998Q3515J5296q4612n6548o6986N6697J31697J69173
8149I528861K93839L27703L04055K93301M60084M90931N44001M23351L13943R7173
8139A3077242j35493k42566m65609o80479n66603m85820l15713j20067o3005R0264
8129A0092151J74778K29992K80110M19972M93588O00991M53622M85639J96636
8120A3427479Q7734r3863j77165k00588j99422k05225k87942j46234j57889j12450
$$ plain form
8110 11934435 12062432 12298575 12554475 13065197 13809792 14513558 15465651 16480584 17277511
8101 17277511 17842092 18077401 18054292 17960844 17662219 17175758 16579461 16001360 15531934 15050356
8091 15050356 14894685 14733604 14808266 15085010 15380007 15903084 16722997 17639788 18579909 19414266
8081 19414266 20130892 20294590 20052506 19493806 19068535 18693123 18479051 18283303 17973118
8072 17973118 17424507 16797753 16340028 15916518 15743663 15682647 15870422 16218428 16803041 17433696
8062 17433696 18072440 18690841 19203179 19552147 19703517 19653565 19492612 19198017 19027024 18551140
8052 18551140 18249123 17851061 17450136 17182659 17081220 17110532 17406343 17859547 18534498 19382910
8042 19382910 20132373 20969215 21568828 21791160 21980344 22368325 22784247 23245423 23457126
$$ packed form
8110A1934435J27997K36143K55900N10722P44595P03766R52093J014933P96927
8101A7277511N64581K35309k3109r3448k98625m86461n96297n78101m69426m81578
8091A5050356j55671j61081P4662K76744K94997N23077Q19913R16791R40121Q34357
8081A9414266P16626J63698k42084n58700m25271l75412k14072j95748l10185
8072A7973118n48611o26754m57725m23510j72855o1016J87775L48006N84613O30655
8062A7433696O38744O18401N12338L48968J51370m9952j60953k94595j70993m75884
8052A8551140l02017l98062m00925k67477j01439K9312K95811M53204O74951Q48412
8042A9382910P49463Q36842N99613K22332J89184L87981M15922M61176K11703
$$ plain form
8033 23457126 23229126 22499149 21434629 20397133 19486150 18879020 18543560 18293721 18334606
8024 18334606 18708593 19150597 19860908 20611537 21448313 22391408 23279245 24004061 24624549
8015 24624549 25182383 25613133 25638431 25238201 24138818 22743728 21344414 20074093 19076425
8006 19076425 18280371 17730416 17404135 17306306 17239125 17446732 17755928 18271417 18982831 19928027
7996 19928027 20980891 22070824 23050946 23664407 24012595 23824075 23120820 22045902 20753213
7987 20753213 19575379 18574546 17735354 17273189 16892850 16733950 16870620 16971419 17416888
7978 17416888 18044597 18900736 19961424 21173709 22223081 23111487 23412688 23150128 22315978
7969 22315978 21407096 20488667 19677561 18891059 18181545 17487619 16834008 16368517 15981892
$$ packed form
8033B3457126k28000p29977j064520j037496r10983o07130l35460k49839M0885
8024A8334606L73987M42004P10311P50629Q36776R43095Q87837P24816O20488
8015B4624549N57834M30750K5298m00230j099383j395090j399314j270321r97668
8006A9076425p96054n49955l26281r7829o7181K07607L09196N15489P11414R45196
7996A9928027J052864J089933R80122O13461L48188j88520p03255j074918j292689
7987B0753213j177834j000833q39192m62165l80339j58900J36670J00799M45469
7978A7416888O27709Q56139J060688J212285J049372Q88406L01201k62560q34150
7969B2315978r08882r18429q11106p86502p09514o93926o53611m65491l86625
$$ plain form
7960 15981892 15657595 15648344 15611036 15840970 16327786 16960021 17711210 18560362 19331529 19720317
7950 19720317 19892800 19330485 18595668 17762872 16998050 16384821 15877738 15341877 14668306
7941 14668306 13842727 13193183 12601770 12105312 11700184 11397579 11267846 11190710 11210205 11287015
7931 11287015 11503165 11734612 12101616 12459568 12573756 12749787 12726394 12560113 12273874 11849294
7921 11849294 11346753 10768462 10257821 9857937 9501376 9168005 8984190 8769666 8612321
7912 8612321 8608304 8700657 8757550 8928698 9145064 9419256 9633431 9947192 10158219 10057390
7902 10057390 9825875 9408381 8893127 8411268 8010724 7630409 7319180 7147336 6914397
7893 6914397 6742823 6654163 6620762 6538770 6557747 6640345 6662583 6749219 6905364 6926936 7009744
$$ packed form
7960A5981892l24297r251l7308K29934M86816O32235P51189Q49152P71167L88788
7950A9720317J72483n62315p34817q32796p64822o13229n07083n35861o73571
7941A4668306q25579o49544n91413m96458m05128l02605j29733p7136J9495P6810
7931A1287015K16150K31447L67004L57952J14188J76031k3393j66281k86239m24580
7921A1849294n02541n78291n10641l99884l56561l33371j83815k14524j57345
7912H612321m017R2353N6893J71148K16366K74192K14175L13761K11027j00829
7902A0057390k31515m17494n15254m81859m00544l80315l11229j71844k32939
7893F914397j71574q8660l3401q1992J8977Q2598K2238Q6636J56145K1572Q2808
$$ plain form
7882 7009744 7045099 6865140 6656968 6454083 6083818 5818866 5584704 5379443 5248602 5099889
7872 5099889 5057407 4959604 4811281 4754828 4713282 4625667 4595069 4588436 4523964 4537572 4455745
7861 4455745 4520241 4429981 4366210 4441908 4290454 4277584 3562500 4480794 4341254 4276238 4239252
7850 4239252 4265516 4171806 4219139 4228307 4182374 4203819 4228258 4209317 4217409 4191473 4190646 4198514
7838 4198514 4221270 4220187 4276765 4220262 4290571 4231180 4274345 4228034 4237911 4272916 4307105 4225228
7826 4225228 4307098 4281891 4391625 4364470 4396799 4413463 4521667 4539581 4478384 4563574 4521842
7815 4521842 4575296 4506456 4596828 4599411 4653225 4667297 4660917 4763181 4709704 4795409 4767107 4798135
7803 4798135 4893883 4873044 4911155 4992411 4943124 5038677 5043060 5074021 5152391 5203304 5148414 5165517
$$ packed form
7882G009744L5355j79959k08172k02885l70265k64952k34162k05261j30841j48713
7872E099889m2482r7803j48323n6453m1546q7615l0598o633o4472J3608q1827
7861D455745O4496r0260o3771P5698j51454j2870p15084R18294j39540o5016l6986
7850D239252K6264r3710M7333R168m5933K1445K4439j8941Q092k5936q27P868
7838D198514K2756j083N6578n6503P0309n9391M3165m6311R877L5005L4189q1877
7826D225228Q1870k5207J09734k7155L2329J6664J08204J7914o1197Q5190m1732
7815D521842N3454o8840R0372K583N3814J4072o380J02264n3477Q5705k8302L1028
7803D798135R5748k0839L8111Q1256m9287R5553M383L0961P8370N0913n4890J7103
$$ plain form
7791 5165517 5150068 5143349 5198669 5205079 5142218 5172450 5172795 5163814 5230522 5342162 5229314 5314678
7779 5314678 5331787 5391659 5444690 5456507 5486260 5569638 5631569 5602642 5614282 5655002 5693295
7768 5693295 5658320 5683553 5701869 5780235 5787448 5811021 5818465 5850240 5846648 5896313 5921275 6015138
7756 6015138 5994794 6046252 6123386 6146589 6175505 6296405 6365047 6296581 6439671 6518006 6519743
7745 6519743 6646749 6635873 6729067 6836885 6931045 7045263 7156850 7262746 7329150 7536126
7735 7536126 7701156 7797855 7791257 7855279 7911826 7858784 7866061 7793677 7771488 7776505 7774219 7728540
7723 7728540 7774104 7778001 7810163 7812139 7876301 7871992 7951732 7896445 8023654 8073554 8127521 8092687
7711 8092687 8215745 8167009 8299501 8303150 8399607 8506031 8581164 8574497 8684238 8739465 8851061
$$ packed form
7791E165517j5449o719N5320O410o2861L0232L45q981O6708J11640j12848Q5364
7779E314678J7109N9872N3031J1817K9753Q3378O1931k8927J1640M0720L8293
7768E693295l4975K5233J8316P8366P213K3573P444L1775l592M9665K4962R3863
7756F015138k0344N1458P7134K3203K8916J20900O8642o8466J43090P8335J737
7745F519743J27006j0876R3194J07818R4160J14218J11587J05896O6404K06976
7735G536126J65030R6699o598O4022N6547n3042P277p2384k2189N017k286m5679
7723G728540M5564L897L2162J976O4162m309P9740n5287J27209M9900N3967l4834
7711H092687J23058m8736J32492L649R6457J06424P5133o667J09741N5227J11596
$$ plain form
7700 8851061 8868581 9024411 9072482 9128990 9178183 9317562 9389122 9447738 9552102 9616142 9794523
7689 9794523 9868596 9970404 10107721 10199747 10311090 10447553 10644858 10779288 10950974 11005201
7679 11005201 11223422 11415825 11564125 11776124 11935883 12129663 12222493 12307990 12354046 12472625
7669 12472625 12467877 12466253 12519837 12558786 12509437 12548706 12609060 12618104 12768252 12865515 12901801 13047726
7657 13047726 13090538 13245450 13347459 13480913 13650808 13847231 13984674 14090249 14284064 14360747
7647 14360747 14657175 14769354 14889345 15076139 15272673 15407507 15730425 15940831 16135701
7638 16135701 16401322 16691874 16914378 17189830 17560077 17926307 18311213 18736517 19192316
7629 19192316 19725512 20352745 20990091 21715982 22469810 23403037 24405804 25336351 26434356
$$ packed form
7700H851061J7520J55830M8071N6508M9193J39379P1560N8616J04364O4040J78381
7689I794523P4073J01808J37317R2026J11343J36463J97305J34430J71686N4227
7679A1005201K18221J92403J48300K11999J59759J93780R2830Q5497M6056J18579
7669A2472625m748j624N3584L8949m9349L9269O0354R044J50148R7263L6286J45925
7657A3047726M2812J54912J02009J33454J69895J96423J37443J05575J93815P6683
7647A4360747K96428J12179J19991J86794J96534J34834L22918K10406J94870
7638A6135701K65621K90552K22504K75452L70247L66230L84906M25304M55799
7629A9192316N33196O27233O37346P25891P53828R33227J002767R30547J098005
$$ plain form
7620 26434356 27709738 28970882 30581389 32237849 34035693 35546567 36899776 37880520
7612 37880520 38620815 39073514 39624649 40197130 40671548 40903614 40416326 39094595 37474141
7603 37474141 36135077 34960288 33986202 33125647 32440570 31492212 30820195 30364403 30047406
7594 30047406 29966539 30244448 30657900 31356904 32307398 33561909 35126476 36690538 38433753
7585 38433753 40311495 42296648 44409662 46276143 47833653 48832724 48877489 48638737 48283067
7576 48283067 47896562 47194040 45991456 44024064 42049945 40158355 38512105 37109317
7568 37109317 35781011 34614612 33637645 32792302 32009815 31420359 31140214 30928689 30940767
7559 30940767 31056554 31357892 31827695 32483922 33268490 34116921 35120280 36474694 37946689
$$ packed form
7620B6434356J275382J261144J610507J656460J797844J510874J353209R80744
7612C7880520P40295M52699N51135N72481M74418K32066m87288j321731j620454
7603C7474141j339064j174789r74086q60555o85077r48358o72017m55792l16997
7594C0047406q0867K77909M13452O99004R50494J254511J564567J564062J743215
7585C8433753J877742J985153K113014J866481J557510R99071M4765k38752l55670
7576D8283067l86505p02522j202584j967392j974119j891590j646250j402788
7568C7109317j328306j166399r76967q45343p82487n89456k80145k11525J2078
7559C0940767J15787L01338M69803O56227P84568Q48431J003359J354414J471995
$$ plain form
7550 37946689 39858461 41947252 44089947 46319259 48350034 50204683 51842892 53480518
7542 53480518 55098368 56649667 57674147 57894902 57056883 55482998 53696187 51847228
7534 51847228 49996647 48105511 46257846 44246134 42534463 40799194 39215140 38069985
7526 38069985 37248972 36665979 36322731 36222563 36307111 36645667 37047689 37747991 38424871 39319328
7516 39319328 40406124 41849778 43409091 45153402 46988464 48888859 51426282 54373725
7508 54373725 57656363 60540548 62718944 62248798 60338663 58342683 56768347 55774829
7500 55774829 54984011 53956441 53020962 52067819 50899237 49713704 48478914 47068755 45597451
7491 45597451 44095994 42312027 40541763 38805891 37227090 35988330 34786539 33886562
$$ packed form
7550C7946689J911772K088791K142695K229312K030775J854649J638209J637626
7542E3480518J617850J551299J024480K20755q38019j573885j786811j848959
7534E1847228j850581j891136j847665k011712j711671j735269j584054j145155
7526C8069985q21013n82993l43248j00168Q4548L38556M02022P00302O76880Q94457
7516C9319328J086796J443654J559313J744311J835062J900395K537423K947443
7508E4373725L282638K884185K178396m70146j910135j995980j574336r93518
7500E5774829p90818j027570r35479r53143j168582j185533j234790j410159j471304
7491D5597451j501457j783967j770264j735872j578801j238760j201791q99977
$$ plain form
7483 33886562 32900698 32291648 31776950 31427032 31363270 31450058 31618205 32045970 32593933 33331823
7473 33331823 34328073 35396304 36635134 37991923 39237878 40747838 42183376 43775153
7465 43775153 45350588 46827242 48015682 48661468 48973220 49208554 49048858 48777403 48360447
7456 48360447 47715011 46963325 46185181 45244380 44359377 43525631 42843438 42305318 41881883
7447 41881883 41597529 41574457 41795950 42159780 42509018 42554188 42453718 42176889 42002496 41971576
7437 41971576 42127066 42281768 42533703 42655311 42722203 42822957 43021101 43554207 44099301 44674406
7427 44674406 45349366 46144096 47055621 47782887 48097285 48049095 47469342 46913583 46543714 46195401
7417 46195401 45487047 44584961 43296944 42295363 41578259 40992434 40502506 39790320 39050342
$$ packed form
7483C3886562r85864o09050n14698l49918o3762Q6788J68147M27765N47963P37890
7473C3331823R96250J068231J238830J356789J245955J509960J435538J591777
7465D3775153J575435J476654J188440O45786L11752K35334j59696k71455m16956
7456D8360447o45436p51686p78144r40801q85003q33746o82193n38120m23435
7447D1881883k84354k3072K21493L63830L49238M5170j00470k76829j74393l0920
7437D1971576J55490J54702K51935J21608O6892J00754J98144N33106N45094N75105
7427D4674406O74960P94730R11525P27266L14398m8190n79753n55759l69869l48313
7417D6195401p08354r02086j288017j001581p17104n85825m89928p12186p39978
$$ plain form
7408 39050342 38210674 37473990 37103251 36748435 36711101 36465804 36156618 35563222 34828542 33990124
7398 33990124 33229606 32553755 32017197 31434250 30727744 29857489 28876897 27791582 26749396
7389 26749396 25921443 25343551 24842720 24368832 24033038 23757090 23489913 23491797 23552253 23727663
7379 23727663 24075703 24586628 25123594 25662690 26234306 26863527 27466775 28106889 28753741
7370 28753741 29198461 29212851 29194845 29039849 28941447 28827230 28475881 27971162 27180290 26364164
7360 26364164 25706351 25080020 24722305 24382096 24126739 23959946 23876146 24001504 24254154 24623541
7350 24623541 24952195 25290717 25470811 25865932 26234005 26633572 27063087 27225234 27096707
7341 27096707 26676417 26318905 25907302 25653030 25355861 25159137 24885998 24781822 24748113 24836848
$$ packed form
7408C9050342q39668p36684l70739l54816l7334k45297l09186n93396p34680q38418
7398C3990124p60518o75851n36558n82947p06506q70255r80592j085315j042186
7389B6749396q27953n77892n00831m73888l35794k75948k67177J884O0456J75410
7379B3727663L48040N10925N36966N39096N71616O29221O03248O40114O46852
7370B8753741M44720J4390j8006j54996r8402j14217l51349n04719p90872q16126
7360B6364164o57813o26331l57715l40209k55357j66793q3800J25358K52650L69387
7350B4623541L28654L38522J80094L95121L68073L99567M29515J62147j28527
7341B7096707m20290l57512m11603k54272k97169j96724k73139j04176l3709Q8735
$$ plain form
7331 24836848 24964618 25040986 24830757 24459306 24108444 23694970 23403894 22933656 22237120 21210478
7321 21210478 20232499 19185833 18345218 17700748 17052354 16476810 15976671 15553315 15261493
7312 15261493 15042885 14915974 14922168 14984808 15175350 15420131 15705544 16059904 16556780 17106407
7302 17106407 17759127 18433332 19193267 19862792 20395548 20864230 20913933 20683718 20271434 19580430
7292 19580430 18728645 17858164 16984394 16267625 15538915 14997066 14476137 14030441 13784084
7283 13784084 13436896 13243101 13070483 12983662 12957010 12827940 12798303 12702853 12564022 12484663
7273 12484663 12240530 11999293 11797310 11704752 11425085 11357012 11235115 11111024 11123580 11074436
7263 11074436 11018723 11030415 11036594 11016373 11106267 11133764 11164217 11381515 11512819 11624499 11879369
$$ packed form
7331B4836848J27770P6368k10229l71451l50862m13474k91076m70238o96536j026642
7321B1210478r77979j046666q40615o44470o48394n75544n00139m23356k91822
7312A5261493k18608j26911O194O2640J90542K44781K85413L54360M96876N49627
7302A7106407O52720O74205P59935O69525N32756M68682M9703k30215m12284o91004
7292A9580430q51785q70481q73770p16769p28710n41849n20929m45696k46357
7283A3784084l47188j93795j72618q6821k6652j29070k9637r5450j38831p9359
7273A2484663k44133k41237k01983r2558k79667o8073j21897j24091J2556m9144
7263A1074436n5713J1692O179k0221Q9894K7497L0453K17298J31304J11680K54870
$$ plain form
7252 11879369 12117666 12307227 12678764 12918527 13255975 13695503 14229464 14849016 15702262
7243 15702262 16490156 17483976 18401318 19460024 20236277 20932260 21011930 20790795 20094687
7234 20094687 19200594 18127329 17062145 15921287 15052034 14238306 13398467 12720657 12178244
7225 12178244 11644236 11111879 10675771 10387606 9937951 9667390 9419227 9205344 9019146
7216 9019146 8827816 8662483 8518144 8371475 8340224 8253625 8101228 8079534 8040904 7991558
7206 7991558 7979918 7919420 7864474 7798640 7844990 7821030 7825142 7835665 7839936 7889566 7914849 7925675
7194 7925675 8016522 8093183 8124072 8088230 8095898 8252428 8398978 8475245 8586543 8637306 8576586
7183 8576586 8551266 8512122 8452843 8344385 8292474 8149076 8069591 8143710 8108085 8183421 8229892
$$ packed form
7252A1879369K38297J89561L71537K39763L37448M39528N33961O19552Q53246
7243A5702262P87894R93820R17342J058706P76253O95983P9670k21135o96108
7234B0094687q94093j073265j065184j140858q69253q13728q39839o77810n42413
7225A2178244n34008n32357m36108k88165m49655k70561k48163k13883j86198
7216I019146j91330j65333j44339j46669l1251q6599j52397k1694l8630m9346
7206G991558j1640o0498n4946o5834M6350k3960M112J0523M271M9630K5283J0826
7194G925675R0847P6661L0889l5842P668J56530J46550P6267J11298N0763o0720
7183H576586k5320l9144n9279j08458n1911j43398p9485P4119l5625P5336M6471
$$ plain form
7172 8229892 8332814 8435516 8384463 8465473 8444759 8346031 8253717 8273595 8230942 8276703 8216012
7161 8216012 8206669 8240897 8281779 8293070 8347446 8439901 8489934 8572888 8697987 8798113 8959967
7150 8959967 9115985 9225367 9381323 9561172 9744825 9918953 9950393 9971156 9937809 9937630 10007674
7139 10007674 9992077 10010322 10176641 10335680 10417191 10537546 10709679 10933017 11053873 11277176
7129 11277176 11642204 11878190 12324703 12591550 13129846 13647487 14278168 14931161 15742572
7120 15742572 16584219 17483202 18526787 19586782 20788268 21970282 22942874 23712162 24036563
7111 24036563 23824550 23113170 22205202 21034603 19941324 18900432 17981660 17257923 16597817
7102 16597817 16034260 15569698 15255079 14923190 14716995 14592548 14421334 14253663 14104760
$$ packed form
7172H229892J02922J02702n1053Q1010k0714r8728r2314J9878m2653M5761o0691
7161H216012r343L4228M0882J1291N4376R2455N0033Q2954J25099J00126J61854
7150H959967J56018J09382J55956J79849J83653J74128L1440K0763l3347j79P0044
7139A0007674j5597J8245J66319J59039Q1511J20355J72133K23338J20856K23303
7129A1277176L65028K35986M46513K66847N38296N17641O30681O52993Q11411
7120A5742572Q41647Q98983J043585J059995J201486J182014R72592P69288L24401
7111B4036563k12013p11380r07968j170599j093279j040892r18772p23737o60106
7102A6597817n63557m64562l14619l31889k06195j24447j71214j67671j48903
$$ plain form
7093 14104760 13991585 13890256 13887424 13831163 13856417 13870166 13847151 13955752 14036757 14143104 14318159
7082 14318159 14532449 14682710 14912336 15194874 15409163 15686618 15933575 16217155 16528183
7073 16528183 16889269 17247272 17651430 18031961 18537435 19034162 19526054 20151869 20767330
7064 20767330 21491284 22321321 23267621 24356284 25534363 26885385 28406989 30063026 31778352
7055 31778352 33545465 35190203 36941241 38671060 40713108 43079129 45971892 49565220
7047 49565220 53854305 58582827 63485420 67925730 71474196 73293451 73196982 70905834
7039 70905834 67083254 62053434 56639218 51572680 47004689 43463846 40568699 38258965
7031 38258965 36504478 34983433 33476751 31995301 30510225 28978393 27625789 26309069
$$ packed form
7093A4104760j13175j01329k832n6261K5254J3749k3015J08601Q1005J06347J75055
7082A4318159K14290J50261K29626K82538K14289K77455K46957K83580L11028
7073A6528183L61086L58003M04158L80531N05474M96727M91892O25815O15461
7064B0767330P23954Q30037R46300J088663J178079J351022J521604J656037J715326
7055C1778352J767113J644738J751038J729819K042048K366021K892763L593328
7047D9565220M289085M728522M902593M440310L548466J819255r6469k291148
7039G0905834l822580n029820n414216n066538m567991l540843k895147k309734
7031C8258965j754487j521045j506682j481450j485076j531832j352604j316720
$$ plain form
7023 26309069 25180929 24168589 23342925 22559511 21879344 21257038 20692621 20108515 19590089
7014 19590089 19080911 18633163 18225189 17926387 17658052 17406667 17249903 16977441 16850742
7005 16850742 16720948 16596914 16544705 16490580 16415483 16395577 16317876 16406703 16404846 16485253 16523574
6994 16523574 16573033 16675911 16733148 16813355 16941175 17121572 17329732 17555772 17788651 17973139
6984 17973139 18315269 18659117 19012449 19471961 19859197 20357455 20960576 21575674 22233196
6975 22233196 22975641 23678020 24458067 25407195 26401820 27639499 29081192 30626572 32441754
6966 32441754 34378606 36182194 37931172 39593056 41113033 42492349 43744371 44955494
6958 44955494 45703158 45966748 45797053 45276372 44681383 44147275 43667538 43181676 42718412
$$ packed form
7023B6309069j128140j012340q25664p83414o80167o22306n64417n84106n18426
7014A9590089n09178m47748m07974k98802k68335k51385j56764k72462j26699
7005A6850742j29794j24034n2209n4125p5097j9906p7701Q8827j857Q0407L8321
6994A6523574M9459J02878N7237Q0207J27820J80397K08160K26040K32879J84488
6984A7973139L42130L43848L53332M59512L87236M98258O03121O15098O57522
6975B2233196P42445P02379P80047R49128R94625J237679J441693J545380J815182
6966C2441754J936852J803588J748978J661884J519977J379316J252022J211123
6958D4955494P47664K63590j69695n20681n94989n34108m79737m85862m63264
$$ plain form
6949 42718412 42349722 42181170 42412309 42961831 43773382 44767261 45764899 46814067 47715261
6940 47715261 48462271 49192229 49737086 50047776 49795437 49082352 47991932 46908612 45731382
6931 45731382 44732905 43613942 42438499 41350208 40459623 39636873 39196055 38958790 38926696
6922 38926696 38963826 39204388 39584573 40187990 41011673 42153932 43538708 45216506 47119113
6913 47119113 49154026 51277459 53495876 55891285 58409332 60926785 63433546 65511443
6905 65511443 66724197 67509544 67673952 67316054 66602752 65379622 63672955 61783260 59814008
6896 59814008 58159639 56857192 55921882 55362618 55089065 55043983 55085091 55316467 55748232
6887 55748232 56161472 56490667 56495616 56105661 55393262 54507754 53781200 53168045 52556183 52017402
$$ packed form
6949D2718412l68690j68552K31139N49522Q11551R93879R97638J049168R01194
6940D7715261P47010P29958N44857L10690k52339p13085j090420j083320j177230
6931D5731382r98477j118963j175443j088291q90585q22750m40818k37265l2094
6922C8926696L7130K40562L80185O03417Q23683J142259J384776J677798J902607
6913D7119113K034913K123433K218417K395409K518047K517453K506761K077897
6905F5511443J212754P85347J64408l57898p13302j223130j706667j889695j969252
6896E9814008j654369j302447r35310n59264k73553m5082M1108K31376M31765
6887E5748232M13240L29195M949l89955p12399q85508p26554o13155o11862n38781
$$ plain form
6877 52017402 51693204 51445005 51573894 52144530 53260763 54900217 57101640 59779463 62944377
6868 62944377 66391080 69854959 72786430 74993854 76251648 76756294 76903247 76984432 77157598
6859 77157598 77368906 77279782 76396381 74663883 72123637 68730389 65403595 62071504 59201691
6850 59201691 56972071 55212788 53984771 53339162 53121325 53267950 53837126 54732302 56226660
6841 56226660 58011514 60151280 62479014 64704027 66846666 68580630 69839360 70493375
6833 70493375 70642730 70121587 69163958 68024485 66806068 65875167 65239448 65171605 65629271
6824 65629271 66743104 68673270 71331982 74889464 79444332 85177172 92061835 99867638
6816 99867638 107850096 115070127 120464116 122922664 122848281 120643466 117747204 114824947
$$ packed form
6877E2017402l24198k48199J28889N70636J116233J639454K201423K677823L164914
6868F2944377L446703L463879K931471K207424J257794N04646J46953Q1185J73166
6859G7157598K11308q9124q83401j732498k540246l393248l326794l332091k869813
6850E9201691k229620j759283j228017o45609k17837J46625N69176Q95176J494358
6841E6226660J784854K139766K327734K225013K142639J733964J258730O54015
6833G0493375J49355n21143r57629j139473j218417r30901o35719o7843M57666
6824F5629271J113833J930166K658712L557482M554868N732840O884663P805803
6816I9867638P982458P220031N393989K458548p4383k204815k896262k922257
$$ plain form
6808 114824947 112324357 109812171 106428996 101905687 96367571 90151338 83916435 78106032
6800 78106032 73035547 68593011 64997651 61859070 59321334 57197489 55539407 54185832
6792 54185832 53203618 52573612 52208468 52280666 52541819 53325998 54262896 55410858 56804387
6783 56804387 58416574 60142685 62138805 64410072 67143532 70380826 73789763 77160899
6775 77160899 80242546 82416244 83372073 82969041 81216202 78453925 75136174 71476487
6767 71476487 67948236 64883607 62232071 60189089 58719513 57632916 57163969 57218172 57721372
6758 57721372 58862185 60760405 63288602 66675161 70630077 74947355 78904385 81958379
6750 81958379 83471038 83085775 81093168 77775152 73613787 69330875 65183611 61383474
$$ packed form
6808A14824947k500590k512186l383175m523309n538116o216233o234903n810403
6800G8106032n070485m442536l595360l138581k537736k123845j658082j353575
6792E4185832r82214o30006l65144P2198K61153P84179R36898J147962J393529
6783E6804387J612187J726111J996120K271267K733460L237294L408937L371136
6775G7160899L081647K173698R55829m03032j752839k762277l317751l659687
6767G1476487l528251l064629k651536k042982j469576j086597m68947N4203N03200
6758E7721372J140813J898220K528197L386559L954916M317278L957030L053994
6750H1958379J512659l85263j992607l318016m161365m282912m147264l800137
$$ plain form
6742 61383474 57898243 54728170 52043067 49727041 47674013 45795852 44146574 42712108
6734 42712108 41383295 40077339 38961238 37954820 36975412 36230572 35520826 34948288 34463383
6725 34463383 34080932 33793443 33745594 33718509 33661716 33855223 33946947 34158034 34474930 34848429
6715 34848429 35437323 36245784 37137965 38292170 39684227 41030369 42448306 43630239 44704540
6706 44704540 45666064 46703750 48049996 49563760 51215845 52624663 53690117 54131366
6698 54131366 54349392 54622279 54932677 55177250 55280087 55016089 54542151 53756512 52866784
6689 52866784 51949714 51191431 50844851 50956684 51555353 52154217 52605360 52585355 52077283 51391482
6679 51391482 50630161 50176540 49777875 49191184 48460915 47299936 45777195 44209388 42682265
$$ packed form
6742F1383474l485231l170073k685103k316026k053028j878161j649278j434466
6734D2712108j328813j305956j116101j006418r79408p44840p09746n72538m84905
6725C4463383l82451k87489m7849k7085n6793J93507R1724K11087L16896L73499
6715C4848429N88894Q08461Q92181J154205J392057J346142J417937J181933J074301
6706D4704540R61524J037686J346246J513764J652085J408818J065454M41249
6698E4131366K18026K72887L10398K44573J02837k63998m73938p85639q89728
6689E2866784r17070p58283l46580J11833N98669N98864M51143k0005n08072o85801
6679E1391482p61321m53621l98665n86691p30269j160979j522741j567807j527123
$$ plain form
6670 42682265 41496452 40649156 40065752 39593995 39273302 38948785 38697072 38389527 38284565
6661 38284565 38339942 38534869 38891208 39300620 39647570 39930105 40094442 40041049 39904223 39452490
6651 39452490 38642063 37540257 35999142 34294856 32571943 30914971 29485623 28339984
6643 28339984 27375694 26490167 25774043 25167751 24605294 24100222 23713777 23372642 23112907
6634 23112907 22835120 22608629 22413413 22282540 22191105 22169679 22182076 22228527 22156468 22307858
6624 22307858 22317429 22395824 22493593 22519669 22721562 22837301 22942299 23211930 23388458 23799938
6614 23799938 24238103 24749534 25419969 26213173 27173214 28171737 29273755 30276576 31027579
6605 31027579 31770197 32241089 32652566 32845526 32794817 32426284 31861211 31141438 30386991 29621276
$$ packed form
6670D2682265j185813q47296n83404m71757l20693l24517k51713l07545j04962
6661C8284565N5377J94927L56339M09412L46950K82535J64337n3393j36826m51733
6651C9452490q10427j101806j541115j704286j722913j656972j429348j145639
6643B8339984r64290q85527p16124o06292n62457n05072l86445l41135k59735
6634B3112907k77787k26491j95216j30873r1435k1426J2397M6451p2059J51390
6624B2307858R571P8395R7769K6076K01893J15739J04998K69631J76528M11480
6614B3799938M38165N11431O70435P93204R60041R98523J102018J002821P51003
6605C1027579P42618M70892M11477J92960n0709l68533n65073p19773p54447p65715
$$ plain form
6595 29621276 28982293 28387482 27786271 27248775 26747326 26358332 26186148 25923995 25806386
6586 25806386 25731243 25666614 25761975 25727749 25833084 26133926 26514004 27009217 27594122 28304580
6576 28304580 29086616 29814796 30656175 31312159 31958448 32319510 32711428 33091904 33573458
6567 33573458 34123615 34856514 35458534 36035912 36412824 36760959 36922965 37149231 37229831 37212941
6557 37212941 37079102 36863385 36786720 36941790 37270656 38027824 38902844 39919267 40981919
6548 40981919 41875638 42606636 43023024 43299984 43123526 42968775 42735198 42480045 42248625
6539 42248625 41933860 41490266 40844377 40281252 39794270 39430669 39014673 38585227 38021175
6530 38021175 37294169 36779641 36367316 36116267 36068658 36012795 36050951 36043245 36038676 36194089 36546657
$$ packed form
6595B9621276o38983n94811o01211n37496n01449l88994j72184k62153j17609
6586B5806386p5143o4629R5361l4226J05335L00842L80078M95213N84905P10458
6576B8304580P82036P28180Q41379O55984O46289L61062L91918L80476M81554
6567C3573458N50157P32899O02020N77378L76912L48135J62006K26266Q0600j6890
6557C7212941j33839k15717p6665J55070L28866P57168Q75020J016423J062652
6548D0981919Q93719P30998M16388K76960j76458j54751k33577k55153k31420
6539D2248625l14765m43594o45889n63125m86982l63601m15996m29446n64052
6530C8021175p27006n14528m12325k51049m7609n5863L8156p706m569J55413L52568
$$ plain form
6519 36546657 36999729 37619886 38604870 39704608 41147276 42858120 44754470 46693585 48426371
6510 48426371 50135548 51449214 52659756 53324923 53472370 53248396 52469884 51351671 49947727
6501 49947727 48317183 46683835 45204351 43815203 42655697 41588156 40767845 40049705
6493 40049705 39468720 38895455 38251434 37801126 37443576 37239509 37254241 37333614 37522148 37740842
6483 37740842 37911314 37989019 37945052 37773298 37373348 36833340 36119749 35462166 34890026 34211431
6473 34211431 33618708 32907753 32222954 31543988 30812639 30061786 29438283 28763753 28206269
6464 28206269 27658275 27260412 26960497 26804200 26744557 26877092 27038089 27214892 27331178 27172008
6454 27172008 26725981 25976888 25171064 24447255 23716951 23133639 22623565 22181464 21902878
$$ packed form
6519C6546657M53072O20157R84984J099738J442668J710844J896350J939115J732786
6510D8426371J709177J313666J210542O65167J47447k23974p78512j118213j403944
6501D9947727j630544j633348j479484j389148j159506j067541q20311p18140
6493D0049705n80985n73265o44021m50308l57550k04067J4732P9373J88534K18694
6483C7740842J70472P7705m3967j71754l99950n40008p13591o57583n72140o78595
6473C4211431n92723p10955o84799o78966p31349p50853o23503o74530n57484
6464B8206269n47994l97863k99915j56297n9643J32535J60997J76803J16286j59170
6454B7172008m46027p49093q05824p23809p30304n83312n10074m42101k78586
$$ plain form
6445 21902878 21628955 21473239 21304649 21176025 21159022 21312582 21486130 21693747 21867634 22237908
6435 22237908 22583614 22928159 23381108 23845724 24279767 24647876 25104196 25361030 25721397
6426 25721397 25957922 26370711 26864355 27607461 28442992 29650852 31008400 32657510 34470259
6417 34470259 36297420 38340023 40110563 41823205 43256399 44395875 45356206 45765347
6409 45765347 45696585 44970604 44059892 43064185 42089837 40937861 39941453 38958763 38180978
6400 38180978 37685159 37579332 37772560 38329942 39211210 40402195 41726235 43267857 44585113
6391 44585113 45783101 46859900 47652065 48235044 48413670 48016932 47162378 45976822 44759805
6382 44759805 43418492 41989782 40480793 38930776 37455323 36165534 35103111 34118097
$$ packed form
6445B1902878k73923j55716j68590j28624j7003J53560J73548K07617J73887L70274
6435B2237908L45706L44545M52949M64616M34043L68109M56320K56834L60367
6426B5721397K36525M12789M93644P43106Q35531J207860J357548J649110J812749
6417C4470259J827161K042603J770540J712642J433194J139476R60331M09141
6409D5765347o8762p25981r10712r95707r74348j151976r96408r82690p77785
6400C8180978m95819j05827J93228N57382Q81268J190985J324040J541622J317256
6391D4585113J197988J076799P92165N82979J78626l96738q54554j185556j217017
6382D4759805j341313j428710j508989j550017j475453j289789j062423r85014
$$ [...]
##END NTUPLES=NMR SPECTRUM
##END=
