##TITLE=abcd
##JCAMPDX= 6.0         $$ Bruker NMR JCAMP-DX V2.0
##DATA TYPE= NMR SPECTRUM
##DATA CLASS= NTUPLES
##ORIGIN= UXNMR, Bruker Analytische Messtechnik GmbH
##OWNER= root
$$ XWIN-NMR		Version 3.5
$$ Thu Feb 23 12:01:19 2023 Russian Standard Time (UT+4h)  servis@DPX200
##.OBSERVE FREQUENCY= 200.131235884673
##.OBSERVE NUCLEUS= ^1H
##.ACQUISITION MODE= SIMULTANEOUS
##.ACQUISITION SCHEME= undefined
##.AVERAGES= 24
##.DIGITISER RES= 18
##SPECTROMETER/DATA SYSTEM= spect
##.PULSE SEQUENCE= zg
##.SOLVENT NAME= DMSO
##.SHIFT REFERENCE= (INTERNAL, DMSO, 0, 16.4885)
##AUDIT TRAIL= $$ (NUMBER, WHEN, WHO, WHERE, WHAT)
$$ ##TITLE= Audit trail, XWIN-NMR		Version 3.5
$$ ##JCAMPDX= 5.01
$$ ##ORIGIN= Bruker BioSpin GmbH
$$ ##OWNER= servis
$$ F:\spectra/data/av/nmr/H1/1/pdata/1/auditp.txt
$$ ##AUDIT TRAIL=  $$ (NUMBER, WHEN, WHO, WHERE, WHAT)
(   1,<2023-02-23 11:59:56.64 +0400>,<servis>,<DPX200>,
      <created by zg, POWCHK disabled, PULCHK disabled
       terminated by command 'halt'
       configuration hash MD5:
       00 E9 B6 7A A2 85 ED C7 34 08 36 98 17 FE 4E 26
       data hash MD5: 32K
       C7 4F 1D 5F 4A BA 59 45 16 7E 05 F5 A3 D8 7C 32>)
(   2,<2023-02-23 12:00:00.20 +0400>,<servis>,<DPX200>,
      <Start of raw data processing
       efp BC_mod = 2 LB = 0.05 FT_mod = 6 PKNL = 1 PHC0 = -182.4208 PHC1 = -2.89851 SI = 16K 
       data hash MD5: 16K
       38 ED 95 52 EF 6B F9 58 82 C7 25 96 AE 54 C0 68>)
(   3,<2023-02-23 12:00:27.25 +0400>,<servis>,<DPX200>,
      <pk PHC0 = -3.600001 PHC1 = 0 
       data hash MD5: 16K
       F1 AA CE 83 2A 6F 40 D8 62 9D B1 F5 01 F6 68 C6>)
$$ ##END=
$$ 
$$ hash MD5
$$ A5 94 84 D2 21 74 A5 9E 81 DA 4D A4 52 30 3F D1
##$RELAX= 
##$RELAX= 
##$RELAX= 
##$RELAX= 
##$RELAX= 
##$RELAX= 
##$RELAX= 
##$RELAX= 
$$ Bruker specific parameters
$$ --------------------------
##$DU= <F:\spectra>
##$EXPNO= 1
##$NAME= <H1>
##$PROCNO= 1
##$TYPE= <nmr>
##$USER= <av>
##$AMP= (0..31)
100 100 100 100 100 100 100 100 100 100 100 100 100 100 100 100 100 100 
100 100 100 100 100 100 100 100 100 100 100 100 100 100 
##$AQSEQ= 0
##$AQ_mod= 1
##$AUNM= <au_zg>
##$AUTOPOS= <>
##$BF1= 200.13
##$BF2= 200.13
##$BF3= 200.13
##$BF4= 200.13
##$BF5= 500.13
##$BF6= 500.13
##$BF7= 500.13
##$BF8= 500.13
##$BYTORDA= 1
##$CFDGTYP= 0
##$CFRGTYP= 5
##$CHEMSTR= <none>
##$CNST= (0..31)
1 1 145 1 1 1 1 1 1 1 1 1 1 1 1 1 1 1 1 1 1 1 1 1 1 1 1 1 1 1 1 1 
##$CPDPRG= <>
##$CPDPRG1= <>
##$CPDPRG2= <>
##$CPDPRG3= <>
##$CPDPRG4= <mlev>
##$CPDPRG5= <mlev>
##$CPDPRG6= <mlev>
##$CPDPRG7= <mlev>
##$CPDPRG8= <mlev>
##$CPDPRGB= <>
##$CPDPRGT= <>
##$D= (0..31)
0 2 0 0 0 0 0 0 0 0.06 0 0 0 0 0 0 0.0002 0 0 0 0 0 0 0 0 0 0 0 0 0 0 
0 
##$DATE= 1677139196
##$DBL= (0..7)
120 120 120 120 120 120 120 120 
##$DBP= (0..7)
150 150 150 150 150 150 150 150 
##$DBP07= 0
##$DBPNAM0= <>
##$DBPNAM1= <>
##$DBPNAM2= <>
##$DBPNAM3= <>
##$DBPNAM4= <>
##$DBPNAM5= <>
##$DBPNAM6= <>
##$DBPNAM7= <>
##$DBPOAL= (0..7)
0.5 0.5 0.5 0.5 0.5 0.5 0.5 0.5 
##$DBPOFFS= (0..7)
0 0 0 0 0 0 0 0 
$$ [...]
##$SUBNAM4= <"">
##$SUBNAM5= <"">
##$SUBNAM6= <"">
##$SUBNAM7= <"">
##$SUBNAM8= <"">
##$SUBNAM9= <"">
##$SW= 20.6817932712277
##$SWIBOX= (0..15)
0 0 3 0 0 0 0 0 0 0 0 0 0 0 0 0 
##$SW_h= 4139.07284768212
##$TD= 32768
##$TD0= 1
##$TE= 0
##$TE2= 300
##$TE3= 300
##$TEG= 300
##$TL= (0..7)
0 120 120 120 120 120 120 120 
##$TP= (0..7)
150 150 150 150 150 150 150 150 
##$TP07= 0
##$TPNAME0= <>
##$TPNAME1= <>
##$TPNAME2= <>
##$TPNAME3= <>
##$TPNAME4= <>
##$TPNAME5= <>
##$TPNAME6= <>
##$TPNAME7= <>
##$TPOAL= (0..7)
0.5 0.5 0.5 0.5 0.5 0.5 0.5 0.5 
##$TPOFFS= (0..7)
0 0 0 0 0 0 0 0 
##$TUNHIN= 0
##$TUNHOUT= 0
##$TUNXOUT= 0
##$USERA1= <user>
##$USERA2= <user>
##$USERA3= <user>
##$USERA4= <user>
##$USERA5= <user>
##$V9= 5
##$VALIST= <valist>
##$VCLIST= <CCCCCCCCCCCCCCC>
##$VD= 0
##$VDLIST= <DDDDDDDDDDDDDDD>
##$VPLIST= <PPPPPPPPPPPPPPP>
##$VTLIST= <TTTTTTTTTTTTTTT>
##$WBST= 1024
##$WBSW= 30
##$XGAIN= (0..3)
0 0 0 0 
##$XL= 0
##$YL= 0
##$YMAX_a= 707396
##$YMIN_a= -904641
##$ZGOPTNS= <>
##$ZL1= 120
##$ZL2= 120
##$ZL3= 120
##$ZL4= 120
##$ABSF1= 0
##$ABSF2= 0
##$ABSG= 0
##$ABSL= 0
##$ALPHA= 0
##$AQORDER= 0
##$ASSFAC= 0
##$ASSFACI= 0
##$ASSFACX= 0
##$ASSWID= 0
##$AUNMP= <proc_1d>
##$AZFE= 0.1
##$AZFW= 0.1
##$BCFW= 0
##$BC_mod= 2
##$BYTORDP= 0
##$COROFFS= 0
##$CY= 18.4799938201904
##$DATMOD= 1
##$DC= 0
##$DFILT= <>
##$DTYPP= 0
##$F1P= 9.9274215381318
##$F2P= -0.165520771350173
##$FCOR= 1
##$FTSIZE= 16384
##$FT_mod= 6
##$GAMMA= 0
##$GB= 0
##$INTBC= 1
##$INTSCL= 4.127829e-11
##$ISEN= 128
##$LB= 0.05
##$LEV0= 0
##$LPBIN= 0
##$MAXI= 10000
##$MC2= 0
##$MEAN= 0
##$ME_mod= 0
##$MI= 50
##$NCOEF= 0
##$NC_proc= -5
##$NLEV= 6
##$NOISF1= 3.799351
##$NOISF2= 2.8
##$NSP= 0
##$NTH_PI= 0
##$NZP= 0
##$OFFSET= 16.48848
##$PC= 4
##$PHC0= -186.0208
##$PHC1= -2.89851
##$PH_mod= 1
##$PKNL= yes
##$PPARMOD= 0
##$PSCAL= 4
##$PSIGN= 0
##$REVERSE= no
##$SF= 200.130005582386
##$SI= 16384
##$SIGF1= 3
##$SIGF2= 2
##$SINO= 400
##$SIOLD= 16384
##$SREGLST= <1H.CDCl3>
##$SSB= 0
##$STSI= 16384
##$STSR= 0
##$SW_p= 4139.07284768211
##$SYMM= 0
##$S_DEV= 0
##$TDeff= 32768
##$TDoff= 0
##$TI= <>
##$TILT= no
##$TM1= 0
##$TM2= 0
##$TOPLEV= 0
##$USERP1= <user>
##$USERP2= <user>
##$USERP3= <user>
##$USERP4= <user>
##$USERP5= <user>
##$WDW= 1
##$XDIM= 16384
##$YMAX_p= 345656008
##$YMIN_p= -805824
$$ End of Bruker specific parameters
$$ ---------------------------------
##NTUPLES= NMR SPECTRUM
##VAR_NAME=  FREQUENCY,     SPECTRUM/REAL,   SPECTRUM/IMAG
##SYMBOL=    X,             R,               I
##VAR_TYPE=  INDEPENDENT,   DEPENDENT,       DEPENDENT
##VAR_FORM=  AFFN,          ASDF,            ASDF
##VAR_DIM=   16384,         16384,           16384
##UNITS=     HZ,            ARBITRARY UNITS, ARBITRARY UNITS
##FACTOR=    0.252644378177508, 1,           1
##FIRST=     3299.83951724647, 0,            0
##LAST=      -839.233330435636, 0,           0
##MIN=       -839.233330435636, -805824,     0
##MAX=       3299.83951724647, 345656008,    0
$$ Real data points
##PAGE= N=1
##DATA TABLE= (X++(R..R)), XYDATA
$$ [...]
$$ plain form
9053 64695631 62854032 61197370 59684894 58171995 56908455 55709052 54491474 53294786
9045 53294786 52133949 51157107 50207320 49406842 48448065 47633241 46755579 45885613 44930645
9036 44930645 43838214 42667047 41317573 39953922 38496831 37169784 35875322 34894011
9028 34894011 33924245 33061377 32351581 31783200 31038976 30559034 30009643 29325781 28731688
9019 28731688 28125115 27455097 26817649 26117745 25503824 24727438 24166228 23574962 22926172
9010 22926172 22204914 21628340 20979859 20312005 19821294 19140661 18664778 18154889 17698143
9001 17698143 17190243 16758416 16216147 15782505 15324575 14987382 14540366 14202167 13851406
8992 13851406 13539261 13211415 12893745 12482444 12166900 11903999 11623765 11353518 11117910
$$ packed form
9053F4695631j841599j656662j512476j512899j263540j199403j217578j196688
9045E3294786j160837r76842r49787q00478r58777q14824q77662q69966r54968
9036D4930645j092431j171167j349474j363651j457091j327047j294462r81311
9028C4894011r69766q62868p09796n68381p44224m79942n49391o83862n94093
9019B8731688o06573o70018o37448o99904o13921p76386n61210n91266o48790
9010B2926172p21258n76574o48481o67854m90711o80633m75883n09889m56746
9001A7698143n07900m31827n42269m33642m57930l37193m47016l38199l50761
8992A3851406l12145l27846l17670m11301l15544k62901k80234k70247k35608
$$ plain form
8983 11117910 10889976 10502340 10341331 10038602 9872107 9683191 9475981 9252221 9059023
8974 9059023 8920458 8609859 8559689 8354499 8204033 8113206 7956961 7832115 7610445 7607618
8964 7607618 7490968 7225487 7198045 7095843 6916382 6858747 6704219 6625158 6622791 6414940
8954 6414940 6308122 6208737 6174024 6145473 5999400 5979242 5794895 5835831 5767339 5626110 5540056
8943 5540056 5446197 5376139 5361651 5170054 5204796 5138753 5066491 4981458 4994172 4885597 4871669
8932 4871669 4860455 4753158 4754788 4597696 4612391 4585589 4449839 4407327 4403965 4325608 4264688
8921 4264688 4203753 4141299 4096731 4084000 4073322 4027197 3916106 3962581 3881766 3850156 3786279
8910 3786279 3751608 3787534 3707000 3630559 3588264 3525614 3527837 3511218 3518532 3426513 3521291 3405537
$$ packed form
8983A1117910k27934l87636j61009l02729j66495j88916k07210k23760j93198
8974I059023j38565l10599n0170k05190j50466r0827j56245j24846k21670k827
8964G607618j16650k65481k7442j02202j79461n7635j54528p9061k367k07851
8954F414940j06818r9385l4713k8551j46073k0158j84347M0936o8492j41229q6054
8943E540056r3859p0058j4488j91597L4742o6043p2262q5033J2714j08575j3928
8932D871669j1214j07297J630j57092J4695k6802j35750m2512l362p8357o0920
8921D264688o0935o2454m4568j2731j0678m6125j11091M6475q0815l1610o3877
8910C786279l4671L5926q0534p6441m2295o2650K223j6619P314r2019R4778j15754
$$ plain form
8898 3405537 3298667 3273000 3230668 3242297 3114913 3181822 3221753 3077654 3213415 3102378
8888 3102378 3107826 3035285 2986900 3039330 3009903 2864881 2894202 2936154 2867627 2880099 2830617
8877 2830617 2781231 2669301 2715224 2684908 2676007 2670494 2637910 2612010 2590983 2583013 2564994 2574259
8865 2574259 2551393 2522446 2539970 2402814 2420554 2512201 2380274 2441604 2498102 2400953 2394265
8854 2394265 2318241 2317019 2308277 2288813 2332364 2310937 2196392 2208558 2227449 2244267 2191415 2202964
8842 2202964 2105974 2127791 2103878 2192463 2199070 2200252 2155907 2193775 2128331 2089880 2152589 2120774
8830 2120774 2167767 2148510 2066063 2087770 2127614 2132523 2045897 2094440 2046099 2100763 2016749 2126963
8818 2126963 2108189 2089196 2031612 2043172 1980190 1997853 2024906 2059558 2068529 1937452 2015267
$$ packed form
8898C405537j06870k5667m2332J1629j27384O6909L9931j44099J35761j11037
8888C102378N448p2541m8385N2430k9427j45022K9321M1952o8527J2472m9482
8877B830617m9386j11930M5923l0316q901n513l2584k5900k1027p970j8019R265
8865B574259k2866k8947J7524j37156J7740R1647j31927O1330N6498r7149o688
8854B394265p6024j222q742j9464M3551k1427j14545J2166J8891J6818n2852J1549
8842B202964r6990K1817k3913Q8585O607J182m4345L7868o5444l8451O2709l1815
8830B120774M6993j9257q2447K1707L9844M909q6626M8543m8341N4664q4014J10214
8818B126963j8774j8993n7584J1560o2982J7663K7053L4652Q971j31077P7815
$$ plain form
8807 2015267 1939491 1970600 2041826 2002477 1996640 2006034 1996792 2017488 1998737 2095345 2025889 2086204
8795 2086204 2096017 2080355 2060260 2062658 1987882 2130289 2083154 2025159 1993185 2159893 1995515
8784 1995515 1943449 2037351 1943959 1988216 2011271 1975940 2009493 1905027 1968719 1881264 1886574
8773 1886574 1840486 1879560 1864961 1843273 1851928 1845840 1835577 1799843 1875174 1816487 1771667 1788266
8761 1788266 1826471 1756569 1752185 1812974 1761500 1817452 1802847 1658384 1777296 1754012 1786041
8750 1786041 1738839 1810712 1681114 1669853 1677573 1648461 1589393 1609923 1644370 1579110 1551316
8739 1551316 1511104 1556050 1504670 1423176 1441562 1438367 1443720 1466665 1410613 1453874 1431915 1349191
8727 1349191 1316746 1323768 1353976 1332127 1390936 1485959 1297043 1292287 1296766 1354954 1306147 1270788
$$ packed form
8807B015267p5776L1109P1226l9349n837R394r242K0696j8751R6608o9456O0315
8795B086204R813j5662k0095K398p4776J42407m7135n7995l1974J66708j64378
8784A995515n2066R3902r3392M4257K3055l5331L3553j04466O3692q7455N310
8773A886574m6088L9074j4599k1688Q655o088j0263l5734P5331n8687m4820J6599
8761A788266L8205o9902m384O0789n1474N5952j4605j44463J18912k3284L2029
8750A786041m7202P1873j29598j1261P720k9112n9068K0530L4447o5260k7794
8739A551316m0212M4946n1380q1494J8386l195N353K2945n6052M3261k1959q2724
8727A349191l2445P022L0208k1849N8809R5023j88916m756M479N8188m8807l5359
$$ plain form
8715 1270788 1248095 1276091 1214634 1225136 1292416 1252581 1176890 1179534 1187302 1168162 1174932 1068768
8703 1068768 1131296 1109848 1058698 1180121 1102148 1143756 1145262 1128868 1106101 1140452 1050954
8692 1050954 1101594 1096678 1086978 1035278 1048013 1122284 1009863 1036619 988028 1031433 943830 946419
8680 946419 1022130 1009957 1050252 917815 949580 992218 993552 883073 1004851 1023466 966030
8669 966030 914967 915280 842658 897927 886804 898714 947308 906632 954201 828159 858155 946638
8657 946638 930683 932384 874566 945851 865001 837627 825047 881851 813140 868469 835751 792395
8645 792395 850465 747526 768924 781919 839361 857311 841170 807288 746587 854136 771986
8634 771986 793696 731945 849379 764263 745302 748093 775314 785901 808843 791319 763640 768862
$$ packed form
8715A270788k2693K7996o1457J0502O7280l9835p5691K644P768j9140O770j06164
8703A068768O2528k1448n1150J21423p7973M1608J506j6394k2767L4351q9498
8692A050954N0640m916r700n1700J2735P4271j12421K6756m8591M3405q7603K589
8680I46419P5711j2173M0295j32437L1765M2638J334j10479J21778J8615n7436
8669I66030n1063L13p2622N5269j1123J1910M8594m0676M7569j26042K9996Q8483
8657I46638j5955J701n7818P1285q0850k7374j2580N6804o8711N5329l2718m3356
8645G92395N8070j02939K1398J2995N7442J7950j6141l3882o0701J07549q2150
8634G71986K1710o1751J17434q5116j8961K791K7221J0587K2942j7524k7679N222
$$ plain form
8622 768862 781535 738166 724725 709079 744565 750192 718600 836679 712172 727105 760999
8611 760999 737658 707997 683290 681509 709257 773848 767917 802532 705944 731615 747355 701004
8599 701004 784435 696699 715794 673980 728223 739750 753796 619060 651144 647060 741377 698773
8587 698773 641840 740942 662560 593388 661531 610736 711264 604892 720572 675437 617929
8576 617929 671438 610371 692413 649886 652150 550152 625625 646200 633768 636736 643849 701801
8564 701801 694757 520731 574468 612080 658981 597441 612994 572330 746920 656582 595601
8553 595601 617822 567089 573592 575334 589163 627795 612769 632835 633729 645259 555173 534629
8541 534629 573526 615614 528003 521039 555624 573785 569904 525693 486302 516560 560965 418593
$$ packed form
8622G68862J2673m3369j3441j5646L5486N627l1592J18079j24507J4933L3894
8611G60999k3341k9661k4707j781K7748O4591n931L4615r6588K5671J5740m6351
8599G01004Q3431q7736J9095m1814N4243J1527J4046j34736L2084m084R4317m2604
8587F98773n6933R9102p8382o9172O8143n0795J00528j06372J15680m5135n7508
8576F17929N3509o1067Q2042m2527K264j01998P5473K0575j2432K968P113N7952
8564G01801p044j74026N3737L7612M6901o1540J5553m0664J74590r0338o0981
8553E95601K2221n0733O503J742J3829L8632j5026K0066Q94J1530r0086k0544
8541E34629L8897M2088q7611o964L4585J8161l881m4211l9391L0258M4405j42372
$$ plain form
8529 418593 921860 679818 594244 630211 635922 582315 609024 616847 548206 580618 579688 625507
8517 625507 505648 529149 692586 563952 578330 564040 556479 578811 511713 550143 583083
8506 583083 608555 567515 522866 491445 456495 517538 486957 503699 555099 530407 469531 530336
8494 530336 563937 576846 507605 514404 537944 465534 452785 609593 489518 563668 524468
8483 524468 578472 547987 491766 507476 540463 519358 556238 523345 506605 510882 458718 486477
8471 486477 517539 613387 515364 513492 462397 398992 511579 467242 507991 541277 397798
8460 397798 404146 467368 422652 452424 441799 405803 480571 482154 354046 458050 428713 506901
8448 506901 478221 536456 503732 506453 453522 526569 486335 399596 425141 397816 460383 399492
$$ packed form
8529D18593N03267k42042q5574L5967N711n3607K6709P823o8641L2412r30M5819
8517F25507j19859K3501J63437j28634J4378j4290p561K2332o7098L8430L2940
8506E83083K5472m1040m4649l1421l4950O1043l0581J6742N1400k4692o0876O0805
8494E30336L3601J2909o9241O799K3540p2410j2749J56808j20075P4150l9200
8483E24468N4004l0485n6221J5710L2987k1105L6880l2893j6740M277n2164K7759
8471D86477L1062R5848r8023j872n1095o3405J12587m4337M0749L3286j43479
8460C97798O348O3222m4716K9772j0625l5996P4768J583j28108J04004k9337P8188
8448E06901k8680N8235l2724K721n2931P3047m0234q6739K5545k7325O2567o0891
$$ plain form
8436 399492 497252 432230 490801 581640 514596 462089 471261 494279 493270 424241 480385 522103
8424 522103 490545 495692 542493 517387 419233 566566 446195 437665 527916 523785 491195 407396
8412 407396 494894 449374 418164 481532 467999 416357 468863 478169 462471 510060 487466 432726
8400 432726 417581 504556 426788 499318 481665 431952 400417 461579 437964 451017 476593 485008
8388 485008 444958 412071 419740 496926 404217 399805 468507 412329 454048 459822 458199 485975
8376 485975 440678 386021 445489 415540 392366 341839 511541 376333 434226 399724 379448
8365 379448 417929 425860 431703 390695 429035 437418 355546 380076 339504 390663 300208 439202
8353 439202 492070 400333 346693 394607 376350 420099 353902 398586 392856 421793 442329 336988
$$ packed form
8436C99492R7760o5022N8571R0839o7044n2507R172K3018j009o9029N6144M1718
8424E22103l1558N147M6801k5106r8154J47333j20371q530R0251m131l2590q3799
8412D07396Q7498m5520l1210O3368j3533n1642N2506R306j5698M7589k2594n4740
8400D32726j5145Q6975p7768P2530j7653m9713l1535O1162k3615J3053K5576Q415
8388D85008m0050l2887P669P7186r2709m412O8702n6178M1719N774j623K7776
8376D85975m5297n4657N9468k9949k3174n0527J69702j35208N7893l4502k0276
8365C79448L8481P931N843m1008L8340Q383q1872K4530m0572N1159r0455J38994
8353D39202N2868r1737n3640M7914j8257M3749o6197M4684n730K8937K0536j05341
$$ plain form
8341 336988 473884 428586 317309 483730 454050 289249 342724 356405 416098 354909 299145
8330 299145 428706 324032 381691 429197 364427 297088 315758 401903 367043 400900 346682
8319 346682 405280 362896 464565 351045 415982 357303 404842 326298 406460 365715 358807
8308 358807 370917 455544 366315 298832 354344 408520 346784 364584 400676 412331 363660 440718
8296 440718 359460 387428 362540 397225 445068 341488 349584 377065 424460 386570 401707 343345
8284 343345 394108 320202 368417 315267 391047 377014 363094 301708 312329 426659 428359 335068
8272 335068 312598 231240 281546 327294 405063 347257 336788 396080 374930 396907 405658 340936
8260 340936 411138 325203 375495 250159 384678 346055 429959 410346 365638 399799 327765
$$ packed form
8341C36988J36896m5298j11277J66421k9680j64801N3475J3681N9693o1189n5764
8330B99145J29561j04674N7659M7506o4770o7339J8670Q6145l4860L3857n4218
8319C46682N8598m2384J01669j13520O4937n8679M7539p8544Q0162m0745o908
8308C58807J2110Q4627q9229o7483N5512N4176o1736J7800L6092J1655m8671P7058
8296D40718q1258K7968k4888L4685M7843j03580Q096K7481M7395l7890J5137n8362
8284C43345N0763p3906M8215n3150P5780j4033j3920o1386J0621J14330J700r3291
8272C35068k2470q1358N0306M5748P7769n7806j0469N9292k1150K1977Q751o4722
8260C40936P0202q5935N0292j25336J34519l8623Q3904j9613m4708L4161p2034
$$ plain form
8249 327765 364387 248621 357680 282225 384733 352006 374421 415947 384684 342897 370272
8238 370272 337413 384167 321116 358104 386163 375356 391080 261868 459609 330213 303078
8227 303078 376536 403224 417089 340646 354239 336077 296935 382934 365630 377865 351136 345697
8215 345697 374430 265120 374595 365169 395941 271902 393619 394417 386777 413432 391549 335015
8203 335015 363253 323132 411939 305044 303307 371060 414745 256103 357566 312044 325711
8192 325711 488123 555601 593529 340287 373609 359716 341183 445874 318356 381549 491400
8181 491400 382549 402945 413040 473832 456489 537528 484193 446538 545421 437010 484679
8170 484679 391911 489159 466869 442191 479205 482402 433760 456352 489295 471869 518950 453367
$$ packed form
8249C27765L6622j15766J09059p5455J02508l2727K2415M1526l1263m1787K7375
8238C70272l2859M6754o3051L6988K8059j0807J5724j29212J97741j29396k7135
8227C03078P3458K6688J3865p6443J3593j8162l9142Q5999j7304J2235k6729n439
8215C45697K8733j09310J09475r426L0772j24039J21717P98p640K6655k1883n6534
8203C35015K8238m0121Q8807j06895j737O7753M3685j58642J01463m5522J3667
8192C25711J62412O7478L7928k53242L3322j3893j8533J04691j27518O3193J09851
8181D91400j08851K0396J0095O0792j7343Q1039n3335l7655R8883j08411M7669
8170D84679r2768R7248k2290k4678L7014L197m8642K2592L2943j7426M7081o5583
$$ plain form
8158 453367 544020 486299 467080 536265 536016 509846 541751 494582 540036 653917 609741 578616
8146 578616 585120 586749 515840 579179 611105 615635 498465 638997 613792 638383 657537 608857
8134 608857 592217 683498 696029 603424 655315 642372 652535 629848 686476 628787 628098 737057
8122 737057 697327 653691 644824 588943 653626 622919 664559 680360 683402 734607 722349 744788
8110 744788 649945 579605 656081 642744 659357 675077 726566 739285 624513 653047 693443
8099 693443 745002 831243 693393 773128 690627 767964 711494 750198 819486 751864 819907
8088 819907 771816 660671 835827 803484 810855 764411 848618 844775 770048 860207 868710 831328
8076 831328 833700 877062 884398 907605 916289 852811 821971 935635 887708 883413 888426 960989
$$ packed form
8158D53367R0653n7721j9219O9185k49k6170L1905m7169M5454J13881m4176l1125
8146E78616O504J629p0909O3339L1926M530j17170J40532k5205K4591J9154m8680
8134F08857j6640R1281J2531r2605N1891j2943J0163k2687N6628n7689o89J08959
8122G37057l9730m3636q867n5881O4683l0707M1640J5801L042N1205j2258K2439
8110G44788r4843p0340P6476j3337J6613J5720N1489J2719j14772K8534M0396
8099F93443N1559Q6241j37850P9735q2501P7337n6470L8704O9288o7622O8043
8088H19907m8091j11145J75156l2343P371m6444Q4207l843p4727R0159Q503l7382
8076H31328K372M3362P336K3207Q684o3478l0840J13664m7927m295N013P2563
$$ plain form
8064 960989 907518 919619 935909 958240 948749 896078 992083 866561 1036577 923105 965241
8053 965241 963712 994450 976229 1033737 1045755 1028136 1011801 1088547 1055450 954360 1021200 1029614
8041 1029614 1040197 1043902 995664 1123252 1098416 1119619 1202909 1185852 1135469 1221885 1229802 1221435
8029 1221435 1231255 1298178 1258711 1287071 1228372 1222029 1295277 1196906 1209503 1182014 1324534 1279754
8017 1279754 1147334 1232763 1180753 1301134 1274465 1324299 1251860 1215954 1206699 1244327 1276343
8006 1276343 1269155 1272117 1236097 1127582 1239408 1193367 1247751 1258814 1249420 1275779 1319933 1241439
7994 1241439 1326911 1332619 1267897 1332288 1404857 1320970 1368949 1367211 1353021 1334932 1355374 1281883
7982 1281883 1328130 1371943 1342059 1340354 1355378 1416877 1438761 1328796 1361813 1479268 1420708
$$ packed form
8064I60989n3471J2101J6290K2331r491n2671R6005j25522J70016j13472M2136
8053I65241j529L0738j8221N7508J2018j7619j6335P6746l3097j01090O6840Q414
8041A029614J0583L705m8238J27588k4836K1203Q3290j7057n0383Q6416P917q367
8029A221435R820O6923l9467K8360n8699o343P3248r8371J2597k7489J42520m4780
8017A279754j32420Q5429n2010J20381k6669M9834p2439l5906r255L7628L2016
8006A276343p188K962l6020j08515J11826m6041N4384J1063r394K6359M4154p8494
7994A241439Q5472N708o4722O4391P2569q3887M7979j738j4190j8089K0442p3491
7982A281883M6247M3813k9884j705J5024O1499K1884j09965L3017J17455n8560
$$ plain form
7971 1420708 1419954 1462237 1458947 1418298 1517693 1545968 1481130 1491493 1556749 1540760 1555286 1535601
7959 1535601 1535960 1522256 1473921 1489117 1516169 1458458 1521759 1499815 1487459 1427578 1515865 1520231
7947 1520231 1418193 1544840 1483130 1477137 1590803 1430864 1471298 1575657 1586009 1508976 1510807
7936 1510807 1482056 1517182 1452531 1439554 1453066 1507531 1506736 1491147 1571971 1475783 1561137 1579281
7924 1579281 1629549 1561009 1543389 1587714 1541067 1474702 1562974 1515580 1447748 1446989 1497170 1346307
7912 1346307 1413138 1377620 1323845 1328219 1393113 1456517 1343389 1402457 1357719 1419450 1326220
7901 1326220 1347976 1382212 1361935 1423802 1381343 1359922 1328940 1270608 1324799 1313323 1221492
7890 1221492 1169192 1322170 1198384 1187686 1245937 1186906 1239702 1093767 1204446 1245592 1189748
$$ packed form
7971A420708p54M2283l290m0649R9395K8275o4838J0363O5256j5989J4526j9685
7959A535601L59j3704m8335J5196K7052n7711O3301k1944j2356n9881Q8287M366
7947A520231j02038J26647o1710n993J13666j59939M0434J04359J0352p7033J831
7936A510807k8751L5126o4651j2977J3512N4465p95j5589Q0824r6188Q5354J8144
7924A579281N0268o8540j7620M4325m6647o6365Q8272m7394o7832p59N0181j50863
7912A346307O6831l5518n3775M374O4894O3404j13128N9068m4738O1731r3230
7901A326220K1756L4236k0277O1867m2459k1421l0982n8332N4191j1476r1831
7890A221492n2300J52978j23786j0698N8251n9031N2796j45935J10679M1146n5844
$$ plain form
7879 1189748 1239850 1171389 1258444 1165251 1149726 1178098 1253384 1083051 1134534 1152675 1080832
7868 1080832 1085895 1015771 1111515 994864 1080332 1073442 1059478 1148628 1110686 1153361 1165883 1198367
7856 1198367 1341088 1180843 822320 955805 1108039 1069864 1121588 1056202 1051142 867633
7846 867633 1009535 1016864 1021879 1037488 986082 930048 922367 874904 943143 907596 1022091 948484
7834 948484 943902 959351 1016690 925258 938584 898906 915146 940432 842347 882626 935361 948735
7822 948735 991553 912801 936321 894727 1022158 884198 871481 900232 887033 901864 832493
7811 832493 944525 859553 830812 821983 790599 748928 801888 745268 735985 665870 691826 702541
7799 702541 683612 679534 740810 723034 763170 576893 734077 703374 673309 700836 706813 682957
$$ packed form
7879A189748N0102o8461Q7055r3193j5525K8372P5286j70333N1483J8141p1843
7868A080832N063p0124R5744j16651Q5468o890j3964Q9150l7942M2675J2522L2484
7856A198367J42721j60245l58523J33485J52234l8175N1724o5386n060j83509
7846H67633J41902P329N015J5609n1406n6034p681m7463O8239l5547J14495p3607
7834I48484m582J5449N7339r1432J3326l9678J6240K5286r8085M0279N2735J3374
7822I48735M2818p8752K3520m1594J27431j37960j2717K8751j3199J4831o9371
7811H32493J12032q4972k8741q829l1384m1671N2960n6620r283p0115K5956J0715
7799G02541j8929m078O1276j7776M0136j86277J57184l0703l0065K7527N977k3856
$$ plain form
7787 682957 721506 660373 735817 650620 782892 686609 665450 651579 618772 648903 704436
7776 704436 635828 692820 633600 651766 666733 642694 595135 618960 591324 574651 644420 674199
7764 674199 658899 672013 658054 610554 624939 664414 604760 676785 562569 650916 650692 621314
7752 621314 583943 610716 572540 582424 664527 614461 629545 572405 516194 597728 569602 597300
7740 597300 515669 559798 537045 580680 507481 598712 569935 546418 554535 518260 524846 690125
7728 690125 641304 539938 537236 500436 541978 536033 535736 481797 547646 544644 573256 615871
7716 615871 488443 594243 522449 500708 493114 519363 482527 542844 507898 526783 525302 586100
7704 586100 566289 545520 561791 548830 509958 508396 524560 503982 597323 639020 474591 577938
$$ packed form
7787F82957L8549o1133P5444q5197J32272r6283k1159j3871l2807L0131N5533
7776G04436o8608N6992n9220J8166J4967k4039m7559K3825k7636j6673O9769K9779
7764F74199j5300J3114j3959m7500J4385L9475n9654P2025j14216Q8347k24k9378
7752F21314l7371K6773l8176R884Q2103n0066J5084n7140n6211Q1534k8126K7698
7740E97300q1631M4129k2753M3635p3199R1231k8777k3517Q117l6275O586J65279
7728F90125m8821j01366k702l6800M1542n945k97n3939O5849l002K8612M2615
7716F15871j27428J05800p1794k1741p594K6249l6836O0317l4946J8885j481O0798
7704E86100j9811k0769J6271j2961l8872j562J6164k0578R3341M1697j64429J03347
$$ plain form
7692 577938 583339 563715 557648 507663 608903 572858 523954 519118 539448 544641 532737 594162
7680 594162 604834 508886 572172 587831 457263 549065 575897 560605 615058 529849 574039
7669 574039 568966 529119 623069 550864 579531 522515 504894 527267 594588 471709 628564
7658 628564 674586 557982 537623 543743 607473 564293 607116 555542 561691 560806 575668 582837
7646 582837 580262 540281 630288 598208 581744 536962 619690 529706 695722 496108 620681
7635 620681 672968 522300 625981 627109 636422 650725 604104 696214 578664 616491 550563
7624 550563 581672 631690 630833 734135 683998 706459 723262 603561 695602 722393 749210 694998
7612 694998 734444 595215 835906 788642 780834 706939 751130 897175 833336 827959 772512
$$ packed form
7692E77938N401j9624o067m9985J01240l6045m8904m836K0330N193j1904O1425
7680E94162J0672r5948O3286J5659j30568R1802K6832j5292N4453q5209M4190
7669E74039n073l9847R3950p2205K8667n7016j7621K2373O7321j22879J56855
7658F28564M6022j16604k0359O120O3730m3180M2823n1574O149q85J4862P169
7646E82837k575l9981R0007l2080j6464m4782Q2728q9984J66016j99614J24573
7635F20681N2287j50668J03681J128R313J4303m6621R2110j17550L7827o5928
7624E50563L1109N0018q57J03302n0137K2461J6803j19701R2041K6791K6817n4212
7612F94998L9446j39229K40691m7264p808p3895M4191J46045o3839n377n5447
$$ plain form
7601 772512 804694 798843 747876 879375 943435 973143 949741 959505 918942 1093557 1054521 1108062
7589 1108062 1174075 1155417 1246011 1232151 1292032 1261515 1273759 1398363 1382720 1320659 1353253
7578 1353253 1298928 1298290 1311031 1273946 1309835 1227763 1308792 1233332 1302391 1172644 1131072 1201582
7566 1201582 1178833 1167749 1174449 1154473 1206829 1256975 1275923 1266683 1359621 1355114 1366892 1475072
7554 1475072 1487581 1497952 1636323 1635566 1612541 1732004 1705607 1783805 1760691 1802526 1831614
7543 1831614 1798185 1891899 1759682 1831680 1880702 1815399 1851990 1832374 1827388 1823370 1845988 1714051
7531 1714051 1720307 1748587 1766440 1756736 1762818 1777808 1695856 1627886 1697275 1637079 1697977 1700136
7519 1700136 1729527 1825991 1715008 1734888 1822666 1854805 1784319 1890253 1858869 1909197 1890543
$$ packed form
7601G72512L2182n851n0967J31499O4060K9708k3402R764m0563J74615l9036N3541
7589A108062O6013j8658R0594j3860N9881l0517J2244J24604j5643o2061L2594
7578A353253n4325o38J2741l7085L5889q2072Q1029p5460O9059j29747m1572P0510
7566A201582k2749j1084O700j9976N2356N0146J8948r240R2938m507J1778J08180
7554A475072J2509J0371J38371p57k3025J19463k6397P8198k3114M1835K9088
7543A831614l3429R3714j32217P1998M9022o5303L6591j9616m986m018K2618j31937
7531A714051O256K8280J7853r704O082J4990q1952o7970O9389o0196O0898K159
7519A700136K9391R6464j10983J9880Q7778L2139p0486J05934l1384N0328j8654
$$ plain form
7508 1890543 1907795 1772050 1729391 1788437 1789197 1703195 1730656 1612254 1521443 1572400 1449250
7497 1449250 1575946 1424995 1455468 1482894 1512526 1333867 1471407 1477897 1395997 1426768 1443703
7486 1443703 1438028 1514919 1533946 1458587 1443735 1513989 1503056 1561143 1517338 1566900 1537188 1575874
7474 1575874 1546045 1659099 1638906 1636914 1649010 1685938 1728168 1759767 1646707 1770531 1606408
7463 1606408 1643751 1831264 1702830 1703818 1826947 1727727 1765365 1770381 1745756 1777232 1696967
7452 1696967 1690759 1810206 1816753 1818321 1830594 1840786 1893997 1907658 2006060 1990962 1947313 2019396
7440 2019396 2070399 2061425 2146978 2173224 2144551 2143324 2085179 2158504 2172467 2170724 2114158 2068112
7428 2068112 2084791 2136021 2145826 2052989 2122885 2118182 2131773 2136597 2239033 2151275 2221174 2200923
$$ packed form
7508A890543J7252j35745m2659N9046P60q6002K7461j18402r0811N0957j23150
7497A449250J26696j50951L0473K7426K9632j78659J37540O490q1900L0771J6935
7486A443703n675P6891J9027p5359j4852P0254j0933N8087m3805M9562k9712L8686
7474A575874k9829J13054k0193j992J2096L6928M2230L1599j13060J23824j64123
7463A606408L7343J87513j28434R88J23129r9220L7638N016k4625L1476q0265
7452A696967o208J19447O547J568J2273J0192N3211J3661R8402j5098m3649P2083
7440B019396N1003q974Q5553K6246k8673j227n8145P3325J3963j743n6566m6046
7428B068112J6679N1230R805r2837O9896m703J3591M824J02436q7758O9899k0251
$$ plain form
7416 2200923 2334670 2276540 2276119 2234915 2189318 2234612 2252457 2238093 2171372 2194742 2209834 2131013
7404 2131013 2138097 2147142 2180485 2214002 2153105 2162308 2178871 2166296 2149100 2182028 2152412 2250603
7392 2250603 2209483 2287675 2206786 2233860 2275879 2296270 2398066 2421257 2447865 2602317 2573312
7381 2573312 2679073 2696482 2739403 2825827 2952282 3012190 3115743 3177150 3249748 3300567 3323641
7370 3323641 3423452 3519993 3481694 3431319 3579391 3550553 3574865 3579146 3540652 3595167 3645023
7359 3645023 3566602 3608709 3521102 3504185 3508663 3413911 3374876 3323220 3325856 3287829 3198566 3132572
7347 3132572 3130411 3038075 3050537 3041582 3008642 3023153 3039165 3106138 3105233 3006812 3056470 3107692
7335 3107692 3147858 3216502 3174375 3183513 3367651 3303707 3409459 3429389 3474275 3617300 3571185
$$ packed form
7416B200923J33747n8130m21m1204m5597M5294J7845j4364o6721K3370J5092p8821
7404B131013P084R045L3343L3517o0897R203J6563j2575j7196L2928k9616R8191
7392B250603m1120P8192q0889K7074M2019K0391J01796K3191K6608J54452k9005
7381B573312J05761J7409M2921Q6424J26455N9908J03553O1407P2598N0819K3074
7370C323641R9811R6541l8299n0375J48072k8838K4312M281l8494N4515M9856
7359C645023p8421M2107q7607j6917M478r4752l9035n1656K636l8027q9263o5994
7347C132572k161r2336J2462q955l2940J4511J6012O6973r05r8421M9658N1222
7335C107692M0166O8644m2127R138J84138o3944J05752J9930M4886J43025m6115
$$ plain form
7324 3571185 3560874 3673132 3714976 3665906 3660938 3659026 3702077 3658390 3624865 3514550 3474196
7313 3474196 3445224 3345006 3293698 3141529 3153163 3055221 2915901 2948077 2941246 2788354 2781344
7302 2781344 2749391 2654583 2650888 2628235 2635679 2656442 2498362 2545534 2480210 2459614 2561768
7291 2561768 2464651 2519169 2518901 2510053 2375527 2367646 2461030 2399399 2378966 2295436 2365935 2353410
7279 2353410 2344037 2316716 2357864 2352807 2294005 2403600 2315495 2286499 2343845 2385341 2400365 2391862
7267 2391862 2394423 2366967 2462561 2395120 2466639 2507692 2577087 2487407 2598782 2668112 2662510 2586254
7255 2586254 2579581 2657688 2764638 2637296 2633219 2659731 2583710 2559013 2525198 2505397 2500941 2501321
7243 2501321 2449295 2397672 2405794 2334600 2338361 2313452 2267067 2279309 2220552 2299758 2254085 2129672
$$ packed form
7324C571185j0311J12258M1844m9070m968j912M3051m3687l3525j10315m0354
7313C474196k8972j00218n1308j52169J1634r7942j39320L2176o831j52892p010
7302B781344l1953r4808l695k2653P444K0763j58080M7172o5324k0596J02154
7291B561768r7117N4518k68q848j34526p881R3384o1631k0433q3530P0499j2525
7279B353410r373k7321M1148n057n8802J09595q8105k8996N7346M1496J5024q503
7267B391862K561k7456R5594o7441P1519M1053O9395q9680J11375O9330n602p6256
7255B586254o673P8107J06950j27342m077K6512p6021k4697l3815j9801m456L80
7243B501321n2026n1623Q122p1194L761k4909m6385J2242n8757P9206m5673j24413
$$ plain form
7231 2129672 2155738 2101731 2208100 2149150 2163412 2124742 2206159 2196852 2118313 2080455 2070896 2086713
7219 2086713 2164719 2087776 2130587 2089827 2123888 2074868 2095824 2038783 2026692 2026423 2054803 2134518
7207 2134518 2116015 2001015 2050013 2146628 2196343 2096206 2033494 2159309 2110692 2081473 2108808
7196 2108808 2110697 2162180 2127485 2152124 2166929 2156899 2190945 2223903 2222432 2186474 2211726 2247582
7184 2247582 2253939 2213341 2123275 2095217 2130413 2143755 2093066 2094845 2128542 2061514 1972298 2051922
7172 2051922 1925859 2057994 1942594 1911538 1900206 1900315 2001252 1846036 2019847 1918621
7162 1918621 1878621 1821182 1898057 1880265 1839095 1918867 1867844 2011354 1989538 2009592 1977262
7151 1977262 2025925 1870128 1983478 1954886 2020652 2014984 2043141 2029915 2094624 2146614 2166963
$$ packed form
7231B129672K6066n4007J06369n8950J4262l8670Q1417r307p8539l7858r559J5817
7219B086713P8006p6943M2811m0760L4061m9020K0956n7041j2091k69K8380P9715
7207B134518j8503j15000M8998R6615M9715j00137o2712J25815m8617k9219K7335
7196B108808J889N1483l4695K4639J4805j0030L4046L2958j471l5958K5252L5856
7184B247582O357m0598r0066k8058L5196J3342n0689J779L3697o7028q9216P9624
7172B051922j26063J32135j15400l1056j1332J09J00937j55216J73811j01226
7162A918621m0000n7439P6875j7792m1170P9772n1023J43510k1816K0054l2330
7151A977262M8663j55797J13350k8592O5766n668K8157j3226O4709N1990K0349
$$ plain form
7140 2166963 2173582 2330219 2303541 2336821 2412283 2424750 2525410 2477265 2506702 2607996 2614807
7129 2614807 2535879 2594677 2740578 2670892 2750204 2675519 2667019 2564656 2585097 2493896 2401920
7118 2401920 2463722 2396272 2318117 2353784 2235927 2244348 2270959 2198428 2218374 2114995 2159146
7107 2159146 2186866 2158624 2148463 2170578 2091775 2154220 2106283 2189100 2206665 2163966 2188804
7096 2188804 2167150 2146412 2201006 2276146 2240777 2256051 2310724 2296726 2373045 2375634 2407148 2366352
7084 2366352 2427983 2502831 2482710 2523981 2544600 2635429 2651117 2703805 2711301 2827216 2760192
7073 2760192 2816795 2846169 2803130 2834778 2885530 2787815 2755437 2758963 2684486 2656799 2618325 2570475
7061 2570475 2456903 2494900 2472551 2413833 2402048 2411876 2346237 2381566 2364527 2341668 2326296
$$ packed form
7140B166963O619J56637k6678L3280P5462J2467J00660m8145K9437J01294O811
7129B614807p8928N8798J45901o9686P9312p4685q500j02363K0441r1201r1976
7118B401920O1802o7450p8155L5667j17857Q421K6611p2531J9946j03379M4151
7107B159146K7720k8242j0161K2115p8803O2445m7937Q2817J7565m2699K4838
7096B188804k1654k0738N4594P5140l5369J5274N4673j3998P6319K589L1514m0796
7084B366352O1631P4848k0121M1271K0619R0829J5688N2688P496J15915o7024
7073B760192N6603K9374m3039L1648N0752r7715l2378L526p4477k7687l8474m7850
7061B570475j13572L7997k2349n8718j1785R828o5639L5329j7039k2859j5372
$$ plain form
7050 2326296 2322459 2319040 2328432 2360033 2303659 2314446 2342457 2361278 2371997 2403819 2424434 2456324
7038 2456324 2478147 2562746 2527197 2564658 2589087 2652105 2615351 2664838 2656612 2662357 2624631 2606328
7026 2606328 2617391 2577496 2537577 2667206 2588753 2572400 2564385 2636700 2677070 2623531 2713603
7015 2713603 2636695 2667302 2609840 2660623 2634098 2609570 2642512 2613922 2649626 2655673 2615032 2580726
7003 2580726 2622792 2557256 2606334 2693389 2616987 2586732 2545363 2611672 2599949 2615698 2569230
6992 2569230 2751992 2707417 2684263 2657535 2665972 2790691 2700717 2759331 2808111 2851344 2913703
6981 2913703 2934471 2999605 3045167 3033181 3116345 3233512 3172677 3292856 3429204 3520396 3551233
6970 3551233 3695079 3785932 3903912 3958532 4090778 4196714 4338148 4373481 4480358 4470965
$$ packed form
7050B326296l837l419R392L1601n6374J0787K8011J8821J0719L1822K0615L1890
7038B456324K1823Q4599l5549L7461K4429O3018l6754M9487q226N745l7726j8303
7026B606328J1063l9895l9919J29629p8453j6353q015P2315M0370n3539R0072
7015B713603p6908L0607n7462N0783k6525k4528L2942k8590L5704O047m0641l4306
7003B580726M2066o5536M9078Q7055p6402l0255m1369O6309j1723J5749m6468
6992B569230J82762m4575k3154k6728Q437J24719q9974N8614M8780M3233O2359
6981B913703K0768O5134M5562j1986Q3164J17167o0835J20179J36348R1192L0837
6970C551233J43846R0853J17980N4620J32246J05936J41434L5333J06877r393
$$ plain form
6960 4470965 4416541 4431260 4412509 4389289 4257316 4129202 4032592 4028340 3915228 3872625 3783318
6949 3783318 3646137 3704584 3620691 3711027 3593449 3576431 3539081 3494197 3431497 3386220 3407288
6938 3407288 3412597 3397414 3363701 3370465 3335090 3391089 3340162 3367112 3421226 3358942 3360598 3365603
6926 3365603 3369742 3306298 3390053 3402674 3354973 3483966 3495148 3447658 3563818 3393931 3490165
6915 3490165 3637932 3518192 3584206 3453442 3559378 3689610 3616716 3665215 3718816 3741496
6905 3741496 3726393 3762237 3813177 3812122 3790065 3834087 3881706 3882359 3920387 4073485 3962687 4035577
6893 4035577 4068224 4023772 4137272 4179169 4131401 4261224 4179263 4334069 4299178 4335249 4518225
6882 4518225 4502431 4523541 4495096 4582347 4653113 4644731 4742821 4837748 4907404 4906155 4951022 4951808
$$ packed form
6960D470965n4424J4719j8751k3220j31973j28114r6610m252j13112m2603q9307
6949C783318j37181N8447q3893R0336j17578j7018l7350m4884o2700m5277K1068
6938C407288N309j5183l3713O764l5375N5999n0927K6950N4114o2284J656N005
6926C365603M139o3444Q3755J2621m7701J28993J1182m7490J16160j69887R6234
6915C490165J47767j19740O6014j30764J05936J30232p2894M8499N3601K2680
6905C741496j5103L5844N0940j055k2057M4022M7619O53L8028J53098j10798P2890
6893D035577L2647m4452J13500M1897m7768J29823q1961J54806l4891L6071J82976
6882D518225j5794K1110k8445Q7251P0766q382R8090R4927O9656j249M4867P86
$$ plain form
6870 4951808 5152371 5141262 5278865 5316894 5429591 5479099 5482752 5650933 5695222 5760922 5825608
6859 5825608 5819162 6044874 6041515 6157259 6285091 6361101 6464445 6617526 6758464 6884489
6849 6884489 6979213 7192380 7231713 7443110 7569564 7745086 7833836 8124277 8298340 8466499
6839 8466499 8624101 8892176 9168244 9439504 9658208 9926967 10251167 10626666 10914884 11322540
6829 11322540 11643906 11990154 12489962 12865648 13247815 13728064 14073787 14391436 14719967
6820 14719967 14882434 15160856 15200034 15302016 15173300 15352920 15277761 15224271 15180766 15276582
6810 15276582 15341890 15414372 15506853 15730236 15968529 16189461 16388890 16697076 17054048 17352721
6800 17352721 17815385 18131127 18471447 18945223 19415741 19870801 20345425 20917064 21370546
$$ packed form
6870D951808K00563j1109J37603L8029J12697M9508L653J68181M4289O5700O4686
6859E825608o446K25712l359J15744J27832P6010J03344J53081J40938J26025
6849F884489R4724K13167L9333K11397J26454J75522Q8750K90441J74063J68159
6839H466499J57602K68075K76068K71260K18704K68759L24200L75499K88218M07656
6829A1322540L21366L46248M99808L75686L82167M80249L45723L17649L28531
6820A4719967J62467K78422L9178J01982j28716J79620p5159n3490m3505R5816
6810A5276582O5308P2482R2481K23383K38293K20932J99429L08186L56972K98673
6800A7352721M62664L15742L40320M73776M70518M55060M74624N71639M53482
$$ plain form
6791 21370546 22031597 22645649 23393329 24095186 24998850 25963810 26862348 28100684 29325423
6782 29325423 30599047 32097908 33562476 35267187 37213997 39299084 41592110 44108534
6774 44108534 46936739 50189080 53846532 58015313 62516207 67405642 72758093 78330989
6766 78330989 83764884 89022094 93892151 98242953 101486742 103654211 104630033 104354832
6758 104354832 102529637 99257292 94902696 89641696 83726282 77552880 71625787 65820230
6750 65820230 60734828 55970309 51921924 48296633 45215702 42407953 39872081 37845658
6742 37845658 35864249 34167366 32684902 31374622 30143533 29093274 28014975 27090584
6734 27090584 26226289 25350587 24608823 23813803 23137587 22658032 22020215 21516404 21052376
$$ packed form
6791B1370546O61051O14052P47680P01857R03664R64960Q98538J238336J224739
6782B9325423J273624J498861J464568J704711J946810K085087K293026K516424
6774D4108534K828205L252341L657452M168781M500894M889435N352451N572896
6766G8330989N433895N257210M870057M350802L243789K167469R75822k75201
6758A04354832j825195l272345m354596n261000n915414o173402n927093n805557
6750F5820230n085402m764519m048385l625291l080931k807749k535872k026423
6742C7845658j981409j696883j482464j310280j231089j050259j078299r24391
6734B7090584q64295q75702p41764p95020o76216m79555o37817n03811m64028
$$ plain form
6725 21052376 20567302 20062268 19588192 19137822 18662561 18246620 17685285 17164281 16673924
6716 16673924 16292301 15750935 15395481 14867292 14517762 14130436 13936627 13675425 13622192 13355047
6706 13355047 13335448 13139297 13185136 13045105 13002373 13018609 13001159 12822572 12860029 12774222 12577890
6695 12577890 12428695 12298151 12038258 11862926 11638584 11390242 11145018 11034126 10780106
6686 10780106 10669578 10503023 10462572 10287490 10248936 10164116 10211942 10194329 10225550 10205685 10156017
6675 10156017 10209130 10215406 10237066 10235339 10334005 10438713 10472654 10609716 10653113 10785139 10894930
6664 10894930 11176710 11229958 11429866 11683972 11878623 12114654 12394193 12697625 13030479 13397061
6654 13397061 13704936 14010320 14420767 14732597 15133304 15383355 15641387 15925981 16060720
$$ packed form
6725B1052376m85074n05034m74076m50370m75261m15941n61335n21004m90357
6716A6673924l81623n41366l55454n28189l49530l87326j93809k61202n3233k67145
6706A3355047j9599j96151M5839j40031m2732J6236j7450j78587L7457q5807j96332
6695A2577890j49195j30544k59893j75332k24342k48342k45224j10892k54020
6686A0780106j10528j66555m0451j75082l8554q4820M7826j7613L1221j9865m9668
6675A0156017N3113O276K1660j727R8666J04708L3941J37062M3397J32026J09791
6664A0894930K81780N3248J99908K54106J94651K36031K79539L03432L32854L66582
6654A3397061L07875L05384M10447L11830M00707K50051K58032K84594J34739
$$ plain form
6645 16060720 16175117 16379617 16628200 16587925 16746679 16759338 16896473 16995226 17030410 17305765
6635 17305765 17662052 17851007 18263198 18635745 19104823 19481900 19849091 20425970 20797510
6626 20797510 21239575 21598752 21933837 22228116 22473488 22691660 22992158 23211448 23407517
6617 23407517 23522380 23661389 23696417 23790700 24011613 24147662 24472407 24751708 25084215 25324970
6607 25324970 25567925 25885159 26008171 26082600 26067173 26081333 26064429 25961795 25899479 25838559
6597 25838559 25807753 25833128 25857835 26087086 25978437 26024739 26129922 26143142 26120576 25931027
6587 25931027 26075018 26103286 26062940 26005955 25900089 25814048 25535645 25176980 24683788 24309397
6577 24309397 23849826 23496393 23280834 23099667 22942369 22751510 22574802 22597474 22452511 22260880
$$ packed form
6645A6060720J14397K04500K48583m0275J58754J2659J37135R8753L5184K75355
6635A7305765L56287J88955M12191L72547M69078L77077L67191N76879L71540
6626B0797510M42065L59177L35085K94279K45372K18172L00498K19290J96069
6617B3407517J14863J39009L5028R4283K20913J36049L24745K79301L32507K40755
6607B5324970K42955L17234J23012P4429j5427J4160j6904j02634o2316o0920
6597B5838559l0806K5375K4707K29251j08649M6302J05183J3220k2566j89549
6587B5931027J43991K8268m0346n6985j05866q6041k78403l58665m93192l74391
6577B4309397m59571l53433k15559j81167j57298j90859j76708K2672j44963j91631
$$ plain form
6567 22260880 21899624 21623823 21057204 20681659 20109057 19631596 19163556 18832902 18321505
6558 18321505 18009716 17609714 17146095 16735559 16296649 16003042 15695462 15611613 15438274 15300937
6548 15300937 15199970 15002661 14842783 14571564 14293135 14053341 13619445 13285611 12781489
6539 12781489 12364826 11994573 11570461 11346900 11076056 10844063 10579166 10457359 10167908
6530 10167908 10063908 9926014 9814955 9664775 9593152 9536289 9482986 9356996 9229694 9075991
6520 9075991 8954740 8990511 8859363 8742745 8661513 8626412 8609410 8531803 8374889 8408877 8408911
6509 8408911 8406891 8377310 8418889 8516310 8391915 8453784 8452304 8425430 8460715 8528221 8526395 8572350
6497 8572350 8544972 8681022 8738555 8760376 8766636 8920669 8932016 9103809 9172488 9324758 9323129
$$ packed form
6567B2260880l61256k75801n66619l75545n72602m77461m68040l30654n11397
6558A8321505l11789m00002m63619m10536m38910k93607l07580q3849j73339j37337
6548A5300937j00967j97309j59878k71219k78429k39794m33896l33834n04122
6539A2781489m16663l70253m24112k23561k70844k31993k64897j21807k89451
6530A0167908j04000j37894j11059j50180p1623n6863n3303j25990j27302j53703
6520I075991j21251L5771j31148j16618q1232l5101j7002p7607j56914L3988L4
6509H408911k020k9581M1579R7421j24395O1869j480k6874L5285O7506j826M5955
6497H572350k7378J36050N7533K1821O260J54033J1347J71793O8679J52270j629
$$ plain form
6486 9323129 9413693 9495036 9518202 9645098 9661215 9728326 9827076 9837088 9874532 9889743 9975330
6475 9975330 10010521 10011032 10016842 10127596 10161072 10247208 10243916 10386577 10435056 10462231 10574374 10625770
6463 10625770 10663480 10730194 10917816 10965894 11140831 11167248 11302223 11394090 11498174 11548392
6453 11548392 11796311 11838958 11978026 12076530 12218820 12445817 12564084 12699941 12784089 12930697
6443 12930697 13064801 13241685 13328110 13478295 13716153 13825434 14033432 14208701 14478053 14763963
6433 14763963 15039689 15151254 15311900 15557498 15720871 16010939 16226918 16348851 16586285
6424 16586285 16825587 16976911 17264170 17390303 17739211 18062763 18439320 18769416 19003764
6415 19003764 19374776 19716004 19934744 20230654 20467117 20540316 20743725 20905166 20911824 21013204
$$ packed form
6486I323129R0564Q1343K3166J26896J6117O7111R8750J0012L7444J5211Q5587
6475I975330L5191N11N810J10754L3476Q6136l292J42661M8479K7175J12143N1396
6463A0625770L7710O6714J87622M8078J74937K6417J34975R1867J04084N0218
6453A1548392K47919M2647J39068R8504J42290K26997J18267J35857Q4148J46608
6443A2930697J34104J76884Q6425J50185K37858J09281K07998J75269K69352K85910
6433A4763963K75726J11565J60646K45598J63373K90068K15979J21933K37434
6424A6586285K39302J51324K87259J26133L48908L23552L76557L30096K34348
6415A9003764L71012L41228K18740K95910K36463P3199K03409J61441O658J01380
$$ plain form
6405 21013204 21203094 21467873 21724755 22158368 22466978 22917702 23491766 24010855 24718880
6396 24718880 25326354 26110184 26921844 27826205 28716846 29668121 30817402 32046742 33257674
6387 33257674 34637953 36179339 37869753 39844294 41968481 44518383 47309331 50373729
6379 50373729 53820037 57405300 60850668 64393007 67731839 70758185 73215517 75118213
6371 75118213 76303138 76800114 76629735 75451125 73815966 71926906 69910270 68096986
6363 68096986 66411823 64882633 63761175 62971483 62289178 61719632 61163196 60367076 59484355
6354 59484355 58307980 57122836 55864284 54928414 53923324 53081327 52417646 51785164 51230425
6345 51230425 50407899 49392752 48120495 46458402 44562745 42420991 40177858 37857375
$$ packed form
6405B1013204J89890K64779K56882M33613L08610M50724N74064N19089P08025
6396B4718880O07474P83830Q11660R04361Q90641R51275J149281J229340J210932
6387C3257674J380279J541386J690414J974541K124187K549902K790948L064398
6379E0373729L446308L585263L445368L542339L338832L026346K457332J902696
6371G5118213J184925M96976j70379j178610j635159j889060k016636j813284
6363F8096986j685163j529190j121458p89692o82305n69546n56436p96120q82721
6354E9484355j176375j185144j258552r35870j005090q41997o63681o32482n54739
6345E1230425q22526j015147j272257j662093j895657k141754k243133k320483
$$ plain form
6337 37857375 35929650 34279936 32735772 31505660 30523289 29500417 28591022 27850920 27156666
6328 27156666 26612571 26064498 25584618 25278556 24874947 24564989 24255289 24049274 23791065
6319 23791065 23505708 23336571 23184898 23040597 22915758 22635057 22541182 22385267 22301607 22134456
6309 22134456 21892111 21907523 21761936 21725336 21642353 21600702 21552061 21710631 21690867 21660599 21727957
6298 21727957 21821599 21841007 21939848 21936358 22097321 22096826 22189174 22269249 22292567 22330944 22330299 22290524
6286 22290524 22223403 22026764 21967837 21925671 21893824 21858687 21882280 21902158 22005789 22095303 22190067
6275 22190067 22212437 22320850 22424999 22518789 22617980 22734449 22808791 22926338 23057664 23054608
6265 23054608 23344050 23295642 23453152 23601983 23786044 23861186 24064264 24267072 24478658 24719072
$$ packed form
6337C7857375j927725j649714j544164j230112r82371j022872r09395p40102o94254
6328B7156666n44095n48073m79880l06062m03609l09958l09700k06015k58209
6319B3791065k85357j69137j51673j44301j24839k80701r3875j55915q3660j67151
6309B2134456k42345J5412j45587l6600q2983m1651m8641J58570j9764l0268O7358
6298B1727957R3642J9408R8841l490J60963m95R2348Q0075K3318L8377o45l9775
6286B2290524o7121j96639n8927m2166l1847l5137K3593J9878J03631Q9514R4764
6275B2190067K2370J08413J04149R3790R9191J16469P4342J17547J31326l056
6265B3054608K89442m8408J57510J48831J84061P5142K03078K02808K11586K40414
$$ plain form
6255 24719072 24935472 25117041 25474882 25726648 25969423 26214396 26444429 26686964 26907633
6246 26907633 27239833 27381954 27764153 27985323 28343026 28664230 29015986 29392750 29785094
6237 29785094 30175939 30658126 31158806 31576074 32118536 32539392 33094169 33621981 34178364
6228 34178364 34719213 35337286 36019223 36800605 37615332 38500834 39608659 40649475 41568561
6219 41568561 42491873 43353328 44268221 45018251 45751180 46269124 46608150 46931775 46942691 46903091
6209 46903091 46865287 46906108 47171983 47451828 47898325 48467210 49162254 49961781 50784794 51921452
6199 51921452 52945962 54190740 55332870 56550780 57624270 58825066 59946755 61093131
6191 61093131 62092642 63056662 63994350 64877408 65850067 66874818 68102352 69641544 71434171
$$ packed form
6255B4719072K16400J81569L57841K51766K42775K44973K30033K42535K20669
6246B6907633L32200J42121L82199K21170L57703L21204L51756L76764L92344
6237B9785094L90845M82187N00680M17268N42462M20856N54777N27812N56383
6228C4178364N40849O18073O81937P81382Q14727Q85502J107825J040816R19086
6219D1568561R23312Q61455R14893P50030P32929N17944L39026L23625J0916l9600
6209D6903091l7804M0821K65875K79845M46497N68885O95044P99527Q23013J136658
6199E1921452J024510J244778J142130J217910J073490J200796J121689J146376
6191F1093131R99511R64020R37688Q83058R72659J024751J227534J539192J792627
$$ plain form
6182 71434171 73248308 74917004 76509678 78156708 79577866 80898421 81942182 82532317
6174 82532317 82888287 82858656 82472302 82002244 81453054 81392410 81456667 81988315 82705050 83639894
6164 83639894 84906199 86248502 87986138 89844776 92109582 94255429 96304244 98416693
6156 98416693 100498292 102339745 104242102 105759529 107196695 108133667 108884364 109437914 109837263
6147 109837263 110359029 111156964 112221997 113655107 115327006 117436618 119775273 122403009
6139 122403009 125427322 128489121 131595935 134752963 137779418 140707770 143716635 146461643
6131 146461643 149085061 151270558 153174575 154808789 156194447 157362901 158857280 160581166
6123 160581166 162704285 165200315 167922167 170932603 174239984 177714216 181428039 185464912
$$ packed form
6182G1434171J814137J668696J592674J647030J421158J320555J043761N90135
6174H2532317L55970k9631l86354m70058n49190o0644O4257N31648P16735R34844
6164H3639894J266305J342303J737636J858638K264806K145847K048815K112449
6156I8416693K081599J841453J902357J517427J437166R36972P50697N53550L99349
6147A09837263N21766P97935J065033J433110J671899K109612K338655K627736
6139A22403009L024313L061799L106814L157028L026455K928352L008865K745008
6131A46461643K623418K185497J904017J634214J385658J168454J494379J723886
6123A60581166K123119K496030K721852L010436L307381L474232L713823M036873
$$ plain form
6115 185464912 189520484 193784821 198444127 203307241 208275725 213535329 219049125 224696554
6107 224696554 230605008 236862809 243387256 250155508 257225788 264299818 271422348 278543897
6099 278543897 285728009 292555245 299176510 305502622 311395359 316635519 321340782 325541344
6091 325541344 329009631 332019534 334875877 337251507 339427283 341310515 343085665 344272007
6083 344272007 345291800 345656008 345585945 344881336 343706201 341952985 339731467 336871185 333443225
6074 333443225 329497463 325154564 320444138 315246333 309863023 304155031 298274125 292221346
6066 292221346 286276040 280172440 274040737 267860311 261644786 255362976 249014460 242780505
6058 242780505 236631937 230324933 224041353 217720396 211389146 205032996 198764807 192770681
$$ packed form
6115A85464912M055572M264337M659306M863114M968484N259604N513796N647429
6107B24696554N908454O257801O524447O768252P070280P074030P122530P121549
6099B78543897P184112O827236O621265O326112N892737N240160M705263M200562
6091C25541344L468287L009903K856343K375630K175776J883232J775150J186342
6083C44272007J019793L64208p0063p04609j175135j753216k221518k860282l427960
6074C33443225l945762m342899m710426n197805n383310n707992n880906o052779
6066B92221346n945306o103600o131703o180426o215525o281810o348516o233955
6058B42780505o148568o307004o283580o320957o331250o356150o268189n994126
$$ plain form
6050 192770681 186989733 181413333 176114036 170922470 165977747 161235387 156590965 152182478
6042 152182478 147839097 143814781 139679564 135747859 131991454 128363809 125021817 121552560
6034 121552560 118326432 115133886 112146335 109085499 106351404 103529221 101006425 98449686
6026 98449686 96012585 93550611 91316983 89080977 86887721 84820195 82786116 80791574
6018 80791574 78872350 77059750 75270683 73454239 71780619 70163102 68582689 67016597
6010 67016597 65407053 64007218 62469566 61056420 59635316 58409439 57097403 55761485
6002 55761485 54654189 53372359 52259214 51147990 50154402 49042417 48097388 47164154 46329996
5993 46329996 45305172 44446715 43661199 42818782 41983153 41195671 40479854 39713516 38939202
$$ packed form
6050A92770681n780948n576400n299297n191566m944723m742360m644422m408487
6042A52182478m343381m024316m135217l931705l756405l627645l341992l469257
6034A21552560l226128l192546k987551l060836k734095k822183k522796k556739
6026I8449686k437101k461974k233628k236006k193256k067526k034079j994542
6018H0791574j919224j812600j789067j816444j673620j617517j580413j566092
6010F7016597j609544j399835j537652j413146j421104j225877j312036j335918
6002E5761485j107296j281830j113145j111224r93588j111985r45029r33234q34158
5993D6329996j024824q58457p85516q42417q35629p87482p15817p66338p74314
$$ plain form
5984 38939202 38185762 37472901 36817151 36029765 35332782 34658501 34049183 33421813 32819186
5975 32819186 32160237 31537954 30926943 30278274 29845935 29187793 28683559 28224803 27599456
5966 27599456 27216244 26687097 26251875 25840513 25356674 25000156 24484741 24218634 23728898
5957 23728898 23445600 23001924 22684129 22364447 21991678 21732322 21346404 21108178 20641270
5948 20641270 20387519 20004867 19731076 19464993 19136680 18805800 18444819 18141352 17921780
5939 17921780 17550653 17247193 17044338 16700756 16470481 16251908 15910915 15751319 15538975
5930 15538975 15319247 15063138 14837693 14637984 14438173 14247726 14020989 13900266 13664134
5921 13664134 13525922 13267121 13090753 12970008 12729738 12597405 12416958 12289198 12102035
$$ packed form
5984C8939202p53440p12861o55750p87386o96983o74281o09318o27370o02627
5975C2819186o58949o22283o11011o48669m32339o58142n04234m58756o25347
5966B7599456l83212n29147m35222m11362m83839l56518n15415k66107m89736
5957B3728898k83298m43676l17795l19682l72769k59356l85918k38226m66908
5948B0641270k53751l82652k73791k66083l28313l30880l60981l03467k19572
5939A7921780l71127l03460k02855l43582k30275k18573l40993j59596k12344
5930A5538975k19728k56109k25445j99709j99811j90447k26737j20723k36132
5921A3664134j38212k58801j76368j20745k40270j32333j80447j27760j87163
$$ plain form
5912 12102035 11876109 11848971 11557119 11337578 11321242 11116171 11015378 10733791 10646527 10474284
5902 10474284 10429020 10225819 10144463 9905279 9802789 9745894 9591563 9397402 9360162 9186694
5892 9186694 9067293 8961102 8793509 8776023 8613883 8542137 8366733 8289931 8206066 8104086
5882 8104086 8002360 7916119 7851939 7695173 7652088 7496380 7451581 7295789 7253248 7170431 7102847
5871 7102847 7052662 7021876 6857257 6816224 6781442 6584862 6526779 6538190 6384000 6284650 6314367
5860 6314367 6202558 6037339 6001752 5995690 5949919 5803623 5658720 5682603 5559389 5536621 5471685
5849 5471685 5475908 5365171 5305884 5239451 5170372 5150681 5081771 5026004 4967506 4916710 4894819
5838 4894819 4806307 4784110 4752051 4665067 4582842 4524460 4507018 4457661 4417318 4322251 4302746
$$ packed form
5912A2102035k25926k7138k91852k19541j6336k05071j00793k81587q7264j72243
5902A0474284m5264k03201q1356k39184j02490n6895j54331j94161l7240j73468
5892I186694j19401j06191j67593j7486j62140p1746j75404p6802q3865j01980
5882H104086j01726q6241o4180j56766m3085j55708m4799j55792m2541q2817o7584
5871G102847n0185l0786j64619m1033l4782j96580n8083J1411j54190r9350K9717
5860F314367j11809j65219l5587o062m5771j46296j44903K3883j23214k2768o4936
5849E471685M223j10737n9287o6433o9079j9691o8910n5767n8498n0796k1891
5838D894819q8512k2197l2059q6984q2225n8382j7442m9357m0343r5067j9505
$$ plain form
5827 4302746 4278169 4225337 4207481 4145609 4099213 4001966 3963685 3966291 3927788 3926068 3840815 3810017
5815 3810017 3783814 3672900 3560895 3541680 3598713 3592876 3494609 3470983 3433810 3402484 3274219
5804 3274219 3316043 3231084 3221810 3198672 3243505 3126813 3053793 3069395 3079746 3024031 2991049
5793 2991049 2931785 2936020 2972171 2889208 2872661 2807067 2861983 2816736 2675559 2697230 2603150
5782 2603150 2688580 2601836 2506901 2532664 2522523 2442159 2406676 2404702 2371974 2343923 2335441 2317501
5770 2317501 2288825 2255310 2240300 2317973 2179964 2185759 2060491 2113139 2081937 2093677 2078115
5759 2078115 2047382 2053435 1998514 2012642 1924202 1834148 1944429 1899802 1888752 1891123 1828899 1754453
5747 1754453 1821790 1765191 1708567 1704439 1684301 1687606 1687564 1637555 1697652 1613803 1652332 1558546
$$ packed form
5827D302746k4577n2832j7856o1872m6396r7247l8281K606l8503j720q5253l0798
5815C810017k6203j10914j12005j9215N7033n837r8267k3626l7173l1326j28265
5804C274219M1824q4959r274k3138M4833j16692p3020J5602J0351n5715l2982
5793B991049n9264M235L6151q2963j6547o5594N4916m5247j41177K1671r4080
5782B603150Q5430q6744r4935K5763j0141q0364l5483j974l2728k8051q482j7940
5770B317501k8676l3515j5010P7673j38009N795j25268N2648l1202J1740j5562
5759B078115l0733O053n4921J4128q8440r0054J10281m4627j1050K371o2224p4446
5747A754453O7337n6599n6624m128k0138L305m2n0009O0097q3849L8529r3786
$$ plain form
5735 1558546 1523199 1484740 1478912 1515480 1408980 1465290 1507360 1471128 1347903 1306057 1367981
5724 1367981 1350798 1332917 1271851 1308851 1258614 1302769 1293136 1275938 1192465 1264923 1183356 1197836
5712 1197836 1242980 1198503 1148960 1183987 1203356 1168897 1027049 1132467 1161352 1075379 1170304
5701 1170304 1159997 1120283 1068467 1117638 1110791 1026119 1062049 1024692 1070473 1056367 1056550 995491
5689 995491 938037 1050445 994942 982613 1018094 928525 997646 956124 990434 933456 984438
5678 984438 898442 909324 886832 1012842 836674 943019 1000008 956045 907678 945053 903610
5667 903610 959518 912593 878201 881442 798692 811115 861028 789544 730909 771245 727349 751725
5655 751725 716768 781591 668930 729012 736136 747536 703292 644807 704300 709960 735338 680711
$$ packed form
5735A558546l5347l8459n828L6568j06500N6310M2070l6232j23225m1846O1924
5724A367981j7183j7881o1066L7000n0237M4155r633j7198q3473P2458q1567J4480
5712A197836M5144m4477m9543L5027J9369l4459j41848J05418K8885q5973R4925
5701A170304j0307l9714n1816M9171o847q4672L5930l7357M5781j4106J83o1059
5689I95491n7454J12408n5503j2329L5481q9569O9121m1522L4310n6978N0982
5678I84438q5996J0882k2492J26010j76168J06345N6989m3963m8367L7375m1443
5667I03610N5908m6925l4392L241q2750J2423M9913p1484n8635M0336m3896K4376
5655G51725l4957O4823j12661O0082P124J1400m4244n8485N9493N660K5378n4627
$$ plain form
5643 680711 715698 705815 785945 623351 707719 644025 711586 662446 612532 574149 628545 650217
5631 650217 606367 616565 476852 509043 436867 528339 443197 503235 431708 370287 395791
5620 395791 335575 490800 525237 416015 471361 400709 409821 399108 360549 381191 439872
5609 439872 335498 304279 398969 348464 375023 353695 397585 246093 325919 323329 409681
5598 409681 261698 344684 308819 309723 319163 325402 222153 244354 240112 389259 271256 306210
5586 306210 270329 239337 234854 273605 254285 251922 280467 129591 282959 250700 181007 235725
5574 235725 216981 263921 208002 151177 191226 256790 139789 143958 139957 200174 161516 203264
5562 203264 176546 123491 97951 150915 124562 147179 56977 71432 48288 117699 67851 70119
$$ packed form
5643F80711L4987r883Q0130j62594Q4368o3694O7561m9140m9914l8383N4396K1672
5631F50217m3850J0198j39713L2191p2176R1472q5142O0038p1527o1421K5504
5620C95791o0216J55225L4437j09222N5346p0652R112j0713l8559K0642N8681
5609D39872j04374l1219R4690n0505K6559k1328M3890j51492P9826k590Q6352
5598D09681j47983Q2986l5865R04R440O239j03249K2201m242J49147j18003L4954
5586C06210l5881l0992m483L8751j9320k363K8545j50876J53368l2259o9693N4718
5574B35725j8744M6940n5919n6825M0049O5564j17001M169m001O0217l8658M1748
5562B03264k6718n3055k5540N2964k6353K2617r0202J4455k3144O9411m9848K268
$$ plain form
5550 70119 50405 50616 147109 65095 39115 32201 -3719 60651 -6139 67991 18831 14853 -64573
5537 -64573 -4725 28582 99543 -18551 22191 -28154 34320 -36386 26451 21918 -100009 -87313
5525 -87313 1203 -22863 56288 52183 -45759 -100452 -11459 -80965 -72522 -23610 41843 -47314
5513 -47314 -38200 -57006 -27533 -43674 -53714 -111914 -91158 -49513 -83200 -71825 -116296 -122024
5501 -122024 -47033 8780 -39990 -5696 -32172 -64363 -76885 -119298 23908 -92409 -90812
5490 -90812 -96942 -108995 -6803 -54969 -82346 18104 -25599 -115299 -88194 -79054 -37939 -69307
5478 -69307 -51238 -90016 -62483 -42981 -53934 -83203 -70981 -92315 45506 -62305 -65496 -6295
5466 -6295 20569 -71151 -16511 -5013 -5843 -62357 -118275 -82165 22273 -44677 -22898 -21421
$$ packed form
5550G0119j9714K11R6493q2014k5980o914l5920O4370o6790P4130m9160l978p9426
5537f4573N9848L3307P0961j18094M0742n0345O2474p0706O2837m533j21927J2696
5525h7313Q8516k4066P9151m105r7942n4693Q8993o9506Q443M8912O5453q9157
5513d7314R114j8806K9473j6141j0040n8200K0756M1645l3687J1375m4471n728
5501a22024P4991N5813m8770L4294k6476l2191j2522m2413J43206j16317J597
5490i0812o130j2053J02192m8166k7377J00450m3703q9700K7105R140M1115l1368
5478f9307J8069l8778K7533J9502j0953k9269J2222k1334J37821j07811l191N9201
5466f295K6864r1720N4640J1498q30n6514n5918L6110J04438o6950K1779J477
$$ plain form
5454 -21421 -65191 -88826 -71428 -83058 -43908 -36148 -65203 10546 -16769 -48302 -65368 -27437
5442 -27437 -60545 -3012 -10849 -92895 -30381 -10131 -23765 -35588 -148069 -52075 -61764 -2191
5430 -2191 -25651 -21122 -47204 42065 24716 -16924 83480 -246 108421 32009 66375 99282
5418 99282 113799 55220 112786 155802 48692 77995 99670 162699 101587 161645 132669 122706
5406 122706 100996 100270 176630 113093 172252 194460 290417 190703 178468 207866 248263 216098
5394 216098 170217 292871 270949 370293 236242 283055 366304 368693 392666 353168 408969
5383 408969 500224 424875 517358 494338 522997 519281 553348 588531 618447 695232 720936 685326
5371 685326 785505 698631 779189 791302 781418 872405 867429 906431 973973 1017408 971704 1057046
$$ packed form
5454b1421m3770k3635J7398j1630L9150P760k9055P5749k7315l1533j7066L7931
5442b7437l3108N7533p837q2046O2514K0250j3634j1823j12481R5994r689N9573
5430b191k3460M529k6082Q9269j7349m1640J00404q3726J08667p6412L4366L2907
5418I9282J4517n8579N7566M3016j07110K9303K1675O3029o1112O0058k8976r963
5406A22706k1710p26P6360o3537N9159K2208R5957r9714j2235K9398M0397l2165
5394B16098m5881J22654k1922R9344j34051M6813Q3249K389K3973l9498N5801
5383D08969R1255p5349R2483k3020K8659l716L4067L5183K9916P6785K5704l5610
5371F85326J00179q6874Q0558J2113r884R0987m976L9002O7542M3435m5704Q5342
$$ plain form
5359 1057046 1126892 1140260 1194019 1255515 1321744 1329673 1285702 1454845 1429119 1527447 1479295
5348 1479295 1611724 1747000 1704513 1757580 1914813 1914824 2102461 2137567 2238494 2297278 2355102
5337 2355102 2601144 2746429 2852495 3044133 3226691 3411409 3543140 3783014 3940432 4162782
5327 4162782 4505715 4886270 5232150 5671694 6089304 6519135 6960826 7376566 7909798 8594328
5317 8594328 9091064 9579175 10158395 10767592 11186925 11649813 12181489 12616999 13014910 13311374
5307 13311374 13522770 13633936 13793910 13806239 13766018 13750619 13632771 13324749 12962483 12533968
5297 12533968 11961333 11506790 11048914 10501613 9926469 9377715 8781597 8263057 7668444
5288 7668444 7185678 6664287 6115756 5754974 5329561 4834416 4387979 4101791 3859239 3592459
$$ packed form
5359A057046O9846J3368N3759O1496O6229P929m3971J69143k5726R8328m8152
5348A479295J32429J35276m2487N3067J57233J1J87637L5106J00927N8784N7824
5337B355102K46042J45285J06066J91638J82558J84718J31731K39874J57418K22350
5327D162782L42933L80555L45880M39544M17610M29831M41691M15740N33232O84530
5317H594328M96736M88111N79220O09197M19333M62888N31676M35510L97911K96464
5307A3311374K11396J11166J59974J2329m0221j5399j17848l08022l62266m28515
5297A2533968n72635m54543m57876n47301n75144n48754n96118n18540n94613
5288G668444m82766n21391n48531l60782m25413m95145m46437k86188k42552k66780
$$ plain form
5278 3592459 3386661 3093750 2958425 2743535 2544309 2502272 2351483 2156274 2045915 1955174
5268 1955174 1772657 1670127 1674380 1505648 1420501 1398775 1323660 1192506 1173310 1130126 1040870
5257 1040870 911314 856886 861757 885019 734912 758134 673283 602894 598926 500357 559396
5246 559396 509593 351637 323517 354597 413073 250985 319961 219061 236564 186957 208323
5235 208323 179873 88370 64918 12322 114581 90547 44819 68801 -32066 -46435 20795
5224 20795 -78272 -47339 -63363 -141747 -154758 -167983 -51018 -120559 -144131 -203199 -150930 -236100
5212 -236100 -236259 -177580 -173598 -237485 -302743 -215942 -277488 -273863 -299098 -217609 -283861 -274420 -241637
5199 -241637 -313433 -366352 -329383 -339020 -354846 -337097 -332609 -305651 -342842 -283238 -347147 -268350
$$ packed form
5278C592459k05798k92911j35325k14890j99226m2037j50789j95209j10359r0741
5268A955174j82517j02530M253j68732q5147k1726p5115j31154j9196m3184q9256
5257A040870j29556n4428M871K3262j50107K3222q4851p0389l968r8569N9039
5246E59396m9803j57956k8120L1080N8476j62088O8976j00900J7503m9607K1366
5235B08323k8450r1503k3452n2596J02259k4034m5728K3982j00867j4369O7230
5224B0795r9067L0933j6024p8384j3011j3225J16965o9541k3572n9068N2269q5170
5212b36100j59N8679L982o3887o5258Q6801o1546L625k5235Q1489o6252R441L2783
5199b41637p1796n2919L6969r637j5826J7749M488K6958l7191N9604o3909P8797
$$ plain form
5187 -268350 -314920 -375513 -366365 -368136 -415456 -384905 -379273 -427170 -398758 -436276 -408862 -386171
5175 -386171 -402628 -438496 -414382 -376413 -411084 -377093 -472234 -423648 -427743 -448908 -436718 -420088
5163 -420088 -468960 -395977 -487876 -528703 -565997 -469953 -434308 -402375 -470291 -458834 -530102 -569058
5151 -569058 -469056 -482838 -491102 -452328 -473911 -512955 -436817 -542862 -431507 -428001 -466351
5140 -466351 -529213 -575958 -501253 -520827 -472510 -508141 -436290 -436579 -453889 -371574 -511644 -493576
5128 -493576 -491195 -502783 -360739 -495801 -424764 -458718 -488722 -513806 -536560 -512456 -529492
5117 -529492 -506675 -560133 -493260 -456806 -447677 -546147 -483342 -460016 -484229 -483747 -499762 -521441
5105 -521441 -531885 -466356 -511942 -477735 -473336 -583028 -524812 -527707 -584040 -468876 -588320
$$ packed form
5187b68350m6570o0593R148j771m7320L0551N632m7897K8412l7518K7414K2691
5175c86171j6457l5868K4114L7969l4671L3991r5141M8586m095k1165J2190J6630
5163d20088m8872P2983r1899m0827l7294R6044L5645L1933o7916J1457p1268l8956
5151e69058J00002j3782q264L8774k1583l9044P6138j06045J11355L506l8350
5140d66351o2862m6745P4705j9574M8317l5631P1851k89j7310Q2315j40070J8068
5128d93576K381j1588J42044j35062P1037l3954l0004k5084k2754K4104j7036
5117e29492K2817n3458O6873L6454R129r8470O2805K3326k4213M82j6015k1679
5105e21441j0444O5529m5586L4207M399j09692N8216k895n6333J15164j19444
$$ plain form
5094 -588320 -528426 -601013 -541139 -622073 -628175 -555054 -618589 -582247 -549383 -563687 -663291 -735967
5082 -735967 -626680 -582053 -601395 -563741 -642158 -586873 -622926 -605520 -617209 -626381 -569418 -609531
5070 -609531 -637059 -648596 -664505 -614511 -647252 -545252 -573204 -611748 -578600 -623210 -576594
5059 -576594 -571099 -536067 -578115 -550254 -577336 -592078 -547175 -621160 -591581 -621196 -542390 -558226
5047 -558226 -616338 -624930 -565620 -534186 -586483 -602992 -624169 -587741 -469905 -530819 -514919 -566049
5035 -566049 -511056 -553452 -479485 -576359 -587456 -561249 -581446 -511295 -511357 -552486 -551238 -521022
5023 -521022 -516215 -609594 -549829 -534867 -534985 -492595 -572355 -539113 -566284 -576481 -546510 -535402
5011 -535402 -594412 -577735 -572401 -614182 -640144 -572509 -628274 -592777 -580107 -676189 -574769 -545299
$$ packed form
5094e88320N9894p2587N9874q0934o102P3121o3535L6342L2864j4304r9604p2676
5082g35967J09287M4627j9342L7654p8417N5285l6053J7406j1689r172N6963m0113
5070f09531k7528j1537j5909M9994l2741J02000k7952l8544L3148m4610M6616
5059e76594N495L5032m2048K7861k7082j4742M4903p3985K9579k9615P8806j5836
5047e58226n8112q592N9310L1434n2297j6509k1177L6428J17836o0914J5900n1130
5035e66049N4993m2396P3967r6874j1097K6207k0197P0151o2m1129J248L0216
5023e21022M807r3379N9765J4962j18M2390p9760L3242k7171j0197K9971J1108
5011e35402n9010J6677N334m1781k5962O7635n5765L5497J2670r6082J01420K9470
$$ plain form
4999 -545299 -613785 -724547 -632404 -617957 -631838 -600064 -614820 -645789 -614863 -579252 -632760
4988 -632760 -605512 -579840 -585239 -654527 -600203 -568869 -600865 -600650 -618920 -573041 -579616 -566277
4976 -566277 -586247 -647471 -573029 -524703 -573229 -569958 -537113 -460269 -423957 -472373 -415877 -556251
4964 -556251 -486504 -470486 -442273 -511087 -487190 -423352 -440950 -465701 -490442 -536742 -496592 -467144
4952 -467144 -516677 -448392 -539104 -507145 -586115 -525533 -570144 -628325 -623828 -575915 -591967 -629436
4940 -629436 -593890 -614922 -591395 -542772 -630228 -630091 -596563 -639363 -669658 -580158 -614057 -704853
4928 -704853 -664637 -696017 -625781 -708717 -549058 -644069 -632867 -582124 -691660 -701816 -654668
4917 -654668 -640083 -616512 -606966 -615790 -572272 -684131 -664055 -675675 -594707 -673713 -661957 -562053
$$ packed form
4999e45299o8486j10762R2143J4447j3881L1774j4756l0969L0926L5611n3508
4988f32760K7248K5672n399o9288N4324L1334l1996K15j8270M5879o575J3339
4976e66277j9970o1224P4442M8326m8526L271L2845P6844L6312m8416N6496j40374
4964e56251O9747J6018K8213o8814K3897O3838j7598k4751k4741m6300M0150K9448
4952d67144m9533O8285r0712L1959p8970O0582m4611n8181M497M7913j6052l7469
4940f29436L5546k1032K3527M8623q7456J37L3528m2800l0295Q9500l3899r0796
4928g04853M0216l1380P0236q2936J59659r5011J1202N0743j09536j0156M7148
4917f54668J4585K3571R546q824M3518j11859K0076j1620Q0968p9006J1756R9904
$$ plain form
4905 -562053 -661651 -674076 -634475 -630900 -672593 -573055 -624136 -589232 -606769 -569578 -607730 -627616
4893 -627616 -634799 -667764 -558490 -583529 -459300 -609568 -562637 -639032 -581480 -604893 -635260
4882 -635260 -599136 -602152 -643968 -656168 -703474 -633439 -580229 -679434 -642293 -619474 -735518 -651851
4870 -651851 -640216 -641921 -645578 -607417 -668933 -647125 -638324 -652727 -646859 -708999 -678117 -729018
4858 -729018 -708193 -749929 -643492 -671237 -610282 -656040 -757029 -769793 -685425 -685448 -718263 -728177
4846 -728177 -696029 -732666 -692230 -695675 -735211 -645388 -628683 -685075 -690902 -709058 -613102 -708387
4834 -708387 -662036 -636751 -714350 -658199 -664795 -656007 -639199 -642060 -701277 -721824 -649006 -680720
4822 -680720 -712462 -706248 -612184 -656650 -642655 -688613 -789599 -771026 -702457 -746874 -662120 -671541
$$ packed form
4905e62053r9598j2425L9601L575m1693R9538n1081L4904j7537L7191l8152j9886
4893f27616p183l2965J09274k5039J24229j50268M6931p6395N7552k3413l0367
4882f35260L6124l016m1816j2200m7306P0035N3210r9205L7141K2819j16044Q3667
4870f51851J1635j705l657L8161o1516K1808Q801j4403N868o2140L0882n0901
4858g29018K0825m1736J06437k7745O0955m5758j00989j2764Q4368k3l2815r914
4846g28177L2148l6637M0436l445l9536Q9823J6705n6392n827j8156R5956r5285
4834g08387M6351K5285p7599N6151o596Q788J6808k861n9217k0547P2818l1714
4822f80720l1742O214R4064m4466J3995m5958j00986J8573O8569m4417Q4754r421
$$ plain form
4810 -671541 -657945 -669576 -651696 -707990 -740654 -674280 -683421 -671762 -624365 -715791 -686515 -683910
4798 -683910 -688478 -656388 -752954 -764237 -703138 -720938 -631302 -663027 -695898 -674454 -716439 -719763
4786 -719763 -705498 -680321 -667861 -677944 -644798 -692696 -682515 -662966 -705687 -646214 -742894 -683381
4774 -683381 -630236 -684388 -653161 -618299 -593029 -645753 -634490 -568250 -638326 -614706 -655300 -669417
4762 -669417 -661896 -718194 -639228 -659958 -696202 -599536 -643054 -689150 -637424 -705856 -624807 -628217
4750 -628217 -581970 -557375 -615037 -694315 -571390 -676628 -657259 -628334 -659905 -749033 -629696
4739 -629696 -636088 -642327 -618765 -663786 -700266 -717607 -682214 -623339 -616905 -663453 -614507 -572188
4727 -572188 -639087 -591534 -667799 -635215 -667368 -570291 -645753 -602290 -623964 -645142 -588024 -583528
$$ packed form
4810f71541J3596j1631J7880n6294l2664O6374r141J1659M7397r1426K9276K605
4798f83910m568L2090r6566j1283O1099j7800Q9636l1725l2871K1444m1985l324
4786g19763J4265K5177J2460j0083L3146m7898J0181J9549m2721N9473r6680N9513
4774f83381N3145n4152L1227L4862K5270n2724J1263O6240p0076K3620m0594j4117
4762f69417P521n6298P8966k0730l6244R6666m3518m6096N1726o8432Q1049l410
4750f28217M6247K4595n7662p9278J22925j05238J9369K8925l1571q9128J19337
4739f29696o392o239K3562m5021l6480j7341L5393N8875O434m6548M8946M2319
4727e72188o6899M7553p6265L2584l2153R7077p5462M3463k1674k1178N7118M496
$$ plain form
4715 -583528 -636332 -588424 -617986 -549750 -580682 -577979 -615744 -610933 -553407 -541942 -576878 -551603
4703 -551603 -604572 -552913 -539846 -650295 -590977 -673860 -667702 -610089 -647937 -674546 -598453 -601467
4691 -601467 -592267 -570703 -628108 -604019 -603544 -564492 -546655 -555220 -605346 -609322 -626411 -654764 -633595
4678 -633595 -603271 -545065 -581314 -679793 -668649 -580718 -632464 -575885 -640124 -584545 -625488 -579854
4666 -579854 -618430 -561316 -528279 -631841 -648278 -625758 -612450 -577844 -572771 -630152 -509132
4655 -509132 -574774 -529110 -628922 -632773 -605955 -541309 -607624 -627815 -504036 -676268 -579691
4644 -579691 -676333 -536605 -631176 -665039 -619774 -568701 -625945 -623088 -492511 -685367 -572200
4633 -572200 -613520 -586848 -538464 -580137 -565290 -582813 -578897 -638611 -503559 -622796 -534919
$$ packed form
4715e83528n2804M7908k9562O8236l0932K703l7765M811N7526J1465l4936K5275
4703e51603n2969N1659J3067j10449N9318q2883O158N7613l7848k6609P6093l014
4691f01467R200K1564n7405K4089M75L9052J7837q565n0126l976j7089k8353K1169
4678f33595L0324N8206l6249r8479J1144Q7931n1746N6579o4239N5579m0943M5634
4666e79854l8576N7114L3037j03562j6437K2520J3308L4606N073n7381J21020
4655e09132o5642M5664r9812l851K6818O4646o6315k0191J23779j72232R6577
4644e79691r6642J39728r4571l3863M5265N1073n7244K857J30577j92856J13167
4633e72200m1320K6672M8384m1673J4847j7523L916n9714J35052j19237Q7877
$$ plain form
4622 -534919 -536335 -613540 -551175 -533574 -605332 -583253 -514222 -479637 -559251 -541641 -603005 -622648
4610 -622648 -560401 -612400 -533423 -557879 -554175 -718496 -610204 -539880 -505806 -495094 -534378
4599 -534378 -635273 -635975 -595026 -597602 -546047 -589707 -541830 -540806 -593158 -574389 -609439 -574733
4587 -574733 -576937 -578264 -638246 -556045 -601918 -583035 -518892 -599196 -673358 -621510 -609733 -581037
4575 -581037 -593860 -619433 -525035 -564521 -514744 -484441 -629536 -608880 -638379 -618433 -618167 -589259
4563 -589259 -693711 -551763 -567807 -579961 -546814 -633012 -544396 -566173 -546413 -513671 -600058
4552 -600058 -642820 -652307 -561023 -524588 -628863 -608574 -593736 -553174 -555503 -592180 -613640 -543487
4540 -543487 -627902 -624160 -554595 -631526 -604473 -583985 -582459 -556131 -593416 -625727 -583041 -537323
$$ packed form
4622e34919j416p7205O2365J7601p1758K2079O9031L4585p9614J7610o1364j9643
4610f22648O2247n1999P8977k4456L704j64321J08292P0324L4074J0712l9284
4599e34378j00895p02M0949k576N1555m3660M7877J024n2352J8769l5050L4706
4587e74733k204j327n9982Q2201m5873J8883O4143q0304p4162N1848J1777K8696
4575e81037j2823k5573R4398l9486M9777L0303j45095K0656k9499J9946K66K8908
4563e89259j04452J41948j6044j2154L3147q6198Q8616k1777J9760L2742q6387
4552f00058m2762r487R1284L6435j04275K0289J4838M0562k329l6677k1460P0153
4540e43487q4415L742O9565p6931K7053K0488J526K6328l7285l2311M2686M5718
$$ plain form
4528 -537323 -574323 -671337 -599266 -576136 -557836 -604521 -561482 -618064 -620317 -581482 -476522 -606047
4516 -606047 -588076 -659030 -513646 -569897 -648529 -551137 -526605 -543476 -562744 -601433 -560321
4505 -560321 -591422 -574708 -594124 -630123 -537847 -506958 -513093 -560486 -512229 -565558 -488587 -545623
4493 -545623 -535023 -553199 -553234 -560152 -465525 -559779 -540195 -524188 -577528 -441801 -617472 -618672
4481 -618672 -431508 -499724 -524622 -498454 -553741 -609299 -583864 -588998 -519655 -610517 -569969 -582218
4469 -582218 -598882 -652201 -522727 -457940 -547139 -591236 -511043 -557133 -488539 -597012 -509144
4458 -509144 -525940 -557968 -594199 -534396 -504266 -566933 -451425 -562139 -468020 -519235 -531407
4447 -531407 -389431 -469356 -577397 -561574 -519751 -540864 -579069 -510948 -495944 -576604 -455150
$$ packed form
4528e37323l7000r7014P2071K3130J8300m6685M3039n6582k253L8835J04960j29525
4516f06047J7971p0954J45384n6251p8632R7392K4532j6871j9268l8689M1112
4505e60321l1101J6714j9416l5999R2276L0889o135m7393M8257n3329P6971n7036
4493e45623J0600j8176l5o918R4627r4254J9584J6007n3340J35727j75671j200
4481f18672J87164o8216k4898K6168n5287n5558K5435n134O9343r0862M0548j2249
4469e82218j6664n3319J29474O4787q9199m4097Q0193m6090O8594j08473Q7868
4458e09144j6796l2028l6231N9803L0130o2667J15508j10714R4119n1215j2172
4447e31407J41976p9925j08041J5823M1823k1113l8205O8121J5004q0660J21454
$$ plain form
4436 -455150 -510615 -613700 -575539 -562057 -493326 -524758 -558927 -586330 -508849 -513174 -463823 -487746
4424 -487746 -521859 -497735 -462498 -452233 -503588 -526440 -467147 -371428 -483280 -434188 -484072
4413 -484072 -504539 -472768 -485826 -495021 -460400 -392739 -396860 -412563 -440554 -498414 -531368 -458903
4401 -458903 -525201 -433038 -516148 -528630 -539042 -432105 -533894 -445140 -459692 -480290 -456283
4390 -456283 -421678 -500267 -454013 -499144 -429838 -443635 -473884 -403620 -326756 -406233 -406438 -447973
4378 -447973 -367030 -385161 -416175 -477943 -303493 -378469 -432266 -466548 -429443 -361080 -401571
4367 -401571 -466703 -364085 -377966 -341805 -390338 -369055 -418414 -405482 -329620 -403717 -366308
4356 -366308 -382186 -287351 -342782 -356695 -330429 -331075 -280185 -288684 -354073 -311794 -282504 -254806
$$ packed form
4436d55150n5465j03085L8161J3482O8731l1432l4169k7403P7481m325M9351k3923
4424d87746l4113K4124L5237J0265n1355k2852N9293R5719j11852M9092m9884
4413d84072k0467L1771j3058r195L4621O7661m121j5703k7991n7860l2954P2465
4401d58903o6298R2163q3110j2482j0412J06937j01789Q8754j4552k0598K4007
4390d56283L4605p8589M6254m5131O9306j3797l0249P0264P6864p9477k05m1535
4378d47973Q0943j8131l1014o1768J74450p4976n3797l4282L7105O8363m0491
4367d01571o5132J02618j3881L6161m8533K1283m9359J2932P5862p4097L7409
4356c66308j5878R4835n5431j3913K6266o46N0890q499o5389M2279K9290K7698
$$ plain form
4344 -254806 -294690 -200755 -270732 -263190 -266393 -212410 -221514 -161786 -166937 -148044 -181783 -154839
4332 -154839 -75420 -188254 -191032 -82474 -132740 -113505 -83770 -72304 -54348 -59343 -131989 -36084
4320 -36084 -17608 -9861 13000 26836 26512 28750 101111 96834 25673 124179 42158 93775 77840
4307 77840 190175 127878 127270 126416 99601 184261 245966 197432 205428 292210 258091 219336 196958
4294 196958 233794 216969 210711 294354 225453 189981 185660 240788 186276 223743 164522 179388
4282 179388 298889 268543 272367 215237 217599 274408 278346 315261 266849 271269 293976 268172
4270 268172 287061 459250 442636 468191 457739 480161 544076 564470 649136 695215 684018
4259 684018 627620 688738 731260 680722 649670 696521 648841 690987 709687 683938 715607 772550
$$ packed form
4344b54806l9884R3935o9977P542l203N3983r104N9728n151J8893l3739K6944
4332a54839P9419j12834k778J08558n0266J9235K9735J1466J7956m995p2646R5905
4320c6084J8476P747K2861J3836l24K238P2361m277p1161R8506q2021N1617j5935
4307G7840J12335o2297o08q54k6815Q4660O1705m8534P996Q6782l4119l8755k2378
4294A96958L6836j6825o258Q3643o8901l5472m321N5128n4512L7467n9221J4866
4282A79388J19501l0346L824n7130K362N6809L938L6915m8412M420K2707k5804
4270B68172J8889J72189j6614K5555j0452K2422O3915K0394Q4666M6079j1197
4259F84018n6398O1118M2522n0538l1052M6851m7680M2146J8700k5749L1669N6943
$$ plain form
4247 772550 744719 742019 772813 814664 850485 951028 952522 961373 1039493 1168225 1118831 1184631
4235 1184631 1173820 1132169 1131442 1138007 1204203 1136769 1169479 1195943 1125000 1087329 1017398 1052607
4223 1052607 1029979 1016793 1000548 1068824 1106771 999934 1052351 1100877 1049895 1197325 1160384
4212 1160384 1200697 1133914 1244698 1283362 1382058 1357586 1304587 1340809 1295574 1351473 1307210
4201 1307210 1433201 1418831 1503689 1498580 1654361 1670519 1770803 1813417 1928325 2077921 2130079
4190 2130079 2360436 2403577 2552266 2830067 3047043 3126259 3444426 3796125 4142844 4513941
4180 4513941 4883426 5092594 5304261 5498437 5729663 5751221 5874988 5811365 5533478 5343259
4170 5343259 5150352 4794999 4545317 4349433 4187721 4166378 4186584 4270345 4447020 4678001
$$ packed form
4247G72550k7831k700L0794M1851L5821J00543J494Q851P8120J28732m9394O5800
4235A184631j0811m1651p27O565O6196o7434L2710K6464p0943l7671o9931L5209
4223A052607k2628j3186j6245O8276L7947j06837N2417M8526n0982J47430l6941
4212A160384M0313o6783J10784L8664R8696k4472n2999L6222m5235N5899m4263
4201A307210J25991j4370Q4858n109J55781J6158J00284M2614J14908J49596N2158
4190B130079K30357M3141J48689K77801K16976P9216L18167L51699L46719L71097
4180D513941L69485K09168K11667J94176K31226K1558J23767o3623k77887j90219
4170E343259j92907l55353k49682j95884j61712k1343K0206Q3761J76675K30981
$$ plain form
4160 4678001 4868108 5076925 5464618 5779754 5976474 6135209 6240366 6321189 6453740 6383889
4150 6383889 6166302 5854194 5564395 5120981 4636048 4186874 3863083 3403398 3288681 3019898
4140 3019898 2867925 2757090 2711371 2614485 2622623 2472317 2564817 2449841 2443562 2432148 2343246
4129 2343246 2239501 2087521 1889610 1702286 1515632 1361155 1184626 1113009 983110 953490
4119 953490 934806 814468 852266 734236 688561 597356 516400 604007 538714 449898 431819
4108 431819 411977 337771 411533 417403 263071 282098 226224 235649 213193 90861 173168 179321
4096 179321 82819 71153 68511 68414 -31112 -37694 -70140 19211 -42749 -116618 -77763 -120821 -141269
4083 -141269 -127023 -137475 -202841 -208224 -242936 -223591 -237047 -200180 -215731 -321374 -303917 -296316
$$ packed form
4160D678001J90107K08817L87693L15136J96720J58735J05157Q0823J32551o9851
4150F383889k17587l12108k89799m43414m84933m49174l23791m59685j14717k68783
4140C019898j51973j10835m5719r6886Q138j50306R2500j14976o279j1414q8902
4129B343246j03745j51980j97911j87324j86654j54477j76529p1617j29899k9620
4119I53490j8684j20338L7798j18030m5675r1205q0956Q7607o5293q8816j8079
4108D31819j9842p4206P3762N870j54332J9027n5874R425k2456j22332Q2307O153
4096A79321r6502j1666k642r7r9526o582l2446Q9351o1960p3869L8855m3058k0448
4083a41269J4246j0452o5366n383l4712J9345j3456L6867j5551j05643J7457P601
$$ plain form
4071 -296316 -304922 -250711 -334687 -329696 -293442 -357233 -274582 -314677 -359123 -409536 -333603 -318827
4059 -318827 -393307 -336200 -315192 -323677 -416937 -381137 -432310 -399221 -309416 -496092 -433954 -479619
4047 -479619 -448206 -500350 -429975 -495694 -389813 -462961 -520109 -412600 -455782 -487967 -433055
4036 -433055 -417035 -412137 -355454 -436957 -353156 -413009 -383281 -381915 -418382 -348934 -358689 -420947
4024 -420947 -467007 -414067 -434548 -432511 -469358 -464952 -418569 -565974 -561988 -407312 -565939 -545326
4012 -545326 -502610 -449907 -491154 -399241 -511924 -472048 -525323 -461115 -481075 -583975 -490234
4001 -490234 -518284 -524134 -457955 -451963 -489125 -428563 -502695 -472890 -496044 -518741 -574421 -509096
3989 -509096 -539377 -465049 -495337 -487196 -522421 -522051 -488205 -555736 -502801 -562669 -528366 -571791
$$ packed form
4071b96316q606N4211q3976M991L6254o3791Q2651m0095m4446n0413P5933J4776
4059c18827p4480N7107K1008q485r3260L5800n1173L3089Q9805j86676O2138m5665
4047d79619L1413n2144P0375o5719J05881p3148n7148J07509m3182l2185N4912
4036d33055J6020M898N6683q1503Q3801n9853K9728J366l6467O9448r755o2258
4024d20947m6060N2940k0481K037l6847M406M6383j47405L986J54676j58627K0613
4012e45326M2716N2703m1247R1913j12683L9876n3275O4208j9960j02900R3741
4001d90234k8050n850O6179N992l7162O0562p4132K9805k3154k2697n5680O5325
3989e09096l0281P4328l0288Q141l5225L70L3846o7531N2935n9868L4303m3425
$$ plain form
3977 -571791 -555696 -551341 -522411 -511359 -531037 -583103 -494845 -569803 -513303 -520765 -540937 -554864
3965 -554864 -545320 -529896 -494145 -566845 -592860 -543840 -567304 -591775 -568892 -549180 -583610 -614125
3953 -614125 -572242 -543976 -494639 -530407 -598054 -564928 -537656 -581074 -537509 -636563 -631449 -590866
3941 -590866 -609920 -580102 -567998 -468581 -585874 -577066 -623419 -609673 -586087 -590232 -657067 -623818
3929 -623818 -653595 -622605 -613971 -595104 -635556 -616969 -651527 -569815 -611831 -577900 -571260 -638998
3917 -638998 -599475 -635983 -716242 -622162 -717163 -558887 -630684 -650546 -576069 -586754 -615096
3906 -615096 -590220 -592415 -624791 -612936 -696088 -559043 -626234 -634998 -680219 -587723 -637396 -609976
3894 -609976 -641817 -715804 -671788 -690484 -731980 -653103 -664641 -652938 -619264 -707747 -611637 -633672
$$ packed form
3977e71791J6095M355K8930J1052j9678n2066Q8258p4958N6500p462k0172j3927
3965e54864R544J5424L5751p2700k6015M9020k3464k4471K2883J9712l4430l0515
3953f14125M1883K8266M9337l5768o7647L3126K7272m3418M3565r9054N114M0583
3941e90866j9054K9818J2104R9417j17293Q808m6353J3746K3586m145o6835L3249
3929f23818k9777L0990Q634J8867m0452J8587l4558Q1712m2016L3931O640o7738
3917f38998L9523l6508q0259R4080r5001J58276p1797j9862P4477j0685k8342
3906f15096K4876k195l2376J1855q3152J37045o7191q764m5221R2496m9673K7420
3894f09976l1841p3987M4016j8696m1496P8877j1538J1703L3674q8483R6110k2035
$$ plain form
3882 -633672 -643935 -634660 -680560 -733546 -697393 -596783 -578981 -624570 -646505 -587397 -719568
3871 -719568 -635798 -583119 -676022 -667112 -636230 -577882 -602874 -626485 -620682 -669926 -673297 -672502 -610739
3858 -610739 -604158 -705552 -625714 -672239 -633298 -563759 -716415 -672071 -692173 -678341 -676986 -684119
3846 -684119 -668857 -654621 -681979 -629062 -649633 -749741 -701554 -666976 -689092 -616972 -577954
3835 -577954 -636132 -664013 -638851 -735014 -626158 -585862 -653430 -650951 -684843 -672468 -635906 -759877
3823 -759877 -671902 -669446 -656783 -717310 -672926 -576098 -650212 -611035 -693961 -634276 -699124 -687312
3811 -687312 -680701 -729709 -632766 -734283 -644596 -685508 -715731 -732048 -687565 -681378 -730612 -710193
3799 -710193 -639252 -657238 -701070 -656644 -654166 -717903 -681606 -630764 -691556 -648626 -713680 -577496
$$ packed form
3882f33672j0263R275m5900n2986L6153J00610J7802m5589k1935N9108j32171
3871g19568Q3770N2679r2903Q910L0882N8348k4992k3611N803m9244l371P95O1763
3858f10739O581j01394P9838m6525L8941O9539j52656M4344k0102J3832J355p133
3846f84119J5262J4236k7358N2917k0571j00108M8187L4578k2116P2120L9018
3835e77954n8178k7881K5162r6163J08856M0296o7568K479l3892J2375L6562j23971
3823g59877Q7975K456J2663o0527M4384R6828p4114L9177q2926N9685o4848J1812
3811f87312O611m9008R6943j01517Q9687m0912l0223j6317M4483O187m9234K0419
3799g10193P0941j7986m3832M4426K478o3737L6297N0842o0792M2930o5054J36184
$$ plain form
3787 -577496 -596020 -644841 -602796 -696250 -661505 -517712 -662287 -626970 -748712 -692969 -583064
3776 -583064 -684840 -654176 -696106 -689878 -776603 -625457 -714740 -720205 -683851 -706654 -780413 -713051
3764 -713051 -683722 -671519 -612745 -637814 -677848 -650375 -615460 -679099 -675785 -635367 -645026 -645145
3752 -645145 -577882 -643654 -685051 -637679 -717594 -615343 -705150 -670278 -637050 -662925 -631497
3741 -631497 -686387 -685024 -570988 -578919 -642402 -668227 -648053 -689041 -729949 -665648 -662361 -569845
3729 -569845 -767173 -725117 -619715 -752306 -685731 -623941 -633691 -671066 -632495 -613518 -696065
3718 -696065 -688586 -674122 -671214 -731421 -617939 -685091 -665151 -663017 -758778 -686438 -696456 -723142
3706 -723142 -744686 -680709 -587584 -606249 -631761 -688188 -658047 -583601 -645492 -645555 -629323 -679628
$$ packed form
3787e77496j8524m8821M2045r3454L4745J43793j44575L5317j21742N5743J09905
3776e83064j01776L0664m1930O228q6725J51146q9283n465L6354k2803p3759O7362
3764g13051K9329J2203N8774k5069m0034K7473L4915o3639L314M0418r659j19
3752f45145O7263o5772m1397M7372p9915J02251q9807L4872L3228k5875L1428
3741f31497n4890J363J14036p931o3483k5825K0174m0988m0908O4301L287R2516
3729e69845j97328M2056J05402j32591O6575O1790r750l7375L8571J8977q2547
3718f96065P479J4464K908o0207J13482o7152J9940K134r5761P2340j0018k6686
3706g23142k1544O3977R3125j8665k5512n6427L0141P4446o1891o3J6232n0305
$$ plain form
3694 -679628 -713150 -691726 -734076 -666300 -589086 -662799 -664049 -680724 -647340 -628399 -681126 -663836
3682 -663836 -675536 -726939 -598049 -657591 -614082 -644329 -667498 -695911 -746366 -576307 -593494
3671 -593494 -651182 -761691 -656907 -644839 -654828 -673065 -785064 -662191 -650005 -684368 -607359
3660 -607359 -717881 -718662 -805824 -699161 -661300 -670526 -643842 -674942 -628672 -782137 -699881 -636362
3648 -636362 -608586 -707390 -679471 -749466 -652007 -593157 -633610 -674376 -576411 -649743 -641384 -629803
3636 -629803 -740352 -651820 -708776 -676843 -708803 -661915 -701492 -664696 -628097 -710540 -675882
3625 -675882 -620046 -739050 -685173 -612738 -699193 -655955 -659937 -642097 -663917 -730510 -643022 -602102
3613 -602102 -638495 -717464 -626818 -662861 -679993 -719314 -658162 -678848 -686968 -641770 -647927 -677816
$$ packed form
3694f79628l3522K1424m2350O7776P7214p3713j250j6675L3384J8941n2727J7290
3682f63836j1700n1403J28890n9542M3509l0247k3169k8413n0455J70059j7187
3671e93494n7688j10509J04784J2068r989j8237j11999J22873J2186l4363P7009
3660f07359j10522p81q7162J06663L7861r226K6684l1100M6270j53465Q2256O3519
3648f36362K7776r8804K7919o9995R7459N8850m0453m0766R7965p3332Q359J1581
3636f29803j10549Q8532n6956L1933l1960M6888l9577L6796L6599q2443L4658
3625f75882N5836j19004N3877P2435q6455M3238l982J7840k1820o6593Q7488M0920
3613f02102l6393p8969R0646l6043j7132l9321O1152k0686q120M5198o157k9889
$$ plain form
3601 -677816 -649730 -630464 -682809 -677314 -589384 -678117 -675813 -606884 -689564 -692364 -637320 -587320
3589 -587320 -658797 -630557 -651713 -659678 -640131 -615388 -666859 -684958 -689000 -676856 -638332 -675002
3577 -675002 -729866 -713425 -626779 -657328 -578545 -610666 -598674 -683981 -700199 -673264 -649537 -605677
3565 -605677 -581447 -662125 -597090 -554568 -659865 -633703 -669313 -570285 -586400 -616407 -681636
3554 -681636 -612748 -591213 -667776 -714103 -627196 -636195 -602386 -642811 -702545 -650109 -663425 -616205
3542 -616205 -641428 -655410 -648617 -634261 -632399 -660557 -677446 -643694 -663524 -624309 -652617 -643337
3530 -643337 -631038 -645475 -755366 -671179 -653873 -669262 -679016 -610278 -607292 -698597 -600405 -668097
3518 -668097 -713300 -581611 -636596 -660368 -622901 -602590 -648533 -655518 -586595 -716756 -666264
$$ packed form
3601f77816K8086J9266n2345N495Q7930q8733K304O8929q2680k800N5044N0000
3589e87320p1477K8240k1156p965J9547K4743n1471j8099m042J2144L8524l6670
3577f75002n4864J6441Q6646l0549P8783l2121J1992q5307j6218K6935K3727M3860
3565f05677K4230q0678O5035M2522j05297K6162l5610R9028j6115l0007o5229
3554f81636O8888K1535p6563m6327Q6907q999L3809m0425n9734N2436j3316M7220
3542f16205k5223j3982O793J4356J862k8158j6889L3752j9830L9215k8308R280
3530f43337J2299j4437j09891Q4187J7306j5389r754O8738K986r1305R8192o7692
3518f68097m5203J31689n4985k3772L7467K0311m5943o985O8923j30161N0492
$$ plain form
3507 -666264 -755965 -699923 -762366 -646564 -679159 -675579 -596979 -670763 -713349 -688202 -631864 -651731
3495 -651731 -629696 -574415 -619786 -627788 -651290 -576254 -607863 -639264 -714064 -698619 -673086 -697832
3483 -697832 -658730 -615313 -651635 -636412 -595650 -621663 -657895 -751386 -653973 -644559 -641930 -639188
3471 -639188 -623399 -678874 -618123 -649355 -658050 -685703 -582726 -611074 -671194 -661369 -680523 -673909
3459 -673909 -593388 -684907 -638355 -676994 -662541 -684675 -627279 -615454 -561188 -604148 -596852 -599051
3447 -599051 -657961 -587408 -615784 -584811 -675461 -638477 -644482 -660563 -686105 -613085 -614890 -653508
3435 -653508 -648478 -659278 -625780 -642784 -653345 -626937 -648668 -668724 -621951 -628748 -580751 -659703
3423 -659703 -606270 -632801 -625781 -714679 -598097 -630068 -633060 -610627 -677668 -576588 -624411 -716584
$$ packed form
3507f66264q9701N6042o2443J15802l2595L580P8600p3784m2586K5147N6338j9867
3495f51731K2035N5281m5371q002k3502P5036l1609l1401p4800J5445K5533k4746
3483f97832L9102M3417l6322J5223M0762k6013l6232r3491R7413R414K629K742
3471f39188J5789n5475O0751l1232q695k7653J02977k8348o0120R825j9154O614
3459f73909Q0521r1519M6552l8639J4453k2134N7396J1825N4266m2960P296k199
3447e99051n8910P0553k8376L0973r0650L6984o005j6081k5542P3020j805l8618
3435f53508N030j0800L3498j7004j0561K6408k1731k0056M6773o797M7997p8952
3423f59703N3433k6531P020q8898J16582l1971k992K2433o7041J01080m7823r2173
$$ plain form
3411 -716584 -669633 -612362 -660337 -655005 -707549 -672913 -632232 -691289 -608608 -614775 -697022 -658248
3399 -658248 -610527 -608678 -543177 -567779 -638535 -740249 -614221 -708803 -569557 -540183 -625787
3388 -625787 -603385 -615216 -605810 -629328 -603076 -620494 -651132 -675653 -588065 -657631 -591303 -665288
3376 -665288 -522214 -594129 -666633 -599434 -608775 -617282 -557800 -492769 -503154 -588553 -517184 -550914
3364 -550914 -572517 -675231 -630855 -629257 -621764 -561255 -542716 -590948 -596252 -487835 -524779 -565681
3352 -565681 -580241 -559294 -537492 -563774 -551295 -547421 -611984 -588277 -539011 -582276 -584597 -527219
3340 -527219 -664040 -549529 -632282 -589890 -485466 -465595 -470548 -604691 -478905 -447593 -496409
3329 -496409 -501338 -534341 -451580 -409226 -464960 -451265 -336399 -297059 -307874 -308713 -170435 -217999
$$ packed form
3411g16584M6951N7271m7975N332n2544L4636M0681n9057Q2681o167q2247L8774
3399f58248M7721J849O5501k4602p0756j01714J26028r4582J39246K9374q5604
3388f25787K2402j1831R406k3518K6252j7418l0638k4521Q7588o9566O6328p3985
3376f65288J43074p1915p2504O7199r341q507N9482O5031j0385q5399P1369l3730
3364e50914k1603j02714M4376J598P493O0509J8539m8232n304J08417l6944m0902
3352e65681j4560K0947K1802k6282J2479L874o4563K3707M9266m3265k321N7378
3340e27219j36821J14511q2753M2392J04424J9871m953j34143J25786L1312m8816
3329d96409m929l3003Q2761M2354n5734J3695J14866L9340j0815q39J38278m7564
$$ plain form
3317 -217999 -198474 -203009 -195755 -225590 -266025 -273465 -366148 -365240 -377661 -402901 -387444 -470586 -505627
3304 -505627 -499966 -551837 -547510 -497357 -589416 -559080 -545667 -610071 -521419 -591215 -572694 -586902
3292 -586902 -632716 -646893 -522011 -591787 -542193 -580217 -609812 -618296 -544380 -590179 -575271 -640002
3280 -640002 -604996 -645072 -622033 -531654 -642218 -581568 -590243 -591617 -617724 -634980 -629532 -623100
3268 -623100 -631454 -656400 -602360 -632345 -597059 -611687 -707146 -638661 -612889 -695455 -648310 -653754
3256 -653754 -552998 -729716 -654907 -630358 -618694 -695718 -590754 -636712 -655811 -644258 -659319
3245 -659319 -637675 -627391 -567562 -656908 -619522 -686865 -607015 -654437 -668449 -662914 -617209 -637111
3233 -637111 -603602 -719228 -683928 -702706 -587117 -655703 -608273 -568706 -630212 -576024 -626223
$$ packed form
3317b17999J9525m535P254k9835m0435p440r2683R08j2421k5240J5457q3142l5041
3304e05627N661n1871M327N0153r2059L0336J3413o4404Q8652o9796J8521j4208
3292e86902m5814j4177J24882o9776M9594l8024k9595q484P3916m5799J4908o4731
3280f40002L5006m0076K3039R0379j10564O0650q675j374k6107j7256N448O432
3268f23100q354k4946N4040k9985L5286j4628r5459O8485K5772q2566M7145n444
3256f53754J00756j76718P4809K4549J1664p7024J04964m5958j9099J1553j5061
3245f59319K1644J0284N9829q9346L7386o7343P9850m7422j4012N535M5705j9902
3233f37111L3509j15626L5300j8778J15589o8586M7430L9567o1506N4188n0199
$$ plain form
3222 -626223 -595163 -627977 -678498 -600521 -641258 -649700 -636120 -561156 -613860 -611413 -633754 -644113
3210 -644113 -692200 -650360 -699393 -614854 -646812 -700656 -594211 -695079 -670790 -702986 -640487
3199 -640487 -601768 -773626 -704564 -691230 -618010 -623775 -658203 -679397 -665626 -684606 -646979 -689631
3187 -689631 -628759 -570227 -631909 -676763 -568066 -645892 -646230 -687911 -631882 -601011 -559915 -639144
3175 -639144 -636507 -558925 -650310 -616375 -638148 -629062 -650934 -528000 -571487 -608381 -588192 -621042
3163 -621042 -653450 -663950 -679496 -650779 -624456 -648469 -606026 -649966 -620408 -626516 -618648 -647369
3151 -647369 -585416 -703149 -633869 -661702 -617609 -689595 -736184 -662451 -617947 -719032 -633446
3140 -633446 -677025 -621046 -686147 -699687 -623666 -691083 -587335 -589042 -675754 -706963 -687267 -581051
$$ packed form
3222f26223L1060l2814n0521P7977m0737q442J3580P4964n2704K447k2341j0359
3210f44113m8087M1840m9033Q4539l1958n3844J06445j00868K4289l2196O2499
3199f40487L8719j71858O9062J3334P3220n765l4428k1194J3771j8980L7627m2652
3187f89631O0872N8532o1682m4854J08697p7826l38m1681N6029L0871M1096p9229
3175f39144K637P7582r1385L3935k1773R086k1872J22934m3487l6894K0189l2850
3163f21042l2408j0500j5546K8717K6323k4013M2443m3940K9558o108P868k8721
3151f47369O1953j17733O9280k7833M4093p1986m6589P3733M4504j01085Q5586
3140f33446m3579N5979o5101j3540P6021o7417J03748j707q6712l1209J9696J06216
$$ plain form
3128 -581051 -620037 -610799 -642242 -639167 -529700 -633895 -621622 -619488 -711156 -628245 -678319 -681006
3116 -681006 -621095 -593851 -632147 -645825 -591318 -647504 -671560 -549146 -561534 -607366 -642137
3105 -642137 -605910 -637505 -601235 -608752 -573298 -649504 -590322 -639157 -562534 -598231 -597330 -597749 -626845
3092 -626845 -584599 -623403 -614302 -592343 -579054 -634796 -612913 -613434 -658734 -628135 -554108 -549370
3080 -549370 -627462 -638816 -615367 -587084 -532287 -584799 -621809 -592764 -602392 -660437 -569342 -597964
3068 -597964 -591461 -648149 -584296 -605432 -592197 -638141 -580484 -647769 -666135 -578998 -647652 -557998
3056 -557998 -655235 -663090 -626127 -631633 -637439 -636377 -596314 -696794 -650212 -676927 -580375 -591998
3044 -591998 -568079 -727997 -650047 -666839 -578061 -624777 -696918 -641379 -578556 -639602 -607936
$$ packed form
3128e81051l8986R238l1443L075J09467j04195J2273K134r1668Q2911n0074k687
3116f81006N9911K7244l8296j3678N4507n6186k4056J22414j2388m5832l4771
3105f42137L6227l1595L6270p517L5454p6206N9182m8835P6623l5697R01m19k9096
3092f26845M2246l8804R101K1959J3289n5742K1883n21m5300L0599P4027M738
3080e49370p8092j1354K3449K8283N4797n2512l7010K9045r628n8045R1095k8622
3068e97964O503n6688O3853k1136J3235m5944N7657o7285j8366Q7137o8654Q9654
3056e57998r7237p855L6963n506n806J062M0063j00480M6582k6715R6552j1623
3044e91998K3919j59918P7950j6792Q8778m6716p2141N5539O2823o1046L1666
$$ plain form
3033 -607936 -596702 -647614 -751960 -674170 -708331 -638970 -636670 -560883 -658763 -660880 -670964 -635073
3021 -635073 -647130 -635271 -596245 -640934 -691872 -652910 -720674 -622075 -648151 -626923 -652094 -672619
3009 -672619 -633857 -741061 -636331 -635763 -681492 -660168 -666965 -609612 -656709 -645506 -562703 -704032
2997 -704032 -621162 -601257 -590073 -667933 -652245 -583944 -642052 -679045 -670747 -662464 -619063 -558405
2985 -558405 -568788 -639615 -644834 -627847 -578424 -555596 -659496 -609635 -554008 -637372 -657851 -605655
2973 -605655 -629289 -626611 -660799 -657563 -629507 -557114 -581597 -600938 -608023 -607726 -622507 -638780 -618920
2960 -618920 -625831 -577051 -601656 -616915 -576574 -625022 -689564 -550194 -671376 -589389 -602496
2949 -602496 -643339 -607104 -582493 -673260 -706925 -582647 -691291 -517981 -651027 -648608 -636333
$$ packed form
3033f07936J1234n0912j04346P7790l4161O9361K300P5787r7880k117j0084L5891
3021f35073j2057J1859L9026m4689n0938L8962o7764R8599k6076K1228k5171k0525
3009f72619L8762j07204J04730N68m5729K1324o797N7353m7097J1203Q2803j41329
2997g04032Q2870J9905J1184p7860J5688O8301n8108l6993Q298Q283M3401O0658
2985e58405j0383p0827n219J6987M9423K2828j03900M9861N5627q3364k0479N2196
2973f05655k3634K678l4188L236K8056P2393k4483j9341p085K97j4781j6273J9860
2960f18920o911M8780k4605j5259M0341m8448o4542J39370j21182Q1987j3107
2949f02496m0843L6235K4611r0767l3665J24278j08644J73310j33046K419J2275
$$ plain form
2938 -636333 -629485 -705718 -558310 -663923 -575887 -658898 -690572 -678092 -682847 -592568 -679335 -639482
$$ packed form
2938f36333O848p6233J47408j05613Q8036q3011l1674J2480m755R0279q6767L9853
$$ [...]
##END NTUPLES=NMR SPECTRUM
##END=
